##TITLE=1H_TG-2353-3
 CDCl3
 8 sc, 
 13.05.2022
##JCAMPDX= 6.0         $$ Bruker NMR JCAMP-DX V2.0
##DATA TYPE= NMR SPECTRUM
##DATA CLASS= NTUPLES
##ORIGIN= UXNMR, Bruker Analytische Messtechnik GmbH
##OWNER= root
$$ XWIN-NMR		Version 3.5
$$ Fri May 13 11:11:07 2022 Russian Standard Time (UT+4h)  she@DPX200
##.OBSERVE FREQUENCY= 200.1313499996
##.OBSERVE NUCLEUS= ^1H
##.ACQUISITION MODE= SIMULTANEOUS
##.ACQUISITION SCHEME= undefined
##.AVERAGES= 8
##.DIGITISER RES= 18
##SPECTROMETER/DATA SYSTEM= spect
##.PULSE SEQUENCE= zg30
##.SOLVENT NAME= CDCl3
##.SHIFT REFERENCE= (INTERNAL, CDCl3, 0, 15.7149)
##AUDIT TRAIL= $$ (NUMBER, WHEN, WHO, WHERE, WHAT)
$$ ##TITLE= Audit trail, XWIN-NMR		Version 3.5
$$ ##JCAMPDX= 5.01
$$ ##ORIGIN= Bruker BioSpin GmbH
$$ ##OWNER= she
$$ F:/spectra/data/she/nmr/H-F/1/pdata/1/auditp.txt
$$ ##AUDIT TRAIL=  $$ (NUMBER, WHEN, WHO, WHERE, WHAT)
(   1,<2022-05-13 11:09:44.01 +0400>,<she>,<DPX200>,
      <created by zg, POWCHK disabled, PULCHK disabled
       configuration hash MD5:
       00 E9 B6 7A A2 85 ED C7 34 08 36 98 17 FE 4E 26
       data hash MD5: 16K
       79 91 F2 E8 BB 2F F3 CE A5 60 F1 21 EB 1B 24 17>)
(   2,<2022-05-13 11:09:48.06 +0400>,<she>,<DPX200>,
      <Start of raw data processing
       efp BC_mod = 2 LB = 0.24 FT_mod = 6 PKNL = 1 PHC0 = -17856.47 PHC1 = 15.60074 SI = 16K 
       data hash MD5: 16K
       19 6F 37 1B 5F 63 33 DE 5C 10 55 08 6B AE 80 E0>)
(   3,<2022-05-13 11:10:10.35 +0400>,<she>,<DPX200>,
      <pk PHC0 = -181.7029 PHC1 = 2 
       data hash MD5: 16K
       59 29 79 C7 94 87 59 0B 0B 36 A8 16 D3 B0 D3 FD>)
(   4,<2022-05-13 11:10:14.01 +0400>,<she>,<DPX200>,
      <abs ABSG = 5 
       data hash MD5: 16K
       B6 3A 59 68 76 E0 97 4D 53 71 8F CE 00 37 78 F4>)
$$ ##END=
$$ 
$$ hash MD5
$$ DF 34 27 48 84 08 EC A9 2A A7 68 57 11 B1 3E 4C
##$RELAX= 
##$RELAX= 
##$RELAX= 
##$RELAX= 
##$RELAX= 
##$RELAX= 
$$ Bruker specific parameters
$$ --------------------------
##$DU= <F:/spectra>
##$EXPNO= 1
##$NAME= <H-F>
##$PROCNO= 1
##$TYPE= <nmr>
##$USER= <she>
##$AMP= (0..31)
100 100 100 100 100 100 100 100 100 100 100 100 100 100 100 100 100 100 
100 100 100 100 100 100 100 100 100 100 100 100 100 100 
##$AQSEQ= 0
##$AQ_mod= 1
##$AUNM= <au_zg>
##$AUTOPOS= <>
##$BF1= 200.13
##$BF2= 200.13
##$BF3= 200.13
##$BF4= 200.13
##$BF5= 200.13
##$BF6= 200.13
##$BF7= 200.13
##$BF8= 200.13
##$BYTORDA= 1
##$CFDGTYP= 0
##$CFRGTYP= 5
##$CHEMSTR= <none>
##$CNST= (0..31)
1 1 145 1 1 1 1 1 1 1 1 1 1 1 1 1 1 1 1 1 1 1 1 1 1 1 1 1 1 1 1 1 
##$CPDPRG= <>
##$CPDPRG1= <>
##$CPDPRG2= <>
##$CPDPRG3= <>
##$CPDPRG4= <mlev>
##$CPDPRG5= <mlev>
##$CPDPRG6= <mlev>
##$CPDPRG7= <mlev>
##$CPDPRG8= <mlev>
##$CPDPRGB= <>
##$CPDPRGT= <>
##$D= (0..31)
0 1.2 0 0 0 0 0 0 0 0.06 0 0.03 0 0 0 0 0.0002 0 0 0 0 0 0 0 0 0 0 0 0 
0 0 0 
##$DATE= 1652425783
##$DBL= (0..7)
120 120 120 120 120 120 120 120 
##$DBP= (0..7)
150 150 150 150 150 150 150 150 
##$DBP07= 0
##$DBPNAM0= <>
##$DBPNAM1= <>
##$DBPNAM2= <>
##$DBPNAM3= <>
##$DBPNAM4= <>
$$ [...]
##$SUBNAM2= <"">
##$SUBNAM3= <"">
##$SUBNAM4= <"">
##$SUBNAM5= <"">
##$SUBNAM6= <"">
##$SUBNAM7= <"">
##$SUBNAM8= <"">
##$SUBNAM9= <"">
##$SW= 18.0517283424761
##$SWIBOX= (0..15)
0 0 2 0 0 0 0 0 0 0 0 0 0 0 0 0 
##$SW_h= 3612.71676300578
##$TD= 16384
##$TD0= 1
##$TE= 0
##$TE2= 300
##$TE3= 300
##$TEG= 300
##$TL= (0..7)
0 120 120 120 120 120 120 120 
##$TP= (0..7)
150 150 150 150 150 150 150 150 
##$TP07= 0
##$TPNAME0= <>
##$TPNAME1= <>
##$TPNAME2= <>
##$TPNAME3= <>
##$TPNAME4= <>
##$TPNAME5= <>
##$TPNAME6= <>
##$TPNAME7= <>
##$TPOAL= (0..7)
0.5 0.5 0.5 0.5 0.5 0.5 0.5 0.5 
##$TPOFFS= (0..7)
0 0 0 0 0 0 0 0 
##$TUNHIN= 0
##$TUNHOUT= 0
##$TUNXOUT= 0
##$USERA1= <user>
##$USERA2= <user>
##$USERA3= <user>
##$USERA4= <user>
##$USERA5= <user>
##$V9= 5
##$VALIST= <valist>
##$VCLIST= <CCCCCCCCCCCCCCC>
##$VD= 0
##$VDLIST= <DDDDDDDDDDDDDDD>
##$VPLIST= <PPPPPPPPPPPPPPP>
##$VTLIST= <TTTTTTTTTTTTTTT>
##$WBST= 1024
##$WBSW= 4
##$XGAIN= (0..3)
0 0 0 0 
##$XL= 0
##$YL= 0
##$YMAX_a= 287655
##$YMIN_a= -397779
##$ZGOPTNS= <>
##$ZL1= 120
##$ZL2= 120
##$ZL3= 120
##$ZL4= 120
##$ABSF1= 15.71637
##$ABSF2= -2.33548
##$ABSG= 5
##$ABSL= 3
##$ALPHA= 0
##$AQORDER= 0
##$ASSFAC= 0
##$ASSFACI= 0
##$ASSFACX= 0
##$ASSWID= 0
##$AUNMP= <proc_1d>
##$AZFE= 0.1
##$AZFW= 0.1
##$BCFW= 0
##$BC_mod= 2
##$BYTORDP= 0
##$COROFFS= 0
##$CY= -3
##$DATMOD= 1
##$DC= 0
##$DFILT= <>
##$DTYPP= 0
##$F1P= 0
##$F2P= 0
##$FCOR= 1
##$FTSIZE= 16384
##$FT_mod= 6
##$GAMMA= 0
##$GB= 0
##$INTBC= 1
##$INTSCL= 0
##$ISEN= 128
##$LB= 0.24
##$LEV0= 0
##$LPBIN= 0
##$MAXI= 10000
##$MC2= 0
##$MEAN= 0
##$ME_mod= 0
##$MI= 1.114404
##$NCOEF= 0
##$NC_proc= -6
##$NLEV= 6
##$NOISF1= 3.799351
##$NOISF2= 2.8
##$NSP= 0
##$NTH_PI= 0
##$NZP= 0
##$OFFSET= 15.71494
##$PC= 1
##$PHC0= -18038.17
##$PHC1= 17.60074
##$PH_mod= 1
##$PKNL= yes
##$PPARMOD= 0
##$PSCAL= 0
##$PSIGN= 0
##$REVERSE= no
##$SF= 200.130011327732
##$SI= 16384
##$SIGF1= 3
##$SIGF2= 2
##$SINO= 5.538805
##$SIOLD= 16384
##$SREGLST= <1H.CDCl3>
##$SSB= 0
##$STSI= 16384
##$STSR= 0
##$SW_p= 3612.71676300578
##$SYMM= 0
##$S_DEV= 0
##$TDeff= 16384
##$TDoff= 0
##$TI= <>
##$TILT= no
##$TM1= 0
##$TM2= 0
##$TOPLEV= 0
##$USERP1= <user>
##$USERP2= <user>
##$USERP3= <user>
##$USERP4= <user>
##$USERP5= <user>
##$WDW= 1
##$XDIM= 16384
##$YMAX_p= 275748847
##$YMIN_p= -265431
$$ End of Bruker specific parameters
$$ ---------------------------------
##NTUPLES= NMR SPECTRUM
##VAR_NAME=  FREQUENCY,     SPECTRUM/REAL,   SPECTRUM/IMAG
##SYMBOL=    X,             R,               I
##VAR_TYPE=  INDEPENDENT,   DEPENDENT,       DEPENDENT
##VAR_FORM=  AFFN,          ASDF,            ASDF
##VAR_DIM=   16384,         16384,           16384
##UNITS=     HZ,            ARBITRARY UNITS, ARBITRARY UNITS
##FACTOR=    0.220516191357247, 1,           1
##FIRST=     3145.03113444506, 0,            0
##LAST=      -467.685628560715, 0,           0
##MIN=       -467.685628560715, -265431,     0
##MAX=       3145.03113444506, 275748847,    0
$$ Real data points
##PAGE= N=1
##DATA TABLE= (X++(R..R)), XYDATA
$$ [...]
$$ plain form
7535 162408 170760 138213 211226 338275 320862 277318 348822 380900 373134 345790 294671 298686
7523 298686 220132 287105 310332 351902 254596 191486 191241 166748 164383 121106 175205 225467
7511 225467 116380 167594 190747 206932 275083 275921 216602 185253 99431 136043 53799 55191
7499 55191 112671 14549 107181 84252 115293 35748 113012 40157 -63737 -79392 5311 -20798
7487 -20798 -103615 -56254 -34973 -25632 2262 32508 7402 3725 24137 67001 19277 -85090
7475 -85090 44999 80252 77991 108240 41427 96861 -68917 7253 62640 101826 -11236
7464 -11236 -32349 -6712 103906 -2135 4461 35084 -22691 -18598 91581 46583 -71906
7453 -71906 -72009 75935 -23187 -78573 4496 65547 92728 106302 118232 -17265 -42177 3128
$$ packed form
7535A62408Q352l2547P3013J27049j7413m3544P1504L2078p766k7344n1119M015
7523B98686p8554O6973K3227M1570r7306o3110k45k4493k365m3277N4099N0262
7511B25467j09087N1214K3153J6185O8151Q38n9319l1349q5822L6612q2244J392
7499E5191N7480r8122R2632k2929L1041p9545P7264p2855j03894j5655Q4703k6109
7487b0798q2817M7361K1281R341K7894L0246k5106l677K0412M2864m7724j04367
7475h5090J30089L5253k261L0249o6813N5434j65778P6170N5387L9186j13062
7464a1236k1113K5637J10618j06041O596L0623n7775M093J10179m4998j18489
7453g1906j03J47944r9122n5386Q3069O1051K7181J3574J1930j35497k4912M5305
$$ plain form
7441 3128 37575 -76070 -92090 52371 20325 -41691 -101300 -170077 -167646 -30951 2518 -70351
7429 -70351 -37776 -41390 7902 2525 -104019 -18316 51711 10772 7151 26654 -35195 46787
7417 46787 58186 -81088 -74790 -126096 -157854 -134822 -52954 -92623 -90277 -104722 -51865 -89481
7405 -89481 -95820 -144469 -109544 -160430 -146868 -27230 15467 -31315 -6658 -59322 -27509 7642
7393 7642 59594 55784 -19073 -91408 -114976 -177269 -96431 -104535 -106023 -138481 -181266 -121188 -113640
7380 -113640 -84561 191 895 -88687 -121886 -72811 20230 -10802 -60612 -123731 -38994 -38166
7368 -38166 -69015 -13549 -18862 -28812 -49979 8532 -7294 16668 -55609 -60310 7468 -92856
7356 -92856 -49262 6070 -102809 -126653 -80406 -108 -83725 -32588 52804 -80860 -75639 -109572
$$ packed form
7441C128L4447j13645j6020J44461l2046o2016n9609o8777K431J36695L3469p2869
7429g0351L2575l614M9292n377j06544Q5703P0027m0939l621J9503o1849Q1982
7417D6787J1399j39274O298n1306l1758K3032Q1868l9669K346j4445N2857l7616
7405h9481o339m8649L4925n0886J3562J19638M2697m6782K4657n2664L1813L5151
7393G642N1952l810p4857p2335k3568o2293Q0838q104j488l2458m2785O0078P548
7380a13640K9079Q4752P04q9582l3199M9075R3041l1032m9810o3119Q4737Q28
7368c8166l0849N5466n313r950k1167N8511j5826K3962p2277m701O7778j00324
7356i2856M3594N5332j08879k3844M6247Q0298q3617N1137Q5392j33664N221l3933
$$ plain form
7344 -109572 53184 -724 29994 21304 -123529 -98827 -1626 -48337 -66393 -43788 6613
7333 6613 25423 -50934 -45219 -41198 5030 -77997 -134576 -113307 -59203 -22214 -137702 -93249
7321 -93249 -44379 -72474 -138244 -164872 -116407 -81732 -71547 -31245 -71252 -131077 -120280 -124190
7309 -124190 -153054 -141972 -179296 -124787 -107335 16095 -66558 -126468 -78659 -9828 -23736
7298 -23736 -93044 -16245 1902 -13553 -150003 -152472 -119184 -121656 -158820 -109686 21616 -138765
7286 -138765 -215539 -90257 -79201 -70603 -154325 -60676 9169 -13584 -82427 -44054 3011 -68573
7274 -68573 -92383 -112423 -72160 -49925 -116746 -23731 14894 -49967 -141465 -87294 -75548 -74876
7262 -74876 -84633 -18609 -68008 -116464 -80290 -167025 -138463 -18811 -24012 -149724 -69971 -23816
$$ packed form
7344a09572J62756n3908L0718q690j44833K4702R7201m6711j8056K2605N0401
7333F613J8810p6357N715M021M6228q3027n6579K1269N4104L6989j15488M4453
7321i3249M8870k8095o5770k6628M8465L4675J0185M0302m0007n9825J0797l910
7309a24190k8864J1082l7324N4509J7452J23430q2653n9910M7809O8831j3908
7298b3736o9308P6799J8147j5455j36450k469L3288k472l7164M9134J31302j60381
7286a38765p6774J25282J1056Q598q3722R3649O9845k2753o8843L8373M7065p1584
7274f8573k3810k0040M0263K2235o6821R3015L8625o4861r1498N4171J1746O72
7262g4876r757O6024m9399m8456L6174q6735K8562J19652n201j25712P9753M6155
$$ plain form
7250 -23816 -126653 -102689 -50856 -82049 -48289 -31385 -30729 -119699 -123142 -118269 -152367 -64472
7238 -64472 8747 -9770 36624 -40769 -94411 -34166 100938 51456 18564 -71262 -135829 -136807
7226 -136807 -169312 -76394 -43769 -43355 -68549 -45199 -83606 -212743 -221569 -127460 -138611 -73132
7214 -73132 -99641 -148053 -105962 -50890 2254 -6294 -94341 -22349 -3684 -87916 -110704 -97012
7202 -97012 -55101 -138447 -91181 -3100 -185252 -151402 -117006 -126177 -58036 -96690 -154241 -63138
7190 -63138 -54783 -21591 8890 113 18498 -17420 -76584 -143452 -111612 -65962 -82661 -128463
7178 -128463 -193370 -192003 -190798 -197488 -140521 -70066 -139932 -177741 -137843 -164719 -167440 -261428
7166 -261428 -265431 -138618 -78480 -208675 -211427 -193288 -144064 -200585 -48225 -7114 -118636
$$ packed form
7250b3816j02837K3964N1833l1193L3760J6904O56q8970l443M873l4098Q7895
7238f4472P3219j8517M6394p7393n3642O0245J35104m9482l2892q9826o4567r78
7226a36807l2505R2918L2625M14k5194K3350l8407j29137q826R4109j1151O5479
7214g3132k6509m8412M2091N5072N3144q548q8047P1992J8665q4232k2788J3692
7202i7012M1911q3346M7266Q8081j82152L3850L4396r171O8141l8654n7551R1103
7190f3138Q355L3192L0481q777J8385l5918n9164o6868L1840M5650j6699m5802
7178a28463o4907J367J205o690N6967P0455o9866l7809L9898k6876k721r3988
7166b61428m003J26813O0138j30195k752J8139M9224n6521J52360M1111j11522
$$ plain form
7155 -118636 -138439 -27458 -33082 -123631 -93939 -154616 -68909 -92950 -109614 -107684 -107660 -79362
7143 -79362 -10855 36965 -45050 -38142 -56974 -107373 -178671 -50100 -85088 -123989 -17035 -22817
7131 -22817 -125731 -162896 -125440 -92125 -66924 -62110 -94689 -99607 -58873 -153206 -135468 -70592
7119 -70592 -69402 -2192 -57787 -9383 -58286 -178683 -136846 -73499 -12608 -17438 -37826 -39913
7107 -39913 -54724 -148076 -43955 -64886 -107180 -41718 -35900 -85542 -153473 -91538 -86472 -163846
7095 -163846 -88380 -49907 -61328 -136753 -198938 -165396 -155995 -159174 -99583 -84610 -84712 -95826
7083 -95826 -112930 -135760 -176744 -205500 -196845 -118796 -104062 16416 55043 -6299 6145 -33279
7071 -33279 -49346 49384 112256 69632 8733 12044 57850 -75888 -124906 -143161 -112541 -93952
$$ packed form
7155a18636j9803J10981n624r0549K9692o0677Q5707k4041j6664J930K4K8298
7143g9362O8507M7820q2015O908j8832n0399p1298J28571l4988l8901J06954n782
7131b2817j02914l7165L7456L3315K5201M814l2579m918M0734r4333J7738O4876
7119g0592J190O7210n5595M8404m8903j20397M1837O3347O0891m830k0388k087
7107c9913j4811r3352J04121k0931m2294O5462N818m9642o7931O1935N066p7374
7095a63846P5466L8473j1421p5425o2185L3542R401l179N9591J4973j02j1114
7083i5826j7104k2830m0984k8756Q655P8049J4734J20478L8627o1342J2444l9424
7071c3279j6067R8730O2872m2624o0899L311M5806j33738m9018j8255L0620J8589
$$ plain form
7059 -93952 -115705 -107920 -125159 -126050 -167403 -179706 -98079 -187702 -195870 -233250 -168206 -29520
7047 -29520 -20854 -115334 -4442 -38957 -75372 -64814 -94028 -118400 -84391 -104145 -131904 -95258
7035 -95258 -86529 -72459 -96323 -47628 -106215 -89228 -39245 -83741 -186162 -60513 -137656 -180285
7023 -180285 -150497 -33204 -54413 -16018 -16523 5164 5917 69973 82800 -20380 -76017 -129334
7011 -129334 -5736 -14340 -65449 -80708 -87109 35545 -35572 -132374 -69004 14347 -29052 -127488
6999 -127488 -82108 -9297 -43518 -24246 31311 35746 78464 11676 -39686 -99034 -117025 258
6987 258 24108 -102648 -46709 -50422 -103490 -130517 -20268 -28495 -106109 -96647 -96294 -82583 3268
6974 3268 27160 -9210 -65421 33813 -4692 -63256 -20297 -25352 -32345 -143136 -184317 -98902
$$ packed form
7059i3952k1753P785j7239q91m1353j2303Q1627q9623q168l7380O5044J38686
7047b9520Q666r4480J10892l4515l6415J0558k9214k4372L4009j9754k7759L6646
7035i5258Q729J4070k3864M8695n8587J6987M9983m4496j02421J25649p7143m2629
7023a80285K9788J17293k1209L8395n05K1687P53O4056J2827j03180n5637n3317
7011a29334J23598q604n1109j5259o401J22654p1117r6802O3370Q3351m3399r8436
6999a27488M5380P2811l4221J9272N5557M435M2718o6788n1362n9348j7991J17283
6987B58K3850j26756N5939l713n3068k7027J10249q227p7614R462L53J3711Q5851
6974C268K3892l6370n6211R9234l8505n8564M2959n055o993j10791m1181Q5415
$$ plain form
6962 -98902 -77457 -31194 -40395 -101724 -22555 -75188 -63158 -65396 -79664 -80833 -56761 -117068
6950 -117068 -140884 -41025 77017 24809 222 -26800 -36108 -44185 9504 -84323 -65866 -6779
6938 -6779 -10611 -15307 20183 65294 -23824 -38425 13261 39930 6351 61335 24603 -146252
6926 -146252 -71089 -14719 -57053 43008 -1670 127465 123439 25783 -44935 104234 91495
6915 91495 47643 8328 26170 2226 -19963 56489 -32145 -83207 -9075 90566 38561 86384
6903 86384 -3664 -18434 -5547 -29908 -47679 -42093 -27652 -30994 59506 42055 54961 149619
6891 149619 108045 40685 -94 -1259 49999 99545 3527 38302 -33058 -2546 18637 -92709
6879 -92709 -50253 -27628 -25440 -58141 -20415 57486 15493 121916 103336 34972 113375 70170
$$ packed form
6962i8902K1445M6263r201o1329P9169n2633J2030k238j4268j169K4072o0307
6950a17068k3816R9859J18042n2208k4587k7022r308q077N3689r3827J8457N9087
6938f779l832m696L5490M5111q9118j4601N1686K6669l3579N4984l6732j70855
6926a46252P5163N6370m2334J00061m4678J29135m026r7656p0718J49169j2739
6915I1495m3852l9315J7842k3944k2189P6452q8634n1062P4132R9641n2005M7823
6903H6384r0048j4770J2887k4361j7771N586J4441l342R0500j7451J2906R4658
6891A49619m1574o7360m0779j165N1258M9546r6018L4775p1360L0512K1183j11346
6879i2709M2456K2625K188l2701L7726P7901m1993J06423j8580o8364P8403m3205
$$ plain form
6867 70170 -35036 28446 130278 113891 154793 147872 97804 98108 218112 181767 125084 151933
6855 151933 86546 67529 102719 140366 115711 67581 80359 98592 176691 151788 56360 130706
6843 130706 118896 88292 183717 298663 271431 293468 294173 298438 279634 223637 265449 319912
6831 319912 361436 406269 396572 351320 404544 464497 516044 442211 343101 263133 390597 405764
6819 405764 240553 197832 322163 181340 204548 195479 190873 205961 153158 65717 135714
6808 135714 122105 105701 62070 26342 47585 88976 134695 156042 97432 93126 118336 70781
6796 70781 -54315 -42894 23076 86840 179275 92136 55383 -11568 51476 34554 -2760 -38008
6784 -38008 -75437 -81929 -2502 -822 63099 40589 -31371 45568 39082 5092 107118 94929
$$ packed form
6867G0170j05206O3482J01832j6387M0902o921n0068L04J20004l6345n6683K6849
6855A51933o5387j9017L5190L7647k4655m8130J2778J8233P8099k4903r5428P4346
6843A30706j1810l0604R5425J14946k7232K2037P05M265j8804n5997M1812N4463
6831C19912M1524M4833r697m5252N3224N9953N1547p3833r9110p9968J27464J5167
6819D05764j65211m2721J24331j40823K3208r069m606J5088n2803q7441O9997
6808A35714j3609j6404m3631l5728K1243M1391M5719K1347n8610m306K5210m7555
6796G0781j25096J1421O5970O3764R2435q7139l6753o6951O3044j6922l7314l5248
6784c8008l7429o492P9427J680O3921k2510p1960P6939o486l3990J02026j2189
$$ plain form
6772 94929 121138 97005 -83056 -41813 -5742 -100 67885 44369 1446 -70163 45892 18761
6760 18761 51358 -63897 -42424 -2272 14456 25223 1124 1015 9809 52713 64627 25272
6748 25272 16429 87356 111967 117028 63929 49037 -57676 39390 -14546 -47250 8460 60398
6736 60398 83734 36361 55743 62106 108233 40261 -82595 -51031 11473 38432 25354 -20182
6724 -20182 -12456 -10571 -99957 -138821 -46828 -74697 -104442 -86025 -5366 -7010 6586 56817
6712 56817 52890 4557 -46250 -10397 4357 49227 21730 -15102 -61543 1897 -53946 -115918
6700 -115918 -147066 -78463 -48183 -44011 -36650 -42864 -2415 -80790 -103889 -101111 20699 17127
6688 17127 -72196 -88122 1245 27345 55707 -39272 -40442 -25714 -48148 -110786 -137181 -104123
$$ packed form
6772I4929K6209k4133j80061M1243L6071N642O7985k3516m2923p1609J16055k7131
6760A8761L2597j15255K1473M0152J6728J0767k4099j09Q794M2904J1914l9355
6748B5272q843P0927K4611N061n3099j4892j06713R7066n3936l2704N5710N1938
6736F0398K3336m7373J9382O363M6127o7972j22856L1564O2504K6959j3078m5536
6724b0182P726J885q9386l8864R1993k7869k9745J8417Q0659j644J3596N0231
6712E6817l927m8333n0807L5853J4754M4870k7497l6832m6441O3440n5843o1972
6700a15918l1148O8603L0280M172P361o214M0449p8375k3099K778J21810l572
6688A7127q9323j5926Q9367K6100K8362r4979j170J4728k2434o2638k6395L3058
$$ plain form
6676 -104123 -48358 -35630 -67024 -50337 -46505 16122 45884 99940 138150 147187 78163 -17933
6664 -17933 27892 69750 74277 64292 13519 43388 41958 -63214 -7332 27265 37346 -3551
6652 -3551 26504 33701 1619 -1644 11573 -3748 -6805 7201 16681 98374 36450 -54310 -82381
6639 -82381 10574 21718 81893 41515 93096 59615 67640 7473 86455 40231 36749 20740
6627 20740 12615 93233 -16620 -20859 55250 77521 -65060 -47501 -16703 -97871 -52708 -15716
6615 -15716 25124 -27791 -6123 19869 11025 83457 119721 103116 79929 30366 -40694 52737
6603 52737 23737 -27775 -15610 -71516 -77528 -57975 -77963 -4584 99273 133497 123338 -61280
6591 -61280 -13499 144752 130397 67020 78820 67445 59836 126898 68848 26965 74933 65245
$$ packed form
6676a04123N5765J2728l1394J6687L832O2627K9762N4056L8210R037o9024r6096
6664a7933M5825M1858M527r985n0773K9869j430j05172N5882L4597J0081m0897
6652c551L0055P197l2082l263J3217j5321l057J4006R480Q1693o1924r0760k8071
6639h2381R2955J1144O0175m0378N1581l3481Q025o0167P8982m6224l482j6009
6627B0740q125Q0618j09853m239P6109K2271j42581J7559L0798q1168M5163L6992
6615a5716M0840n2915K1668K5992q844P2432L6264j6605k3187m9563p1060R3431
6603E2737k9000n1512J2165n5906o012J9553j9988P3379J03857L4224j0159j84618
6591f1280M7781J58251j4355o3377J1800j1375p609O7062n8050m1883M7968r688
$$ plain form
6579 65245 37335 30980 26723 4939 -55584 7544 99990 101121 84453 112951 107249 116349 52377
6566 52377 160332 148142 115905 165078 289067 190697 59204 -18081 41319 156642 97929
6555 97929 48268 -23330 26662 96798 22943 39554 -18180 6867 65650 52743 28011 -7398
6543 -7398 60730 24748 -5131 34282 42955 84443 67217 137922 163932 54343 104581 14696
6531 14696 65382 -13179 -13000 -6272 7173 18204 100905 149338 75995 75115 78372 168918 112413
6518 112413 166208 199459 77429 131499 59421 -34322 -36760 35884 153123 170165 171951 233634
6506 233634 218248 134436 93549 21826 102375 153197 200491 229551 232022 122332 114655 215198
6494 215198 186820 159080 202327 273832 254482 253819 325379 257082 249151 216703 217228 249152 252889
$$ packed form
6579F5245k7910o355m257k1784o0523O3128R2446J131j6668K8498n702R100o3972
6566E2377J07955j2190l2237M9173J23989r8370j31493p7285N9400J15323n8713
6555I7929m9661p1598M9992P0136p3855J6611n7734K5047N8783j2907k4732l5409
6543g398O8128l5982k9879L9413Q673M1488j7226P0705K6010j09589N0238q9885
6531A4696N0686p8561J79O728J3445J1031Q2701M8433p3343q80L257R0546n6505
6518A12413N3795L3251j22030N4070p2078r3743k438P2644J17239J7042J786O1683
6506B33634j5386q3812m0887p1723Q0549N0822M7294K9060K471j09690p677J00543
6494B15198k8378k7740M3247P1505j9350o63P1560o8297p931l2448N25L1924L737
$$ plain form
6481 252889 274054 196501 180798 165675 165297 310921 272335 188978 209927 249763 187826 126376
6469 126376 218930 191928 169641 158919 230053 128101 56693 194307 157462 113891 143150
6458 143150 40819 147208 201807 23828 107149 141192 149473 181220 168889 172355 52328
6447 52328 127232 235305 286703 249913 210190 205498 224037 185104 168286 238251 318973 421424
6435 421424 362209 301531 249808 218997 235749 322554 341406 311446 354721 461196 412726
6424 412726 358798 350860 373077 481384 557479 448900 486110 441157 354433 393933 494031
6413 494031 387195 400679 316810 313351 374486 376346 385591 293267 287797 329342 344052 232108
6401 232108 232569 263437 277514 264405 286110 229409 186824 205675 270864 226347 279842 282921
$$ packed form
6481B52889K1165p7553j5703j5123l78J45624l8586q3357K0949L9836o1937o1450
6469A26376R2554k7002k2287j0722P1134j01952p1408J37614l6845m3571K9259
6458A43150j02331J06389N4599j77979Q3321L4043Q281L1747j2331L466j20027
6447E2328P4904J08073N1398l6790l9723m692J8539l8933j6818O9965Q0722J02451
6435D21424n9215o0678n1723l0811J6752Q6805J8852k9960M3275J06475m8470
6424D12726n3928p938K2217J08307P6095j08579L7210m4953q6724L9500J00098
6413D94031j06836J3484q3869l459O1135J860R245r2324n470M1545J4710j11944
6401B32108M61L0868J4077j3109K1705n6701m2585J8851O5189m4517N3495L079
$$ plain form
6389 282921 208006 213467 227120 290500 340052 301359 346499 361884 371898 319622 361845 351915
6377 351915 279865 270215 234008 229433 269214 388309 414651 381247 406570 269997 307035 376804
6365 376804 422531 399772 455904 368039 295548 359294 396905 446077 469881 391003 321863 389656
6353 389656 468115 446833 471053 514989 438171 385239 391062 422834 486324 589986 598319 515415
6341 515415 537901 576124 521125 471453 504650 548604 585103 668576 690939 709098 644643 597254
6329 597254 552105 610612 612281 550156 739821 811323 916441 949660 931317 960224 858949
6318 858949 846433 894663 1052014 1089167 1094347 1177330 1299675 1288849 1380879 1487942 1583789
6307 1583789 1714828 1943408 2144211 2356559 2479961 2657655 2813006 2790695 2682270 2532110
$$ packed form
6389B82921p4915N461J3653O3380M9552l8693M5140J5385J0014n2276M2223r930
6377C51915p2050r650l6207m575L9781J19095K6342l3404K5323j36573L7038O9769
6365C76804M5727k2759N6132q7865p2491O3746L7611M9172K3804p8878o9140O7793
6353C89656P8459k1282K4220M3936p6818n2932N823L1772O3490J03662Q333q2904
6341E15415K2486L8223n4999m9672L3197M3954L6499Q3473K2363J8159o4455m7389
6329E97254m5149N8507J669o2125J89665P1502J05118L3219j8343K8907j01275
6318H58949j2516M8230J57351L7153N180Q2983J22345j0826R2030J07063R5847
6307A583789J31039K28580K00803K12348J23402J77694J55351k2311j08425j50160
$$ plain form
6297 2532110 2349016 2254275 2145923 1918717 1826538 1748660 1729627 1775200 1686363 1619814 1596822
6286 1596822 1621552 1603040 1579231 1594397 1600616 1592845 1666524 1669899 1548102 1557641 1424324 1404184
6274 1404184 1418771 1419278 1292454 1336754 1435386 1294419 1243936 1260417 1230687 1268192 1264457 1275378
6262 1275378 1269313 1289194 1196925 1226001 1182307 1179453 1320018 1278530 1249024 1184231 1150846 1116965
6250 1116965 1327625 1332664 1338295 1268619 1201074 1169872 1292376 1254566 1312861 1335986 1258838
6239 1258838 1224796 1228684 1287580 1360006 1291971 1345498 1396455 1409542 1433457 1398608 1348602 1406971
6227 1406971 1420887 1361125 1440179 1529447 1605381 1430198 1449611 1468436 1430890 1454569 1446439
6216 1446439 1359188 1507585 1587588 1564244 1545095 1504925 1503901 1481806 1484514 1523438 1620344 1689568
$$ packed form
6297B532110j83094r4741j08352k27206r2179p7878j9033M5573q8837o6549k2992
6286A596822K4730j8512k3809J5166O219p771P3679L375j21797R539j33317k0140
6274A404184J4587N07j26824M4300R8632j40967n0483J6481k9730L7505l735J0921
6262A275378o065J9881r2269K9076m3694k854J40565m1488k9506o4793l3385l3881
6250A116965K10660N039N631o9676o7545l1202J22504l7810N8295K3125p7148
6239A258838l4042L888N8896P2426o8035N3527N0957J3087K3915l4849n0006N8369
6227A406971J3916n9762P9054Q9268P5934j75183J9413J8825l7546K3679q130
6216A446439q7251J48397Q0003k3344j9149m0170j024k2095K708L8924R6906O9224
$$ plain form
6204 1689568 1622998 1596807 1598357 1510663 1535259 1586389 1687949 1653404 1596669 1660212 1536469
6193 1536469 1520837 1583387 1592425 1541868 1641250 1587690 1649017 1730365 1756276 1691903 1790946 1774764
6181 1774764 1830964 1935634 1942031 1998556 2114948 2213443 2247432 2293772 2277307 2414956 2454215
6170 2454215 2510791 2545608 2538237 2554959 2484669 2473063 2488502 2514592 2598775 2594042 2626342 2589079
6158 2589079 2579863 2669575 2791988 2892475 2887243 2974951 2879706 2688391 2528355 2378948 2368808
6147 2368808 2435464 2393148 2352277 2331402 2209615 2061315 2037409 2049988 2087893 1953264 1912024
6136 1912024 1865326 1741702 1722850 1670973 1648594 1624645 1677875 1651165 1535032 1519061 1548388
6125 1548388 1521511 1409616 1480742 1529937 1538810 1486078 1407946 1421444 1393104 1546639 1515529
$$ packed form
6204A689568o6570k6191J550q7694K4596N1130J01560l4545n6735O3543j23743
6193A536469j5632O2550R038n0557R9382n3560O1327Q1348K5911o4373R9043j6182
6181A774764N6200J04670O397N6525J16392R8495L3989M6340j6465J37649L9259
6170B454215N6576L4817p371J6722p0290j1606J5439K6090Q4183m733L2300l7263
6158B589079r216Q9712J22413J00487n232Q7708r5245j91315j60036j49407j0140
6147B368808O6656m2316m0871k0875j21787j48300k3906J2579L7905j34629m1240
6136A912024m6698j23624j8852n1877k2379k3949N3230k6710j16133j5971K9327
6125A548388k6877j11895P1126M9195Q873n2732p8132J3498k8340J53535l1110
$$ plain form
6114 1515529 1509653 1484723 1502427 1421292 1456729 1468566 1494283 1534553 1618442 1550269 1439203
6103 1439203 1523761 1683905 1804796 1739208 1709013 1830654 1721575 1736335 1784501 1759211 1835695
6092 1835695 1840463 1913085 1947075 1950052 1886185 1855270 1893641 1859138 1850164 1800590 1821696 1863465
6080 1863465 1796983 1743445 1816926 1874712 1825443 1671481 1653963 1712644 1698680 1667809 1709087
6069 1709087 1679360 1506761 1395983 1459107 1556215 1511667 1534827 1510815 1482206 1449088 1449121 1392352
6057 1392352 1361068 1308476 1387465 1341912 1330172 1361026 1348931 1355904 1334685 1344312 1383269 1496419
6045 1496419 1543122 1500486 1527111 1549219 1653776 1666840 1602759 1712378 1733229 1858570 1831847
6034 1831847 1761019 1849326 1948565 2020485 2132854 2130143 2118468 2230172 2241231 2342360 2362850
$$ packed form
6114A515529n876k4930J7704q1135L5437J1837K5717M0270Q3889o8173j11066
6103A439203Q4558J60144J20891o5588l0195J21641j09079J4760M8166k5290P6484
6092A835695M768P2622L3990K977o3867l0915L8371l4503q974m9574K1106M1769
6080A863465o6482n3538P3481N7786m9269j53962j7518N8681j3964l0871M1278
6069A709087k9727j72599j10778O3124R7108m4548K3160k4012k8609l3118L3n6769
6057A392352l1284n2592P8989m5553j1740L0854j2095O973k1219R627L8957J13150
6045A496419M6703m2636K6625K2108J04557J3064o4081J09619K0851J25341k6723
6034A831847p0828Q8307R9239P1920J12369k711j1675J11704J1059J01129K0490
$$ plain form
6023 2362850 2212166 2083160 2303203 2436283 2412950 2537469 2629825 2759972 2842748 2845814
6013 2845814 2852716 3057744 3213051 3374579 3529847 3626043 3793497 3927904 3971236 4022060
6003 4022060 4129840 4157484 4210343 4329215 4342219 4178875 4132327 4132996 4150797 4087783 4036818
5992 4036818 4058295 4103536 4142904 4144799 4051408 4101593 4137763 4242284 4287145 4409018 4552036
5981 4552036 4754739 5044514 5179321 5277015 5365131 5486288 5566682 5554191 5560536 5602124 5585928
5970 5585928 5499980 5304538 5261231 5125795 5069889 4881600 4694505 4578122 4469570 4323481
5960 4323481 4170345 4146261 4059970 4085325 4180911 4158106 4182368 4343168 4495393 4494482 4544071
5949 4544071 4658918 4648826 4753613 4823187 4745334 4666063 4556018 4505224 4417461 4333889 4284457
$$ packed form
6023B362850j50684j29006K20043J33080k3333J24519R2356J30147Q2776L066
6013B845814O902K05028J55307J61528J55268R6196J67454J34407M3332N0824
6003D022060J07780K7644N2859J18872J3004j63344m6548O69J7801o3014n0965
5992D036818K1477M5241L9368J895r3391N0185L6170J04521M4861J21873J43018
5981D552036K02703K89775J34807R7694Q8116J21157Q0394j2491O345M1588j6196
5970E585928q5948j95442m3307j35436n5906j88289j87095j16383j08552j46089
5960D323481j53136k4084q6291K5355R5586k2805K4262J60800J52225r11M9589
5949D544071J14847j0092J04787O9574p7853p9271j10045n0794q7763q3572m9432
$$ plain form
5938 4284457 4132265 3888010 3754549 3754968 3781778 3542213 3363776 3270818 3107841 3020149 2964083
5927 2964083 2737178 2704969 2691859 2580918 2576309 2643557 2670351 2697837 2607143 2647290 2579934
5916 2579934 2487503 2493131 2360340 2285385 2239683 2278399 2155001 2041941 1969481 1991107 1983645
5905 1983645 1887682 1894624 1949929 1859798 1822176 1859413 1937582 1823157 1769115 1686285 1714614
5894 1714614 1775909 1788179 1835794 1793734 1655368 1684137 1682810 1628709 1551350 1575288 1483917
5883 1483917 1394609 1410387 1516799 1461379 1447803 1453175 1443905 1521201 1485966 1443163 1458779 1459509
5871 1459509 1439016 1498985 1447990 1450940 1536864 1692122 1677035 1705597 1612378 1618396 1529168 1428543
5859 1428543 1509513 1594483 1590929 1537102 1530367 1575065 1494862 1508984 1488075 1393151 1431504 1567496
$$ packed form
5938D284457j52192k44255j33461M19K6810k39565j78437r2958j62977q7692n6066
5927B964083k26905l2209j3110j10941m609O7248K6794K7486r0694M0147o7356
5916B579934r2431N628j32791p4955m5702L8716j23398j13060p2460K1626p462
5905A983645r5963O942N5305r0131l7622L7237P8169j14425n4042q2830K8329
5894A714614O1295J2270M7615m2060j38366K8769j327n4101p7359K3938r1371
5883A483917q9308J5778J06412n5420j3576N372r270P7296l5235m2803J5616P30
5871A459509k0493N9969n0995K950Q5924J55258j5087K8562r3219O018q9228j00625
5859A428543Q0970Q4970l554n3827o735M4698q0203J4122k0909r4924L8353J35992
$$ plain form
5847 1567496 1615625 1548529 1591664 1673993 1639583 1623201 1683722 1717274 1773557 1726181 1772888
5836 1772888 1799361 1854472 1901124 1933433 2006405 2030210 1951990 2038782 2077301 2056780 2070324
5825 2070324 2102147 2138747 2119760 2068995 2141925 2162021 2170952 2335183 2423288 2400559 2414325
5814 2414325 2592403 2642516 2717108 2945268 3030333 3209530 3447285 3649011 3755618 3818910
5804 3818910 3896708 4013451 4020498 4013200 4145801 3996469 3974497 3917970 3923730 3910090 4094200
5793 4094200 4252541 4447110 4557137 4667191 4584341 4302522 4049722 3629531 3403574 3314022
5783 3314022 3263598 3209551 3219691 3181402 3142417 3141205 3164939 3293857 3341700 3418327 3350628
5772 3350628 3292994 3307354 3368217 3429386 3432477 3514594 3492301 3508384 3559445 3702824 3836151
$$ packed form
5847A567496M8129o7096M3135Q2329l4410j6382O0521L3552N6283m7376M6707
5836A772888K6473N5111M6652L2309P2972K3805p8220Q6792L8519k0521J3544
5825B070324L1823L6600j8987n0765P2930K0096Q931J64231Q8105k2729J3766
5814B414325J78078N0113P4592K28160Q5065J79197K37755K01726J06607O3292
5804C818910P7798J16743P047p298J32601j49332k1972n6527N760j3640J84110
5793D094200J58341J94569J10027J10054q2850k81819k52800m20191k25957q9552
5783C314022n0424n4047J0140l8289l8985j212K3734J28918M7843P6627o7699
5772C350628n7634J4360O0863O1169L091Q2117k2293J6083N1061J43379J33327
$$ plain form
5761 3836151 3823760 3844098 3929806 4032983 4114773 4166761 4177465 4105693 4103306 4130070 4102348
5750 4102348 4024158 3976480 3996314 3999700 4071261 4151945 4124954 3997484 3953403 4014608 4037308
5739 4037308 4078647 4027295 4022011 3914872 3733287 3681915 3667852 3612117 3543041 3520724 3467413
5728 3467413 3454333 3413859 3452947 3489982 3381706 3388277 3397154 3386118 3288261 3338253 3358947 3178601
5716 3178601 3110147 3117027 2962378 3035201 2952646 2815305 2857917 2810820 2813445 2765155 2621564
5705 2621564 2651567 2682269 2720538 2745953 2745584 2706225 2671780 2649725 2602836 2532289 2533737 2619892
5693 2619892 2661127 2577235 2550243 2502173 2467647 2407864 2347999 2419148 2435353 2371212 2386753
5682 2386753 2471035 2552342 2729989 2678573 2661750 2753535 2817559 2813704 2940458 3093976 3130557
$$ packed form
5761C836151j2391K0338Q5708J03177Q1790N1988J0704p1772k387K6764k7722
5750D102348p8190m7678J9834L386P1561Q0684k6991j27470m4081O1205K2700
5739D037308M1339n1352n284j07139j81585n1372j4063n5735o9076k2317n3311
5728C467413j3080m0474L9088L7035j08276O571Q877j1036r7857M9992K0694j80346
5716C178601o8454O880j54649P2823q2555j37341M2612m7097K625m8290j43591
5705B621564L0003L0702L8269K5415l69l9359l4445k2055m6889p0547J448Q6155
5693B619892M1235q3892k6992m8070l4526n9783n9865P1149J6205o4141J5541
5682B386753Q4282Q1307J77647n1416j6823R1785O4024l855J26754J53518L6581
$$ plain form
5671 3130557 3055459 3081002 3070806 3030909 2868193 2810782 2766231 2746439 2685389 2695469 2621566
5660 2621566 2542214 2484100 2443303 2471312 2535233 2482422 2443250 2433989 2397235 2473583 2491291 2511185
5648 2511185 2417754 2444366 2472739 2574994 2619070 2645424 2664031 2850087 2744035 2723436 2765533
5637 2765533 2771596 2697492 2683059 2808349 2856508 2903891 2966906 3028086 2912087 2976537 3051310
5626 3051310 3099932 3092311 3097272 3154056 3149321 3160146 3173174 3274774 3314082 3425265 3417023 3414028
5614 3414028 3557450 3670253 3752485 3797197 3907453 3940439 4039322 4011712 4017049 4080144 4062202
5603 4062202 3994218 3883644 3811792 3790690 3692927 3750938 3866602 3852166 3814319 3736159 3744063
5592 3744063 3832552 3834716 3866635 3889554 3959440 4064505 4026478 3988065 4079263 4254453 4221779
$$ packed form
5671C130557p5098K5543j0196l9897j62716n7411m4551j9792o1050J0080p3903
5660B621566p9352n8114m0797K8009O3921n2811l9172r261l6754P6348J7708J9894
5648B511185r3431K6612K8373J02255M4076K6354J8607J86056j06052k0599M2097
5637B765533O063p4104j4433J25290M8159M7383O3015O1180j15999O4450P4773
5626C051310M8622p621M961N6784m735J0825J3028J01600L9308J11183q242k995
5614C414028J43422J12803Q2232M4712J10256L2986R8883k7610N337O3095j7942
5603D062202o7984j10574p1852k1102r7763N8011J15664j4436l7847p8160P904
5592C744063Q8489K164L1919K2919O9886J05065l8027l8413R1198J75190l2674
$$ plain form
5581 4221779 4142891 4273453 4239389 4283041 4303121 4353284 4459220 4563746 4563804 4675438 4738835
5570 4738835 4767288 4848144 4847924 4956952 5088265 5122784 5217209 5352132 5633790 5964735 6127810
5559 6127810 6264036 6275713 6295073 6178932 6222112 6286473 6403622 6429099 6520074 6624132 6812848
5548 6812848 7039595 7295956 7549481 7843806 8111754 8451512 8902535 9367453 9906330 10449231
5538 10449231 11201905 12082557 13207045 14324953 15342898 16257370 16840274 17631000 18716821
5529 18716821 20052324 21712895 23419045 24704196 25258285 25325110 24870331 23778387 22115064
5520 22115064 20211576 18594016 17467504 16596628 16065037 15687533 15644154 15594179 15433242
5511 15433242 15162196 14788225 14305621 14146211 14034636 13987003 13999824 14284494 14531603 14552342
$$ packed form
5581D221779p8888J30562l4064M3652K0080N0163J05936J04526N8J11634O3397
5570D738835K8453Q0856k20J09028J31313L4519R4425J34923K81658L30945J63075
5559F127810J36226J1677J9360j16141M3180O4361J17149K5477R0975J04058J88716
5548F812848K26747K56361K53525K94325K67948L39758M51023M64918N38877N42901
5538A0449231P52674Q80652J124488J117908J017945R14472N82904P90726J085821
5529A8716821J335503J660571J706150J285151N54089O6825m54779j091944j663323
5520B2115064j903488j617560j126512q70876n31591l77504m3379m9975j60937
5511A5433242k71046l73971m82604j59410j11575m7633J2821K84670K47109K0739
$$ plain form
5501 14552342 14409906 13911673 13474260 13140481 12911702 12753428 12648068 12554240 12549863 12475489
5491 12475489 12519668 12638201 12762337 12829419 12982605 13140219 13245700 13444597 13784179 13991432
5481 13991432 14262929 14616145 15124652 15695058 16192770 16479584 16929112 17194947 17486459
5472 17486459 17757385 18085830 18577789 18958981 19349623 19904766 20498704 21232639 22000974
5463 22000974 22742435 23832743 24969139 26216676 27624647 29193176 31005284 32837504
5455 32837504 34880097 37072302 39641696 42600594 45825818 49662015 54045883 58897116
5447 58897116 64470372 70605227 77195754 84023403 90911826 97659524 104044916 110221117
5439 110221117 115971352 121531552 126120102 129126532 129912941 128010984 123664471 117617059
$$ packed form
5501A4552342j42436m98233m37413l33779k28779j58274j05360r3828m377p4374
5491A2475489M4179J18533J24136O7082J53186J57614J05481J98897L39582K07253
5481A3991432K71497L53216N08507N70406M97712K86814M49528K65835K91512
5472A7486459K70926L28445M91959L81192L90642N55143N93938P33935P68335
5463B2000974P41461J090308J136396J247537J407971J568529J812108J832220
5455C2837504K042593K192205K569394K958898L225224L836197M383868M851233
5447E8897116N573256O134855O590527O827649O888423O747698O385392O176201
5439A10221117N750235N560200M588550L006430P86409j901957m346513o047412
$$ plain form
5431 117617059 110656685 103354032 95833963 88347631 80874041 73527390 66480159 59977244
5423 59977244 54167032 49097990 44711861 40813480 37471775 34472225 31926723 29726677
5415 29726677 27797271 26094456 24615146 23231161 21916810 20790733 19709042 18793639
5407 18793639 17848845 17047729 16397765 15634089 15031176 14493078 13883581 13409218 12955711
5398 12955711 12479127 12033212 11622657 11301265 10959499 10602743 10335690 9995580 9687078
5389 9687078 9408301 9171385 8934846 8674990 8462246 8321137 8116091 7852394 7669038 7645837
5379 7645837 7516854 7425658 7327280 7232596 7175723 7102596 6980730 6867574 6781832 6690751 6753909
5368 6753909 6722681 6730162 6809215 6707809 6577986 6345731 6132073 6115779 5975318 5939741 5852018
$$ packed form
5431A17617059o960374p302653p520069p486332p473590p346651p047231o502915
5423E9977244n810212n069042m386129l898381l341705k999550k545502k200046
5415B9726677j929406j702815j479310j383985j314351j126077j081691r15403
5407A8793639r44794q01116o49964p63676o02913n38098o09497m74363m53507
5398A2955711m76584m45915m10555l21392l41766l56756k67053l40110l08502
5389I687078k78777k36916k36539k59856k12744j41109k05046k63697j83356k3201
5379G645837j28983r1196r8378r4684n6873p3127j21866j13156q5742r1081O3158
5368F753909l1228P481P9053j01406j29823k32255k13658j6294j40461l5577q7723
$$ plain form
5357 5852018 5822256 5823834 5736367 5669797 5548523 5559766 5499356 5484692 5516448 5430175 5495215
5346 5495215 5458448 5420870 5400339 5439132 5456974 5571715 5601860 5681036 5641003 5606038 5639146
5335 5639146 5658135 5679379 5816546 5877787 6070386 6293689 6357762 6602576 6864724 7342649
5325 7342649 7750095 8147101 8577642 9030615 9569890 9963162 10311404 10646036 10834592 10856735
5315 10856735 10883738 10773370 10533592 10532443 10500550 10422499 10384625 10431104 10378684 10356053 10437119
5304 10437119 10567397 10565403 10609681 10706051 10820643 11016952 11320982 11529518 11610106 11754936
5294 11754936 11904220 11966600 11942466 11763409 11601327 11446647 11293998 11332468 11230945 11244114
5284 11244114 11412171 11414127 11418103 11555709 11626236 11840563 12116477 12163296 12185092 12409396 12401041
$$ packed form
5357E852018k9762J578q7467o6570j21274J1243o0410j4664L1756q6273O5040
5346E495215l6767l7578k0531L8793J7842J14741L0145P9176m0033l4965L3108
5335E639146J8989K1244J37167O1241J92599K23303O4073K44814K62148M77925
5325G342649M07446L97006M30541M52973N39275L93272L48242L34632J88556K2143
5315A0856735K7003j10368k39778j149l1893p8051l7874M6479n2420k2631Q1066
5304A0437119J30278j994M4278R6370J14592J96309L04030K08536Q0588J44830
5294A1754936J49284O2380k4134j79057j62082j54680j52649L8470j01523J3169
5284A1244114J68057J956L976J37606P0527K14327K75914M6819K1796K24304q355
$$ plain form
5273 12401041 12347433 12344343 12432554 12481579 12457724 12587772 12589460 12679316 12579526 12461488 12337542
5262 12337542 12201529 12087173 11873269 11648129 11327964 11145203 11157564 11178540 11177845 11054509
5252 11054509 10944607 10978247 11107753 11367562 11786166 12229748 12461036 12531182 12201140 11687362
5242 11687362 11278304 10984418 10855276 10688039 10613016 10551636 10523024 10423380 10173280 9895476
5232 9895476 9739433 9505956 9284234 8928024 8646747 8520836 8212016 7922906 7652096 7358633
5222 7358633 7073937 6784509 6420411 6137725 5929012 5745904 5477473 5347723 5298645 5191528
5212 5191528 5105481 4955230 4908648 4935659 4796878 4647143 4605172 4656400 4797894 4746760 4745614
5201 4745614 4896076 4940645 5033269 5084472 5055785 4973389 4884431 4752606 4622981 4435914 4272841
$$ packed form
5273A2401041n3608l090Q8211M9025k3855J30048J688Q9856r9790j18038j23946
5262A2337542j36013j14356k13904k25140l20165j82761J2361K0976o95j23336
5252A1054509j09902L3640J29506K59809M18604M43582K31288P0146l30042n13778
5242A1687362m09058k93886j29142j67237p5023o1380k8612r9644k50100k77804
5232I895476j56043k33477k21722l56210k81277j25911l08820k89110k70810k93463
5222G358633k84696k89428l64098k82686k08713j83108k68431j29750m9078j07117
5212E191528q6047j50251m6582K7011j38781j49735m1971N1228J41494n1134j146
5201D745614J50462M4569R2624N1203k8687q2396q8958j31825j29625j87067j63073
$$ plain form
5190 4272841 4184912 4157918 4090632 3942680 3949817 4005561 3999793 3988963 3934825 3862158 3869977 3851227
5178 3851227 3943556 3976605 4015178 3991081 3978142 3992748 3922968 3934004 3949295 3943855 3908259 3851621
5166 3851621 3844155 3913731 3907682 3909004 3897830 4021539 3999119 3954422 3959909 4029517 4083347 4014983
5154 4014983 3918853 4009679 4077057 4131033 4171473 4164183 4206195 4203153 4310315 4387627 4345263 4410589
5142 4410589 4464083 4575113 4600364 4763634 4901743 5003001 5130514 5249998 5329179 5415714
5132 5415714 5550066 5588923 5699822 5916195 5984785 6099523 6203186 6232253 6309387 6271389
5122 6271389 6461222 6611228 6640033 6715739 6837305 6991667 7211889 7350930 7702255 7979743
5112 7979743 8162554 8451329 8702374 8954504 9128640 9288720 9361184 9411371 9700232 9849861
$$ packed form
5190D272841q7929k6994o7286j47952P137N5744n768j0830n4138p2667P819j8750
5178C851227R2329L3049L8573k4097j2939J4606o9780J1036J5291n440l5596n6638
5166C851621p466O9576o049J322j1174J23709k2420m4697N487O9608N3830o8364
5154D014983r6130R0826O7378N3976M0440p290M2012l042J07162P7312m2364O5326
5142D410589N3494J11030K5251J63270J38109J01258J27513J19484P9181Q6535
5132E415714J34352L8857J10899K16373O8590J14738J03663K9067P7134l7998
5122F271389J89833J50006K8805P5706J21566J54362K20222J39041L51325K77488
5112G979743J82811K88775K51045K52130J74136J60080P2464N0187K88861J49629
$$ plain form
5102 9849861 10012084 10207982 10488881 10764066 11054306 11344867 11614802 11995416 12337143 12580074
5092 12580074 12797227 13011505 13210353 13314167 13472768 13606924 13654521 13662758 13672852 13744105
5082 13744105 13878248 13971483 14100924 14318216 14383416 14574931 14854960 15098773 15206130 15198850
5072 15198850 14975303 14445508 14072107 13634075 13253950 12966281 12854683 12831725 12836589 12853205
5062 12853205 12908408 13063503 13199746 13428661 13602160 13641360 13855619 13901503 13910746 14059667
5052 14059667 13995036 13933010 13778153 13562868 13336425 12959633 12585597 12372343 12253601 11959852
5042 11959852 11693924 11564261 11281671 10983765 10717485 10606641 10295634 9980254 9809726
5033 9809726 9666186 9484174 9221657 9048032 8985382 8846649 8735609 8726176 8625646 8594992
$$ packed form
5102I849861J62223J95898K80899K75185K90240K90561K69935L80614L41727K42931
5092A2580074K17153K14278J98848J03814J58601J34156M7597Q237J0094P1253
5082A3744105J34143R3235J29441K17292O5200J91515K80029K43813J07357p280
5072A5198850k23547n29795l73401m38032l80125k87669j11598k2958M864J6616
5062A2853205N5203J55095J36243K28915J73499L9200K14259M5884R243J48921
5052A4059667o4631o2026j54857k15285k26443l76792l74036k13254j18742k93749
5042A1959852k65928j29663k82590k97906k66280j10844l11007l15380j70528
5033I809726j43540j82012k62517j73625o2650j38733j11040r433j00530l0654
$$ plain form
5023 8594992 8422287 8425033 8492733 8514808 8452347 8382899 8431421 8522050 8652330 8707970 8695042
5012 8695042 8663165 8502685 8314028 8282267 8062290 7909431 7911387 7720141 7468793 7306883
5002 7306883 7052346 6729462 6494287 6314448 6151299 5912279 5649859 5457077 5191242 4919788
4992 4919788 4801715 4700473 4612399 4563471 4449358 4385709 4229311 4211948 4142174 4175751 4299316
4981 4299316 4259024 4265618 4313717 4251480 4332416 4339040 4322179 4348914 4327676 4260594 4184249 4194934
4969 4194934 4166077 4096131 4167123 4178811 4115810 4024391 3946788 3944475 3920530 3872435 3922254 3859797
4957 3859797 3896524 3885341 3726603 3523378 3577980 3600640 3490732 3447133 3386236 3393604 3371237
4946 3371237 3418210 3379339 3362072 3302431 3329876 3371667 3270232 3274061 3241478 3261292 3172022
$$ packed form
5023H594992j72705K746O7700K2075o2461o9448M8522R0629J30280N5640j2928
5012H695042l1877j60480j88657l1761k19977j52859J956j91246k51348j61910
5002G306883k54537l22884k35175j79839j63149k39020k62420j92782k65835k71454
4992D919788j18073j01242q8074m8928j14113o3649j56398j7363o9774L3577J23565
4981D299316m0292O594M8099o2237Q0936O624j6861K6735k1238o7082p6345J0685
4969D194934k8857o9946P0992J1688o3001r1419p7603k313k3945m8095M9819o2457
4957C859797L6727j1183j58738k03225N4602K2660j09908m3599o0897P368k2367
4946C371237M6973l8871j7267n9641K7445M1791j01435L829l2583J9814q9270
$$ plain form
4935 3172022 3123363 3168448 3264308 3217002 3217704 3158243 3062692 2949457 2976362 3064526 3007565 3053368
4923 3053368 3068300 3087158 3113533 3114216 3081031 3151375 3135110 3237512 3236327 3158285 3205323 3244392
4911 3244392 3213065 3218908 3262606 3331744 3204887 3269436 3188777 3224990 3249110 3315071 3341173
4900 3341173 3305725 3255865 3282464 3333641 3266083 3273838 3289779 3345760 3296593 3227506 3252209 3342806
4888 3342806 3222389 3163645 3214853 3193385 3180042 3197294 3226066 3176974 3201984 3278643 3165984
4877 3165984 3166336 3363316 3381770 3391008 3360923 3373357 3415888 3381527 3439124 3459518 3381678 3384929
4865 3384929 3425303 3452773 3396054 3471604 3386824 3301009 3369633 3356561 3298121 3320001 3345545
4854 3345545 3358396 3323501 3268405 3319596 3366663 3400698 3391658 3405707 3436989 3581229 3509424
$$ packed form
4935C172022m8659M5085R5860m7306P02n9461r5551j13235K6905Q8164n6961M5803
4923C053368J4932J8858K6375O83l3185P0344j6265J02402j185p8042M7038L9069
4911C244392l1327N843M3698O9138j26857O4549q0659L6213K4120O5961K6102
4900C341173l5448m9860K6599N1177o7558P755J5941N5981m9167o9087K4703R0597
4888C342806j20417n8744N1208k1468j3343J7252K8772m9092K5010P6659j12659
4877C165984L52J96980J8454R238l0085J2434M2531l4361N7597K0394p7840L251
4865C384929M0374K7470n6719P5550q4780q5815O8624j3072n8440K1880K5544
4854C345545J2851l4895n5096N1191M7067L4035r040J4049L1282J44240p1805
$$ plain form
4843 3509424 3458925 3538227 3486204 3610662 3637537 3622059 3603632 3580637 3625442 3753110 3848996
4832 3848996 3997748 4008439 3959498 3949752 4041747 4044846 4110664 4188503 4318535 4283110 4301154
4821 4301154 4458081 4433485 4337489 4205250 4263951 4332469 4333084 4432287 4509624 4561382 4616338
4810 4616338 4719408 4817745 4760654 4730430 4689656 4699463 4702814 4781015 4761594 4755440 4716644 4902727
4798 4902727 4844001 4799791 4850991 4907721 4862229 4916422 5064950 5141395 5204963 5210774 5232508
4787 5232508 5335059 5317859 5283017 5424651 5596494 5514978 5628817 5742103 5816421 6020891
4777 6020891 6049703 6223087 6357302 6482875 6661874 6703272 6906721 6998341 7159862 7236161
4767 7236161 7358315 7372828 7473712 7457597 7461754 7533452 7614723 7548729 7725020 7945335 8084510
$$ packed form
4843C509424n0499P9302n2023J24458K6875j5478j8427k2995M4805J27668R5886
4832C848996J48752J0691m8941r746R1995L099O5818P7839J30032l5425J8044
4821D301154J56927k4596r5996j32239N8701O8518O15R9203P7337N1758N4956
4810D616338J03070R8337n7091l0224m0774R807L351P8201j9421o154l8796J86083
4798D902727n8726m4210N1200N6730m5492N4193J48528P6445O3568N811K1734
4787E232508J02551j7200l4842J41634J71843q1516J13839J13286P4318K04470
4777F020891K8812J73384J34215J25573J78999M1398K03449R1620J61521P6299
4767G236161J22154J4513J00884j6115M157P1698Q1271o5994J76291K20315J39175
$$ plain form
4756 8084510 8203242 8150309 8234287 8369659 8585364 8577503 8574841 8629190 8684112 8762810 8823055
4745 8823055 8896140 8977295 9024136 9159672 9270844 9321442 9402789 9623520 9730978 9847088
4735 9847088 10136831 10314167 10575497 10888644 11128259 11411808 11651365 11846503 12074209 12189810
4725 12189810 12158882 12295402 12352075 12363359 12385576 12519550 12572675 12768363 12992438 13145045
4715 13145045 13286501 13485010 13787173 14047103 14254872 14428863 14619396 14811182 15031349
4706 15031349 15476044 15687695 16026214 16392712 16814968 17122616 17489548 18010746 18474999
4697 18474999 19052364 19603237 20128072 20849986 21526742 22477721 23336797 24186080 25215670
4688 25215670 26132083 27113957 28088734 29021233 29802378 30777163 31548386 32422633 33322767
$$ packed form
4756H084510J18732n2933Q3978J35372K15705p861k662N4349N4922P8698O0245
4745H823055P3085Q1155M6841J35536J11172N0598Q1347K20731J07458J16110
4735I847088K89743J77336K61330L13147K39615K83549K39557J95138K27706J15601
4725A2189810l0928J36520N6673J1284K2217J33974N3125J95688K24075J52607
4715A3145045J41456J98509L02163K59930K07769J73991J90533J91786K20167
4706A5031349M44695K11651L38519L66498M22256L07648L66932N21198M64253
4697A8474999N77365N50873N24835P21914O76756R50979Q59076Q49283J029590
4688B5215670R16413R81874R74777R32499P81145R74785P71223Q74247R00134
$$ plain form
4679 33322767 34198866 35257566 36512493 37937043 39272136 40624556 41938342 43294861
4671 43294861 44338721 45223060 46063320 46715959 47313752 47950002 48473195 49114035 49885970
4662 49885970 50744036 51818048 53138174 54802275 56918430 59166754 61916288 65156605
4654 65156605 68869026 73097604 77549399 82057510 86370612 89846642 92131292 93081172
4646 93081172 92898510 91947861 90356058 88581791 87088489 86296823 86469238 87616342 89635696
4637 89635696 92542581 96098032 100116310 104238283 108181319 111629129 114456209 116445179
4629 116445179 117430042 117410609 116755846 115549995 113850795 112129327 110354178 108895993 107878561
4620 107878561 107154355 106738780 106504914 106350657 106226488 105943479 105459945 104962696 104165637
$$ packed form
4679C3322767Q76099J058700J254927J424550J335093J352420J313786J356519
4671D3294861J043860Q84339Q40260O52639N97793O36250N23193O40840P71935
4662D9885970Q58066J074012J320126J664101K116155K248324K749534L240317
4654F5156605L712421M228578M451795M508111M313102L476030K284650R49880
4646I3081172j82662r50649j591803j774267j493302p91666J72415J147104K019354
4637H9635696K906885L555451M018278M121973L943036L447810K827080J988970
4629A16445179R84863j9433o54763j205851j699200j721468j775149j458185j017432
4620A07878561p24206m15575k33866j54257j24169k83009m83534m97249p97059
$$ plain form
4611 104165637 103174001 101848806 100277331 98461321 96644904 94567485 92541651 90568331
4603 90568331 88708041 87018987 85470239 83970391 82516803 80983883 79456752 77870648
4595 77870648 76290109 74682575 73057610 71324589 69497005 67596193 65574091 63450053
4587 63450053 61251706 59124209 57073060 55122023 53407236 51722537 49974646 48307924
4579 48307924 46726385 45466448 44258286 43232982 42243952 41319639 40298118 39130807
4571 39130807 38299982 37455588 36505799 35678392 34811712 33961092 33155474 32344797 31580981
4562 31580981 30748366 29982610 29317008 28626237 27856766 27130787 26455812 25757689 24929415
4553 24929415 24226032 23491321 22764000 22083831 21420932 20854143 20290383 19770910 19308105
$$ packed form
4611A04165637r91636j325195j571475j816010j816417k077419k025834j973320
4603I0568331j860290j689054j548748j499848j453588j532920j527131j586104
4595G7870648j580539j607534j624965j733021j827584j900812k022102k124038
4587F3450053k198347k127497k051149j951037j714787j684699j747891j666722
4579D8307924j581539j259937j208162j025304r89030r24313j021521j167311
4571C9130807q30825q44394r49789q27407q66680q50620q05618q10677p63816
4562C1580981q32615p65756o65602o90771p69471p25979o74975o98123q28274
4553B4929415p03383p34711p27321o80169o62899n66789n63760n19473m62805
$$ plain form
4544 19308105 18814198 18447738 18113800 17743628 17411272 17092727 16798719 16542853 16243197
4535 16243197 15882145 15762197 15673838 15612196 15365858 15064025 14897471 14796797 14794636 14847505
4525 14847505 14614685 14588350 14572856 14487742 14386865 14367660 14370989 14368931 14352442 14299813 14314086
4514 14314086 14428633 14496059 14584034 14652312 14693700 14662703 14746541 14863096 14966888 15089497
4504 15089497 15203678 15287727 15393936 15471589 15521986 15549882 15523821 15645570 15834457 15962089
4494 15962089 15864557 15857271 15999570 16201987 16426463 16528336 16724892 16888569 16968265 17093604
4484 17093604 17275878 17466591 17566604 17775321 17979394 18144500 18230777 18378259 18562604 18721334
4474 18721334 19019952 19467397 19687710 20067315 20547331 20965721 21370762 21838255 22397526
$$ packed form
4544A9308105m93907l66460l33938l70172l32356l18545k94008k55866k99656
4535A6243197l61052j19948q8359o1642k46338l01833j66554j00674k161N2869
4525A4847505k32820k6335j5494q5114j00877j9205L329k058j6489n2629J4273
4514A4314086J14547O7426Q7975O8278M1388l0997Q3838J16555J03792J22609
4504A5089497J14181Q4049J06209P7653N0397K7896k6061J21749J88887J27632
4494A5962089r7532p286J42299K02417K24476J01873J96556J63677P9696J25339
4484A7093604J82274J90713J00013K08717K04073J65106Q6277J47482J84345J58730
4474A8721334K98618M47445K20313L79605M80016M18390M05041M67493N59271
$$ plain form
4465 22397526 22968024 23537829 24145279 24910911 25628685 26482734 27190802 27891483 28778296
4456 28778296 29700931 30774067 32034291 33203575 34594108 36151446 37839797 39599327
4448 39599327 41485171 43669000 45802601 48209707 50898912 53905573 57476128 61612727
4440 61612727 66329576 71699042 77816152 84796302 93042461 102834051 114177486 127440248
4432 127440248 142674712 160240283 180624168 204242521 230528939 256256825 273964625
4425 273964625 275748847 261357258 236669008 206936699 177386936 151762791 131206092
4418 131206092 115006982 102200363 92060868 83698232 76817074 71008146 66062680 61777735
4410 61777735 57977051 54592672 51677358 49214860 47012671 45036898 43281555 41585082
$$ packed form
4465B2397526N70498N69805O07450P65632P17774Q54049P08068P00681Q86813
4456B8778296R22635J073136J260224J169284J390533J557338J688351J759530
4448C9599327J885844K183829K133601K407106K689205L006661L570555M136599
4440F1612727M716849N369466O117110O980150Q246159R791590J1343435J3262762
4432A27440248J5234464J7565571K0383885K3618353K6286418K5727886J7707800
4425B73964625J784222j4391589k4688250k9732309k9549763k5624145k0556699
4418A31206092j6199110j2806619j0139495q362636o881158n808928m945466m284945
4410F1777735l800684l384379k915314k462498k202189j975773j755343j696473
$$ plain form
4402 41585082 39915377 38501317 37120856 35670785 34485525 33461310 32457694 31534755
4394 31534755 30727909 29957254 29247344 28618033 28113815 27737331 27392768 27123960 26902560
4385 26902560 26588567 26469656 26315325 26241509 26296678 26318828 26250143 25939534 25661934 25209486
4375 25209486 24917422 24681630 24457562 24355767 24276837 24276693 24186409 24197960 24285184 24264766 24183766
4364 24183766 24261270 24285587 24462550 24581580 24718380 24994373 25382164 25762103 26206209 26701039
4354 26701039 27427864 28136554 28964612 29767973 30437813 30893723 31130832 31247928 31156733 30805187
4344 30805187 30473697 30469795 30569154 30775420 31351691 32252625 33052750 34017443 35047017 35982115
4334 35982115 36760536 37493394 37880936 38130612 38502647 38963498 39571452 40561403 41598615
$$ packed form
4402D1585082j669705j414060j380461j450071j185260j024215j003616r22939
4394C1534755q06846p70655p09910o29311n04218l76484l44563k68808k21400
4385B6902560l13993j18911j54331p3816N5169K2150o8685l10609k77600m52448
4375B5209486k92064k35792k24068j01795p8930j44r0284J1551Q7224k0418q1000
4364B4183766P7504K4317J76963J19030J36800K75993L87791L79939M44106M94830
4354B6701039P26825P08690Q28058Q03361O69840M55910K37109J17096r1195l51546
4344C0805187l31490l902R9359K06266N76271R00934Q00125R64693J029574R35098
4334C5982115P78421P32858L87542K49676L72035M60851O07954R89951J037212
$$ plain form
4325 41598615 42844241 44389615 46038861 48007893 50193176 52648544 55583017 58922597
4317 58922597 62794832 67259271 72421119 78558369 85803127 94264560 104091423 115761796
4309 115761796 129677087 145995244 165450077 188268802 213302996 237686357 257837271
4302 257837271 270967897 274862081 268357477 252822368 229865598 202308126 174164156
4295 174164156 148783363 128012557 111836445 99451868 89983744 82544200 76673726
4288 76673726 71815766 67719073 64218793 61269838 58773013 56748112 55064532 53610883
4280 53610883 52521734 51485251 50731050 50200246 49695855 49422305 49231523 48958327 48513494
4271 48513494 47989917 47368558 46463111 45321983 44001494 42630555 41154169 39652486 38127832
$$ packed form
4325D1598615J245626J545374J649246J969032K185283K455368K934473L339580
4317E8922597L872235M464439N161848O137250P244758Q461433R826863J1670373
4309A15761796J3915291J6318157J9454833K2818725K5034194K4383361K0150914
4302B57837271J3130626L894184o504604j5535109k2956770k7557472k8143970
4295A74164156k5380793k0770806j6176112j2384577r468124p439544n870474
4288G6673726m857960m096693l500280k948955k496825k024901j683580j453649
4280E3610883j089149j036483p54201n30804n04391k73550j90782k73196m44833
4271D8513494n23577o21359r05447j141128j320489j370939j476386j501683j524654
$$ plain form
4262 38127832 36675736 35271491 34118199 33039189 32091797 31192405 30291207 29546354 28852707
4253 28852707 28401204 28156677 27832972 27752447 27823136 27943330 28217015 28136812 27704935 26927929
4243 26927929 25706721 24388125 23118572 22057280 21085254 20307150 19593731 19067997 18604770
4234 18604770 18324315 18167155 18045324 17921456 17725034 17447311 17212366 16865079 16324849
4225 16324849 15675342 15155654 14700495 14248757 13881445 13599611 13270595 12890780 12737733
4216 12737733 12572993 12324517 12018310 11821439 11550694 11228883 11032148 10857721 10611772
4207 10611772 10486818 10258517 10041667 9969851 9803030 9699161 9666508 9548860 9451648 9335569
4197 9335569 9289336 9211287 9131589 9126517 9179775 9163201 9101665 9202542 9218254 9234878 9209766
$$ packed form
4262C8127832j452096j404245j153292j079010r47392q99392r01198p44853o93647
4253B8852707m51503k44527l23705q0525P0689J20194K73685q0203m31877p77006
4243B6927929j221208j318596j269553j061292r72026p78104p13419n25734m63227
4234A8604770k80455j57160j21831j23868j96422k77723k34945l47287n40230
4225A6324849o49507n19688m55159m51738l67312k81834l29016l79815j53047
4216A2737733j64740k48476l06207j96871k70745l21811j96735j74427k45949
4207A0611772j24954k28301k16850p1816j66821j03869l2653j17648r7212j16079
4197I335569m6233p8049p9698n072N3258j6574o1536J00877J5712J6624k5112
$$ plain form
4186 9209766 9241004 9255471 9331959 9244146 9228966 9196455 9072606 8831900 8661865 8551504 8352537
4175 8352537 8218493 8123833 8086092 7894406 7764446 7835639 7763048 7543019 7601822 7518411 7340367
4164 7340367 7242271 7245008 7206740 7176474 7045485 6985923 6944448 6844620 6802425 6699070 6627501
4153 6627501 6598627 6489855 6537625 6495563 6422146 6440594 6423774 6453718 6534084 6438330 6444991
4142 6444991 6519117 6522712 6571448 6580226 6419876 6421928 6555436 6654476 6617611 6669622 6806901
4131 6806901 6838201 6894990 6916762 7038012 7118276 7330077 7486941 7569524 7733989 7831011 7941811
4120 7941811 7997390 7939833 7933413 7814180 7721856 7651543 7567781 7509883 7382180 7207818 7089570
4109 7089570 6889933 6780217 6825601 6791258 6795407 6778031 6850574 6859672 6951990 7055888 7185381
$$ packed form
4186I209766L1238J4467P6488q7813j5180l2511j23849k40706j70035j10361j98967
4175H352537j34044r4660l7741j91686j29960P1193p2591k20029N8803q3411j78044
4164G340367r8096K737l8268l0266j30989n9562m1475r9828m2195j03355p1569
4153F627501k8874j08772M7770m2062p3417J8448j6820K9944Q0366r5754O661
4142F444991P4126L595M8736Q778j60350K052J33508R9040l6865N2011J37279
4131F806901L1300N6789K1772J21250Q0264K11801J56864Q2583J64465R7022J10800
4120G941811N5579n7557o420j19233r2324p0313q3762n7898j27703j74362j18248
4109G089570j99637j09716M5384l4343M149j7376P2543R098R2318J03898J29493
$$ plain form
4098 7185381 7326010 7363529 7446523 7533313 7616341 7672823 7929882 8082931 8245487 8610182
4088 8610182 8947143 9267527 9687664 10149221 10668632 11241494 11912158 12553693 13062905 13404435
4078 13404435 13507368 13352445 12950102 12430577 11685250 10866655 10222405 9682304 9250223
4069 9250223 8942630 8643941 8425861 8343837 8162705 7922846 7903665 7879778 7896755 7895734 7844713
4058 7844713 7877076 7899851 7880858 7864273 7776158 7691229 7648871 7718520 7755319 7626520 7627077 7740709
4046 7740709 7824911 7839602 7863507 7925750 8078219 8227636 8328092 8384206 8482833 8506820 8621546
4035 8621546 8741483 8975517 8971914 9201408 9362732 9479057 9673753 9789193 9936332 10205890
4025 10205890 10432256 10686858 10997490 11329480 11514347 11774189 12173301 12452820 12818128
$$ packed form
4098G185381J40629L7519Q2994Q6790Q3028N6482K57059J53049J62556L64695
4088H610182L36961L20384M20137M61557N19411N72862O70664O41535N09212L41530
4078A3404435J02933j54923m02343n19525p45327q18595o44250n40101m32081
4069I250223l07593k98689k18080q2024j81132k39859j9181k3887J6977j021n1021
4058G844713L2363K2775j8993j6585q8115q4929m2358O9649L6799j28799N57J13632
4046G740709Q4202J4691K3905O2243J52469J49417J00456N6114R8627K3987J14726
4035H621546J19937K34034l603K29494J61324J16325J94696J15440J47139K69558
4025A0205890K26366K54602L10632L31990J84867K59842L99112K79519L65308
$$ plain form
4016 12818128 13144050 13590177 13809227 13991337 14156058 14415097 14572884 14730900 14860093
4007 14860093 15048218 15500705 15889525 16071258 16513278 16893284 17154533 17476958 17941815
3998 17941815 18342624 18750266 19106632 19520683 19977998 20295265 20663490 21085758 21408427
3989 21408427 21769796 22233873 22647528 22928904 23165663 23413703 23625106 23862175 24077150
3980 24077150 24207114 24273765 24345059 24469195 24506673 24568521 24449470 24423377 24362669 24179451
3970 24179451 24080236 23865740 23678054 23428746 23150138 22813456 22451121 22099615 21676803 21169640
3960 21169640 20711711 20268098 19853118 19374555 18953259 18435501 17771563 17267815 16696145
3951 16696145 16192273 15606062 15077085 14539276 14065578 13655964 13074452 12624277 12163262
$$ packed form
4016A2818128L25922M46127K19050J82110J64721K59039J57787J58016J29193
4007A4860093J88125M52487L88820J81733M42020L80006K61249L22425M64857
3998A7941815M00809M07642L56366M14051M57315L17267L68225M22268L22669
3989B1408427L61369M64077M13655K81376K36759K48040K11403K37069K14975
3980B4077150J29964O6651P1294J24136L7478O1848j19051k6093o0708j83218
3970B4179451r9215k14496j87686k49308k78608l36682l62335l51506m22812n07163
3960B1169640m57929m43613m14980m78563m21296n17758o63938n03748n71670
3951A6696145n03872n86211n28977n37809m73698m09614n81512m50175m61015
$$ plain form
3942 12163262 11642029 11241915 10754082 10373656 9963725 9539303 9158201 8759572 8427409
3933 8427409 7916412 7667745 7376640 7170341 6918339 6638961 6280388 6054893 5765858 5625846
3923 5625846 5458911 5287635 5098849 4960734 4878332 4734312 4585522 4358320 4199015 4078096
3913 4078096 3905589 3844382 3734183 3659204 3652190 3610280 3538762 3491568 3440652 3341074 3198760
3902 3198760 3163074 3073430 2976847 2956050 2923177 2842582 2788402 2866276 2813447 2736840 2690745
3891 2690745 2740407 2580918 2431329 2372116 2442280 2518944 2537460 2525264 2464873 2406777 2396774
3880 2396774 2389146 2229123 2149059 2150574 2249871 2185713 2173627 2218407 2148387 2122113 2083354 2009179
3868 2009179 2073664 2105457 2068736 2085667 2068765 2049751 2003441 1958225 1979629 2037003 1996819
$$ packed form
3942A2163262n21233m00114m87833l80426m09931m24422l81102l98629l32163
3933H427409n10997k48667k91105k06299k52002k79378l58573k25495k89035j40012
3923E625846j66935j71276j88786j38115q2402j44020j48790k27202j59305j20919
3913D078096j72507o1207j10199p4979p014m1910p1518m7194n0916r9578j42314
3902C198760l5686q9644r6583k0797l2873q0595n4180P7874n2829p6607m6095
3891B690745M9662j59489j49589n9213P0164P6664J8516j2196o0391n8096j0003
3880B396774p628j60023q0064J515R9297o4158j2086M4780p0020k6274l8759p4175
3868B009179O4485L1793l6721J6931j6902j9014m6310m5216K1404N7374m0184
$$ plain form
3857 1996819 2037755 2026186 2067610 1915303 1958894 1875910 1948621 2014637 1940909 1967663 2018823
3846 2018823 1957570 1934238 1961983 1932442 1910795 1986228 1928691 1860153 1955231 2020033 1972894
3835 1972894 1893938 1992412 1975219 1944477 2075774 2046038 1987685 2019008 2016163 2016494 2027352 1993676
3823 1993676 2076756 2012584 1898906 1943627 1958678 1962372 2062718 2119055 2177393 2135855 2088676
3812 2088676 2093185 2142256 2150199 2161253 2121493 2117097 2125908 2113143 2161850 2245893 2308727 2276424
3800 2276424 2342944 2369373 2393701 2402230 2392609 2475632 2420949 2325481 2388460 2450547 2506663 2525342
3788 2525342 2621182 2609474 2641717 2629505 2657604 2577979 2643967 2749630 2821882 2823252 2947485
3777 2947485 2969509 2902720 2887279 2859588 2890929 2940542 3005316 3123900 3197682 3180259 3238114
$$ packed form
3857A996819M0936j1569M1424j52307M3591q2984P2711O6016p3728K6754N1160
3846B018823o1253k3332K7745k9541k1647P5433n7537o8538R5078O4802m7139
3835A972894p8956R8474j7193l0742J31297k9736n8353L1323k845L31J0858l3676
3823A993676Q3080o4172j13678M4721J5051L694J00346N6337N8338m1538m7179
3812B088676M509M9071P943J1054l9760m396Q811j2765M8707Q4043O2834l2303
3800B276424O6520K6429K4328Q529r621Q3023n4683r5468O2979O2087N6116J8679
3788B525342R5840j1708L2243j2212K8099p9625O5988J05663P2252J370J24233
3777B947485K2024o6789j5441k7691L1341M9613O4774J18584P3782j7423N7855
$$ plain form
3766 3238114 3113240 3152951 3196647 3254227 3279559 3212424 3228241 3345465 3519065 3446973 3478764
3755 3478764 3626016 3638867 3604781 3633573 3644799 3733173 3851499 3912204 3856027 4003642 4008248
3744 4008248 4038032 4030819 4031719 4114434 4203832 4316943 4430428 4459101 4583662 4693136 4889347
3733 4889347 5063264 5086099 5142339 5405587 5639792 5854790 6024825 6185781 6467314 6745018
3723 6745018 7175337 7560677 7896671 8273083 8736620 9109247 9566932 10169192 10677132 11178434
3713 11178434 11648174 12042206 12457910 12898545 13212738 13450396 13552185 13682301 13733666 13743646
3703 13743646 13810579 13759004 13798023 13718148 13607163 13295236 13142823 12904624 12754104 12580532
3693 12580532 12239496 11920725 11474303 11198237 10776709 10323175 10113869 9738986 9537034
$$ packed form
3766C238114j24874L9711M3696N7580K5332o7135J5817J17224J73600p2092L1791
3755C478764J47252J2851l4086K8792J1226Q8374J18326O0705n6177J47615M606
3744D008248K9784p213R00Q2715Q9398J13111J13485K8673J24561J09474J96211
3733D889347J73917K2835N6240K63248K34205K14998J70035J60956K81533K77704
3723F745018M30319L85340L35994L76412M63537L72627M57685O02260N07940N01302
3713A1178434M69740L94032M15704M40635L14193K37658J01789J30116N1365R980
3703A3743646O6933n1575L9019p9875j10985l11927j52413k38199j50520j73572
3693A2580532l41036l18771m46422k76066m21528m53534k09306l74883k01952
$$ plain form
3684 9537034 9291009 9079707 8981864 8900766 8817882 8718804 8617988 8553617 8514056 8683836 8886884
3673 8886884 9018322 9061876 9213624 9522733 9736203 10125916 10480320 10721743 10954841 11267505
3663 11267505 11690386 11869884 12032479 12299239 12317568 12407635 12528290 12514828 12495331 12461141
3653 12461141 12558030 12505298 12396940 12472199 12450990 12299983 12287361 12261656 12089284 11922298
3643 11922298 11837747 11715680 11593892 11435387 11323192 11284078 11317185 11223811 11309162 11319348
3633 11319348 11326341 11416921 11593058 11907392 12184026 12598981 13002358 13326190 13674663 14053800
3623 14053800 14341547 14735013 15174368 15651124 15900100 16271558 16691952 17109447 17492641
3614 17492641 17844812 17962815 18159269 18478793 18812385 19090494 19297617 19460771 19593902
$$ packed form
3684I537034k46025k11302r7843q1098q2884r9078j00816o4371l9561J69780K03048
3673H886884J31438M3554J51748L09109K13470L89713L54404K41423K33098L12664
3663A1267505M22881J79498J62595K66760J8329R0067J20655j3462j9497l4190
3653A2461141R6889n2732j08358P5259k1209j51007j2622k5705j72372j66986
3643A1922298q4551j22067j21788j58505j12195l9114L3107r3374Q5351J0186
3633A1319348O993R0580J76137L14334K76634M14955M03377L23832L48473L79137
3623A4053800K87747L93466M39355M76756K48976L71458M20394M17495L83194
3614A7492641L52171J18003J96454L19524L33592K78109K07123J63154J33131
$$ plain form
3605 19593902 19671079 19714691 19799144 19875179 19832725 19844371 19799232 19722991 19728149 19647072 19514960
3594 19514960 19323916 19231498 19089537 18973307 18903560 18879316 18848445 18826149 18759794 18615679
3584 18615679 18654188 18808950 18744961 18746521 18936661 19107312 19039537 19214449 19509055 19754727
3574 19754727 19957846 20248693 20583577 20880169 21329174 21838226 22169275 22596968 22870267
3565 22870267 23190837 23603658 23855765 24051633 24366735 24575572 24830629 24979350 25116235
3556 25116235 25308546 25269560 25269845 25240047 25180260 25053998 24884513 24592212 24279165 23761100
3546 23761100 23355135 22937036 22446432 21946000 21508900 20995768 20587149 20107689 19580860
3537 19580860 19004204 18508535 17949604 17409553 16933387 16466866 16039504 15666846 15302593
$$ packed form
3605A9593902P7177M3612Q4453P6035m2454J1646m5139p6241N158q1077j32112
3594A9514960j91044r2418j41961j16230o9747k4244l0871k2296o6355j44115
3584A8615679L8509J54762o3989J560J90140J70651o7775J74912K94606K45672
3574A9754727K03119K90847L34884K96592M49005N09052L31049M27693K73299
3565B2870267L20570M12821K52107J95868L15102K08837K55057J48721J36885
3556B5116235J92311l8986K85k9798n9787j26262j69485k92301l13047n18065
3546B3761100m05965m18099m90604n00432m37100n13132m08619m79460n26829
3537A9580860n76656m95669n58931n40051m76166m66521m27362l72658l64253
$$ plain form
3528 15302593 14947195 14598042 14282595 14000878 13829296 13651795 13531924 13378285 13388441 13391483
3518 13391483 13276282 13185191 13290423 13457157 13547877 13755230 13955197 14054852 14326341 14628779
3508 14628779 14902848 15283193 15768352 16236516 16768774 17263311 17730863 18287444 18738294
3499 18738294 19415462 20092886 20813583 21465076 21945567 22546266 23144003 23668243 24241450
3490 24241450 24772933 25340920 25854424 26364992 26858858 27424153 27765161 28040358 28466044
3481 28466044 28831992 29238246 29464095 29613217 29935765 30337412 30797456 31161368 31704928
3472 31704928 32311242 32870245 33709511 34562548 35520806 36775666 38137003 39651090 41141697
3463 41141697 42681851 44324780 45991060 47551277 49232900 50692185 51931894 52984435
$$ packed form
3528A5302593l55398l49153l15447k81717j71582j77501j19871j53639J0156L042
3518A3391483j15201r1091J05232J66734R0720K07353J99967R9655K71489L02438
3508A4628779K74069L80345M85159M68164N32258M94537M67552N56581M50850
3499A8738294O77168O77424P20697O51493M80491O00699N97737N24240N73207
3490B4241450N31483N67987N13504N10568M93866N65295L41008K75197M25686
3481B8466044L65948M06254K25849J49122L22548M01647M60044L63912N43560
3472C1704928O06314N59003Q39266Q53037R58258J254860J361337J514087J490607
3463D1141697J540154J642929J666280J560217J681623J459285J239709J052541
$$ plain form
3455 52984435 53956889 54675063 55181219 55495170 55745449 55700013 55669584 55537737 55120767 54594500
3445 54594500 54060369 53373073 52355279 51139794 49723049 48273024 46583831 44813290
3437 44813290 42934917 40906104 38922251 36920582 34924473 32999994 31187945 29602160
3429 29602160 28104057 26730569 25494368 24311781 23195319 22136966 21143834 20350460
3421 20350460 19477858 18761288 17922300 17238528 16668595 16026184 15382995 14859070 14393513
3412 14393513 13942367 13455911 12959971 12463660 12119007 11608518 11116358 10692602 10237729
3403 10237729 9762838 9221928 8858519 8479400 8197935 7774095 7437371 7120232 6760407
3394 6760407 6503805 6313076 6104279 5925928 5719619 5444631 5306662 5177443 5058268 5002304
$$ packed form
3455E2984435R72454P18174N06156L13951K50279m5436l0429j31847m16970n26267
3445E4594500n34131o87296j017794j215485j416745j450025j689193j770541
3437D4813290j878373k028813j983853k001669j996109j924479j812049j585785
3429B9602160j498103j373488j236201j182587j116462j058353r93132p93374
3421B0350460q72602p16570q38988o83772n69933o42411o43189n23925m65557
3412A4393513m51146m86456m95940m96311l44653n10489m92160m23756m54873
3403A0237729m74891n40910l63409l79119k81465m23840l36724l17139l59825
3394F760407k56602j90729k08797j78351k06309k74988j37969j29219j19175n5964
$$ plain form
3384 5002304 4940432 4819824 4591347 4504724 4370429 4225537 4135388 3984469 3861347 3846236
3374 3846236 3799013 3744310 3655190 3559518 3435985 3393845 3348887 3306631 3269508 3132697 3081963
3363 3081963 3081974 3007111 2933879 2901293 2856781 2878245 2859904 2793705 2725918 2595978 2593684 2621174
3351 2621174 2556051 2505841 2486927 2378232 2358116 2336820 2366643 2427661 2440202 2398971 2344575
3340 2344575 2304284 2319901 2330187 2300133 2319242 2311927 2346693 2429478 2362879 2177006 2174071 2288599
3328 2288599 2291511 2152647 2140477 2179546 2184863 2174666 2300669 2398922 2360169 2340559 2455412
3317 2455412 2459641 2460465 2408923 2447635 2490870 2542346 2536763 2437999 2392929 2361083 2382755 2303512
3305 2303512 2331195 2431974 2455949 2446735 2476997 2511509 2497600 2511007 2463824 2579756 2578394
$$ packed form
3384E002304o1872j20608k28477q6623j34295j44892r0149j50919j23122j5111
3374C846236m7223n4703q9120r5672j23533m2140m4958m2256l7123j36811n0734
3363C081963J1p4863p3232l2586m4512K1464j8341o6199o7787j29940k294K7490
3351B621174o5123n0210j8914j08695k0116k1296K9823O1018J2541m1231n4396
3340B344575m0291J5617J0286l0054J9109p315L4766Q2785o6599j85873k935J14528
3328B288599K912j38864j2170L9069N317j0197J26003R8253l8753j9610J14853
3317B455412M229Q24n1542L8712M3235N1476n583r8764m5070l1846K1672p9243
3305B303512K7683J00779K3975r214L0262L4512j3909J3407m7183J15932j362
$$ plain form
3294 2578394 2616774 2672511 2725113 2738147 2884782 2896908 2917599 2977313 3074578 3158827 3291533
3283 3291533 3352123 3412885 3494402 3475865 3500347 3514361 3602818 3579854 3598150 3681355 3830793
3272 3830793 3928722 4075245 4343928 4529726 4557185 4706172 4954240 5128908 5325944 5712837
3262 5712837 5913292 6137476 6367805 6409276 6451594 6738608 6886696 6788419 6619584 6561567
3252 6561567 6482701 6444237 6412056 6337595 6265838 6179845 6155902 6089308 6074409 5875426 5843842
3241 5843842 5808568 5794645 5867548 5811543 5719086 5571916 5326252 4906815 4677101 4341945
3231 4341945 3962350 3736983 3540850 3389165 3225569 3055025 2893433 2784840 2710393 2566215
3221 2566215 2568887 2480124 2329198 2257353 2172360 2254008 2369536 2412018 2339603 2293814 2479520
$$ packed form
3294B578394L8380N5737N2602J3034J46635J2126K0691N9714R7265Q4249J32706
3283C291533O0590O0762Q1517j8537K4482J4014Q8457k2964J8296Q3205J49438
3272C830793R7929J46523K68683J85798K7459J48987K48068J74668J97036L86893
3262E712837K00455K24184K30329M1471M2318K87014J48088r8277j68835n8017
3252F561567p8866l8464l2181p4461p1757q5993k3943o6594j4899j98983l1584
3241E843842l5274j3923P2903n6005r2457j47170k45664m19437k29714l35156
3231D341945l79595k25367j96133j51685j63596j70544j61592j08593p4447j44178
3221B566215K672q8763j50926p1845q4993Q1648J15528M2482p2415m5789J85706
$$ plain form
3210 2479520 2457743 2548165 2741934 2853798 3197499 3578962 3677176 3481734 3160998 2872400
3200 2872400 2458456 2143237 1889694 1783953 1732274 1609273 1625622 1688558 1632958 1565245
3190 1565245 1512478 1507546 1383964 1310068 1369833 1412531 1411569 1402443 1391687 1425355 1408754 1464863
3178 1464863 1564851 1561644 1665323 1776862 1965656 1981044 1976259 1865699 1690805 1610377 1452219
3167 1452219 1310890 1348499 1241091 1233345 1211846 1221288 1205046 1124749 1069495 1053943 1097768
3156 1097768 903481 906269 989461 1022686 986504 903678 920380 977396 915465 853074 847199 881119
3144 881119 911318 823301 837968 817967 828786 677369 634397 608487 592567 606944 612711 502988
3132 502988 550366 615276 548799 617776 626261 543074 563693 511816 514378 599740 626491 660844
$$ packed form
3210B479520k1777R0422J93769J11864L43701L81463R8214j95442l20736k88598
3200B872400m13944l15219k53543j05741n1679j23001J6349O2936n5600o7713
3190A565245n2767m932j23582p3896N9765M2698r62r126j0756L3668j6601N6109
3178A464863R9988l207J03679J11539J88794J5388m785j10560j74894q0428j58158
3167A452219j41329L7609j07408p746k1499R442j6242q0297n5254j5552M3825
3156A097768j94287K788Q3192L3225l6182q2826J6702N7016o1931o2391n875L3920
3144H81119L0199q8017J4667k0001J0819j51417m2972k5910j5920J4377N767j09723
3132E02988M7378O4910o6477O8977Q485q3187K0619n1877K562Q5362K6751L4353
$$ plain form
3120 660844 660535 634506 629883 643475 495736 496783 524036 417904 422118 377374 433792 503911
3108 503911 523534 616509 533398 550465 546315 620803 542756 536473 548193 541807 485907 509195
3096 509195 463586 346284 441977 430249 466723 473688 399166 339887 362030 351590 404703 438212
3084 438212 364653 301382 307828 266163 304714 288923 297589 352180 287041 275032 302106 404743
3072 404743 289939 310266 372436 410104 382080 361009 378550 348383 327163 278580 363516
3061 363516 311658 219160 309393 385592 313578 249287 117510 237453 268234 238496 258882
3050 258882 288989 289230 327444 317180 347619 356793 345840 242632 263718 341771 428083 337522
3038 337522 200821 186895 199531 261113 262755 113015 145665 255700 286046 304931 208233
$$ packed form
3120F60844l09k6029m623J3592j47739J047K7253j06132M214m4744N6418P0119
3108E03911J9623R2975q3111J7067m150P4488p8047o283J1720o386n5900K3288
3096E09195m5609j17302R5693j1728L6474O965p4522n9279K2143j0440N3113L3509
3084D38212p3559o3271O446m1665L8551j5791Q666N4591o5139j2009K7074J02637
3072D04743j14804K0327O2170L7668k8024k1071J7541l0167k1220m8583Q4936
3061C63516n1858r2498R0233P6199p2014o4291j31777J19943L0781k9738K0386
3050B58882L0107K41L8214j0264L0439R174j0953j03208K1086P8053Q6312r0561
3038C37522j36701j3926J2636O1582J642j49740L2650J10035L0346J8885r6698
$$ plain form
3027 208233 180553 228457 305073 323227 372203 288790 349346 365741 312700 179638 101324
3016 101324 139041 254405 262253 254570 220972 248722 246666 279589 316172 325309 224650 146179
3004 146179 233332 247005 313873 104927 91938 221160 200335 141505 166662 277133 247803
2993 247803 284534 275543 268676 230802 281875 324290 379425 365368 277712 223196 326514 221654
2981 221654 294516 288593 384891 361243 295489 297860 225077 282528 222488 202836 224194 272668
2969 272668 366285 254646 275737 298434 339140 365300 384400 387064 267251 388181 441871
2958 441871 331902 324131 358602 374901 414408 441866 479235 513041 499815 428139 519225 583490
2946 583490 702302 707124 655295 499237 497947 515794 613492 564450 470940 443688 475742 504101
$$ packed form
3027B08233k7680M7904P6616J8154M8976q3413O0556J6395n3041j33062p8314
3016A01324L7717J15364P848p683l3598K7750k056L2923L6583R137j00659p8471
3004A46179Q7153J3673O6868k08946j2989J29222k0825n8830K5157J10471k9330
2993B47803L6731q991o867l7874N1073M2415N5135j4057q7656n4516J03318j04860
2981B21654P2862n923R6298k3648o5754K371p2783N7451o0040j9652K1358M8474
2969B72668R3617j11639K1091K2697M0706K6160J9100K664j19813J20930N3690
2958D41871j09969p771L4471J6299L9507K7458L7369L3806j3226p1676R1086O4265
2946E83490J18812M822n1829j56058j290J7847R7698m9042r3510k7252L2054K8359
$$ plain form
2934 504101 557007 548466 481550 575883 638181 636187 714685 742209 724214 632064 656274 625830
2922 625830 693006 776907 823574 883895 919034 935700 975135 893962 699484 641074 608738
2911 608738 637252 665015 662313 634704 553186 533807 605924 569443 651014 669477 461447 409006
2899 409006 388061 403785 365396 438588 487931 466677 556886 611993 607835 462648 443579 481525
2887 481525 562366 572566 538301 545440 459309 418474 328714 368826 383684 415085 413826 413443
2875 413443 338716 297944 354849 294317 241742 218178 306054 198951 265973 285606 259719
2864 259719 270227 303536 271981 291249 244606 250128 263201 188079 124305 129180 145700 182566
2852 182566 172268 128895 257674 273392 225337 158647 132191 185296 220299 169071 153025
$$ packed form
2934E04101N2906q541o6916R4333O2298j994P8498K7524j7995r2150K4210l0444
2922F25830O7176Q3901M6667O0321L5139J6666L9435q1173j94478n8410l2336
2911F08738K8514K7763k702k7609q1518j9379P2117l6481Q1571J8463k08030n2441
2899D09006k0945J5724l8389P3192M9343k1254R0209N5107m158j45187j9069L7946
2887D81525Q0841J0200l4265P139q6131m0835q9760M0112J4858L1401j259l83
2875D13443p4727m0772N6905o0532n2575k3564Q7876j07103O7022J9633k5887
2864B59719J0508L3309l1555J9268m6643N522J3073p5122o3774M875J6520L6866
2852A82566j0298m3373J28779J5718m8055o6690k6456N3105L5003n1228j6046
$$ plain form
2841 153025 219207 181931 173949 220824 142641 144825 113795 141548 157265 104612 15450 47394
2829 47394 119427 108840 61425 -18380 107697 141386 223176 173553 142814 169544 138836 154940
2817 154940 106538 14494 -15896 63108 124326 186963 169827 39894 157252 123835 147430
2806 147430 195014 117315 89671 100364 95565 81192 109532 128697 161606 75911 -1660 -39463
2794 -39463 -13320 6644 26592 114373 68841 33556 26242 -23099 -55181 20705 41744 -44793
2782 -44793 67591 106546 162789 255405 189589 89491 99156 103175 102189 48458 46088 63986
2770 63986 57465 52555 78844 162297 147700 51109 19905 -75218 -66656 -3604 71579 118728
2758 118728 95833 70515 53236 78668 40841 -38609 -33195 -27155 14826 57421 72561 106504
$$ packed form
2841A53025O6182l7276p982M6875p8183K184l1030K7753J5717n2653q9162L1944
2829D7394P2033j0587m7415p9805J26077L3689Q1790m9623l0739K6730l0708J6104
2817A54940m8402r2044l0390P9004O1218O2637j7136j29933J17358l3417K3595
2806A47430M7584p7699k7644J0693m799j4373K8340J9165L2909q5695p7571l7803
2794c9463K6143J9964J9948Q7781m5532l5285p314m9341l2082P5886K1039q6537
2782d4793J12384L8955N6243R2616o5816j00098R665M019r86n3731k370J7898
2770F3986o521m910K6289Q3453j4597r6591l1204r5123Q562O3052P5183M7149
2758A18728k2895k5318j7279K5432l7827p9450N414O040M1981M2595J5140L3943
$$ plain form
2746 106504 97118 48228 -16064 -93347 -31521 -63994 43412 26698 -26031 -36287 3929 51270
2734 51270 75936 107991 133811 103012 -8276 -16406 65347 63080 -17195 125167 166690 105403
2722 105403 227038 183105 -53272 -77381 -5531 -26829 -40200 102148 72686 84939 56330
2711 56330 79675 94444 89648 74194 31878 31134 43518 -70501 -2197 99147 -10900 -11638
2699 -11638 13147 -26770 -9305 90680 91337 56145 61059 -7447 -67597 -65575 -48199 -49306 -86333
2686 -86333 -85522 -15123 2585 53669 -49198 -87668 812 -25604 -28100 -272 22943 167
2674 167 -73083 -6146 -66890 53080 96596 14744 34199 -23991 49072 171016 115581 -16691
2662 -16691 -45744 42795 57643 17940 20204 -131653 -39512 -7323 -47745 39998 69339 101519
$$ packed form
2746A06504r386m8890o4292p7283O1826l2473J07406j6714n2729j0256M0216M7341
2734E1270K4666L2055K5820l0799j11288q130Q1753k267q0275J42362M1523o1287
2722A05403J21635m3933k36377k4109P1850k1298j3371J42348k9462J2253k8609
2711E6330K3345J4769m796j5454m2316p44J2384j14019O8304J01344j10047p38
2699a1638K4785l9917J7465R9985O57l5192M914o8506o0150K022J7376j107l7027
2686h6333Q11P0399J7708N1084j02867l8470Q8480k6416k496K7828K3215k2776
2674A67p3250O6937o0744J19970M3516q1852J9455n8190P3063J21944n5435j32272
2662a6691k9053Q8539J4848l9703K264j51857R2141L2189m0422Q7743K9341L2180
$$ plain form
2650 101519 96247 52856 61162 -11207 69933 101749 -11192 -61618 16166 -16391 -91018 -74560
2638 -74560 -36018 61266 142534 43398 10814 39646 25276 12016 21434 -29352 -69703 -67004
2626 -67004 -41845 -73390 -37109 9711 84967 93691 86278 117515 79518 25603 -30801 19785
2614 19785 -85734 -119641 -132919 -117158 -62643 -45215 -14904 -24907 2387 -21676 -26579 41087
2602 41087 -11701 -19487 -29601 22402 55581 36667 -49253 -27048 -36132 -4153 21065 1014
2590 1014 6394 22391 144518 93906 98740 84977 48664 102010 15477 22201 -30943 -7184
2578 -7184 43139 123452 63496 455 -14590 -14730 71223 48521 106034 14851 -16368 -101433
2566 -101433 -55362 13606 -83675 -93651 -30640 21065 76898 12917 -3991 -16573 7648 40795
$$ packed form
2650A01519n272m3391Q306p2369Q1140L1816j12941n0426P7784l2557p4627J6458
2638g4560L8542R7284Q1268r9136l2584K8832j4370j3260R418n0786m0351K699
2626f7004K5159l1545L6281M6820P5256Q724p413L1237l7997n3915n6404N0586
2614A9785j05519l3907j3278J5761N4515J7428L0311j0003K7294k4063m903O7666
2602D1087n2788p786j0114N2003L3179j8914q5920K2205r084L1979K5218k0051
2590A014N380J5997J22127n0612M834j3763l6313N3346q6533O724n3144K3759
2578g184N0323Q0313n9956o3041j5045j40Q5953k2702N7513r1183l1219q5065
2566a01433M6071O8968r7281r976O3011N1705N5833o3981j6908j2582K4221L3147
$$ plain form
2554 40795 80429 70795 129065 20718 -30878 -24033 101 -44570 8182 50038 52104 -49766
2542 -49766 -68346 56277 25104 70159 -58754 -88744 -18322 10605 17215 -35119 -117789 -74401
2530 -74401 -47515 39651 -63119 -38601 62549 21311 -18384 -87355 -48797 4479 -15562
2519 -15562 -54223 -62318 34878 -23737 -28169 -7878 -18642 62798 33265 31466 37858 13123 7391
2506 7391 -29977 -48556 -23373 30398 94471 -24153 -87435 -6888 -61192 -66904 -91677 4439
2494 4439 32203 -16073 -94554 -51898 -63072 15963 22691 97651 113365 61079 14428 -24282
2482 -24282 22824 99910 52735 -10897 83781 96893 29058 -69014 -63728 -118204 -137543 -87610
2470 -87610 -84881 -159146 -164975 -175478 -108360 20820 87920 5910 -97943 -31794 -28351 -101401
$$ packed form
2554D0795L9634r634N8270j08347n1596O845K4134m4671N2752M1856K066j01870
2542d9766j8580J24623l1173M5055j28913k9990P0422K8927O610n2334q2670M3388
2530g4401K6886Q7166j02770K4518J01150m1238l9695o8971L8558N3276k0041
2519a5562l8661q095R7196n8615m432K0291j0764Q1440k9533j799O392k4735n732
2506G391l7368j8579K5183N3771O4073j18624o3282Q0547n4304n712k4773R6116
2494D439K7764m8276p8481M2656j1174P9035O728P4960J5714n2286m6651l8710
2482b4282M7106P7086m7175o3632R4678J3112o7835r8072N286n4476j9339M9933
2470h7610K729p4265n829j0503O7118J29180O7100q2010j03853O6149L443p3050
$$ plain form
2458 -101401 -17166 -12833 48197 34632 109117 82961 39659 55554 101656 29828 102494 30960
2446 30960 -31145 -63004 23026 170668 214787 94814 32504 69174 17003 -40136 -18855
2435 -18855 20275 -24939 52512 67845 69518 29087 25001 -52614 -12258 53011 56362 90424
2423 90424 52817 43827 106259 95322 45954 106751 204117 153654 125160 96307 78438 56621
2411 56621 14112 -18265 96268 105040 -488 15165 -17452 -2250 39463 86998 53043 151276
2399 151276 99300 90873 145229 102768 143288 107065 112253 172725 207666 136668 253977 217986
2387 217986 219897 85385 82605 44450 16050 77770 42039 65842 67326 25718 91074 150711
2375 150711 8191 -53443 52009 123988 115651 66408 79373 176117 171484 -4789 -18613
$$ packed form
2458a01401Q4235M333O1030j3565P4485k6156m3302J5895M6102p1828P2666p1534
2446C0960o2105l1859Q6030J47642M4119j19973o2310L6670n2171n7139K1281
2435a8855L9130m5214P7451J5333J673m0431m086p7615M0356O5269L351L4062
2423I0424l7607q990O2432j0937m9368O0797R7366n0463k8494k8853j7869k1817
2411E6621m2509l2377J14533Q772j05528J5653l2617J5202M1713M7535l3955R8233
2399A51276n1976q427N4356m2461M0520l6223N188O0472L4941p0998J17309l5991
2387B17986J911j34512k780l8155k8400O1720l5731K3803J484m1608O5356N9637
2375A50711j42520o1634J05452P1979q337m9243J2965R6744m633j76273j3824
$$ plain form
2364 -18613 46577 144331 50061 40094 69719 44646 88009 65579 151320 42243 -7969 62913
2352 62913 110255 57745 -1277 -102035 -42607 -12161 77639 133442 128044 47027 104816 140820
2340 140820 107297 77579 60347 61653 67810 -11106 -52606 -18795 -39919 76320 97220 67950
2328 67950 65286 97357 23914 10004 109252 35707 22017 44014 60505 13062 2901 34102
2316 34102 -3664 49675 129660 220548 224479 143207 82671 106621 75430 45385 68035 -4681
2304 -4681 45731 67603 140131 170641 66074 98246 78568 103761 91996 98202 94100 110358
2292 110358 108069 144508 92932 118035 174360 60867 117689 123464 136446 46375 118071 160844
2280 160844 70991 -21424 1113 102287 114896 167628 78499 53762 74541 144193 161431
$$ packed form
2364a8613O5190R7754r4270r967K9625k5073M3363k2430Q5741j09077n0212P0882
2352F2913M7342n2510n9022j00758N9428L0446Q9800N5803n398q1017N7789L6004
2340A40820l3523k9718j7232J306O157p8916m1500L3811k1124J16239K0900k9270
2328F7950k664L2071p3443j3910R9248p3545j3690K1997J6491m7443j0161L1201
2316C4102l7766N3339P9985R0888L931q1272o0536K3950l1191l0045K2650p2716
2304d681N0412K1872P2528L0510j04567L2172j9678K5193j1765O206m102J6258
2292A10358k289L6439n1576K5103N6325j13493N6822N775J2982r0071P1696M2773
2280A60844q9853r2415K2537J01174J2609N2732q9129k4737K0779O9652J7238
$$ plain form
2269 161431 200309 188084 216050 242667 221325 206030 212044 234615 233904 234199 260306 197793 97211
2256 97211 129760 117899 134795 216681 187937 221270 255168 248452 308144 267816 315635 240270
2244 240270 123382 149485 150722 241524 200332 241698 309403 312471 325217 334475 429779 404026
2232 404026 400248 368164 307829 303169 287009 347947 385749 375777 360239 363467 393415 357525
2220 357525 383997 463418 467397 357298 333645 460581 529934 453097 514151 501354 570122
2209 570122 482804 504201 533368 537909 615904 639713 692534 660554 650771 646876 751829 784494
2197 784494 772752 711270 672671 664879 618000 686241 789592 785807 867408 832187 779757 801105
2185 801105 877943 936821 897763 848851 894119 964093 994420 1015022 990667 1076842 1145416 1061833
$$ packed form
2269A61431L8878j2225K7966K6617k1342j5295O014K2571p11K95K6107o2513j00582
2256I7211L2549j1861J6896Q1886k8744L3333L3898o716N9692m0328M7819p5365
2244B40270j16888K6103J237R0802m1192M1366O7705L068J2746R258R5304k5753
2232D04026l778l2084o0335m660j6160O0938L7802r972j5538L228K9948l5890
2220C57525K6472P9421L979j10099k3653J26936O9353p6837O1054j2797O8768
2209E70122q7318K1397K9167M541P7995K3809N2821l1980r783l895J04953L2665
2197G84494j1742o1482l8599p792m6879O8241J03351l785Q1601l5221n2430K1348
2185H01105P6838N8878l9058m8912M5268O9974L0327K0602k4355Q6175O8574q3583
$$ plain form
2173 1061833 1130592 1098711 1109566 1234441 1294325 1295515 1363959 1456787 1430112 1482395 1475242 1454887
2161 1454887 1542195 1638346 1667713 1722534 1811194 1844034 1990539 2069280 2130555 2270947 2391990
2150 2391990 2568012 2760920 2970316 3140601 3310837 3556190 3615951 3885290 4223298 4492659
2140 4492659 4740063 5131176 5595223 6146423 6660838 7124920 7491813 8056931 8969597 10098354
2130 10098354 11485161 12979429 15103867 17549220 20152405 23305070 27088328 32932192
2122 32932192 40234618 45755201 45167219 36925165 27894864 21976084 17990290 15052783
2114 15052783 12790064 11059460 9783418 8932241 8177796 7517876 7084888 6662976 6294243
2105 6294243 5993684 5547623 5000821 4576265 4280862 4011706 3689183 3463413 3363117 3250283
$$ packed form
2173A061833O8759l1881J0855J24875N9884J190O8444R2828k6675N2283p153k0355
2161A454887Q7308R6151K9367N4821Q8660L2840J46505P8741O1275J40392J21043
2150B391990J76022J92908K09396J70285J70236K45353N9761K69339L38008K69361
2140D492659K47404L91113M64047N51200N14415M64082L66893N65118R12666J128757
2130A0098354J386807J494268K124438K445353K603185L152665L783258N843864
2122C2932192P302426N520583n87982q242054r030301n918780l985794k937507
2114A5052783k262719j730604j276042q51177p54445o59920m32988m21912l68733
2105F294243l00559m46061n46802m24556k95403k69156l22523k25770j00296j12834
$$ plain form
2095 3250283 3002721 2855869 2725227 2626992 2454610 2372296 2371218 2322214 2193455 2000022
2085 2000022 1847345 1785606 1786872 1683297 1576838 1522926 1503612 1451872 1431196 1343556 1247790
2074 1247790 1274787 1307600 1344693 1359171 1234889 1169884 1149176 1070653 982107 1028086 1025453
2063 1025453 929956 901675 838668 850419 1006612 959205 831031 840726 892950 857951 857017 817480
2051 817480 840581 795295 735472 678108 707743 656458 649253 730415 624706 531447 536877 637480
2039 637480 593719 521757 480231 526754 578410 563240 574969 581849 544904 475049 411039 479908
2027 479908 417237 343238 303259 376482 409295 339928 351977 351922 229023 242827 341036 401937
2015 401937 299396 222335 341436 285966 323114 274985 213039 386706 363093 322980 289463
$$ packed form
2095C250283k47562j46852j30642r8235j72382q2314j078m9004j28759j93433
2085B000022j52677o1739J266j03575j06459n3912j9314n1740k0676q7640r5766
2074A247790K6997L2813L7093J4478j24282o5005k0708p8523q8546M5979k633
2063A025453r5497k8281o3007J1751J56193m7407j28174R695N2224l4999r34l9537
2051H17480K3101m5286n9823n7364K9635n1285p205Q1162j05709r3259N430J00603
2039F37480m3761p1962m1526M6523N1656j5170J1729O880l6945o9855o4010O8869
2027D79908o2671p3999l9979P3223L2813o9367J2049n5j22899J3804R8209O0901
2015D01937j02541p7061J19101n5470L7148m8129o1946J73667k3613m0113l3517
$$ plain form
2004 289463 274699 398734 305159 318762 347079 330800 296545 312981 298320 265580 215805
1993 215805 332455 308201 224176 172844 234618 202084 187427 219513 229430 173996 141555 123152
1981 123152 177757 211170 188537 134677 100373 249987 119412 132561 87009 116482 157511
1970 157511 151615 183848 278496 224994 79954 45977 92650 227640 154831 115544 50224
1959 50224 65570 66585 38263 145700 151344 129511 140017 109801 72597 21770 56827 101358
1947 101358 97360 79752 117046 121555 44722 36212 -4815 130860 76526 -12945 72453 130102
1935 130102 108004 116355 113716 66069 78693 98737 113538 143434 203932 237219 166243 138708
1923 138708 101210 117970 147323 178128 186817 157668 187394 141355 98326 99016 123410 38360
$$ packed form
2004B89463j4764J24035r3575J3603K8317j6279l4255J6436j4661l2740m9775
1993B15805J16650k4254q4025n1332O1774l2534j4657L2086R917n5434l2441j8403
1981A23152N4605L3413k2633n3860l4304J49614j30575J3149m5552K9473M1029
1970A57511n896L2233R4648n3502j45040l3977M6673J34990p2809l9287o5320
1959E0224J5346J015k8322J07437N644k1833J0506l0216l7204n0827L5057M4531
1947A01358l998j7608L7294M509p6833q510m1027J35675n4334q9471Q5398N7649
1935A30102k2098Q351k639m7647J2624K0044J4801K9896O0498L3287p0976k7535
1923A38708l7498J6760K9353L0805Q689k9149K9726m6039m3029O90K4394q5050
$$ plain form
1911 38360 31200 88163 121246 109452 90504 125401 42692 42687 70993 47143 83969 68625 112066
1898 112066 22194 39383 160322 80496 74481 126840 41569 101141 192679 76766 55389
1887 55389 66927 184575 118769 57526 82396 32624 10662 103775 153830 205032 209895 180597
1875 180597 205939 165661 204062 178573 103528 120882 66552 40033 77108 77575 109486 152853
1863 152853 213222 117739 106069 121644 114763 163966 140165 198175 217605 233002 239582 270289
1851 270289 194043 185750 177911 127296 81955 116450 85226 26336 30938 -14447 -111028 -62453
1839 -62453 72765 6315 29831 -19678 -943 79580 5053 -6250 37899 74131 166782 39889
1827 39889 -19612 19106 110773 43999 -5728 -1220 38134 -20842 -1220 3102 13548 -21735
$$ packed form
1911C8360p160N6963L3083j1794j8948L4897q2709nK8306k3850L6826j5344M3441
1898A12066q9872J7189J20939p9826o015N2359q5271N9572R1538j15913k1377
1887E5389J1538J17648o5806o1243K4870m9772k1962R3113N0055N1202M863k9298
1875A80597K5342m0278L8401k5489p5045J7354n4330k6519L7075M67L1911M3367
1863A52853O0369r5483j1670J5575o881M9203k3801N8010J9430J5397O580L0707
1851B70289p6246q293p839n0615m5341L4495l1224n8890M602m5385r6581M8575
1839f2453J35218o6450K3516m9509J8735Q0523p4527j1303M4149L6232R2651j26893
1827C9889n9501L8718R1667o6774m9727M508L9354n8976J9622M322J0446l5283
$$ plain form
1815 -21735 44556 109778 79581 63702 -56367 -79940 -50526 78766 47186 -7820 -119251
1804 -119251 -34657 48270 102685 104327 57976 79327 88786 67291 4944 -96298 -139187 -59831
1792 -59831 3734 6501 -14791 -17707 10403 2707 -69691 32552 56309 64706 58154 -14178 -3502
1779 -3502 -36148 70539 121942 144393 59724 15681 -9938 -100938 -67190 -89131 25550 50620
1767 50620 21976 14078 49431 35416 -859 59360 1121 69774 72046 107098 104487 128217
1755 128217 100194 47390 104741 3789 71465 73143 25591 22089 24057 -23741 -43348 -22243
1743 -22243 -29724 -45694 -11448 34551 72315 97310 124269 114572 97429 -45760 -31481 -12628
1731 -12628 -89507 -79692 -59563 48049 46467 84767 44547 -59879 6401 -86619 -129261 -161773
$$ packed form
1815b1735O6291O5222l0197j5879j20069k3573K9414J29292l1580n5006j11431
1804a19251Q4594Q2927N4415J642m6351K1351R459k1495o2347j01242m2889P9356
1792e9831O3565K767k1292k916K8110p696p2398J02243K3757Q397o552p2332J0676
1779c502l2646J06687N1403K2451q4669m4043k5619r1000L3748k1941J14681K5070
1767E0620k8644p898L5353j4015l6275O0219n8239O8653K272L5052k611K3730
1755A28217k8023n2804N7351j00952O7676J678m7552l502J968m7798j9607K1105
1743b2243p481j5970L4246M5999L7764K4995K6959r697j7143j43189J4279J8853
1731a2628p6879R815K0129J07612j582L8300m0220j04426O6280r3020m2642l2512
$$ plain form
1719 -161773 -96865 -45357 -79008 33480 42903 -83696 -61298 -26110 19569 73756 -16076
1708 -16076 5953 -34801 -14058 -49174 12096 7026 -54229 -146645 -108377 -52951 -79397 -11216
1696 -11216 -28974 61376 58231 -18059 4100 -15297 -73012 33548 78670 27058 14174 -39234
1684 -39234 19045 -64550 -64741 -23556 52385 49786 -105850 24317 18664 -59857 -56084 36962
1672 36962 110099 88354 123454 50851 -5698 -28571 78132 87038 145464 63706 -21929 -49213
1660 -49213 -99363 -117745 -5654 100427 20312 97675 131984 87372 -41194 -52043 11548
1649 11548 -80645 -66995 9319 51758 63180 85405 81244 25029 145845 214655 82878 36989
1637 36989 -3074 256 66581 -14185 -116976 -106636 -97076 -54936 29540 -55904 -48210 -42994
$$ packed form
1719a61773O4908N1508l3651J12488R423j26599K2398L5188M5679N4187q9832
1708a6076K2029m0754K0743l5116O1270n070o1255r2416L8268N5426k6446O8181
1696a1216j7758R0350l145p6290K2159j9397n7715J06560M5122n1612j2884n3408
1684c9234N8279q3595j91M1185P5941k599j55636J30167n653p8521L773R3046
1672C6962P3137k1745L5100p2603n6549k2873J06703Q906N8426q1758q5635k7284
1660d9213n0150j8382J12091J06081q0115P7363L4309m4612j28566j0849O3591
1649A1548r2193J3650P6314M2439J1422K2225m161n6215J20816O8810j31777m5889
1637C6989m0063L330O6325q0766j02791J0340R560M2140Q4476q5444P694N216
$$ plain form
1625 -42994 -27376 -94914 -110117 -38763 -105866 1346 109577 39652 -26373 -25275 67604 74257
1613 74257 -36478 -146166 -105181 23612 103584 -11937 -15079 82594 37640 66803 113748
1602 113748 113482 61937 131532 25815 -65089 -6983 13992 20189 -9760 -33891 -89087 -30666
1590 -30666 34234 -20028 -65737 -131211 -147523 -129012 -72076 -34380 -70811 -45018 -82497 -96843
1578 -96843 -74070 -89646 -57257 -46756 -109672 -68815 -23597 -2506 64577 136403 24626 -128240
1566 -128240 -141727 -43167 -15840 -34496 2087 75691 74776 95642 80727 3509 -28216 -95865
1554 -95865 -19792 113820 41094 -113800 -102175 -19039 -20143 -12284 -81118 -163088 -82711 44794
1542 44794 48001 34823 -67804 -58368 -14782 -39176 -41675 -327 63209 45850 46108 20295 42536
$$ packed form
1625d2994J5618o7538j5203P1354o7103J07212J08231o9925o6025J098R2879O653
1613G4257j10735j09688M0985J28793P9972j15521l142R7673m4954K9163M6945
1602A13748k66n1545O9595j05717r0904N8106K0975O197k9949k4131n5196N8421
1590c0666O4900n4262m5709o5474j6312J8511N6936L7696l6431K5793l7479j4346
1578i6843K2773j5576L2389J0501o2916M0857M5218K1091O7083P1826j11777j52866
1566a28240j3487R8560K7327j8656L6583P3604r15K0866j4915p7218l1725o7649
1554i5865P6073J33612p2726j54894J1625Q3136j104P859o8834q1970Q0377J27505
1542D4794L207j3178j02627R436M3586k4394k499M1348O3536j7359K58k5813K2241
$$ plain form
1529 42536 19376 -26814 -83628 -95456 -69678 19923 -18646 32576 -12916 -28640 -83418 -48421
1517 -48421 -729 -55638 -11194 10016 85353 -12916 -87751 -69087 -6881 -77050 -15148 17096
1505 17096 -58132 -26255 -38695 -33699 -13456 -88242 -33002 62467 63241 38505 47350 44164 -9104
1492 -9104 -19695 -31264 -62682 -64176 -52259 -18068 -1830 39014 10266 28431 35542 -31924
1480 -31924 -44998 -18979 -65012 -18309 -6033 -52045 -72213 -48109 23837 23343 45488 -7117
1468 -7117 -79454 -73475 -24390 -55187 -14679 -93186 -14372 39264 36220 53010 -30417 -42311
1456 -42311 18165 12202 59741 127608 77364 118384 2542 -51126 6225 33902 82363 -85602
1444 -85602 -94020 -30713 43024 8437 57060 13795 -76667 -62761 13931 16695 -54147 -57044
$$ packed form
1529D2536k3160m6190n6814j1828K5778Q9601l8569N1222m5492j5724n4778L4997
1517d8421M7692n4909M4444K1210P5337r8269p4835J8664O2206p0169O1902L2244
1505A7096p5228L1877j2440M996K0243p4786N5240R5469P74k4736Q845l186n3268
1492i104j0591j1569l1418j494J1917L4191J6238M0844k8748J8165P111o7466
1480c1924j3074K6019m6033M6703J2276m6012k0168K4104P1946m94K2145n2605
1468g117p2337N979M9085l0797M0508p8507P8814N3636l044J6790q3427j1894
1456d2311O0476n963M7539O7867n0244M1020j15842n3668N7351K7677M8461j67965
1444h5602q418O3307P3737l4587M8623m3265r0462J3906P6692K764p0842k897
$$ plain form
1432 -57044 -104789 28041 -10766 -142300 -46466 118875 64611 5553 -45816 -57883 -102301
1421 -102301 -49167 -50979 -47418 59503 -15867 -94445 -5216 -31992 -90794 -51907 -62903 -127459
1409 -127459 -84555 -32433 -42245 57558 -38210 -51201 -29149 54193 50132 -105023 -180601 -113369
1397 -113369 35646 59332 43070 76964 75044 29664 -72214 -36226 -59944 -107417 -98208 -41174
1385 -41174 -28912 10292 -55732 -105914 -71724 25933 95230 40078 13567 45359 67024 98384
1373 98384 54166 -24783 -45741 -113601 -90447 -194849 -140972 -59249 -51813 -8490 14090 23604
1361 23604 21197 -5624 72269 86572 91829 -9378 6909 44550 -50386 -33327 24467 9126
1349 9126 -85784 -42735 16117 -87970 -81617 -29946 -43102 -92326 -62671 -66261 52099 51032
$$ packed form
1432e7044m7745J32830l8807j31534R5834J65341n4264n9058n1369j2067m4418
1421a02301N3134j812L561J06921p5370p8578Q9229k6776n8802L8887j0996o4556
1409a27459M2904N2122r812R9803r5768j2991K2052Q3342m061j55155p5578O7232
1397a13369J49015K3686j6262L3894j920m5380j01878L5988k3718m7473R209N7034
1385d1174J2262L9204o6024n0182L4190R7657O9297n5152k6511L1792K1665L1360
1373I8384m4218p8949k0958o7860K3154j04402N3877Q1723P436M3323K2580R514
1361B3604k407k6821P7893J4303N257j01207J6287L7641r4936J7059N7794j5341
1349I126r4910M3049N8852j04087O353N1671j3156m9224K9655l590J18360j067
$$ plain form
1337 51032 1687 -55066 -71105 -81819 -126149 -128379 -499 54128 47538 35839 39991 -70913
1325 -70913 -81646 -15349 72498 34079 33314 115704 149626 84430 -60495 -76401 -52179 -66395
1313 -66395 -64190 -16477 -70532 5623 -44962 14422 89401 130155 -44886 -4300 6202 -73322
$$ packed form
1337E1032m9345n6753j6039j0714m4330k230J27880N4627o590j1699M152j10904
1325g0913j0733O6297Q7847l8419p65Q2390L3922o5196j44925j5906K4222j4216
1313f6395K205M7713n4055P6155n0585N9384P4979M0754j75041M0586J0502p9524
$$ [...]
##END NTUPLES=NMR SPECTRUM
##END=
