##TITLE=1H_TG-2353-2
 CDCl3
 8 sc, 
 13.05.2022
##JCAMPDX= 6.0         $$ Bruker NMR JCAMP-DX V2.0
##DATA TYPE= NMR SPECTRUM
##DATA CLASS= NTUPLES
##ORIGIN= UXNMR, Bruker Analytische Messtechnik GmbH
##OWNER= root
$$ XWIN-NMR		Version 3.5
$$ Fri May 13 11:04:49 2022 Russian Standard Time (UT+4h)  she@DPX200
##.OBSERVE FREQUENCY= 200.1313499996
##.OBSERVE NUCLEUS= ^1H
##.ACQUISITION MODE= SIMULTANEOUS
##.ACQUISITION SCHEME= undefined
##.AVERAGES= 8
##.DIGITISER RES= 18
##SPECTROMETER/DATA SYSTEM= spect
##.PULSE SEQUENCE= zg30
##.SOLVENT NAME= CDCl3
##.SHIFT REFERENCE= (INTERNAL, CDCl3, 0, 19.7028)
##AUDIT TRAIL= $$ (NUMBER, WHEN, WHO, WHERE, WHAT)
$$ ##TITLE= Audit trail, XWIN-NMR		Version 3.5
$$ ##JCAMPDX= 5.01
$$ ##ORIGIN= Bruker BioSpin GmbH
$$ ##OWNER= she
$$ F:/spectra/data/she/nmr/H-F/1/pdata/1/auditp.txt
$$ ##AUDIT TRAIL=  $$ (NUMBER, WHEN, WHO, WHERE, WHAT)
(   1,<2022-05-13 11:03:27.62 +0400>,<she>,<DPX200>,
      <created by zg, POWCHK disabled, PULCHK disabled
       configuration hash MD5:
       00 E9 B6 7A A2 85 ED C7 34 08 36 98 17 FE 4E 26
       data hash MD5: 16K
       10 00 DF 8B E1 27 60 69 86 0B 88 85 3A 49 51 89>)
(   2,<2022-05-13 11:03:33.76 +0400>,<she>,<DPX200>,
      <Start of raw data processing
       efp BC_mod = 2 LB = 0.24 FT_mod = 6 PKNL = 1 PHC0 = -17870.85 PHC1 = 38.40075 SI = 16K 
       data hash MD5: 16K
       83 45 98 06 5D 14 2B FC 02 E9 AC AD D7 5B 41 05>)
(   3,<2022-05-13 11:04:09.18 +0400>,<she>,<DPX200>,
      <pk PHC0 = 14.38266 PHC1 = -22.8 
       data hash MD5: 16K
       19 6E 83 1F 77 9F 55 87 0B 80 B0 4C 72 09 4D 5C>)
$$ ##END=
$$ 
$$ hash MD5
$$ 37 F0 A7 16 60 86 C0 96 2B 81 BB 89 BE 8D 4F 73
##$RELAX= 
##$RELAX= 
##$RELAX= 
##$RELAX= 
##$RELAX= 
##$RELAX= 
$$ Bruker specific parameters
$$ --------------------------
##$DU= <F:/spectra>
##$EXPNO= 1
##$NAME= <H-F>
##$PROCNO= 1
##$TYPE= <nmr>
##$USER= <she>
##$AMP= (0..31)
100 100 100 100 100 100 100 100 100 100 100 100 100 100 100 100 100 100 
100 100 100 100 100 100 100 100 100 100 100 100 100 100 
##$AQSEQ= 0
##$AQ_mod= 1
##$AUNM= <au_zg>
##$AUTOPOS= <>
##$BF1= 200.13
##$BF2= 200.13
##$BF3= 200.13
##$BF4= 200.13
##$BF5= 200.13
##$BF6= 200.13
##$BF7= 200.13
##$BF8= 200.13
##$BYTORDA= 1
##$CFDGTYP= 0
##$CFRGTYP= 5
##$CHEMSTR= <none>
##$CNST= (0..31)
1 1 145 1 1 1 1 1 1 1 1 1 1 1 1 1 1 1 1 1 1 1 1 1 1 1 1 1 1 1 1 1 
##$CPDPRG= <>
##$CPDPRG1= <>
##$CPDPRG2= <>
##$CPDPRG3= <>
##$CPDPRG4= <mlev>
##$CPDPRG5= <mlev>
##$CPDPRG6= <mlev>
##$CPDPRG7= <mlev>
##$CPDPRG8= <mlev>
##$CPDPRGB= <>
##$CPDPRGT= <>
##$D= (0..31)
0 1.2 0 0 0 0 0 0 0 0.06 0 0.03 0 0 0 0 0.0002 0 0 0 0 0 0 0 0 0 0 0 0 
0 0 0 
##$DATE= 1652425406
##$DBL= (0..7)
120 120 120 120 120 120 120 120 
##$DBP= (0..7)
150 150 150 150 150 150 150 150 
##$DBP07= 0
##$DBPNAM0= <>
##$DBPNAM1= <>
##$DBPNAM2= <>
##$DBPNAM3= <>
##$DBPNAM4= <>
##$DBPNAM5= <>
##$DBPNAM6= <>
##$DBPNAM7= <>
##$DBPOAL= (0..7)
0.5 0.5 0.5 0.5 0.5 0.5 0.5 0.5 
##$DBPOFFS= (0..7)
0 0 0 0 0 0 0 0 
##$DE= 6
##$DECBNUC= <off>
$$ [...]
##$SUBNAM1= <"">
##$SUBNAM2= <"">
##$SUBNAM3= <"">
##$SUBNAM4= <"">
##$SUBNAM5= <"">
##$SUBNAM6= <"">
##$SUBNAM7= <"">
##$SUBNAM8= <"">
##$SUBNAM9= <"">
##$SW= 26.0245750270697
##$SWIBOX= (0..15)
0 0 2 0 0 0 0 0 0 0 0 0 0 0 0 0 
##$SW_h= 5208.33333333333
##$TD= 16384
##$TD0= 1
##$TE= 0
##$TE2= 300
##$TE3= 300
##$TEG= 300
##$TL= (0..7)
0 120 120 120 120 120 120 120 
##$TP= (0..7)
150 150 150 150 150 150 150 150 
##$TP07= 0
##$TPNAME0= <>
##$TPNAME1= <>
##$TPNAME2= <>
##$TPNAME3= <>
##$TPNAME4= <>
##$TPNAME5= <>
##$TPNAME6= <>
##$TPNAME7= <>
##$TPOAL= (0..7)
0.5 0.5 0.5 0.5 0.5 0.5 0.5 0.5 
##$TPOFFS= (0..7)
0 0 0 0 0 0 0 0 
##$TUNHIN= 0
##$TUNHOUT= 0
##$TUNXOUT= 0
##$USERA1= <user>
##$USERA2= <user>
##$USERA3= <user>
##$USERA4= <user>
##$USERA5= <user>
##$V9= 5
##$VALIST= <valist>
##$VCLIST= <CCCCCCCCCCCCCCC>
##$VD= 0
##$VDLIST= <DDDDDDDDDDDDDDD>
##$VPLIST= <PPPPPPPPPPPPPPP>
##$VTLIST= <TTTTTTTTTTTTTTT>
##$WBST= 1024
##$WBSW= 4
##$XGAIN= (0..3)
0 0 0 0 
##$XL= 0
##$YL= 0
##$YMAX_a= 579322
##$YMIN_a= -791482
##$ZGOPTNS= <>
##$ZL1= 120
##$ZL2= 120
##$ZL3= 120
##$ZL4= 120
##$ABSF1= 0
##$ABSF2= 0
##$ABSG= 0
##$ABSL= 0
##$ALPHA= 0
##$AQORDER= 0
##$ASSFAC= 0
##$ASSFACI= 0
##$ASSFACX= 0
##$ASSWID= 0
##$AUNMP= <proc_1d>
##$AZFE= 0.1
##$AZFW= 0.1
##$BCFW= 0
##$BC_mod= 2
##$BYTORDP= 0
##$COROFFS= 0
##$CY= -3
##$DATMOD= 1
##$DC= 0
##$DFILT= <>
##$DTYPP= 0
##$F1P= 0
##$F2P= 0
##$FCOR= 1
##$FTSIZE= 16384
##$FT_mod= 6
##$GAMMA= 0
##$GB= 0
##$INTBC= 1
##$INTSCL= 0
##$ISEN= 128
##$LB= 0.24
##$LEV0= 0
##$LPBIN= 0
##$MAXI= 10000
##$MC2= 0
##$MEAN= 0
##$ME_mod= 0
##$MI= 1.114404
##$NCOEF= 0
##$NC_proc= -5
##$NLEV= 6
##$NOISF1= 3.799351
##$NOISF2= 2.8
##$NSP= 0
##$NTH_PI= 0
##$NZP= 0
##$OFFSET= 19.70282
##$PC= 1
##$PHC0= -17856.47
##$PHC1= 15.60075
##$PH_mod= 1
##$PKNL= yes
##$PPARMOD= 0
##$PSCAL= 0
##$PSIGN= 0
##$REVERSE= no
##$SF= 200.130011040973
##$SI= 16384
##$SIGF1= 3
##$SIGF2= 2
##$SINO= 5.538805
##$SIOLD= 16384
##$SREGLST= <1H.CDCl3>
##$SSB= 0
##$STSI= 16384
##$STSR= 0
##$SW_p= 5208.33333333334
##$SYMM= 0
##$S_DEV= 0
##$TDeff= 16384
##$TDoff= 0
##$TI= <>
##$TILT= no
##$TM1= 0
##$TM2= 0
##$TOPLEV= 0
##$USERP1= <user>
##$USERP2= <user>
##$USERP3= <user>
##$USERP4= <user>
##$USERP5= <user>
##$WDW= 1
##$XDIM= 16384
##$YMAX_p= 289754743
##$YMIN_p= -748318
$$ End of Bruker specific parameters
$$ ---------------------------------
##NTUPLES= NMR SPECTRUM
##VAR_NAME=  FREQUENCY,     SPECTRUM/REAL,   SPECTRUM/IMAG
##SYMBOL=    X,             R,               I
##VAR_TYPE=  INDEPENDENT,   DEPENDENT,       DEPENDENT
##VAR_FORM=  AFFN,          ASDF,            ASDF
##VAR_DIM=   16384,         16384,           16384
##UNITS=     HZ,            ARBITRARY UNITS, ARBITRARY UNITS
##FACTOR=    0.317910842540032, 1,           1
##FIRST=     3943.1255489592, 0,             0
##LAST=      -1265.20778437414, 0,           0
##MIN=       -1265.20778437414, -748318,     0
##MAX=       3943.1255489592, 289754743,     0
$$ Real data points
##PAGE= N=1
##DATA TABLE= (X++(R..R)), XYDATA
$$ [...]
$$ plain form
7981 227865 241778 252199 262798 284540 319924 357651 410872 392509 432485 465143 443696 485323
7969 485323 403499 345386 294255 216672 296977 226477 215141 143752 36863 114860 130094
7958 130094 106395 104207 98266 41577 25040 77967 118557 35955 90478 103949 105010 26360
7946 26360 -17976 16538 -9414 -85071 -59223 -70056 8136 14454 -10360 389 -393 106663
7934 106663 15722 93111 99049 38182 -26996 9021 -214172 -41366 65237 53451 116928
7923 116928 57601 106237 95109 33432 5968 2362 -21349 -23712 -31626 25914 8217 -20146
7911 -20146 -37846 -617 46892 12149 -10264 -32578 56512 33697 -22421 -89532 -71773 15367
7899 15367 10246 27646 -2580 -49446 -27061 -37089 -65562 4416 35804 -4800 -22551 -39406
$$ packed form
7981B27865J3913J0421J0599K1742L5384L7727N3221j8363L9976L2658k1447M1627
7969D85323q1824n8113n1131p7583Q0305p0500j1336p1389j06889P7997J5234
7958A30094k3699k188n941n6689j6537N2927M0590q2602N4523J3471J061p8650
7946B6360m4336L4514k5952p5657K5848j0833P8192O318k4814J0749p82J07056
7934A06663r0941P7389N938o0867o5178L6017k23193J72806J06603j1786O3477
7923A16928n9327M8636j1128o1677k7464l606k3711k363p914N7540j7697k8363
7911b0146j7700L7229M7509l4743k2413k2314Q9090k2815n6118o7111J7759Q7140
7899A5367n121J7400l0226m6866K2385j0028k8473O9978L1388m0604j7751j6855
$$ plain form
7887 -39406 -33671 -29040 15447 28288 3574 -2156 -6140 -16654 68764 80856 13652 22764 -86127
7874 -86127 -43499 24071 -110653 -44059 -19966 -26378 -64769 -71489 -50136 -65831 -1583 -54930
7862 -54930 -75425 -52937 -37211 -55729 -55012 -1262 -10633 -60266 -73392 -24782 10479 10295 -38461
7849 -38461 -57610 -49862 -9639 -1639 -63721 -30962 17966 -61674 -89837 -133143 -162679 -69010
7837 -69010 -1316 -24586 -36436 -3748 40516 -81934 -126924 -93606 -24614 39943 16217 -2520
7825 -2520 19856 -75983 -84954 -39341 -29801 85069 1937 29978 -63183 -67794 -50703 -1741
7813 -1741 34240 63766 -43751 -27762 -59523 -30621 4045 -30499 -54174 -41035 -40855 15001
7801 15001 -15322 47977 10705 -22494 -12914 -35440 68346 55131 102055 38354 2065 -2603
$$ packed form
7887c9406N735M631M4487J2841k4714n730l984j0514Q5418J2092o7204R112j08891
7874h6127M2628O7570j34724O6594K4093o412l8391o720K1353j5695O4248n3347
7862e4930k0495K2488J5726j8518P17N3750r371m9633j3126M8610L5261j84m8756
7849c8461j9149P748M0223Q000o2082L2759M8928p9640k8163m3306k9536R3669
7837f9010O7694k3270j1850L2688M4264j22450m4990L3318O8992O4557k3726j8737
7825b520K2376r5839q971M5613R540J14870q3132K8041r3161m611J7091M8962
7813a741L5981K9526j07517J5989l1761K8902L4666l4544k3675J3139J80N5856
7801A5001l0323O3299l7272l3199R580k2526J03786j3215M6924o3701l6289m668
$$ plain form
7789 -2603 6242 -6279 -15051 65416 62604 -35928 -39133 31405 53415 122747 136992 116011 169228
7776 169228 217680 283146 297135 288876 275064 291913 250181 232657 222526 181122 167035 187776
7764 187776 134947 70253 31065 -8946 6810 -20331 -7134 3288 -23144 34685 5843 -21305
7752 -21305 -41613 1041 -29198 -43487 -13202 -7539 -66388 -79288 -98952 -64997 -27688 28643
7740 28643 234 -4419 30232 -104881 -88203 -39063 -6174 -7073 13972 -20257 750 83527
7728 83527 43545 -32349 32783 52617 48273 31990 34902 -6423 -322 -24175 -22148 -48894 -13987
7715 -13987 22011 40270 57180 70798 128909 164373 129525 214878 288973 197213 191607 76306
7703 76306 75843 57472 120934 74865 7881 -7980 13063 -42717 -46878 5797 46255 32153
$$ packed form
7789b603Q845j2521q772Q0467k812r8532l205P0538K2010O9332J4245k0981N3217
7776A69228M8452O5466J3989q259j3812J6849m1732j7524j0131m1404j4087K0741
7764A87776n2829o4694l9188m0011J5756k7141J3197J0422k6432N7829k8842k7148
7752b1305k0308M2654l0239j4289L0285N663n8849j2900j9664L3955L7309N6331
7740B8643k8409m653L4651j35113J6678M9140L2889q99K1045l4229K1007Q2777
7728H3527l9982p5894O5132J9834m344j6283K912m1325O101k3853K027k6746L4907
7715a3987L5998J8259J6910J3618N8111L5464l4848Q5353P4095r1760n606j15301
7703G6306m63j8371O3462m6069o6984j5861K1043n5780m161N2675M0458j4102
$$ plain form
7691 32153 17808 -21265 -13852 18409 48890 -8671 -66674 -6181 78123 -22315 -32597 -61096
7679 -61096 -92219 33152 -6255 24099 -37427 -10671 1383 -103403 -114015 20847 41358
7668 41358 -61415 -10446 30111 -90427 -28492 5410 -49508 -13798 -86971 -53096 -32231
7657 -32231 -49684 -46564 -73696 -28183 26503 2838 11510 -167 31110 -46287 -12837 16915
7645 16915 -22202 -25676 -21031 -31388 -57695 -36916 -112720 -65281 -62375 -49402 -21308 -38241
7633 -38241 -46511 -72749 -126394 -123970 -48211 -86030 -79930 -73950 24989 25104 -81987 -100712 -31250
7620 -31250 -87558 -50898 19045 -45874 -31127 -62959 -88277 -48324 -34708 -76560 -13715 8717
7608 8717 26072 -62433 -38736 -33427 -44573 -56629 -13991 -31739 -67030 3742 -22616 -22811 16480
$$ packed form
7691C2153j4345l9073P413L2261L0481n7561n8003O0493Q4304j00438j0282k8499
7679f1096l1123J25371l9407L0354o1526K6756J2054j04786j0612J34862K0511
7668D1358j02773N0969M0557j20538O1935L3902n4918L5710p3173L3875K0865
7657c2231j7453L120k7132M5513N4686k3665Q672j1677L1277p7397L3450K9752
7645A6915l9117l474M645j0357k6307K0779p5804M7439K906J2973K8094j6933
7633c8241q270k6238n3645K424P5759l7819O100N980R8939J15j07091j8725O9462
7620c1250n6308L6660O9943o4919J4747l1832k5318L9953J3616m1852O2845K2432
7608H717J7355q8505K3697N309j1146j2056M2638j7748l5291P0772k6358j95L9291
$$ plain form
7595 16480 -27885 38911 -7721 -61111 -21752 36155 58385 31118 15926 -39608 -48024 -8148
7583 -8148 -65559 5921 -29836 -110491 -78851 -76137 -77431 -134285 -78559 -96344 -155240 -113641
7571 -113641 -73424 -1605 -83689 -16849 -8568 -38963 -71000 -89293 -78600 -67270 -87618 -2952
7559 -2952 -33200 -48195 -55113 -41521 59387 -11977 -110206 -183446 -57755 -77825 -92013 -113261
7547 -113261 -61006 -21467 5195 -1374 -86668 -18525 902 -48399 -73570 -133335 -80274 65774
7535 65774 71187 7615 -87926 -73936 -35708 -64730 -108958 -39972 -63646 -114320 -60801 -20904
7523 -20904 21444 -28640 -46883 -29368 -17384 -58068 -61018 -49076 10232 -45224 19427 -15141
7511 -15141 -21998 21243 -39791 -7250 43511 -7172 54243 -1474 -40471 -11061 111030 67436
$$ packed form
7595A6480m4365O6796m6632n3390L9359N7907K2230k7267j5192n5534q416L9876
7583h148n7411P1480l5757q0655L1640K714j294n6854N5726j7785n8896M1599
7571a13641M0217P1819q2084O6840Q281l0395l2037j8293J0693J1330k0348Q4666
7559b952l0248j4995o918J3592J00908p1364r8229p3240J25691k0070j4188k1248
7547a13261N2255L9539K6662o569q5294O8143J9427m9301k5171n9765N3061J46048
7535F5774N413o3572r5541J3990L8228k9022m4228O8986k3674n0674N3519L9897
7523b0904M2348n0084j8243J7515J1984m0684k950J1942N9308n5456O4651l4568
7511a5141o857M3241o1034L2541N0761n0683O1415n5717l8997K9410J22091m3594
$$ plain form
7499 67436 12049 -19228 -17141 -10512 34859 21724 -9774 -30620 20612 6587 -8976 -70074
7487 -70074 -53560 370 -29665 -9573 -25992 -81504 53105 22900 -14332 -46189 36215 71408
7475 71408 10063 57201 -9157 -3858 -17362 -3517 54191 7399 -24085 -8928 43106 60642
7463 60642 9704 39703 31398 89462 82814 88226 19703 -27263 -15936 30393 -31788 19453
7451 19453 69813 73258 46702 72949 4961 9701 27692 22598 -16206 84917 67541 37630
7439 37630 86510 101817 109647 155811 139030 187412 187321 184464 185308 326887 276034 203790 197579
7426 197579 175051 216843 101400 91838 143410 193967 174342 102717 48156 96823 52587 56943
7414 56943 63160 -8189 -27100 4661 88998 30471 7036 23475 19632 15600 67306 86381
$$ packed form
7499F7436n5387l1277K087O629M5371j3135l1498k0846N1232j4025j5563o1098
7487g0074J6514N3930l0035K0092j6419n5512J34609l0205l7232l1857Q2404L5193
7475G1408o1345M7138o6358N299j3504J3845N7708m6792l1484J5157N2034J7536
7463F0642n0938K9999q305N8064o648N412o8523m6966J1327M6329o2181N1241
7451A9453N0360L445k6556K6247o7988M740J7991n094l8804J01123j7376k9911
7439C7630M8880J5307P830M6164j6781M8382r1k857Q44J41579n0853p2244o211
7426A97579k2528M1792j15443r562N1572N0557j9625p1625n4561M8667m4236M356
7414E6943O217p1349j8911L1761Q4337n8527k3435J6439l843m032N1706J9075
$$ plain form
7402 86381 100111 32980 90178 82072 48580 71005 38761 94866 112409 98049 33903 -10898
7390 -10898 -10602 3175 -27952 2417 30222 75681 36751 34065 42117 14932 35990 25495 24959
7377 24959 30288 16919 31769 48974 12442 -1545 39528 66984 70962 82178 32309 61941
7365 61941 54374 55650 104952 48418 56567 -9676 -23001 -11929 -43060 19094 104113 88336
7353 88336 53360 -37494 -41239 -30431 56754 78689 -25279 11135 21737 39387 85044 42169
7341 42169 6740 37476 -2990 13831 85954 37858 57323 69751 61594 2423 10661 20308
7329 20308 113489 117591 54957 1426 8515 48682 56358 78073 134834 117915 150322 118361
7317 118361 104833 98180 194757 193457 140789 235777 235766 237952 121132 253461 282998 241898
$$ packed form
7402H6381J3730o7131N7198q106l3492K2425l2244N6105J7543j4360o4146m4801
7390a0898K96J3777l1127L0369K7805M5459l8930k686Q052k7185K1058j0495n36
7377B4959N329j3369J4850J7205l6532j3987M1073K7456L978J1216m9869K9632
7365F1941p567J276M9302n6534Q149o6243j3325J1072l1131O2154Q5019j5777
7353H8336l4976r0854l745J0808Q7185K1935j03968L6414J0602J7650M5657m2875
7341D2169l5429L0736m0466J6821P2123m8096J9465J2428q157n9171Q238R647
7329B0308R3181M102o2634n3531P089M0167P676K1715N6761j6919L2407l1961
7317A18361j3528o653R6577j300n2668R4988j1K186j16820J32329K9537m1100
$$ plain form
7305 241898 317931 326667 408034 550746 636204 590207 705453 897234 1047853 1072077 1100290
7294 1100290 1014387 870580 719774 654602 569572 437959 461152 488498 371511 359275 370192
7283 370192 394571 417025 375340 354589 251937 233578 249029 310537 362290 306320 229220
7272 229220 239917 195802 194869 239366 246437 189665 178654 280477 308023 304685 312803 292375
7260 292375 326124 275055 291250 319744 347866 307308 340523 347315 340207 279882 283891 279816
7248 279816 355915 274913 203290 169784 163652 185695 262304 244497 118794 147981 118459 160512
7236 160512 125563 153232 102076 45128 107131 88886 43686 47064 21456 22326 40953 85360
7224 85360 125107 51887 3547 -2187 110319 40484 1050 48665 52828 -8876 10113 92706
$$ packed form
7305B41898P6033Q736Q1367J42712Q5458m5997J15246J91781J50619K4224K8213
7294A100290q5903j43807j50806o5172q5030j31613K3193K7346j16987j2236J0917
7283C70192K4379K2454m1685k0751j02652j8359J5451O1508N1753n5970p7100
7272B29220J0697m4115r33M4497P071n6772j1011J01823K7546l338Q118k0428
7260B92375L3749n1069J6195K8494K8122m0558L3215O792p108o0325M009m075
7248B79816P6099q1002p1623l3506o132K2043P6609j7807j25703K9187k9522M2053
7236A60512l4949K7669n1156n6948O2003j8245m5200L378k5608Q70J8627M4407
7224H5360L9747p3220m8340n734J12506o9835l9434M7615M163o1704J8989Q2593
$$ plain form
7212 92706 125711 96307 27513 84243 63345 84222 119065 31817 23846 6668 9103 41872
7200 41872 47897 39355 51136 100717 85578 74696 21415 75069 55159 26804 70440 73391
7188 73391 51526 60659 27314 60477 79820 105494 57630 84034 49922 112668 120794 53459
7176 53459 135870 47214 48401 111773 41889 111717 71833 53112 118984 119683 165095 123422
7164 123422 98232 53714 -3014 2036 48739 81516 114542 69154 41292 59012 64064 121025
7152 121025 130291 105959 122192 142541 123457 144354 224131 183950 133875 229836 168494 145663
7140 145663 41176 18576 182088 161236 177177 114853 80797 133152 214904 137734 157366
7129 157366 185227 150350 205979 113739 144074 217429 190163 185077 190475 104165 116312 141781
$$ packed form
7212I2706L3005k9404o8794N6730k0898K0877L4843q7248p971j7178K435L2769
7200D1872O025q542J1781M9581j5139j0882n3281N3654j9910k8355M3636K951
7188G3391k1865R133l3345L3163J9343K5674m7864K6404l4112O2746Q126o7335
7176E3459Q2411q8656J187O3372o9884O9828l9884j8721O5872O99M5412m1673
7164A23422k5190m4518n6728N050M6703L2777L3026m5388k7862J7720N052N6961
7152A21025R266k4332J6233K0349j9084K0897P9777m0181n0075R5961o1342k2831
7140A45663j04487k2600J63512k0852J5941o2324l4056N2355Q1752p7170J9632
7129A57366K7861l4877N5629r2240L0335P3355k7266n086N398q6310J2147K5469
$$ plain form
7117 141781 168219 177454 122461 149294 126028 163212 123522 167600 171403 121939 104429 139623
7105 139623 99677 62497 84750 137157 101377 169933 109845 116919 136494 74204 49244 18027
7093 18027 102884 110292 76864 90131 74837 73903 11528 72878 98471 71967 173935 155030
7081 155030 129665 146685 130359 53519 45144 11624 65196 26106 77345 142345 132432 146983
7069 146983 117653 44372 78791 27074 53641 94803 45390 77901 98788 118685 62403 70076
7057 70076 104974 53432 43733 25956 18142 10764 67115 22849 -1339 63061 112323 173222
7045 173222 96707 58503 76400 75735 38378 62310 125251 116090 84121 62832 85049 33090
7033 33090 102558 111660 39485 90108 105132 18457 67363 78796 64684 26467 90299 71260
$$ packed form
7117A41781K6438R235n4993K6833k3266L7184l9690M4078L803m9464j7510L5194
7105A39623l9946l7180K2253N2407l5780O8556o0088P074J9575o2290k4960l1217
7093A8027Q4857P408l3428J3267j5294r34o2375O1350K5593k6504J01968j8905
7081A55030k5365J7020j6326p6840q375l3520N3572l9090N1239O5000r913J4551
7069A46983k9330p3281L4419n1717K6567M1162m9413L2511K0887J9897n6282P673
7057G0076L4898n1542r699j7777p814p378N6351m4266k4188O4400M9262O0899
7045A73222p6515l8204J7897o65l7357K3932O2941r161l1969k1289K2217n1959
7033C3090O9468R102p2175N0623J5024q6675M8906J1433j4112l8217O3832j9039
$$ plain form
7021 71260 156220 110404 4853 53232 2095 73194 19482 43574 96746 61147 83257 166769
7009 166769 121083 151645 141230 145866 129866 138619 122981 34893 126377 140105 131731 132542 80186
6996 80186 125526 162277 165913 174465 155035 101278 55217 92559 41473 -17168 43893 107982
6984 107982 63132 130216 134561 132271 116560 135028 131864 81823 113427 54502 86529 96998
6972 96998 84101 70778 110001 146398 162577 162363 139938 115304 130378 146068 88806 42888
6960 42888 131826 180537 199982 177680 205870 145751 161064 212999 160084 130492 99430 198747
6948 198747 136047 143962 162698 148288 84257 97095 120813 183172 231397 172678 213150 134870
6936 134870 200995 213326 238948 206899 220697 320889 270408 245051 257704 246883 222227
$$ packed form
7021G1260Q4960m5816j05551M8379n1137P1099n3712K4092N3172l5599K2110Q3512
7009A66769m5686L0562j0415M636j6000Q753j5638q8088R1484J3728q374Q11n2356
6996H0186M5340L6751L636Q552j9430n3757m6061L7342n1086n8641O1061O4089
6984A07982m4850O7084M345k290j5711J8468l164n0041L1604n8925L2027J0469
6972I6998j2897j3323L9223L6397J6179k14k2425k4634J5074J5690n7262m5918
6960D2888Q8938M8711J9445k2302K8190o0119J5313N1935n2915k9592l1062R9317
6948A98747o2700P915J8736j4410o4031J2838K3718O2359M8225n8719M0472p8280
6936A34870O6125J2331K5622l2049J3798J00192n0481k5357J2653j0821k4656
$$ plain form
6925 222227 209032 342142 250507 230729 207383 167753 156881 190144 251439 219810 227347 258672
6913 258672 217512 249184 301500 293036 246722 249319 279923 192462 276266 287303 288859 285320
6901 285320 303776 337498 334915 377338 390698 351687 346079 378604 463643 408639 446597 450173
6889 450173 464941 489644 540677 619426 626179 639409 657445 721899 684273 737735 763244 848031
6877 848031 987438 1098519 1225946 1202995 1072178 969403 847076 804147 886656 962262
6867 962262 971197 1024228 1117453 1218868 1316143 1317437 1106745 865909 812440 765689 679394
6856 679394 690999 655823 601171 581041 564704 644036 616974 590272 599400 561853 592234 575186
6844 575186 468778 478522 459745 410974 389500 452533 385025 414608 503360 477685 512948 552028
$$ packed form
6925B22227j3195J33110r1635j9778k3346l9630j0872L3263O1295l1629P537L1325
6913B58672m1160L1672N2316q464m6314K597L0604q7461Q3804J1037J556l539
6901B85320J8456L3722k583M2423J3360l9011n608L2525Q5039n5004L7958L576
6889D50173J4768K4703N1033P8749O753J3230J8036O4454l7626N3462K5509Q4787
6877H48031J39407J11081J27427k2951j30817j02775j22327m2929Q2509P5606
6867I62262Q935N3031R3225J01415R7275J294k10692k40836n3469m6751q6295
6856F79394J1605l5176n4652k0130j6337P9332k7062k6702R128l7547L0381j7048
6844E75186j06408R744j8777m8771k1474O3033o7508K9583Q8752k5675L5263L9080
$$ plain form
6832 552028 472745 470583 486808 531367 532490 483346 505551 522439 566679 555098 533011 584805
6820 584805 579339 509407 495022 536413 559523 536183 591227 647403 612766 638442 616883 581584
6808 581584 601393 598205 575818 562381 620987 642946 693516 700736 629478 622855 682317 777671
6796 777671 802920 731865 767914 874140 1022770 1058138 1141542 1267063 1402221 1583778 1630414
6785 1630414 1393952 1174860 1015846 1011945 1084202 939251 1007478 1050674 1145162 1229013 1319961
6774 1319961 1319621 1131399 990726 861781 793779 821243 718791 709637 692593 662293 695452
6763 695452 706479 642660 542875 588369 662384 623939 521618 586747 647037 580763 624681
6752 624681 605213 612574 559627 604546 673711 553043 615387 622865 630137 620589 652673 644539
$$ packed form
6832E52028p9283k162J6225M4559J123m9144K2205J6888M4240j1581k2087N1794
6820E84805n466o9932j4385M1391K3110k3340N5044N6176l4637K5676k1559l5299
6808E81584J9809l188k2387j3437N8606K1959N0570P220p1258o623N9462R5354
6796G77671K5249p1055L6049J06226J48630L5368Q3404J25521J35158J81557M6636
6785A630414k36462k19092j59014l901P2257j44951O8227M3196R4488Q3851R0948
6774A319961l40j88222j40673j28945o8002K7464j02452r154j7044l0300L3159
6763F95452J1027o3819r9785M5494P4015l8445j02321O5129O0290o6274M3918
6752F24681j9468P361n2947M4919O9165j20668O2344P478P272r548L2084q134
$$ plain form
6740 644539 621401 600027 710331 652961 746597 727275 742192 747806 799395 822055 829746 876050
6728 876050 944252 918114 931037 1101996 1193050 1225086 1194125 1156395 1220615 1252833 1123889
6717 1123889 1208146 1245732 1254576 1337799 1409483 1418806 1574745 1738644 1841059 2023537 2243659
6706 2243659 2374328 2517713 2600804 2587090 2429552 2296293 2245444 2104865 2045895 2034922
6696 2034922 2004410 2017349 2070616 2273919 2371392 2534312 2734504 2887744 3120505 3383001
6686 3383001 3653666 3748072 3612618 3302504 2989251 2729719 2496771 2360230 2207017 2174985
6676 2174985 2180931 2219695 2226480 2329684 2333695 2410574 2658612 2829284 2988734 3125270 3192234
6665 3192234 3101720 2868998 2634638 2416090 2261924 2263369 2232106 2203641 2273572 2310450 2414933
$$ packed form
6740F44539k3138k1374J10304n7370R3636j9322J4917N614N1589K2660P691M6304
6728H76050O8202k6138J2923J70959R1054L2036l0961l7730O4220L2218j28944
6717A123889Q4257L7586Q844Q3223P1684R323J55939J63899J02415J82478K20122
6706B243659J30669J43385Q3091j3714j57538j33259n0849j40579n8970j0973
6696B034922l0512J2939N3267K03303R7473J62920K00192J53240K32761K62496
6686C383001K70665R4406j35454l10114l13253k59532k32948j36541j53213l2032
6676B174985N946L8764O785J03204M011P6879K48038J70672J59450J36536O6964
6665C192234r0514k32722k34360k18548j54166J445l1263k8465O9931L6878J04483
$$ plain form
6654 2414933 2483198 2559009 2637862 2751355 2909286 2912447 2859697 2868662 2803227 2624506 2496374
6643 2496374 2251362 2106745 2035872 1913859 1827061 1776272 1769846 1691555 1709361 1655756 1591886
6632 1591886 1521587 1469963 1538919 1381025 1299512 1337507 1355759 1438822 1425423 1401352 1480911
6621 1480911 1492482 1531559 1486994 1545848 1531010 1514650 1522990 1580718 1615852 1553448 1598975 1579541
6609 1579541 1596535 1597671 1572957 1616416 1632741 1576950 1581105 1562771 1563696 1636032 1651246 1645151
6597 1645151 1675202 1706573 1688875 1655914 1608662 1561593 1549031 1495595 1407202 1324114 1340030
6586 1340030 1361397 1318490 1287175 1297557 1419042 1388938 1416076 1460509 1539391 1620132 1731065
6575 1731065 1801866 1801361 1725694 1689028 1670695 1659734 1697426 1667932 1673669 1763347 1731235 1789117
$$ packed form
6654B414933O8265P5811P8853J13493J57931L161n2750Q965o5435j78721j28132
6643B496374k45012j44617p0873j22013q6798n0789o426p8291J7806n3605o3870
6632A591886p0299n1624O8956j57894q1513L7995J8252Q3063j3399k4071P9559
6621A480911J1571L9077m4565N8854j4838j6360Q340N7728L5134o2404M5527j9434
6609A579541J6994J136k4714M3459J6325n5791M155j8334R25P2336J5214o095
6597A645151L0051L1371j7698l2961m7252m7069j2562n3436q8393q3088J5916
6586A340030K1367m2907l1315J0382J21485l0104K7138M4433P8882Q0741J10933
6575A731065P0801n05p5667l6666j8333j0961L7692k9494N737Q9678l2112N7882
$$ plain form
6563 1789117 1908190 1961862 1924496 2018408 2073295 2123384 2227297 2378073 2427923 2429747 2530868
6552 2530868 2454322 2504281 2565950 2587101 2693342 2768558 2936949 2986836 3094972 3235460 3441938
6541 3441938 3732874 3966593 4294824 4710250 5268254 5850732 6029548 5522621 5039662 4856748
6531 4856748 4785880 4849312 5079720 5249760 5681266 6068822 6485035 6978706 7288553 7379507
6521 7379507 7299612 7217693 7159738 7052048 6984144 6963788 7135457 7339989 7449990 7726307
6511 7726307 8139034 8582056 9085212 9667868 10369246 11007437 11589371 11978046 12030796 11769934
6501 11769934 11286341 10547464 9791898 8985586 8304260 7783137 7347815 6955514 6716604
6492 6716604 6500591 6296092 6166027 6037388 5787071 5508571 5316806 5045319 4760575 4557593
$$ packed form
6563A789117J19073N3672l7366R3912N4887N0089J03913J50776M9850J824J01121
6552B530868p6546M9959O1669K1151J06241P5216J68391M9887J08136J40488K06478
6541C441938K90936K33719L28231M15426N58004N82478J78816n06927m82959j82914
6531D856748p0868O3432K30408J70040M31506L87556M16213M93671L09847R0954
6521G379507p9895q1919n7955j07690o7904k0356J71669K04532J10001K76317
6511G726307M12727M43022N03156N82656P01378O38191N81934L88675N2750k60862
6501A1769934m83593p38877p55566q06312o81326n21123m35322l92301k38910
6492F716604k16013k04499j30065j28639k50317k78500j91765k71487k84744k02982
$$ plain form
6482 4557593 4367798 4183948 3999093 3787011 3715216 3685158 3566199 3453975 3359572 3226029
6472 3226029 3166683 3080968 2925393 2903065 2883238 2768564 2645606 2571371 2504830 2511537 2422739
6461 2422739 2433611 2462819 2427704 2373136 2258503 2279477 2188936 2178827 2156820 2194485 2201655
6450 2201655 2192682 2174133 2186170 2250691 2304250 2340875 2368697 2438368 2349209 2359735 2323402 2307435
6438 2307435 2264530 2335264 2295435 2334955 2443577 2435911 2504804 2561339 2676826 2729037 2785151
6427 2785151 2862183 2853414 2837561 2784256 2777317 2891589 2922840 2912884 2830893 2935914 2901356 2835011
6415 2835011 2936912 2995961 3004439 3174557 3283027 3392138 3261601 3228118 3158861 3240099 3297242
6404 3297242 3320849 3468195 3580958 3646572 3756065 3771922 3789326 3789767 3828949 3910201 3856099
$$ packed form
6482D557593j89795j83850j84855k12082p1795l0058j18959j12224r4403j33543
6472C226029n9346q5715j55575k2328j9827j14674j22958p4235o6541O707q8798
6461B422739J0872K9208l5115n4568j14633K0974r0541j0109k2007L7665P170
6450B201655q973j8549J2037O4521N3559L6625K7822O9671q9159J0526l6333j5967
6438B307435m2905P0734l9829L9520J08622p666O8893N6535J15487N2211N6114
6427B785151P7032q769j5853n3305o939J14272L1251r956q1991J05021l4558o6345
6415B835011J01901N9049Q478J70118J08470J09111j30537l3483o9257Q1238N7143
6404C297242K3607J47346J12763O5614J09493J5857J7404M41L9182Q1252n4102
$$ plain form
6393 3856099 3918266 3954606 4014991 4132645 4192547 4278122 4309773 4394934 4436699 4551937 4704104
6382 4704104 4832771 4964472 5061755 5227145 5421663 5631210 5828507 6093401 6323119 6598520
6372 6598520 6947103 7304924 7735272 8228487 8874542 9687169 10611013 11854378 13083831
6363 13083831 13500370 13128615 13012942 13036752 12938146 12853351 12735741 12909468 13188369 13610881
6353 13610881 14364655 15342236 16503624 17937029 19714100 21739396 23819264 25650474
6345 25650474 27072161 28469525 29902945 31151848 32277717 33379420 34803871 36511295
6337 36511295 38712203 41177770 44045503 47342111 50315976 50521408 47138427 42846892
6329 42846892 39405109 36902662 35280172 34422973 33952876 33651633 32984717 31950586 31143384
$$ packed form
6393C856099O2167L6340O0385J17654N9902Q5575L1651Q5161M1765J15238J52167
6382D704104J28667J31701R7283J65390J94518K09547J97297K64894K29718K75401
6372F598520L48583L57821M30348M93215O46055Q12627R23844J243365J229453
6363A3083831M16539l71755j15673K3810r8606q4795j17610J73727K78901M22512
6353A3610881P53774R77581J161388J433405J777071K025296K079868J831210
6345B5650474J421687J397364J433420J248903J125869J101703J424451J707424
6337C6511295K200908K465567K867733L296608K973865K05432l382981m291535
6329D2846892l441783k502447j622490q57199m70097l01243o66916j034131q07202
$$ plain form
6320 31143384 30497154 30135893 29910490 29297665 28572793 27886231 27687270 27720183 27414261 26918562
6310 26918562 26734737 26845615 26685192 26445835 26216411 25905996 25388379 24727265 23864829
6301 23864829 22907172 21486591 20070994 18954303 18234977 17819376 17639044 17739479 18077568
6292 18077568 18698928 19404324 20233481 21050722 21447797 21017683 20321508 19769202 19623032
6283 19623032 19713942 20084053 20706298 21486325 22548015 23902009 25542538 27632343 30208267
6274 30208267 33189827 36785136 41016671 45961613 51233841 56648099 61600809 66196190
6266 66196190 70484402 73680562 74450453 72213042 67803100 62457545 57041318 51848962
6258 51848962 46889559 42579820 38960543 36017861 33363984 31030039 28990387 27076312
$$ packed form
6320C1143384o46230l61261k25403o12825p24872o86562j98961L2913l05922m95699
6310B6918562j83825J10878j60423k39357k29424l10415n17617o61114q62436
6301B3864829r57657j420581j415597j116691p19326m15601j80332J00435L38089
6292A8077568O21360P05396Q29157Q17241L97075m30114o96175n52306j46170
6283A9623032R0910L70111O22245P80027J061690J353994J640529K089805K575924
6274C0208267K981560L595309M231535M944942N272228N414258M952710M595381
6266F6196190M288212L196160P69891k237411m409942n345555n416227n192356
6258E1848962m959403m309739l619277k942682k653877k333945k039652j914075
$$ plain form
6250 27076312 25357166 23708271 22293623 20931286 19763531 18703614 17796542 17031847
6242 17031847 16258957 15442572 14902504 14429379 14057239 13788320 13526332 13317604 13098167
6233 13098167 13080748 13199859 13263314 13396260 13514877 13571679 13440991 13133361 12791670 12520222
6223 12520222 12407512 12376014 12438730 12608324 12886454 13021512 13228922 13463118 13798474 14349610
6213 14349610 14844471 15338790 15878998 16194771 16548440 17176150 17858055 18815953 20065434
6204 20065434 21433015 23155069 25306571 27928770 30967624 34838250 39542391 45495635
6196 45495635 52943184 62577849 74778998 88401685 94687676 85761291 69634238 56205287
6188 56205287 47570624 42355214 39401603 37756264 37190540 37652913 39183759 41774028
$$ packed form
6250B7076312j719146j648895j414648j362337j167755j059917r07072p64695
6242A7031847p72890q16385n40068m73125l72140k68919k61988k08728k19437
6233A3098167j7419J19111O3455J32946J18617N6802j30688l07630l41691k71448
6223A2520222j12710l1498O2716J69594K78130J35058K07410K34196L35356N51136
6213A4349610M94861M94319N40208L15773L53669O27710O81905R57898J249481
6204B0065434J367581J722054K151502K622199L038854L870626M704141N953244
6196D5495635P447549R634665J2201149J3622687O285991q926385j6127053j3428951
6188E6205287q634663n215410k953611j645339n65724M62373J530846K590269
$$ plain form
6180 41774028 45378484 50295665 56718560 63944405 68990028 69395629 66673728 60096236
6172 60096236 50402236 41592403 35419968 31368286 28696036 26832847 25032752 22951241
6164 22951241 21128933 19638347 18438849 17559174 16935884 16451408 16062870 15603288 14955900
6155 14955900 14318410 13829656 13594221 13373117 13090920 12992335 12972473 13066483 13351912 13604680
6145 13604680 13431928 13122336 13006578 12861477 12663971 12474464 12294334 11926489 11595775
6136 11595775 11090503 10757669 10495051 10231639 10062537 9907905 9829345 9769495 9876639 10074141
6126 10074141 10312520 10664507 11077180 11469991 11788477 12065131 12275022 12339039 12315821 12332228
6116 12332228 12339642 12404396 12385629 12193129 11994721 11676965 11451760 11372120 11362524 11004235 10524248
$$ packed form
6180D1774028L604456M917181O422895P225845N045623M05601k721901o577492
6172F0096236r694000q809833o172435m051682k672250j863189j800095k081511
6164B2951241j822308j490586j199498q79675o23290m84476l88538m59582o47388
6155A4955900o37490m88754k35435k21104k82197r8585j9862R4010K85429K52768
6145A3604680j72752l09592j15758j45101j97506j89507j80130l67845l30714
6136A1595775n05272l32834k62618k63412j69102j54632p8560n9850J07144J97502
6126A0074141K38379L51987M12673L92811L18486K76654K09891O4017k3218J6407
6116A2332228P414O4754j8767j92500j98408l17756k25205p9640r596l58289m79987
$$ plain form
6105 10524248 10320816 10142793 10219463 10434721 10636669 10838925 11045052 11168698 11246877 11387253
6095 11387253 11504651 11524918 11537403 11451330 11280279 10948428 10556492 10359217 10153404 9999109
6085 9999109 9952051 10020672 10088492 10092789 10223636 10402676 10635600 10848313 11110531 11364417
6075 11364417 11637100 11856018 12021134 12069243 12176955 12283831 12513413 12674736 12898202 13213913
6065 13213913 13606862 13909857 14163993 14480223 14769468 15185759 15600549 16058436 16560555
6056 16560555 17235975 17886821 18586802 19364559 20385239 21382273 22660779 24131667 25584957
6047 25584957 26860236 27308183 26795261 25539142 24112094 22951556 22169976 21731605 21490623
6038 21490623 21206691 21066031 20739659 20382895 20171120 20074611 19987064 20107745 20226057 20364787
$$ packed form
6105A0524248k03432j78023P6670K15258K01948K02256K06127J23646P8179J40376
6095A1387253J17398K0267J2485q6073j71051l31851l91936j97275k05813j54295
6085I999109m7058O8621O7820M297J30847J79040K32924K12713K62218K53886
6075A1364417K72683K18918J65116M8109J07712J06876K29582J61323K23466L15711
6065A3213913L92949L02995K54136L16230K89245M16291M14790M57887N02119
6056A6560555O75420O50846O99981P77757J020680R97034J278506J470888J453290
6047B5584957J275279M47947n12922j256119j427048j160538p81580m38371k40982
6038B1490623k83932j40660l26372l56764k11775r6509q7547J20681J18312J38730
$$ plain form
6028 20364787 20573314 20641716 20695226 20618804 20596409 20586807 20582867 20615645 20679648 20814053 20976616
6017 20976616 21180460 21354050 21486882 21720448 21997967 22225815 22426876 22553328 22647536 22812268
6007 22812268 23041061 23144594 23262759 23386902 23439168 23620919 23659145 23791752 23992338 23886076
5997 23886076 23809554 23625575 23326773 23150108 22895583 22693840 22509147 22246392 21927017 21697583
5987 21697583 21497885 21306438 21093225 20894346 20674574 20496589 20206376 19861336 19682148
5978 19682148 19392348 19178232 18918203 18629803 18390709 18200033 18015362 17967754 17881404 17832948
5968 17832948 17835235 17876686 17955286 18098860 18333131 18553532 18724484 18745777 18627082 18346620
5958 18346620 18026070 17731269 17279139 16879814 16563521 16096033 15766393 15491519 15192596
$$ packed form
6028B0364787K08527O8402N3510p6422k2395r602l940L2778O4003J34405J62563
6017B0976616K03844J73590J32832K33566K77519K27848K01061J26452R4208J64732
6007B2812268K28793J03533J18165J24143N2266J81751L8226J32607K00586j06262
5997B3886076p6522j83979k98802j76665k54525k01743j84693k62755l19375k29434
5987B1697583j99698j91447k13213j98879k19772j77985k90213l45040j79188
5978A9682148k89800k14116k60029k88400k39094j90676j84671m7608q6350m8456
5968A7832948K287M1451P8600J43574K34271K20401J70952K1293j18695k80462
5958A8346620l20550k94801m52130l99325l16293m67488l29640k74874k98923
$$ plain form
5949 15192596 14988792 14903453 14949640 14986479 15165237 15415723 15580872 15722598 15881699 15908942
5939 15908942 15753821 15663530 15360420 15133170 14819036 14445784 14155001 13838813 13376569 12923036
5929 12923036 12419258 11939302 11560045 11252857 11047405 10853799 10780732 10711609 10685153 10714033
5919 10714033 10562664 10521174 10496255 10405689 10401433 10284884 10140758 9878115 9474419 9063379
5909 9063379 8623505 8293170 8011970 7842252 7633259 7568836 7396909 7309714 7154700 7151420
5899 7151420 7133221 7076506 7088775 7009266 6971951 6898238 6884162 6881912 6862362 6762768 6694455 6661307
5887 6661307 6611295 6558212 6450705 6340743 6255195 6257258 6271836 6189627 6157676 6105252 5980615
5876 5980615 5971148 5887998 5810595 5717670 5676436 5665350 5608995 5700620 5691337 5705280 5660753 5721561
$$ packed form
5949A5192596k03804q5339M6187L6839J78758K50486J65149J41726J59101K7243
5939A5908942j55121r0291l03110k27250l14134l73252k90783l16188m62244m53533
5929A2923036n03778m79956l79257l07188k05452j93606p3067o9123k6456K8880
5919A0714033j51369m1490k4919r0566m256j16549j44126k62643m03696m11040
5909I063379m39874l30335k81200j69718k08993o4423j71927q7195j55014l280
5899G151420j8199n6715J2269p9509l7315p3713j4076k250j9550r9594o8313l3148
5887F661307n0012n3083j07507j09962q5548K063J4578q2209l1951n2424j24637
5876E980615r467q3150p7403r2925m1234j1086n6355R1625r283J3943m4527O0808
$$ plain form
5864 5721561 5778468 5788175 5845148 6066338 6178397 6281572 6149799 5976952 5802767 5608406
5854 5608406 5348749 5272225 5234857 5084759 4969973 4949270 4999403 4991146 4865046 4797772 4796319
5843 4796319 4679606 4736832 4788693 4805779 4823642 4805724 4832273 4818038 4828991 4800922 4846355
5832 4846355 4857022 4835868 4833304 4785584 4848536 4919212 4978102 4963635 4981475 4969752 4995206 5022731
5820 5022731 5100991 5157581 5102976 5248929 5341863 5340344 5408264 5471493 5619028 5757917 5730886
5809 5730886 5836358 5847498 5905399 6049934 6057366 6194961 6268659 6311419 6434300 6587642 6682832
5798 6682832 6749768 6869904 7045195 7234255 7283837 7472197 7642576 7768037 7940445 8021241
5788 8021241 8195070 8334625 8413244 8610044 8821250 9009458 9227123 9465963 9781165 10112794
$$ packed form
5864E721561N6907R707N6973K21190J12059J03175j31773j72847j74185j94361
5854E608406k59657p6524l7368j50098j14786k0703N0133q257j26100o7274j453
5843D796319j16713N7226N1861J7086J7863j7918K6549j4235J0953k8069M5433
5832D846355J0667k1154k564m7720O2952P0676N8890j4467J7840j1723K5454K7525
5820E022731P8260N6590n4605J45953R2934j519O7920O3229J47535J38889k7031
5809E730886J05472J1140N7901J44535P432J37595P3698M2760J22881J53342R5190
5798F682832O6936J20136J75291J89060M9582J88360J70379J25461J72408Q0796
5788H021241J73829J39555P8619J96800K11206J88208K17665K38840L15202L31629
$$ plain form
5778 10112794 10457591 10708827 11049694 11411316 11707244 12106827 12620330 13247973 13886063
5769 13886063 14778325 15769453 17001409 18583652 20254893 22504690 24757783 25895493
5761 25895493 25222063 23511837 22056234 21223030 21075650 21327836 21941261 22931706 24257297
5752 24257297 25967976 28145005 30126115 30941773 29934083 28059568 26615474 25888278
5744 25888278 25619525 25620294 25771811 26149854 26598830 27236524 27974811 28837250 29997570 31321702
5734 31321702 32803150 34414123 36279276 38322857 40610455 43288716 46660875 50843640
5726 50843640 55717020 60955721 64311184 64668373 63917062 64155342 66232001 69919984 75023903
5717 75023903 80901991 86617301 91641348 96248871 101468178 107763432 113356824 117068297
$$ packed form
5778A0112794L44797K51236L40867L61622K95928L99583N13503O27643O38090
5769A3886063Q92262R91128J231956J582243J671241K249797K253093J137710
5761B5895493o73430j710226j455603q33204j47380K52186O13425R90445J325591
5752B4257297J710679K177029J981110Q15658j007690j874515j444094p27196
5744B5888278k68753P69J51517L78043M48976O37694P38287Q62439J160320J324132
5734C1321702J481448J610973J865153K043581K287598K678261L372159M182765
5726E0843640M873380N238701L355463L57189p51311K38280K076659L687983N103919
5717G5023903N878088N715310N024047M607523N219307O295254N593392L711473
$$ plain form
5709 117068297 119576673 121386848 121880902 120372105 117165343 112887383 107891668 102823862
5701 102823862 97926360 93592415 89939746 86945142 84263075 81542949 78281666 74387966
5693 74387966 70107189 65845828 61918818 58272977 54677493 51140588 47841241 44985120
5685 44985120 42435857 40274983 38557877 37078616 35983486 35031868 34165221 33353688 32594020
5676 32594020 32015701 31360349 30688486 29934849 29078232 28159294 27310105 26538541 25789268
5667 25789268 25260109 24791065 24303643 23987571 23739699 23615164 23508675 23438478 23496444 23725460
5657 23725460 23987522 24177282 24557696 25067012 25393562 25827300 26299712 26733284 27283564
5648 27283564 28005867 28865831 30182382 31887795 33951224 36764878 39780794 41881745
$$ packed form
5709A17068297K508376J810175M94054j508797l206762m277960m995715n067806
5701A02823862m897502m333945l652669k994604k682067k720126l261283l893700
5693G4387966m280777m261361l927010l645841l595484l536905l299347k856121
5685D4985120k549263k160874j717106j479261j095130r51618q66647q11533p59668
5676C2594020n78319o55352o71863p53637q56617r18938q49189p71564p49273
5667B5789268n29159m69044m87422l16072k47872j24535j06489p0197N7966K29016
5657B3725460K62062J89760L80414N09316L26550M33738M72412M33572N50280
5648B7283564P22303Q59964J316551J705413K063429K813654L015916K100951
$$ plain form
5640 41881745 40856054 37042133 32839767 29662729 27499423 25947706 24890764 24114190
5632 24114190 23398238 22997944 22577946 22423644 22410730 22581247 22846045 23305429 23964011 24822144
5622 24822144 26101829 27661805 29616999 32092713 35028030 37685216 38083222 35524443
5614 35524443 31934879 28751982 26772812 25696435 25144501 25105505 25410527 26081605 27084568
5605 27084568 28558993 30284784 31464641 30802740 28628734 26493642 25101031 24396803
5597 24396803 24117727 23979243 24026015 24205937 24330265 24575272 25064498 25686586 26469852 27501691
5587 27501691 28819793 30530621 32381712 34576176 37158577 40388549 44131133 48713816
5579 48713816 53723490 57881817 60948356 64520179 70074599 78101619 88851275 102703210
$$ packed form
5640D1881745j025691l813921m202366l177038k163306j551717j056942p76574
5632B4114190p15952m00294m19998j54302j2914J70517K64798M59384O58582Q58133
5622B4822144J279685J559976J955194K475714K935317K657186L98006k558779
5614C5524443l589564l182897j979170j076377n51934l8996L05022O71078J002963
5605B7084568J474425J725791J179857o61901k174006k135092j392611p04228
5597B4396803k79076j38484M6772J79922J24328K45007M89226O22088P83266J031839
5587B7501691J318102J710828J851091K194464K582401L229972L742584M582683
5579D8713816N009674M158327L066539L571823N554420Q027020J0749656J3851935
$$ plain form
5571 102703210 119742901 138468566 151124477 145182879 123688322 100798159 83260585
5564 83260585 71167985 63233759 57923559 54511911 52354206 51078445 50601591 50820819
5556 50820819 51070333 50684228 49079108 46318683 43078649 40204690 38015174 36324985
5548 36324985 35337303 34828004 34539536 34521768 34873203 35638688 36898771 38371988 39739357
5539 39739357 40360044 40015240 38548201 36478763 34434024 32765514 31418525 30252741
5531 30252741 29211798 28391314 27840933 27497989 27281916 27158839 27134206 27233160 27292574 27434496
5521 27434496 27661970 28164782 28853337 29740846 30770090 31982622 33172312 34364850 35621764
5512 35621764 36943734 38424354 40057543 42135228 44723124 47982209 52080288 57106285
$$ packed form
5571A02703210J7039691J8725665J2655911n941598k1494557k2890163j7537574
5564H3260585j2092600p934226n310200l411648k157705j275761m76854K19228
5556E0820819K49514l86105j605120k760425l240034k873959k189516j690189
5548C6324985r87682n09299k88468j7768L51435P65485J260083J473217J367369
5539C9739357O20687l44804j467039k069438k044739j668510j346989j165784
5531C0252741j040943q20484n50381l42944k16073j23077k4633R8954N9414J41922
5521B7434496K27474N02812O88555Q87509J029244J212532J189690J192538J256914
5512C5621764J321970J480620J633189K077685K587896L259085M098079N025997
$$ plain form
5504 57106285 63123346 70711029 80492069 93227873 109381311 127721779 143119533 150817478
5496 150817478 148200361 135701422 116834361 96639656 80031830 68434703 60767376
5489 60767376 55450671 51644495 48787344 46552812 44673666 43221719 41819316 40500899
5481 40500899 39244476 38382863 37917084 37788910 38042445 38678190 40035436 41837159 44024101
5472 44024101 45994519 46770379 45432613 42531530 39567369 37207332 35618982 34612007
5464 34612007 34177649 34189454 34415300 34685213 34966892 35124283 35449354 36214240 37148156 37940765
5454 37940765 38087521 37056551 34908969 32147079 29483752 27230211 25501514 24306680
5446 24306680 23392747 22645854 22032915 21641487 21326464 21114560 21020902 21019511 20743853 20369572
$$ packed form
5504E7106285O017061P587683R781040J2735804J6153438J8340468J5397754P697945
5496A50817478k617117j2498939j8867061k0194705j6607826j1597127p667327
5489F0767376n316705l806176k857151k234532j879146j451947j402403j318417
5481D0500899j256423q61613m65779j28174K53535O35745J357246J801723K186942
5472D4024101J970418P75860j337766k901083k964161k360037j588350j006975
5464C4612007m34358J1805K25846K69913K81679J57391L25071P64886R33916P92609
5454C7940765J46756j030970k147582k761890k663327k253541j728697j194834
5446B4306680r13933p46893o12939l91428l15023k11904r3658j391k75658l74281
$$ plain form
5436 20369572 19762826 18826332 17743419 16719451 15884369 15262021 14877225 14469826 14185824
5427 14185824 14074324 13846027 13685570 13302888 12872031 12436095 12185492 11912908 11723949
5418 11723949 11512670 11405694 11493632 11415104 11516404 11682750 11657343 11759880 11905842 12007952
5408 12007952 11916156 11645380 11365245 10984292 10772251 10353975 10116981 10068543 9871871 9829091
5398 9829091 9863062 9741168 9784971 9754635 9717186 9787937 9866861 9973923 10177189 10291733 10244405
5387 10244405 9912446 9489207 9111398 8722063 8505414 8301300 8186233 8015065 7885995
5378 7885995 7766452 7590706 7494335 7444753 7319510 7315302 7373343 7422806 7489886 7534823 7767850
5367 7767850 7799950 7949231 8209978 8388502 8627892 8892670 9158984 9539468 9975790 10372934
$$ packed form
5436B0369572o06746r36494j082913j023968q35082o22348l84796m07399k84002
5427A4185824j11500k28297j60457l82682m30857m35936k50603k72584j88959
5418A1723949k11279j06976Q7938p8528J01300J66346k5407J02537J45962J02110
5408A2007952r1796k70776k80135l80953k12041m18276k36994m8438j96672m2780
5398I829091L3971j21894M3803l0336l7449P0751P8924J07062K03266J14544m7328
5387A0244405l31959m23239l77809l89335k16649k04114j15067j71168j29070
5378G885995j19543j75746r6371m9582j25243m208N8041M9463O7080M4937K33027
5367G767850L2100J49281K60747J78524K39390K64778K66314L80484M36322L97144
$$ plain form
5357 10372934 10742695 10881160 10826688 10666213 10387053 10125543 9830366 9563357 9375457 9271682
5347 9271682 9351301 9461956 9486093 9558562 9783556 9935382 10228840 10541486 10804068 11073316
5337 11073316 11242239 11184002 10969299 10755297 10614483 10519139 10533117 10618088 10741282 10848424
5327 10848424 10970736 11196820 11390725 11540098 11742479 11926061 12083194 12311677 12532725
5318 12532725 12866457 13212654 13621001 14089970 14618736 15227413 15893251 16629236 17403787
5309 17403787 18283575 19399624 20490539 21821860 23227256 24784372 26679542 28679368
5301 28679368 30654949 32682740 34517579 36391803 38433844 40526470 42771336 45108158
5293 45108158 47754306 50508076 53351769 56263506 59265195 62419104 65472507 68350895
$$ packed form
5357A0372934L69761J38465n4472j60475k79160k61510k95177k67009j87900j03775
5347I271682P9619J10655K4137P2469K24994J51826K93458L12646K62582K69248
5337A1073316J68923n8237k14703k14002j40814r5344J3978Q4971J23194J07142
5327A0848424J22312K26084J93905J49373K02381J83582J57133K28483K21048
5318A2532725L33732L46197M08347M68969N28766O08677O65838P35985P74551
5309A7403787Q79788J116049J090915J331321J405396J557116J895170J999826
5301B8679368J975581K027791J834839J874224K042041K092626K244866K336822
5293D5108158K646148K753770K843693K911737L001689L153909L053403K878388
$$ plain form
5285 68350895 71048129 73587043 75985772 78099556 79957512 81805294 83487761 84930536
5277 84930536 86055000 86760751 86891739 86628486 85856568 84726432 83426167 81984218 80297510
5268 80297510 78397207 76407272 73961660 71264229 68330214 65148515 61930445 58716355
5260 58716355 55585773 52602422 49704309 46886950 44056622 41281171 38517582 35813176
5252 35813176 33179442 30737819 28429755 26427832 24553706 22871925 21320275 19931535
5244 19931535 18663577 17428486 16304591 15380824 14464152 13605483 12887816 12226417 11554030
5235 11554030 11021897 10536620 10077471 9692400 9238711 8911028 8617830 8351189 8108064
5226 8108064 7824056 7621515 7390128 7141503 6919515 6746847 6603087 6490966 6449007 6310929
$$ packed form
5285F8350895K697234K538914K398729K113784J857956J847782J682467J442775
5277H4930536J124464P05751J30988k63253p71918j130136j300265j441949j686708
5268H0297510j900303j989935k445612k697431k934015l181699l218070l214090
5260E8716355l130582k983351k898113k817359k830328k775451k763589k704406
5252C5813176k633734k441623k308064k001923j874126j681781j551650j388740
5244A9931535j267958j235091j123895r23767r16672q58669p17667o61399o72387
5235A1554030n32133m85277m59149l85071m53689l27683k93198k66641k43125
5226H108064k84008k02541k31387k48625k21988j72668j43760j12121m1959j38078
$$ plain form
5216 6310929 6222857 6171966 6029008 5983504 5884529 5852549 5838128 5844263 5809757 5758774 5653459
5205 5653459 5525251 5603486 5588265 5568329 5600955 5566224 5511133 5404651 5382450 5330129 5199675
5194 5199675 5204663 5240423 5314125 5359504 5381774 5332193 5307155 5356971 5422434 5447535 5371839 5386720
5182 5386720 5357294 5325620 5396828 5399769 5371259 5358984 5308707 5179482 5192954 5195855 5100328 5020864
5170 5020864 4937275 4908481 4752701 4704863 4647355 4585324 4573268 4550760 4567233 4484239 4439741
5159 4439741 4399664 4398413 4352193 4256910 4211984 4200833 4214905 4093841 4011076 3955081 4025773
5148 4025773 4100853 4055106 4046540 3940323 4071243 4098544 4027371 4036480 4020067 3958076 3921760
5137 3921760 3998726 4004286 3979082 3982939 3984122 4020543 3952630 3967902 3999906 4089351 4195054 4106129
$$ packed form
5216F310929q8072n0891j42958m5504r8975l1980j4421O135l4506n0983j05315
5205E653459j28208P8235j5221j9936L2626l4731n5091j06482k2201n2321j30454
5194E199675M988L5760P3702M5379K2270m9581k5038M9816O5463K5101p5696J4881
5182E386720k9426l1674P1208K941k8510j2275n0277j29225J3472K901r5527p9464
5170E020864q3589k8794j55780m7838n7508o2031j2056k2508J6473q2994m4498
5159D439741m0077j251m6220r5283m4926j1151J4072j21064q2765n5995P0692
5148D025773P5080m5747q566j06217J30920K7301p1173R109j6413o1991l6316
5137C921760P6966N560k5204L857J183L6421o7913J5272L2004Q9445J05703q8925
$$ plain form
5125 4106129 4139941 4215153 4287938 4307625 4362334 4337047 4384186 4491897 4515736 4576239 4607346
5114 4607346 4765682 4717038 4775107 4859902 4942645 5055246 5136010 5321656 5414919 5397526 5577963
5103 5577963 5654179 5763259 5807576 5992058 6021637 6139312 6375205 6524232 6536300 6687409
5093 6687409 6913254 7102772 7254530 7369699 7558347 7743030 7921724 8155014 8370073 8715455
5083 8715455 9008321 9269602 9545831 9813575 10229041 10533800 10971371 11449361 11940193 12441715
5073 12441715 12952221 13583862 14283635 15021292 15772225 16668691 17697907 18792845 19991360
5064 19991360 21228809 22668322 24072755 25633149 27066845 28502131 29970675 31349342
5056 31349342 32595137 33902566 35287388 36679446 37996018 39335359 40516624 41582503
$$ packed form
5125D106129L3812P5212P2785J9687N4709k5287M7139J07711K3839O0503L1107
5114D607346J58336m8644N8069Q4795Q2743J12601Q0764J85646R3263j7393J80437
5103E577963P6216J09080M4317J84482K9579J17675K35893J49027J2068J51109
5093F687409K25845J89518J51758J15169J88648J84683J78694K33290K15059L45382
5083H715455K92866K61281K76229K67744M15466L04759M37571M77990M90832N01522
5073A2441715N10506O31641O99773P37657P50933Q96466J029216J094938J198515
5064A9991360J237449J439513J404433J560394J433696J435286J468544J378667
5056C1349342J245795J307429J384822J392058J316572J339341J181265J065879
$$ plain form
5048 41582503 42353217 43015034 43479285 43820242 44107696 44460180 44777376 45155636 45616870
5039 45616870 46062264 46681097 47381713 48050230 48945052 50053450 51364718 52903863 54838506
5030 54838506 57182382 59843564 62866422 66320154 70149250 74408912 78957321 83471017
5022 83471017 88199906 92965594 97706156 102223855 106760650 111334298 115729701 120107994
5014 120107994 124361739 128179175 131778993 135001613 137583776 139952515 142103157 144385943
5006 144385943 146798807 149650799 153022086 156595732 160344003 164304354 168376342 172481571
4998 172481571 176860343 181955641 188212297 195919412 205046770 215382055 227116443 239755472
4990 239755472 252535261 264588741 275049692 282992777 287926492 289754743 288643885 285140700
$$ packed form
5048D1582503P70714O61817M64251L40957K87454L52484L17196L78260M61234
5039D5616870M45394O18833P00616O68517Q94822J108398J311268J539145J934643
5030E4838506K343876K661182L022858L453732L829096M259662M548409M513696
5022H3471017M728889M765688M740562M517699M536795M573648M395403M378293
5014A20107994M253745L817436L599818L222620K582163K368739K150642K282786
5006A44385943K412864K851992L371287L573646L748271L960351M071988M105229
4998A72481571M378772N095298O256656P707115R127358J0335285J1734388J2639029
4990B39755472J2779789J2053480J0460951P943085M933715J828251j110858l503185
$$ plain form
4982 285140700 280197936 274645306 268671241 262020434 254152754 244200464 231646375 216811304
4974 216811304 200329422 183045625 165976620 149980268 135506864 123043030 112712194
4967 112712194 104068187 96974024 91154766 86287376 82367484 79064617 76139241 73612431
4959 73612431 71335079 69311822 67561967 66108652 64820091 63747643 62631917 61399384
4951 61399384 59937025 58380755 56699752 54970070 53099584 51277957 49485537 47775685
4943 47775685 46136451 44545977 43036863 41591592 40144298 38622360 37327786 36157663
4935 36157663 35222729 34462550 33823835 33415799 33365502 33462326 33925786 34563444 35518284 36777329
4925 36777329 38019895 39128145 40103466 40800665 40976732 40706617 40192641 39527128 38857223
$$ packed form
4982B85140700m942764n552630n974065o650807p867680r952290j2554089j4835071
4974B16811304j6481882j7283797j7069005j5996352j4473404j2463834j0330836
4967A12712194q644007p094163n819258m867390l919892l302867k925376k526810
4959G3612431k277352k023257j749855j453315j288561j072448j115726j232533
4951F1399384j462359j556270j681003j729682j870486j821627j792420j709852
4943D7775685j639234j590474j509114j445271j447294j521938j294574j170123
4935C6157663r34934p60179o38715m08036n0297R6824M63460O37658R54840J259045
4925C6777329J242566J108250R75321O97199J76067k70115n13976o65513o69905
$$ plain form
4916 38857223 38276314 37636670 36842416 35720096 34303312 32599374 30341680 28047967 25780670
4907 25780670 23435601 21437162 19719868 18300846 16979371 15821445 14778950 13895222
4899 13895222 13137893 12403403 11819197 11287282 10860803 10408888 9913366 9595722 9273379
4890 9273379 8930610 8629528 8348162 8048772 7750146 7581175 7338998 7120428 7000633 6771999
4880 6771999 6609304 6483609 6343614 6168098 6014139 5854719 5718569 5547706 5402790 5331213
4870 5331213 5155853 4943092 4753246 4691974 4501769 4440153 4371584 4212011 4067222 4015258
4860 4015258 4094646 4021343 3912116 3669362 3599353 3513869 3499191 3454941 3463183 3430639 3332549
4849 3332549 3297763 3289967 3290552 3145304 3097860 3026414 3069071 3045462 2931616 2951220 2903470 2868119
$$ packed form
4916C8857223n80909o39644p94254j122320j416784j703938k257694k293713k267297
4907B5780670k345069j998439j717294j419022j321475j157926j042495q83728
4899A3895222p57329p34490n84206n31915m26479m51915m95522l17644l22343
4890I273379l42769l01082k81366k99390k98626j68971k42177k18570j19795k28634
4880F771999j62695j25695j39995j75516j53959j59420j36150j70863j44916p1577
4870E331213j75360k12761j89846o1272j90205o1616o8569j59573j44789n1964
4860D015258P9388p3303j09227k42754p0009q5484j4678m4250Q242l2544r8090
4849C332549l4786p796N85j45248m7444p1446M2657k3609j13846J9604m7750l5351
$$ plain form
4837 2868119 2894802 2869091 2766671 2737261 2730780 2783264 2774246 2764532 2715080 2623354 2701811 2727541
4825 2727541 2717145 2744228 2811035 2839055 2797272 2833136 2817714 2855580 2881006 2877239 2880361 2914657
4813 2914657 3051376 3106566 3054385 3098314 3111636 3080389 3062631 2990511 3015727 3022518 3041849
4802 3041849 3141802 3104996 3083445 3268167 3360901 3320712 3377566 3427881 3532384 3625228 3783188
4791 3783188 3965308 4034011 4171054 4321257 4334916 4285102 4180288 4157331 4267753 4223412
4781 4223412 4237997 4335312 4484534 4430305 4509751 4642104 4740549 4749890 4895389 4960532 4990000
4770 4990000 4887073 4730862 4609826 4380447 4171765 4043710 3917063 3724718 3515257 3387445
4760 3387445 3225970 3081689 2872743 2748256 2733992 2741454 2754519 2700955 2650722 2506542 2343386
$$ packed form
4837B868119K6683k5711j02420k9410o481N2484r018r714m9452r1726P8457K5730
4825B727541j0396K7083O6807K8020m1783L5864j5422L7866K5426l767L122L4296
4813B914657J36719N5190n2181M3929J3322l1247j7758p2120K5216O791J9331
4802C041849R9953l6806k1551J84722R2734m0189N6854N0315J04503R2844J57960
4791C783188J82120O8703J37043J50203J3659m9814j04814k2957J10422m4341
4781D223412J4585R7315J49222n4229P9446J32353R8445R341J45499O5143K9468
4770D990000j02927j56211j21036k29379k08682j28055j26647j92345k09461j27812
4760C387445j61475j44281k08946j24487j4264P462J3065n3564n0233j44180j63156
$$ plain form
4749 2343386 2221902 2190791 2078165 2020070 1912279 1900674 1837550 1800219 1804655 1794106 1728343
4738 1728343 1756104 1736087 1686898 1677904 1729134 1663384 1782167 1871889 1935038 1896751 1771796
4727 1771796 1649613 1443547 1432698 1347365 1286165 1323373 1376575 1285410 1380237 1351962 1293542
4716 1293542 1259965 1194437 1248711 1268081 1230529 1239053 1225546 1295084 1227715 1240883 1150039 1113068
4704 1113068 1047064 988146 905106 930793 903618 892190 884445 912212 950350 842067 818585
4693 818585 783206 809633 865558 801074 841774 855715 729198 694766 715343 781162 785878 758343
4681 758343 694898 744121 768490 750370 704063 714579 655784 703582 750886 723634 729753 733186
4669 733186 778232 758765 712965 701711 645975 669779 611425 658340 686713 591630 680757 717628
$$ packed form
4749B343386j21484l1111j12626n8095j07791j1605o3124l7331M436j0549o5763
4738A728343K7761k0017m9189q994N1230o5750J18783Q9722O3149l8287j24955
4727A771796j22183k06066j0849q5333o1200L7208N3202r1165R4827k8275n8420
4716A293542l3577o5528N4274J9370l7552Q524j3507O9538o7369J3168r0844l6971
4704A113068o6004n8918q3040K5687k7175j1428p745K7767L8138j08283k3482
4693H18585l5379K6427N5925o4484M0700J3941j26517l4432K0577O5819M716k7535
4681G58343o3445M9223K4369j8120m6307J0516n8795M7798M7304k7252O119L433
4669G33186M5046j9467m5800j1254n5736K3804n8354M6915K8373r5083Q9127L6871
$$ plain form
4657 717628 633840 665038 621735 613023 601888 633312 560993 626431 536906 573956 560618 515307
4645 515307 531590 539624 649994 580474 556295 516435 462484 514210 532441 521304 517414 488814
4633 488814 432760 502324 520211 522970 478440 419600 447003 479653 407661 481707 469514 462332
4621 462332 471116 531893 583499 538549 591368 572937 598601 640105 646701 679378 661234 629741
4609 629741 767315 789458 841276 911230 931403 933519 989720 1000549 964565 959581 889729 922214
4597 922214 959348 937212 890067 754788 723315 798083 877592 870755 863803 878580 949599 1084761
4585 1084761 1113523 1163134 1247333 1374241 1484892 1539797 1561766 1525777 1475798 1391572 1361793
4574 1361793 1284766 1284489 1159564 1072337 1012357 937292 949341 923271 827079 895578 956672 935186
$$ packed form
4657G17628q3788L1198m3303q712j1135L1424p2319O5438q9525L7050j3338m5311
4645E15307J6283Q034J10370o9520k4179l9860n3951N1726J8231j1137l890k8600
4633D88814n6054O9564J7887K759m4530n8840K7403L2650p1992P4046j2193p182
4621D62332Q784O0777N1606m4950N2819j8431K5664M1504O596L2677j8144l1493
4609F29741J37574K2143N1818O9954K0173K116N6201J0829l5984m984o9852L2485
4597I22214L7134k2136m7145j35279l1473P4768P9509o837o952J4777P1019J35162
4585A084761K8762M9611Q4199J26908J10651N4905K1969l5989m9979q4226k9779
4574A361793p7027k77j24925q7227n9980p5065J2049k6070r6192O8499O1094k1486
$$ plain form
4562 935186 934070 946348 996162 1052279 1059149 1134482 1093050 1210447 1294476 1286610 1252255 1183633
4550 1183633 1168669 1083970 1094090 1049630 908859 813230 809503 837189 791167 794215 785617 777921
4538 777921 755977 763212 798673 921963 906887 947833 892596 793886 809921 766436 782302 695953
4526 695953 687696 731019 714233 579212 676453 786531 733808 678936 666560 680896 706927
4515 706927 670170 616409 612540 634130 522759 569970 619227 543021 570842 556709 549753 512202
4503 512202 598830 598895 509690 484725 554198 452279 426134 421023 405958 448096 454247 434311
4491 434311 382449 362009 303154 372896 323130 334529 312090 317225 344506 351709 381434 324785
4479 324785 420633 316095 286832 305909 306390 279123 184664 190726 263902 298972 355444 268553
$$ packed form
4562I35186j116J2278M9814N6117O870P5333m1432J17397Q4029p866l4355o8622
4550A183633j4964q4699J0120m4460j40771r5629l727K7686m6022L048q598p696
4538G77921k1944P235L5461J23290j5076M0946n5237r8710J6035m3485J5866q6349
4526F95953q257M3323j6786j35021R7241J10078n2723n4872j2376J4336K6031
4515G06927l6757n3761l869K1590j11371M7211M9257p6206K7821j4133o956l7551
4503E12202Q6628O5q9205k4965O9473j01919k6145n111j5065M2138O151j9936
4491D34311n1862k0440n8855O9742m9766J1399k2439N135K7281P203K9725n6649
4479C24785R5848j04538k9263J9077M81k7267r4459O062P3176L5070N6472q6891
$$ plain form
4467 268553 306623 216153 168059 205998 202360 221320 142614 214900 216989 226147 198201 147467
4455 147467 112023 88531 193732 278209 206832 279596 205066 158571 193490 175833 61902
4444 61902 55312 134812 227136 126337 113260 162853 201643 130149 52604 138389 124618 60823
4432 60823 110827 156987 233779 183071 189909 152968 231878 188255 46761 65558 146149 122996
4420 122996 106186 112994 138971 161141 105612 82127 118673 89447 137272 182345 136005 85213
4408 85213 111062 166953 50837 42121 101880 57693 29837 80621 80534 60606 32729 51993
4396 51993 101116 163136 107220 41598 38382 89271 154444 132848 148834 178919 90648 130134
4384 130134 130996 206528 113025 126587 142907 140851 150430 157030 133515 160801 123496 72459 83044
$$ packed form
4467B68553L8070r0470m8094L7939l638J8960p8706P2286K089R158k7946n0734
4455A47467l5444k3492J05201Q4477p1377P2764p4530m6495L4919j7657j13931
4444F1902o590P9500R2324j00799j3077M9593L8790p1494p7545Q5785j3771o3795
4432F0823N0004M6160P6792n0708O838l6941P8910m3623j41494J8797Q0591k3153
4420A22996j6810O808K5977K2170n5529k3485L6546k9226M7825M5073m6340n0792
4408H5213K5849N5891j16116q716N9759m4187k7856N0784q7j9928k7877J9264
4396E1993M9123O2020n5916o5622l216N0889O5173k1596J5986L0085q8271L9486
4384A30134Q62P5532r3503J3562J6320k056R579O600k3515K7286l7305n1037J0585
$$ plain form
4371 83044 89415 173244 150443 80769 185267 209248 211406 273368 306615 325824 303558 312853
4359 312853 326666 283619 252858 242274 256941 274195 269615 277270 213998 192731 314226 304038
4347 304038 285976 301029 362537 357494 299983 406574 365229 389477 381102 370314 407712 375892
4335 375892 332145 341737 384077 330361 414505 497502 504625 461070 438168 463819 389460 457648
4323 457648 459722 517403 551071 576229 597685 614431 564896 599761 552653 542539 589605 589343
4311 589343 543196 478201 426183 350518 407761 467360 478764 474816 443085 429473 401014 431498
4299 431498 391972 410842 437317 408913 458407 493046 415644 439022 488626 434399 384642 323389
4287 323389 348921 302436 331377 292684 171298 171451 309451 281986 272131 319912 253014 173634
$$ packed form
4371H3044O371Q3829k2801o9674J04498K3981K158O1962L3247J9209k2266R295
4359C12853J3813m3047l0761j0584J4667J7254m580P655o3272k1267J21495j0188
4347C04038j8062J5053O1508n043n7511J06591m1345K4248q375j0788L7398l1820
4335C75892m3747R592M2340n3716Q4144Q2997P123m3555k2902K5651p4359O8188
4323D57648K074N7681L3668K5158K1456J6746m9535L4865m7108j0114M7066k62
4311E89343m6147o4995n2018p5665N7243N9599J1404l948l1731j3612k8459L0484
4299D31498l9526J8870K6475k8404M9494L4639p7402K3378M9604n4227m9757o1253
4287C23389K5532m6485K8941l8693j21386J53J38000k7465r855M7781o6898p9380
$$ plain form
4275 173634 174628 243379 228173 150530 253077 291882 164087 118720 164679 222430 158087 136151
4263 136151 139397 172624 191940 178665 163887 80336 123549 105022 119530 96977 98304 145503
4251 145503 93557 58514 111717 100175 130630 69293 147597 87947 63470 71614 123934 65543
4239 65543 59606 40236 4169 65559 31185 54302 60992 17829 -35398 -1935 9595 42572
4227 42572 35750 48792 153298 68354 47439 23533 24782 67223 77210 76526 35220 81981 -6733
4214 -6733 34010 44425 34366 40731 121515 136366 -8852 -21456 -9400 -15893 -15348 -50652 -36136
4201 -36136 -14970 84259 -9645 63850 43515 79626 68135 49600 12297 37937 41074 64798
4189 64798 27644 73854 78711 33659 3462 12917 -11429 41246 65563 54961 33453 70606
$$ packed form
4275A73634R94O8751j5206p7643J02547L8805j27795m5367M5959N7751o4343k1936
4263A36151L246L3227J9316j3275j4778q3551M3213j8527J4508k2553J327M7199
4251A45503n1946l5043N3203j1542L0455o1337P8304n9650k4477Q144N2320n8391
4239F5543n937j9370l6067O1390l4374K3117O690m3163n3227L3463J1530L2977
4227D2572o822J3042J04506q4944k0915k3906J249M2441R987o84m1306M6761q8714
4214f733M0743J0415j0059O365Q0784J4851j45218j2604J2056o493N45l5304J4516
4201c6136K1166R9229r3904P3495k0335L6111j1491j8535l7303K5640L137K3724
4189F4798l7154M6210M857m5052l0197R455k4346N2675K4317j0602k1508L7153
$$ plain form
4177 70606 39581 1854 68662 60261 113888 216421 173914 181482 91571 108359 227381 192624
4165 192624 122947 115744 124025 66730 131387 92625 96510 153856 146587 120508 106690 47021
4153 47021 131214 55784 65990 84037 120177 129923 63200 6528 38171 76922 159865 105614
4141 105614 186548 102877 95383 39520 32683 45335 16047 30842 26858 93874 82136 72345
4129 72345 61032 96087 63516 72971 138331 124826 96874 55330 9 -8932 8849 7619
4117 7619 63723 -16774 -1011 64894 129951 165124 92059 155397 107667 70266 168793 120301
4105 120301 80497 88258 99788 117186 71523 89488 138344 84987 66182 131524 151103 158175
4093 158175 123952 80848 42208 13440 12606 25127 66697 97590 87741 82950 122836 117780 136361
$$ packed form
4177G0606l1025l7727O6808q401N3627J02533m2507P568q9911J6788J19022l4757
4165A92624o9677p203Q281n7295O4657l8762L885N7346p269k6079j3818n9669
4153D7021Q4193p5430J0206J8047L6140R746o6723n6672L1643L8751Q2943n4251
4141A05614Q0934q3671p494n5863o837J2652k9288J4795l984O7016j1738r791
4129G2345j1313L5055l2571R455O5360j3505k7952m1544n5321q941J7781j230
4117G619N6104q0497J5763O5905O5057L5173p3065O3338m7730l7401R8527m8492
4105A20301l9804P761J1530J7398m5663J7965M8856n3357j8805O5342J9579P072
4093A58175l4223m3104l8640k8768q34J2521M1570L0893r849m791L9886n056J8581
$$ plain form
4080 136361 199144 179583 186721 155923 164121 219926 139529 193337 131469 103401 175114 214534
4068 214534 220457 168720 219210 204145 174602 192221 212441 169768 221304 280848 220423 236415
4056 236415 229251 261648 315579 296530 228506 169043 365666 367207 337182 288724 289638 355962
4044 355962 365396 323257 383681 442402 447164 410629 537214 505382 526876 524109 591420 609421
4032 609421 620753 605123 652480 678862 739884 714641 751170 826902 819574 791466 813083 773798
4020 773798 853083 968192 997399 988215 948283 964866 985814 1069812 1176627 1189471 1262048
4009 1262048 1335029 1375532 1514445 1542636 1617595 1791178 1807010 1919720 2063009 2148256 2358148
3998 2358148 2569637 2860485 3173044 3428673 3740803 4159139 4735567 5459367 5906366 6395037
$$ packed form
4080A36361O2783j9561P138l0798Q198N5805q0397N3808o1868k8068P1713L9420
4068B14534N923n1737N0490j5065k9543J7619K0220m2673N1536N9544o0425J5992
4056B36415p164L2397N3931j9049o8024n9463J96623J541l0025m8458R14O6324
4044C55962R434m2139O0424N8721M762l6535J26585l1832K1494k767O7311J8001
4032F09421J1332j5630M7357K6382O1022k5243L6529P5732p328k8108K1617l9285
4020G73798P9285J15109K9207r184l9932J6583K0948Q3998J06815J2844P2577
4009A262048P2981M0503J38913K8191P4959J73583J5832J12710J43289Q5247K09892
3998B358148K11489K90848L12559K55629L12130M18336N76428P23800M46999M88671
$$ plain form
3988 6395037 7230307 8545232 10183352 12483163 15393904 19265192 24982168 32882137
3980 32882137 31345397 21771663 14905336 11029759 8691127 7139593 6025251 5303186
3972 5303186 4823209 4456257 4270971 3841336 3355255 2961765 2735364 2584327 2396431 2154049
3962 2154049 2045216 1896985 1819538 1654233 1585706 1519832 1451663 1237975 1234052 1155657 1155809
3951 1155809 1031113 965784 931113 929681 844206 733196 755199 729944 761820 631642 664654
3940 664654 642737 646678 610079 502574 535764 532042 542154 457285 520532 395910 364164 390095
3928 390095 352726 331916 336213 309371 322883 300511 255693 260292 288086 312432 215214 250728
3916 250728 287210 212698 186575 175809 176979 243142 249782 148045 161001 104340 124776 133831
$$ packed form
3988F395037Q35270J314925J638120K299811K910741L871288N716976P899969
3980C2882137j536740r573734o866327l875577k338632j551534j114342p22065
3972E303186m79977l66952j85286m29635m86081l93490k26401j51037j87896k42382
3962B154049j08833j48231p7447j65305o8527o5874o8169k13688l923p8395J52
3951A155809j24696o5329l4671j432q5475j11010K2003k5255L1876j30178L3012
3940F64654k1917L941l6599j07505L3190l722J0112q4869O3247j24622l1746K5931
3928C90095l7369k0810M297k6842J3512k2372m4818M599K7794K4346r7218L5514
3916B50728L6482p4512k6123j0766J170O6163O640j01737J2956n6661K0436R055
$$ plain form
3904 133831 206891 234693 222447 140639 131107 180555 180990 192957 97075 103739 194198 169502
3892 169502 199624 220730 166566 182144 161709 150689 115838 151095 99562 100424 158622 105549
3880 105549 158228 152934 75883 139797 62740 91994 134095 156240 70393 98808 107908 91754
3868 91754 114443 65285 145987 93969 -3206 -34568 -29554 37990 129755 69067 15426 -33552
3856 -33552 -58617 30413 -5133 18449 75315 117879 70597 37616 55325 61792 146431 117446
3844 117446 80332 19743 -40222 82546 102893 74051 89061 14307 -45270 -1883 13773
3833 13773 11188 53758 61932 -11548 9860 51597 130258 80711 51745 55441 6501 59893
3821 59893 18224 18844 48548 62302 75553 55186 -10189 -8097 4260 55960 68272 46521
$$ packed form
3904A33831P3060K7802j2246q1808r532M9448M35J1967r5882O664R0459k4696
3892A69502L0122K1106n4164J5578k0435j1020l4851L5257n1533Q62N8198n3073
3880A05549N2679n294p7051O3914p7057K9254M2101K2145q5847K8415R100j6154
3868I1754K2689m9158Q0702n2018r7175l1362N014O7544R1765o0688n3641m8978
3856c3552k5065Q9030l5546K3582N6866M2564m7282l2981J7709O467Q4639k8985
3844A17446l7114o0589n9965J22768K0347k8842J5010p4754n9577M3387J5656
3833A3773k585M2570Q174p3480K1408M1737P8661m9547k8966L696m8940N3392
3821E9893m1669O20K9704J3754J3251k0367o5375K092J2357N1700J2312k1751
$$ plain form
3809 46521 75257 17865 43675 -34546 -20564 -15344 20666 94438 103730 28152 29966 4909
3797 4909 -73843 52680 94442 137563 144551 127119 52884 3945 10590 106263 45858 49548
3785 49548 119207 63284 39557 105072 29363 31683 75202 10776 -70440 14488 12249 13107 -39590
3772 -39590 -9122 -9342 -26826 45979 45263 38956 48383 65719 22575 -25151 37030 49018 3818
3759 3818 58755 68391 31350 15275 -28970 -25082 -21523 -74716 8591 96213 10483 34414 74251
3746 74251 47568 11314 -48064 -93782 -82630 22295 -66098 15898 -9991 -91504 -89710 -46383
3734 -46383 65 -43491 21073 13633 -18168 45411 10616 124101 126372 23909 264 -19008
3722 -19008 48166 -21439 -63097 65185 -4971 17617 14827 36951 67704 -27163 -7065 17864
$$ packed form
3809D6521K8736n7392K5810p8221J3982N220L6010P3772R292p5578J814k5057
3797D909p8752J26523M1762M3121O988j7432p4235m8939O645R5673o0405L690
3785D9548O9659n5923k3727O5515p5709K320M3519o4426q1216Q4928k239Q58n2697
3772c9590L0468k20j7484P2805p16o307R427J7336m3144m7726O2181J1988m5200
3759C818N4937R636l7041j6075m4245L888L559n3193Q3307Q7622q5730K3931L9837
3746G4251k6683l6254n9378m5718J1152J04925q8393Q1996k5889q1513J794M3327
3734d6383M6448m3556O4564p440l1801O3579l4795J13485K271j02463k3645j9272
3722a9008O7174o9605m1658J28282p0156K2588k790K2124L0753r4867K0098K4929
$$ plain form
3710 17864 90733 53727 -87897 59054 19037 -24515 33596 -3484 42944 43717 -17236 17269
3698 17269 -5335 -12516 24537 72663 41259 35271 8722 -45421 -46321 -17279 -47592 -25677 -34756
3685 -34756 -15423 -4730 51662 69187 34247 -40814 -19774 -14402 -6504 15360 -1612 7231
3673 7231 26970 24536 -35384 49304 -9176 -131045 -112033 -2555 -42216 -18439 -382 -2340
3661 -2340 3520 -32170 111102 149614 -9953 40065 16153 -10137 43148 88955 -44759 -11686
3649 -11686 -19606 -53033 -3374 3038 8186 5308 -59941 12365 -52938 -84798 -30841 9537 -61427
3636 -61427 -81536 -23680 -8359 39414 6051 -20958 70600 9424 25504 33237 31356 61379
3624 61379 20766 1709 7637 44767 -7350 24158 -37392 -22041 -16210 27126 60979 -11110
$$ packed form
3710A7864P2869l7006j41624J46951m0017m3552N8111l7080M6428P73o0953L4505
3698A7269k2604p181L7053M8126l1404n988k6549n4143r00K9042l0313K1915r079
3685c4756J9333J0693N6392J7525l4940p5061K1040N372P898K1864j6972Q843
3673G231J9739k434n9920Q4688n8480j21869J9012J09478l9661K3777J8057j958
3661b340N860l5690J43272L8512j59567N0018k3912k6290N3285M5807j33714L3073
3649a1686p920l3427M9659O412N148k878o5249P2306o5303l1860N3957M0378p0964
3636f1427k0109N7856J5321M7773l3363k7009R1558o1176J6080P733j881L0023
3624F1379m0613j9057N928L7130n2117L1508o1550J5351N831M3336L3853p2089
$$ plain form
3612 -11110 32070 13664 -4251 37243 -3354 -41199 -37652 -69975 -4536 13875 11053 57457
3600 57457 -33975 -74505 24060 5527 -30310 -40598 -1815 -8666 -34321 -7848 29722 28201
3588 28201 3087 -46802 -65777 17870 -2258 -16833 -19275 35417 -27541 -21795 -33090 -39697
3576 -39697 70489 46055 22923 30046 11029 95727 9054 8754 -29831 -37177 -74779 -19492
3564 -19492 12999 -99323 11966 -55796 -103628 -34924 23698 34197 -20242 86151 53251
3553 53251 -10349 13330 19711 14582 51246 112016 39750 -10997 34598 -6676 22290 68371
3541 68371 126639 -6542 -49703 -27250 -10340 28771 -39003 -44461 -117945 -112451 -37250 -12993
3529 -12993 -54488 -22922 -49467 -4210 -28755 -55015 -26550 -10342 24571 18268 -14112 -43102
$$ packed form
3612a1110M3180j8406j7915M1494m0597l7845L547l2323O5439J8411k822M6404
3600E7457r1432m0530R8565j8533l5837j0288L8783o851k5655K6473L7570j521
3588B8201k5114m9889j8975Q3647k0128j4575k442N4692o2958N746j1295o607
3576c9697J10186k4434k3132P123j9017Q4698q6673l00l8585p346l7602N5287
3564a9492L2491j12322J11289o7762m7832O8704N8622J0499n4439J06393l2900
3553E3251o3600K3679O381n129L6664O0770p2266n0747M5595m1274K8966M6081
3541F8371N8268j33181m3161K2453J6910L9111o7774n458p3484N494P5201K4257
3529a2993m1495L1566k6545M5257k4545k6260K8465J6208L4913o303l2380k8990
$$ plain form
3517 -43102 -56170 -27766 -47000 -61890 -124187 -118620 -88456 -43589 23729 -61258 1035 21306
3505 21306 17107 2577 -6652 40296 6768 59902 2443 47560 534 -21208 -62972 -17088
3493 -17088 21 -16646 53727 -4652 -9148 -39441 38185 75027 29980 3721 -75548 -68553
3481 -68553 3119 72713 75137 28965 -4593 -90019 -15163 -61749 -87171 4843 -40891 9393
3469 9393 67353 15054 -18581 16430 6256 1399 38938 48383 52479 35122 3823 -60435 -19885
3456 -19885 -9016 -65999 -45722 9233 -8708 -32352 -24438 -5852 -70750 -60143 -10146 -92037
3444 -92037 -51391 -59522 -29289 -23262 -32707 12010 39914 71755 2864 -26894 -36159 -88668 -34694
3431 -34694 350 -44885 -6141 48072 29695 -51415 19239 32760 52576 57019 12433 -24024
$$ packed form
3517d3102j3068K8404j9234j4890o2297N567L0164M4867O7318q4987O2293K0271
3505B1306m199j4530r229M6948l3528N3134n7459M5117m7026k1742m1764M5884
3493a7088J7109j6667P0373n8379m496l0293P7626L6842m5047k6259p9269O995
3481f8553P1672O9594K424m6172l3558q5426P4856m6586k5422R2014m5734N0284
3469I393N7960n2299l3635L5011j0174m857L7539R445M096j7357l1299o4258M0550
3456a9885J0869n6983K0277N4955j7941k3644P914J8586o4898J0607M9997q1891
3444i2037M0646q131L0233O027r445M4717K7904L1841o8891k9758r265n2509N3974
3431c4694L5044m5235L8744N4213j8377q1110P0654J3521J9816M443m4586l6457
$$ plain form
3419 -24024 -23457 -15587 -12267 -105158 -36768 -49128 -5124 -76215 -50510 -53594 -17475 -38407 -69160
3406 -69160 30040 69230 -5848 -41567 -4056 -37686 -12839 58376 -18525 -29796 -23325 -78946
3394 -78946 -65113 20961 2499 14818 87556 92952 81395 -1929 34437 46316 -14078 -95761
3382 -95761 9154 -14397 -5051 -57468 -23184 -71328 -50238 31658 45529 -127421 -71538 -75874
3370 -75874 -70106 -104291 -70638 -30789 -36340 18817 49138 13329 124115 -713 -68606 -36883
3358 -36883 -14838 -98223 -83408 -45899 3634 44114 -788 -42960 -34406 -35297 -22759 36663
3346 36663 18699 38449 21120 -20042 7497 18323 -11694 -46129 -52523 48310 48376 35225
3334 35225 -43980 -31449 -72799 -14950 -36493 -11483 -10059 70270 -30269 6970 -253 11007
$$ packed form
3419b4024N67P870L320r2891O8390j2360M4004p1091K5705l084L6119k0932l0753
3406f9160R9200L9190p5078l5719L7511l3630K4847P1215p6901j1271O471n5621
3394g8946J3833Q6074j8462J2319P2738N396j1557q3324L6366J1879o0394q1683
3382i5761J04915k3551R346n2417L4284m8144K1090Q1896J3871j72950N5883m336
3370g5874N768l4185L3653L9849n551N5157L0321l5809J10786j24828o7893L1723
3358c6883K2045q3385J4815L7509M9533M0480m4902m2172Q554q91J2538N9422
3346C6663j7964J9750j7329m1162K7539J0826l0017l4435o394J00833O6j3151
3334C5225p9205J2531m1350N7849k1543K5010J424Q0329j00539L7239p223J1260
$$ plain form
3322 11007 -23629 -12719 -5872 41728 -16172 16530 -24855 -68907 -50605 -78093 16698 34416
3310 34416 16927 -100812 -50727 -61572 806 33978 50371 51186 -16156 -56598 14080 -24542
3298 -24542 -37016 -83133 -62688 -58962 12264 9012 20148 37089 -73633 -86560 -36784 11364
3286 11364 30460 2383 13974 -64186 -12907 4239 -12298 -44085 8721 40514 -43456 -114846
3274 -114846 -109864 -71131 -83818 -30753 -13742 13941 -46284 -25602 -49231 -10348 22305 -57480
3262 -57480 -47327 -6577 33764 32510 -25010 -121598 -103544 -7942 -49096 -11113 -81460 -33619
3250 -33619 -13247 -4560 21748 31586 22932 804 -57342 -28934 205 44745 -3879 26368
3238 26368 39146 38632 -128617 -86588 -69388 -42783 -79507 -38676 38769 -67852 -102308 -62184
$$ packed form
3322A1007l4636J0910O847M7600n7900L2702m1385m4052J8302k7488R4791J7718
3310C4416j7489j17739N0085j0845O2378L3172J6393Q15o7342m0442P0678l8622
3298b4542j2474m6117K0445L726P1226l252J1136J6941j10722j2927M9776M8148
3286A1364J9096k8077J1591p8160N1279J7146j6537l1787N2806L1793q3970p1390
3274a14846M982L8733j2687N3065J7011K7683o0225K0682k3629L8883L2653p9785
3262e7480J0153M0750M0341j254n7520r6588J8054R5602m1154L7983p0347M7841
3250c3619K0372Q687K6308R838q654k2128n8146K8408K9139M4540m8624L0247
3238B6368J2778n14j67249M2029J7200K6605l6724M0831P7445j06621l4456M0124
$$ plain form
3226 -62184 -40945 -121645 -86920 -20351 16018 -57442 7198 -13832 8358 -5277 4075 -38306
3214 -38306 -50224 54567 -54160 7696 -54723 -27398 -31090 -147330 -43441 -77514 -14737
3203 -14737 19879 -51466 -74732 -71339 -45659 60718 -5166 -56952 12235 33362 33989 4224
3191 4224 53994 88984 67991 16633 -72190 -23255 54048 17535 -18032 -48170 -31011 -45281
3179 -45281 -56672 -86147 -74580 25784 6111 315 -13945 -37542 -43069 1708 51197 70116
3167 70116 -51912 -39185 -58475 -48641 -83291 -113647 -113196 -40925 -25133 48909 -25782 -40358
3155 -40358 -7183 13642 5042 -28210 -69874 -92529 -17235 32042 2216 -17668 2763 -22295
3143 -22295 -19102 20690 16007 -22993 -3252 -21346 36636 -13048 -48945 419 44555 -13938
$$ packed form
3226f2184K1239q0700L4725O6569L6369p3460O4640k1030K2190j3635R352m2381
3214c8306j1918J04791j08727O1856o2419K7325l692j16240J03889l4073O2777
3203a4737L4616p1345k3266L393K5680J06377o5884n1786O9187K1127O27k9765
3191D224M9770L4990k0993n1358q8823M8935P7303l6513l5567l0138J7159j4270
3179d5281j1391k9475J1567J00364j9673n796j4260k3597n527M4777M9489J8919
3167G0116j22028J2727j9290R834l4650l0356M51P2271J5792P4042p4691j4576
3155d0358L3175K0825q600l3252m1664k2655P5294M9277k9826j9884K0431k5058
3143b2295L193L9792m683l9000J9741j8094N7982m9684l5897M9364M4136n8493
$$ plain form
3131 -13938 62481 79229 -25186 -68871 -104837 8471 43488 23251 26200 36713 34466 51094
3119 51094 2212 9306 -38098 -48686 27240 50772 -62956 -94187 -40902 -21064 -53086 -62012
3107 -62012 -27224 45974 10314 43594 1695 -46255 -9941 -71978 -63676 -22722 38032 -8653
3095 -8653 -29699 37369 79616 -33999 -17675 35507 -2405 -104628 -19746 35305 -72267
3084 -72267 -38608 20972 21809 -24501 -18263 93576 34903 -44269 -83915 -78019 -81347 -11361 8378
3071 8378 -17154 -55943 -109083 -91895 -77598 -3134 -46922 -57918 -14154 -78270 -39215 -30453
3059 -30453 -25252 -46475 -32273 -44748 -34376 -71526 -6156 -9411 38886 28889 -41684 -63293
3047 -63293 -51231 3514 11138 11932 -83025 -130550 17523 -39975 -125608 -15460 -30747 10092
$$ packed form
3131a3938P6419J6748j04415m3685l5966J13308L5017k0237K949J0513k247J6628
3119E1094m8882P094m7404j0588P5926K3532j13728l1231N3285J9838l2022q926
3107f2012L4788P3198l5660L3280m1899m7950L6314o2037Q302M0954O0754m6685
3095h653k1046O7068M2247j13615J6324N3182l7912j02223Q4882N5051j07572
3084g2267L3659N9580Q37m6310O238J11839n8673p9172l9646N896l328O9986J9739
3071H378k5532l8789n3140J7188J4297P4464m3788j0996M3764o4116L9055Q762
3059c0453N201k1223J4202j2475J0372l7150O5370l255M8297r997p0573k1609
3047f3293J2062N4745P624P94r4957m7525J48073n7498q5633J10148j5287M0839
$$ plain form
3035 10092 -55123 -124212 -107579 -151973 -89229 -57000 -96813 -60315 -73478 -115616 -52964 5928
3023 5928 -4156 -28641 -114126 -109286 65696 55879 36672 59040 -8021 -81458 4607 -32384
3011 -32384 -131880 -62443 -6255 -28284 -56258 8800 89030 14971 -98128 -147158 -65968 -39809
2999 -39809 -99942 -21509 70269 1043 -78884 -37398 -24694 3274 -44383 -68632 -60521 -178611
2987 -178611 -105209 -45522 -15333 -45344 -31486 79165 -28636 -57888 -7134 1771 -50362
2976 -50362 25035 65871 2593 -13363 -7624 -9254 -57829 -18964 5365 194 -31686 -99116
2964 -99116 -96193 -130467 -34017 -33729 10431 -107266 -93088 -43018 13897 -48227 -87802 -6860
2952 -6860 15108 -35964 -4888 25657 -86006 -75139 -47771 -53474 -42219 -41687 -11896 4788
$$ packed form
3035A0092o5215o9089J6633m4394O2744L2229l9813L6498j3163m2138O2652N8892
3023E928j0084k4485q5485M840J74982r817j9207K2368o7061p3437Q6065l6991
3011c2384r9496O9437N6188k2029k7974O5058Q0230p4059j13099m9030Q1190K6159
2999c9809o0133P8433R1778o9226p9927M1486J2704K7968m7657k4249Q111j18090
2987a78611P3402N9687L0189l0011J3858J10651j07801k9252N0754Q905n2133
2976e0362P5397M0836o3278j5956N739j630m8575L8865K4329n171l1880o7430
2964i9116K923l4274R6450K88M4160j17697J4178N0070N6915o2124l9575Q0942
2952f860K1968n1072L1076L0545j11663J0867K7368n703J1255N32K9791J6684
$$ plain form
2940 4788 -49124 -71127 -8 -77855 -29054 -84178 -36990 55080 37036 -52297 -9774 -1316
2928 -1316 58455 66936 55664 42490 -55479 17936 -54012 -46127 22405 -30019 -118897 -77586
2916 -77586 -18417 -38583 -59960 -66862 -53680 -56166 -133170 -67468 -34792 13448 59369 20535
2904 20535 -87563 4484 -7198 -120764 -68377 6465 7833 41089 10616 -27546 -79429 -27622
2892 -27622 6757 -38339 20583 12315 28846 41819 11540 14859 -12472 11888 6850 -7435
2880 -7435 35510 -9098 -33560 -32906 -43657 -52224 -31320 -25134 -60892 -148266 -112022 -33865 -1401
2867 -1401 40663 -20627 -24307 -1343 -47457 -49987 -66146 -117431 -31700 -41273 -50821 -83166 -69622
2854 -69622 -95646 -84681 7268 -4331 -11675 30258 31937 60333 -62051 -114238 -11097 -64135
$$ packed form
2940D788n3912k2003P1119p7847M8801n5124M7188R2070j8044q9333M2523Q458
2928a316N9771Q481j1272j3174r7969P3415p1948P885O8532n2424q8878M1311
2916g7586N9169k0166k1377o902J3182k486p7004O5702L2676M8240M5921l8834
2904B0535j08098R2047j1682j13566N2387P4842J368L3256l0473l8162n1883N1807
2892b7622L4379m5096N8922q268J6531J2973l0279L319k7331K4360n038j4285
2880g435M2945m4608k4462O54j0751q567K0904O186l5758q7374L6244P8157L2464
2867a401M2064o1290l680K2964m6114k530j6159n1285Q5731r573r548l2345J3544
2854f9622k6024J0965R1949j1599p344M1933J679K8396j22384n2187J03141n3038
$$ plain form
2842 -64135 -65606 -47240 -15835 57740 -85511 -78190 -87669 -64150 -62007 -77782 -56561 -40402
2830 -40402 -17107 -56986 -17356 15259 13039 19992 -58356 -113932 -73374 823 27671 -88627
2818 -88627 -112116 26436 -49202 -11546 -7075 -64143 -131803 -103520 2338 2193 -101824 -131948
2806 -131948 -67587 -104312 11391 -41737 -2260 -23864 46725 10085 -95041 -6128 6845
2795 6845 -6425 -41242 -39209 -11538 -5337 44598 -58497 -16476 -69598 -44611 -37232 -59210
2783 -59210 -38113 -51291 -52343 -5060 -21036 -50089 -65762 -1752 21575 -61960 -67723 -75956
2771 -75956 -47045 -77161 -32708 -3657 -15718 -32696 -7263 10878 -45683 -46353 -53182 -53188 -17247
2758 -17247 -18811 -70420 -97222 24019 -56669 -65060 -88036 -93096 -108337 -99992 -114930 -55539
$$ packed form
2842f4135j471J8366L1405P3575j43251P321r479K3519K143j5775K1221J6159
2830d0402K3295l9879L9630L2615k220O953p8348n5576M0558P4197K6848j16298
2818h8627k3489J38552p5638L7656M471n7068o7660K8283J05858j45j04017l0124
2806a31948O4361l6725J15703n3128L9477k1604P0589l6640j05126Q8913J2973
2795F845j3270l4817K033K7671O201M9935j03095M2021n3122K4987P379k1978
2783e9210K1097j3178j052M7283j5976k9053j5673O4010K3327q3535n763q233
2771g5956K8911l0116M4453K9051j2061j6978K5433J8141n6561o70o829oL5941
2758a7247j564n1609k6802J21241q0688q391k2976n060j5241Q345j4938N9391
$$ plain form
2746 -55539 -13693 -105775 -50635 -17516 -55491 -33787 -58808 -36229 38454 -25066 -5640 -24334
2734 -24334 -34159 -56277 -63417 -116209 -113805 -73010 -91627 -43377 -42078 -41762 -17673 -67276 -117733
2721 -117733 -58110 -58039 -53241 -68090 -4518 -15080 -46113 -18908 -142311 -34027 -25951 -62396
2709 -62396 -24255 -100266 -112736 -61972 -73010 -66198 -39895 78389 32234 16242 -31901 -51162
2697 -51162 -37944 -4073 -44354 -52994 -22821 -88568 -83923 -110249 -116499 -7927 25437 -16264
2685 -16264 -13107 -44819 -41323 27027 -13017 -59551 -102885 -34180 17898 -57779 -66335 -69643 -51387
2672 -51387 73108 81146 -38627 -15216 -6899 -43547 -68438 21165 20658 7051 -56606 -79871
2660 -79871 -53316 -86125 -55642 -45555 -17090 28268 -22419 -61477 -74698 -58561 -44635 -95976
$$ packed form
2746e5539M1846r2082N5140L3119l7975K1704k5021K2579P4683o3520J9426j8694
2734b4334r825k2118p140n2792K404M0795j8617M8250J299L16K4089m9603n0457
2721a17733N9623P1M798j4849O3572j0562l1033K7205j23403J08284Q076l6445
2709f2396L8141p6011j2470N0764j1038O812K6303J18284m6155j5992m8143j9261
2697e1162J3218L3871m0281q640L0173o5747M645k6326o250J08572L3364m1701
2685a6264L157l1712L496O8350m0044m6534m3334O8705N2078p5677q556l308J8256
2672e1387J24495Q038j19773K3411Q317l6648k4891Q9603n07j3607o3657k3265
2660g9871K6555l2809L0483J0087K8465M5358n0687l9058j3221J6137J3926n1341
$$ plain form
2648 -95976 -40041 5793 -79957 -57514 -34307 -39215 -44267 -39903 57062 50626 -11499 38701 -50339
2635 -50339 -39985 -61213 -94557 -64114 -53274 -88124 -1617 -58369 -144250 -20823 1577 -13428
2623 -13428 -30278 -6889 16766 -34850 -17559 -4836 1189 11256 26254 51320 55879 49875
2611 49875 25035 -9052 -533 -60955 -10268 -47499 1891 -18350 -39055 -22321 -11779 -47424
2599 -47424 -45207 38819 -29772 -24504 -31044 -47954 -55005 -63014 -83286 4730 -66983 -53516 -23815
2586 -23815 -55528 111 23889 -22859 -18559 42303 60052 -7109 -102088 -105762 -40152 43323
2574 43323 136238 20119 -18111 -13665 -25940 -25290 -45379 -78995 -78918 -15041 -23951 -58946 4370
2561 4370 -11437 32646 66214 32930 -56825 -61059 5580 -97151 -51541 -53221 -33061 -29189
$$ packed form
2648i5976N5935M5834q5750K2443K3207m908n052M364R6965o436o2125N0200q9040
2635e0339J0354k1228l3344L0443J0840l4850Q6507n6752q5881J23427K2400j5005
2623a3428j6850K3389K3655n1616J7291J2723O025J0067J4998K5066M559o004
2611D9875k4840l4087Q519o0422N0687l7231M9390k0241k0705J6734J0542l5645
2599d7424K217Q4026o8591N268o540j6910p051q009k0272Q8016p1713J3467K9701
2586b3815l1713N5639K3778m6748M300O0862J7749o7161r4979l674O5610Q3475
2574D3323R2915j16119l8230M446j2275O50k0089l3616P7O3877q910l4995O3316
2561D370j5807M4083L3568l3284q9755m234O6639j02731M5610j680K0160L872
$$ plain form
2549 -29189 -15698 12124 -49049 -80650 -56606 -57217 -22112 -28600 -29990 -37431 -68832 -1539 32555
2536 32555 34766 -12739 58325 -34271 -63991 19038 -35346 -42728 5637 -16231 -32486 -34328
2524 -34328 -75813 -67918 -29303 -31495 -36991 -12587 -91095 -82086 -37558 -37351 -80165 -7680 -16513
2511 -16513 -37540 -43671 -34503 -59685 -13233 -89758 -116445 22903 -41624 -6095 -13647 24590
2499 24590 -34643 -45273 11971 -71892 -43488 -33177 -62937 3639 -2473 -2125 -50359 -15129
2487 -15129 -61680 -61495 -17821 30135 -40721 -69838 26977 6332 -59928 12182 -67338 -51558
2475 -51558 15225 16144 -50626 -56580 11318 -35007 -76758 -94203 -13762 39766 2714 -92297
2463 -92297 -56794 -52267 -65922 -93469 -64111 -63153 -28469 -53400 -6946 -15268 -70428 -82193 -103581
$$ packed form
2549b9189J3491K7822o1173l1601K4044o11L5105o488j390p441l1401O7293L4094
2536C2555K211m7505P1064r2596k9720Q3029n4384p382M8365k1868j6255j842
2524c4328m1485P895L8615k192n496K4404p8508R009M4528K07m2814P2485q833
2511a6513k1027o131R168k5182M6452p6525k6687J39348o4527L5529p552L8237
2499B4590n9233j0630N7244q3863K8404J0311k9760O6576o112L48m8234L5230
2487a5129m6551J85M3674M7956p0856k9117R6815k0645o6260P2110p9520J5780
2475e1558O6783R19o6770n954O7898m6325m1751j7445Q0441N3528l7052r5011
2463i2297L5503M527j3655k7547K9358R58L4684k4931M6454q322n5160j1765k1388
$$ plain form
2450 -103581 -72746 -106071 -31687 -53746 -13593 82392 52774 -6218 -35537 -39265 -122755 -90277
2438 -90277 -63565 -96362 -72699 -52161 -19796 3618 -61349 1308 -728 -64807 -99215 -75602
2426 -75602 -5087 -74086 -85707 -45174 -73967 -15094 -55047 -77826 -67504 -33269 -74416 -50314
2414 -50314 -102435 -96321 -21639 -27146 -41632 -39686 -83308 -59553 1778 -91853 -51620 -76756
2402 -76756 -46754 -22949 -99315 -51306 -70817 -91053 -87149 -30683 141 -37124 6446 -40232
2390 -40232 54092 23145 -27631 -24185 -33377 -42133 -26749 -37115 -81971 -71035 -3346 -34205
2378 -34205 -25272 -91184 -76971 -65017 -113694 -111020 -73138 9359 -64732 -45548 -89895 -19248
2366 -19248 -64313 -111381 -186417 -153070 -77982 -105770 -55204 -34534 -50469 -38861 -54408 -38092
$$ packed form
2450a03581L0835l3325P4384k2059M0153R5985k9618n8992k9319l728q3490L2478
2438i0277K6712l2797K3663K0538L2365K3414o4967O2657k036o4079l4408K3613
2426g5602P0515o8999j1621M0533k8793N8873l9953k2779J0322L4235m1147K4102
2414e0314n2121O114P4682n507j4486J946m3622K3755O1331r3631M0233k5136
2402g6756L0002K3805p6366M8009j9511k0236L904N6466L0824l7265M3570m6678
2390d0232R4324l0947n0776L446r192q756J5384j0366m4856J0936O7689l0859
2378c4205Q933o5912J4213J1954m8677K674L7882Q2497p4091J9184m4347P0647
2366a9248m5065m7068p5036L3347P5088k7788N0566K0670j5935J1608j5547J6316
$$ plain form
2354 -38092 -52767 -87947 -55056 -22784 6405 21983 -35990 -129875 -51954 -38035 -19121 -15798
2342 -15798 -43907 -60769 -95276 -79997 -37347 -41557 -35917 -112232 -44626 -7820 -7898 -451 -12722
2329 -12722 -85879 -77609 -10000 -114540 -97407 -80467 1961 15876 -25753 17456 -28598 -171019
2317 -171019 -74889 -42924 -52186 -78363 -78303 -122749 -107061 -86066 4649 -30381 -77753 -48778
2305 -48778 -90306 -83228 -90490 -118254 -78733 16055 38674 -4776 -21456 -66063 -17310 -29516
2293 -29516 -115371 -72279 -69501 -123424 -125692 -25408 -25085 -42530 -41073 -5416 -9584 6614 27625
2280 27625 34886 -50903 -109346 -133035 -77601 -99421 -69358 -87282 -35589 -35613 158 -51943 -74010
2267 -74010 -28920 74404 85945 -55488 -71080 -133908 -131378 -104547 -97472 -45933 -63162 25303
$$ packed form
2354c8092j4675l5180L2891L2272K9189J5578n7973r3885P7921J3919J8914L323
2342a5798k8109j6862l4507J5279M2650m210N640p6315O7606L6806p8P447j2271
2329a2722p3157Q270O7609j04540J7133J6940Q2428J3915m1629M3209m6054j42421
2317a71019R6130L1965r262k6177O0m4446J5688K0995R0715l5030m7372K8975
2305d8778m1528P078p262k7764L9521R4788K2619m3450j6680m4607M8753j2206
2293b9516q5855M3092K778n3923k268J00284L23j7445J457L5657m168J6198K1011
2280B7625P261q5789n8443k3689N5434k1820L0063j7924N1693k4L5771n2101k2067
2267g4010M5090J03324J1541j41433j5592o2828K530K6831P075N1539j7229Q8465
$$ plain form
2255 25303 50438 33409 -37900 3336 11673 -53057 -136544 -40711 52881 21707 -57080 -131757
2243 -131757 -15824 31972 -36730 -42088 -53108 -78101 -88416 -32195 -41924 -17303 -18545 -78019
2231 -78019 -84645 -24075 -44558 -122093 -50963 -44489 -71379 -67450 -76935 -43053 -18786 -58088 -49011
2218 -49011 -95800 -40738 -36153 8747 14778 -22028 -130204 -45497 -4083 -4074 -72673 -90768 -21181
2205 -21181 -9865 -50168 -83604 -32318 -34856 -79579 18122 -61230 -50123 -24945 -16176 -4525
2193 -4525 -30082 -62471 -89546 -96841 -86554 -100219 -28893 -113409 -54769 -75741 -46243 -14826
2181 -14826 -53862 -50158 -76581 -1976 -58428 -35295 -43705 -20311 -34991 -1979 -83753 -43498
2169 -43498 14417 -10923 -118068 -100102 -25489 -59781 -66742 -15409 -55866 -80714 -85488 -120548
$$ packed form
2255B5303K5135j7029p1309M1236Q337o4730q3487R5833R3592l1174p8787p4677
2243a31757J15933M7796o8702n358j1020k4993j0315N6221r729K4621j242n9474
2231g8019o626O0570k0483p7535P1130O474k6890L929r485L3882K4267l9302R077
2218d9011m6789N5062M585M4900O031l6806j08176Q4707M1414Ro8599j8095O9587
2205b1181J1316m0303l3436N1286k538m4723R7701p9352J1107K5178Q769J1651
2193d525k5557l2389k7075p295J0287j3665P1326q4516N8640k0972K9498L1417
2181a4826l9036L704k6423P4605n6452K3133q410K3394j4680L3012q1774M0255
2169d3498N7915k5340j07145J7966P4613l4292o961N1333m0457k4848m774l5060
$$ plain form
2157 -120548 -52183 -60257 -73798 11603 17823 -24456 -79046 -65325 -89493 -45445 6286 -55762
2145 -55762 -63057 -7484 7770 -8618 -10154 15700 -33358 -44805 -38234 -25726 -7143 -51382
2133 -51382 -52494 -77401 -85087 -75160 -10731 -57149 -38214 -22216 -36256 -74717 -80580 -96406 -112759
2120 -112759 -187167 -60101 -28203 -128267 -153370 -132834 531 -3488 27100 -12550 -23918
2109 -23918 -91902 -94765 -129978 -181379 -124528 -102374 -40463 -34590 -60582 -83682 -80007 8407
2097 8407 13496 -102075 -108724 -51007 -110951 -60034 -67627 -56497 -58746 -124048 -109275 -63862 -72328
2084 -72328 -53613 -91536 -74673 -73756 -106130 -48687 -42444 -50326 -176273 -146888 -102680 -92801 -39524
2071 -39524 -94847 -93077 -36530 -23363 -26927 -69016 -76662 -98030 -36477 -34514 -54660 51896
$$ packed form
2157a20548O8365q074j3541Q5401O220m2279n4590J3721k4168M4048N1731o2048
2145e5762p295N5573J5254j6388j536K5854m9058j1447O571J2508J8583m4239
2133e1382j112k4907p686R927O4429m6418J8935J5998j4040l8461n863j5826j6353
2120a12759p4408J27066L1898j00064k5103K0536J33365m019L0588l9650j1368
2109b3918o7984k863l5213n1401N6851K2154O1911N873k5992k3100L675Q8414
2097H407N089j15571o649N7717n9944N0917p593J1130k249o5302J4773M5413q466
2084g2328J8715l7923J6863R17l2374N7443O243p882j25947K9385M4208R879N3277
2071c9524n5323J770N6547J3167l564m2089p646k1368O1553J963k0146J06556
$$ plain form
2059 51896 32034 -40245 49347 83575 -30285 -27869 -2218 -71649 -54989 -85946 -70689 -45856
2047 -45856 -85767 -33951 -68574 -61768 -9792 -3674 -30014 -22390 -91378 -92909 -110975 -80959 -48657
2034 -48657 -39910 -20759 5940 -116195 -69555 -53675 -114123 -30760 3735 -21010 2795 38577
2022 38577 -20997 -32267 -55820 -64501 7667 -60290 -80192 -61188 -2402 4720 -26380 2649
2010 2649 -39248 -113489 -123048 -70483 -99206 -51273 3763 -50728 -63053 20165 -29429 -119918
1998 -119918 -88461 -94403 -93959 -110463 -105841 -21011 -54613 -56529 -101746 -71023 -71976 18859 -81976
1985 -81976 -64811 -63372 21602 -60313 -95993 -86652 -104582 -98877 -146792 -118505 -66907 -90871
1973 -90871 -27240 -62448 -67744 35055 -14642 -52967 -87745 -58657 -51199 -102433 -89867 -77305
$$ packed form
2059E1896j9862p2279Q9592L4228j13860K416K5651o9431J6660l0957J5257K4833
2047d5856l9911N1816l4623O806N1976O118k6340P624o8988j531j8066L0016L2302
2034d8657Q747J9151K6699j22135M6640J5880o0448Q3363L4495k4745K3805L5782
2022C8577n9574j1270k3553q681P2168o7957j9902J9004N8786P122l1100K9029
2010B649m1897p4241r559N2565k8723M7933N5036n4491j2325Q3218m9594r0489
1998a19918L1457n942M44j6504M622Q4830l3602j916m5217L0723r53R0835j00835
1985h1976J7165J439Q4974q1915l5680R341j7930N705m7915K8287N1598k3964
1973i0871O3631l5208n296J02799m9697l8325l4778K9088P458n1234J2566J2562
$$ plain form
1961 -77305 -103355 -25923 -49875 -58445 -80958 -16480 -45974 -69834 -80609 -139460 -108033 -113101
1949 -113101 -109359 -55311 -42161 -79637 -64862 44997 -83215 -83668 15366 26237 -15613 -3357
1937 -3357 -39603 -30907 -116319 -96590 -58128 -60942 -92834 -65983 -29018 -80781 -26599 48762
1925 48762 8753 -7908 76203 -123735 -141677 -114883 -93107 -47254 -28080 -60783 -50173 4865
1913 4865 26271 -26946 18145 11566 -36800 -8004 -14061 -96194 -166034 -89541 -67803 -34122
1901 -34122 -56407 -36374 -30979 -41290 -1228 -35833 -21494 -48992 -42747 -49355 -50413 -22656 -98786
1888 -98786 -124974 -45526 -33982 -41029 -23888 -57509 -25592 -35763 -93743 -96478 -23218 -77727
1876 -77727 -36977 -57787 -77726 -56216 -68590 -112527 -81048 -43629 -31029 -18416 -47190 -27952
$$ packed form
1961g7305k6050P7432k3952q570k2513O4478k9494k3860j0775n8851L1427n068
1949a13101L742N4048J3150l7476J4775J09859j28212m53R9034J0871m1850J2256
1937c357l6246Q696q5412J9729L8462k814l1892K6851L6965n1763N4182P5361
1925D8762m0009j6661Q4111j99938j7942K6794K1776M5853J9174l2703J0610N5038
1913D865K1406n3217M5091o579m8366K8796o057q2133o9840P6493K1738L3681
1901c4122k2285K0033N395j0311M0062l4605J4339k7498O245o608j058K7757p6130
1888i8786k6188P9448J1544p047J7141l3621L1917j0171n7980k735P3260n4509
1876g7727M0750k0810j9939K1510j2374m3937L1479L7419J2600J2613k8774J9238
$$ plain form
1864 -27952 -66492 -117638 -66172 -49952 -45862 -16507 -39331 -79269 -81186 -94408 -40026 -16952
1852 -16952 16981 -75882 -115199 -112645 -61491 -27859 -52053 -29682 -82515 -66788 -115285 -66004
1840 -66004 -22725 -32655 -68482 -92493 -42624 -87038 -102368 -17329 -117967 -44016 -33215 -69371
1828 -69371 -98144 -46489 -53841 -31263 -46722 -122079 -28906 31006 -36695 -75707 -77942 -1656
1816 -1656 276 9522 50073 -90769 28928 -7656 8741 -46418 -69116 -42286 -18756 3433
1804 3433 -34055 -35282 -15030 1846 -56935 -47104 -34355 -22563 -17764 -42353 -47133 70577 50270
1791 50270 56085 -13291 -28046 -58121 -83354 -33814 -23366 -51911 -76384 -35516 -61504 -3176
1779 -3176 -62895 -61133 -24119 -35608 22262 11326 -26471 -104831 -87023 -54655 -2702 -50292
$$ packed form
1864b7952l8540n1146N1466J6220M090K9355k2824l9938j917j3222N4382K3074
1852a6952L3933r2863l9317K554N1154L3632k4194K2371n2833J5727m8497M9281
1840f6004M3279r930l5827k4011M9869m4414j5330Q5039j00638P3951J0801l6156
1828f9371k8773N1655p352K2578j5459p5357R3173N9912o7701l9012k235P6286
1816a656J932R246M0551j40842J19697l6584J6397n5159k2698K6830K3530K2189
1804C433l7488j227K0252J6876n8781R831J2749J1792M799k4589m780J17710k0307
1791E0270N815o9376j4755l0075k5233M9540J0448k8545k4473M0868k5988N8328
1779c176n9719J762L7014j1489N7870j0936l7797p8360J7808L2368N1953m7590
$$ plain form
1767 -50292 -7027 -29990 -49423 -41361 -50203 -108206 -146511 -28791 -55635 -139064 -87224 -68486
1755 -68486 -86745 -35641 -34680 -60738 -66410 -12058 5089 13435 -45564 -60436 -42655 -4076 -27757
1742 -27757 -95057 -84594 -60422 -9134 -50367 -97389 -103648 -116885 -138943 -110509 -99956 -75104
1730 -75104 -52917 -91009 -81467 -27651 -48192 -55753 -110988 -50652 -48355 -10300 -22164 14891
1718 14891 26978 -23302 18903 10743 29649 -34411 -21315 57096 56788 -90422 -50579 -81888
1706 -81888 -38219 -17924 -40760 -78415 -38059 -45966 -61946 -64988 -108773 -69091 -138337 -49171
1694 -49171 -75601 -68644 -4608 -79784 -20526 -49560 -84502 -91507 -50451 -108071 -109195 -35335
1682 -35335 -52651 -72108 -116124 -63431 -6500 -25285 -46049 -48236 -60468 -62651 -74589 -86842
$$ packed form
1767e0292M3265k2963j9433Q062q842n8003l8305J17720k6844q3429N1840J8738
1755f8486j8259N1104R61k6058n672N4352J7147Q346n8999j4872J7781L8579k3681
1742b7757o7300J0463K4172N1288m1233m7022o259j3237k2058K8434J0553K4852
1730g5104K2187l8092R542N3816k0541p561n5235O0336K297L8055j1864L7055
1718A4891J2087n0280M2205q160J8906o4060J3096P8411l08j47210L9843l1309
1706h1888M3669K0295k2836l7655M0356p907j5980l042m3785L9682o9246Q9166
1694d9171k6430O957O4036p5176N9258k9034l4942p005M1056n7620j124P3860
1682c5335j7316j9457m4016N2693N6931j8785k0764k187j2232k183j1938j2253
$$ plain form
1670 -86842 -95755 -76007 -43698 -50153 -38894 -42834 -60731 -45022 20147 -54898 -82027 1720
1658 1720 -65031 -72576 -69300 -83624 -146015 -147859 -73385 -103316 -97085 -85210 -14489 -92503 -52048
1645 -52048 -35845 -29672 -101320 -20166 -57910 -70979 -30477 -46958 -56940 -198547 -136143 -141810
1633 -141810 -84421 -55622 -58727 -58434 -14864 17086 -47710 -32750 -17811 40589 -52550 -106806
1621 -106806 -77214 -109032 -58430 -54381 -38362 -36319 -114118 -102336 -82750 -94352 -5275 -55829
1609 -55829 1632 -50477 27669 -18424 -15782 68140 -94505 -81396 -81422 -50588 -97201 -45943
1597 -45943 -64199 -40239 -85541 -111980 -31509 -10627 7909 3877 -67866 -53342 -29360 -5887
1585 -5887 -7077 -38451 -30034 -107614 -57925 -77548 -85451 -57968 -73265 -9196 -22992 -84266 -58358
$$ packed form
1670h6842q913J9748L2309o455J1259l940j7897J5709O5169p5045k7129Q3747
1658A720o6751p545L276j4324o2391j844P4474k9931O231J1875P0721p8014M0455
1645e2048J6203O173p1648Q1154l7744j3069M0502j6481r982j41607O2404n667
1633a41810N7389K8799l105K93M3570L1950o4796J4960J4939N8400r3139n4256
1621a06806K9592l1818N0602M049J6019K043p7799J1782J9586j1602Q9077n0554
1609e5829N7461n2109P8146m6093K642Q3922j62645J3109k6L0834m6613N1258
1597d5943j8256K3960m5302k6439Q0471K0882J8536m032p1743J4524K3982K3473
1585e887j190l1374Q417p7580M9689j9623p903K7483j5297O4069j3796o1274K5908
$$ plain form
1572 -58358 -165574 -43576 -28153 -83440 -65742 -25156 -55343 -65665 -60878 -53902 -42457 37
$$ packed form
1572e8358j07216J21998J5423n5287J7698M0586l0187j0322M787O976J1445M2494
$$ [...]
##END NTUPLES=NMR SPECTRUM
##END=
