##TITLE=1H_TG-2352
 CDCl3
 8 sc, 
 14.03.2022
##JCAMPDX= 6.0         $$ Bruker NMR JCAMP-DX V2.0
##DATA TYPE= NMR SPECTRUM
##DATA CLASS= NTUPLES
##ORIGIN= UXNMR, Bruker Analytische Messtechnik GmbH
##OWNER= root
$$ XWIN-NMR		Version 3.5
$$ Mon Mar 14 11:05:36 2022 Russian Standard Time (UT+4h)  she@DPX200
##.OBSERVE FREQUENCY= 200.131346
##.OBSERVE NUCLEUS= ^1H
##.ACQUISITION MODE= SIMULTANEOUS
##.ACQUISITION SCHEME= undefined
##.AVERAGES= 8
##.DIGITISER RES= 18
##SPECTROMETER/DATA SYSTEM= spect
##.PULSE SEQUENCE= zg30
##.SOLVENT NAME= CDCl3
##.SHIFT REFERENCE= (INTERNAL, CDCl3, 0, 15.7094)
##AUDIT TRAIL= $$ (NUMBER, WHEN, WHO, WHERE, WHAT)
$$ ##TITLE= Audit trail, XWIN-NMR		Version 3.5
$$ ##JCAMPDX= 5.01
$$ ##ORIGIN= Bruker BioSpin GmbH
$$ ##OWNER= she
$$ F:/spectra/data/she/nmr/H-F/1/pdata/1/auditp.txt
$$ ##AUDIT TRAIL=  $$ (NUMBER, WHEN, WHO, WHERE, WHAT)
(   1,<2022-03-14 11:04:30.89 +0400>,<she>,<DPX200>,
      <created by zg, POWCHK disabled, PULCHK disabled
       configuration hash MD5:
       00 E9 B6 7A A2 85 ED C7 34 08 36 98 17 FE 4E 26
       data hash MD5: 16K
       70 55 A2 0C 14 4D C5 FD 71 59 54 97 93 AA C8 CB>)
(   2,<2022-03-14 11:04:33.04 +0400>,<she>,<DPX200>,
      <Start of raw data processing
       efp BC_mod = 2 LB = 0.24 FT_mod = 6 PKNL = 1 PHC0 = -17109.1 PHC1 = 14.00078 SI = 16K 
       data hash MD5: 16K
       80 B6 DB EB D0 4E F8 30 25 D2 BF 74 2A 86 AF 5F>)
(   3,<2022-03-14 11:04:50.25 +0400>,<she>,<DPX200>,
      <pk PHC0 = 159.948 PHC1 = -2.4 
       data hash MD5: 16K
       FD AB BF 40 6F 3C D3 41 85 D6 23 2E DE 82 57 CA>)
(   4,<2022-03-14 11:04:53.26 +0400>,<she>,<DPX200>,
      <abs ABSG = 5 
       data hash MD5: 16K
       B5 2B FE 3B A2 13 B3 BD 6B B2 AE 28 4A 17 ED 73>)
$$ ##END=
$$ 
$$ hash MD5
$$ BD 13 7C BA 27 42 3A F5 21 15 01 98 98 8C 79 D6
##$RELAX= 
##$RELAX= 
##$RELAX= 
##$RELAX= 
##$RELAX= 
##$RELAX= 
$$ Bruker specific parameters
$$ --------------------------
##$DU= <F:/spectra>
##$EXPNO= 1
##$NAME= <H-F>
##$PROCNO= 1
##$TYPE= <nmr>
##$USER= <she>
##$AMP= (0..31)
100 100 100 100 100 100 100 100 100 100 100 100 100 100 100 100 100 100 
100 100 100 100 100 100 100 100 100 100 100 100 100 100 
##$AQSEQ= 0
##$AQ_mod= 1
##$AUNM= <au_zg>
##$AUTOPOS= <>
##$BF1= 200.13
##$BF2= 200.13
##$BF3= 200.13
##$BF4= 200.13
##$BF5= 200.13
##$BF6= 200.13
##$BF7= 200.13
##$BF8= 200.13
##$BYTORDA= 1
##$CFDGTYP= 0
##$CFRGTYP= 5
##$CHEMSTR= <none>
##$CNST= (0..31)
1 1 145 1 1 1 1 1 1 1 1 1 1 1 1 1 1 1 1 1 1 1 1 1 1 1 1 1 1 1 1 1 
##$CPDPRG= <>
##$CPDPRG1= <>
##$CPDPRG2= <>
##$CPDPRG3= <>
##$CPDPRG4= <mlev>
##$CPDPRG5= <mlev>
##$CPDPRG6= <mlev>
##$CPDPRG7= <mlev>
##$CPDPRG8= <mlev>
##$CPDPRGB= <>
##$CPDPRGT= <>
##$D= (0..31)
0 1.2 0 0 0 0 0 0 0 0.06 0 0.03 0 0 0 0 0.0002 0 0 0 0 0 0 0 0 0 0 0 0 
0 0 0 
##$DATE= 1647241470
##$DBL= (0..7)
120 120 120 120 120 120 120 120 
##$DBP= (0..7)
150 150 150 150 150 150 150 150 
##$DBP07= 0
##$DBPNAM0= <>
##$DBPNAM1= <>
##$DBPNAM2= <>
##$DBPNAM3= <>
##$DBPNAM4= <>
$$ [...]
##$SUBNAM2= <"">
##$SUBNAM3= <"">
##$SUBNAM4= <"">
##$SUBNAM5= <"">
##$SUBNAM6= <"">
##$SUBNAM7= <"">
##$SUBNAM8= <"">
##$SUBNAM9= <"">
##$SW= 18.0517287032376
##$SWIBOX= (0..15)
0 0 2 0 0 0 0 0 0 0 0 0 0 0 0 0 
##$SW_h= 3612.71676300578
##$TD= 16384
##$TD0= 1
##$TE= 0
##$TE2= 300
##$TE3= 300
##$TEG= 300
##$TL= (0..7)
0 120 120 120 120 120 120 120 
##$TP= (0..7)
150 150 150 150 150 150 150 150 
##$TP07= 0
##$TPNAME0= <>
##$TPNAME1= <>
##$TPNAME2= <>
##$TPNAME3= <>
##$TPNAME4= <>
##$TPNAME5= <>
##$TPNAME6= <>
##$TPNAME7= <>
##$TPOAL= (0..7)
0.5 0.5 0.5 0.5 0.5 0.5 0.5 0.5 
##$TPOFFS= (0..7)
0 0 0 0 0 0 0 0 
##$TUNHIN= 0
##$TUNHOUT= 0
##$TUNXOUT= 0
##$USERA1= <user>
##$USERA2= <user>
##$USERA3= <user>
##$USERA4= <user>
##$USERA5= <user>
##$V9= 5
##$VALIST= <valist>
##$VCLIST= <CCCCCCCCCCCCCCC>
##$VD= 0
##$VDLIST= <DDDDDDDDDDDDDDD>
##$VPLIST= <PPPPPPPPPPPPPPP>
##$VTLIST= <TTTTTTTTTTTTTTT>
##$WBST= 1024
##$WBSW= 4
##$XGAIN= (0..3)
0 0 0 0 
##$XL= 0
##$YL= 0
##$YMAX_a= 346909
##$YMIN_a= -510313
##$ZGOPTNS= <>
##$ZL1= 120
##$ZL2= 120
##$ZL3= 120
##$ZL4= 120
##$ABSF1= 15.69748
##$ABSF2= -2.354369
##$ABSG= 5
##$ABSL= 3
##$ALPHA= 0
##$AQORDER= 0
##$ASSFAC= 0
##$ASSFACI= 0
##$ASSFACX= 0
##$ASSWID= 0
##$AUNMP= <proc_1d>
##$AZFE= 0.1
##$AZFW= 0.1
##$BCFW= 0
##$BC_mod= 2
##$BYTORDP= 0
##$COROFFS= 0
##$CY= -3
##$DATMOD= 1
##$DC= 0
##$DFILT= <>
##$DTYPP= 0
##$F1P= 0
##$F2P= 0
##$FCOR= 1
##$FTSIZE= 16384
##$FT_mod= 6
##$GAMMA= 0
##$GB= 0
##$INTBC= 1
##$INTSCL= 0
##$ISEN= 128
##$LB= 0.24
##$LEV0= 0
##$LPBIN= 0
##$MAXI= 10000
##$MC2= 0
##$MEAN= 0
##$ME_mod= 0
##$MI= 1.114404
##$NCOEF= 0
##$NC_proc= -7
##$NLEV= 6
##$NOISF1= 3.799351
##$NOISF2= 2.8
##$NSP= 0
##$NTH_PI= 0
##$NZP= 0
##$OFFSET= 15.70943
##$PC= 1
##$PHC0= -16949.15
##$PHC1= 11.60078
##$PH_mod= 1
##$PKNL= yes
##$PPARMOD= 0
##$PSCAL= 0
##$PSIGN= 0
##$REVERSE= no
##$SF= 200.130008429836
##$SI= 16384
##$SIGF1= 3
##$SIGF2= 2
##$SINO= 5.538805
##$SIOLD= 16384
##$SREGLST= <1H.CDCl3>
##$SSB= 0
##$STSI= 16384
##$STSR= 0
##$SW_p= 3612.71676300578
##$SYMM= 0
##$S_DEV= 0
##$TDeff= 16384
##$TDoff= 0
##$TI= <>
##$TILT= no
##$TM1= 0
##$TM2= 0
##$TOPLEV= 0
##$USERP1= <user>
##$USERP2= <user>
##$USERP3= <user>
##$USERP4= <user>
##$USERP5= <user>
##$WDW= 1
##$XDIM= 16384
##$YMAX_p= 374279120
##$YMIN_p= -2995599
$$ End of Bruker specific parameters
$$ ---------------------------------
##NTUPLES= NMR SPECTRUM
##VAR_NAME=  FREQUENCY,     SPECTRUM/REAL,   SPECTRUM/IMAG
##SYMBOL=    X,             R,               I
##VAR_TYPE=  INDEPENDENT,   DEPENDENT,       DEPENDENT
##VAR_FORM=  AFFN,          ASDF,            ASDF
##VAR_DIM=   16384,         16384,           16384
##UNITS=     HZ,            ARBITRARY UNITS, ARBITRARY UNITS
##FACTOR=    0.220516191357247, 1,           1
##FIRST=     3143.92830647539, 0,            0
##LAST=      -468.788456530393, 0,           0
##MIN=       -468.788456530393, -2995599,    0
##MAX=       3143.92830647539, 374279120,    0
$$ Real data points
##PAGE= N=1
##DATA TABLE= (X++(R..R)), XYDATA
$$ [...]
7010A2560832r00326o91335p74907n54970n25865n00203n33177j79116l48814
$$ 12560832 11660506 10969171 10194264 9639294 9113429 8613226 8080049 7900933 7552119
7001G552119m74945j76746j12812l33408l92637r6081k07502j39796M507j79304
$$ 7552119 7077174 6900428 6787616 6454208 6061571 5965490 5757988 5618192 5622699 5443395
6991E443395j42620m9155l1944q7703j17039l05350K34836p8035j13495J27217
$$ 5443395 5300775 5251620 5219676 5131973 5014934 4709584 4944420 4866385 4752890 4880107
6981D880107q8141p2587J57669L33131N5102k97834J88383P5475J6989J95856
$$ 4880107 4791966 4719379 4877048 5210179 5265281 4967447 5155830 5231305 5248294 5444150
6971E444150K07519K92431M1933k14043j4962m14134o50267l93229k47870k62423
$$ 5444150 5651669 5944100 5986033 5771990 5757028 5342894 4692627 4299398 4051528 3789105
6961C789105q4131K3377l86000j15046j29524m8605p5242K39467K4924k12982
$$ 3789105 3704974 3728351 3342351 3227305 3097781 3049176 2973934 3213401 3238325 3025343
6951C025343j14541j81195k14003J29426l3498o3684J18606K6692j11188r6910
$$ 3025343 2910802 2729607 2515604 2645030 2611532 2547848 2666454 2693146 2581958 2485048
6941B485048j66609l5667K58360n3475r4784O1891j23192j11983N9158P3904r7248
$$ 2485048 2318439 2282772 2541132 2487657 2392873 2454764 2331572 2219589 2278747 2352651 2255403
6930B255403L7106l9668o9821K06767j26679l4829L7813k18135J12210M3082o2987
$$ 2255403 2292509 2252841 2183020 2389787 2263108 2228279 2266092 2047957 2160167 2203249 2140262
6919B140262j9020j47349l36855K45998K08100k55104j2237O7178j66165K46511
$$ 2140262 2121242 1973893 1637038 1883036 2091136 1836032 1823795 1890973 1724808 1971319
6909A971319R0966k08010P3893o0726p5025R2863n6202R5928J3366l1261J09749
$$ 1971319 2062285 1854275 1928168 1867442 1792417 1885280 1829078 1925006 1938372 1907111 2016860
6898B016860J98897j95955j38427N5921J80730r175j38929J60345K6039k8895
$$ 2016860 2215757 2019802 1881375 1937296 2118026 2108851 1969922 2130267 2156306 2127411
6888B127411P8858R6004P3194l8457m7765P4748Q3102m52046j79218K51514K38160
$$ 2127411 2206269 2302273 2375467 2337010 2289245 2363993 2447095 1995049 1815831 2067345 2305505
6877B305505R740j80310q9082n4555N6087p1163J79481J68521k21706J15738Q6754
$$ 2305505 2315245 2134935 2045853 1991298 2047385 1976222 2155703 2324224 2102518 2218256 2305010
6866B305010k15805r6418P8317n362k0762P6889k40978J56327r906p2966L4880
$$ 2305010 2089205 1992787 2071104 2065742 2044980 2121869 1880891 2037218 2027312 1954346 1989226
6855A989226p2941M1030n0764j23813J99988j16381J36713R3957k11635j15497
$$ 1989226 1916285 1957315 1906551 1782738 1982726 1866345 2003058 2097015 1885380 1769883
6845A769883R6125R2284j62050j08058P6690j15296R8024j42126l9829J61910
$$ 1769883 1866008 1958292 1796242 1688184 1764874 1649578 1747602 1605476 1565647 1727557
6835A727557Q1339J50385L3460p8371J20011j47764n8606j4144k6399K45417K2523
$$ 1727557 1808896 1959281 1992741 1914370 2034381 1886617 1828011 1813867 1787468 2032885 2055408
6824B055408P2206p4380O216k48235L1724J96004J5401j79233j80469o3502P2972
$$ 2055408 2127614 2053234 2059450 1811215 1842939 2038943 2054344 1875111 1694642 1631140 1704112
6813A704112J08733j11983J00190J64520r8825j43886j12107J87270q5548J39093
$$ 1704112 1812845 1700862 1801052 1965572 1866747 1722861 1610754 1798024 1712476 1851569
6803A851569J6355j30265O7334l0996L8745K2232m0816N5521j38446P2536O1570
$$ 1851569 1867924 1737659 1804993 1773997 1812742 1834974 1794158 1849679 1711233 1783769 1845339
6792A845339j92203j40140n5199R8519j56894q6850J23808J01265R6307J47224
$$ 1845339 1653136 1512996 1457797 1556316 1399422 1312572 1436380 1537645 1633952 1781176
6782A781176j20093j07421o7217K14776J48887k00307n7349k2377j21620L13064
$$ 1781176 1661083 1553662 1486445 1701221 1850108 1649801 1592452 1570075 1448455 1761519
6772A761519j92566o7011N9202k2511J88211j50928j83938P4102q4321J26508
$$ 1761519 1568953 1501942 1561144 1538633 1726844 1575916 1391978 1466080 1381759 1508267
6762A508267j22575Q0078K13206j5692N9925L6955M5559N9702L6637P050q1101
$$ 1508267 1385692 1465770 1678976 1663284 1723209 1760164 1805723 1865425 1902062 1909112 1828011
6751A828011n1278O3060M8079K5204j24413J3686N1620J48744j9611k6701J75949
$$ 1828011 1776733 1839793 1887872 1913076 1788663 1802349 1853969 2002713 1983102 1956401 2132350
6740B132350J87385r8823k66395L7839n4107q3944R67j7250Q5617k33545q1124
$$ 2132350 2319735 2220912 1954517 1992356 1938249 1854305 1855272 1838022 1923639 1690094 1608970
6729A608970J8755o9748M5089j861j1884K7095r2576K654K5903R6503o2092M0411
$$ 1608970 1627725 1557977 1603066 1601205 1589321 1616416 1523840 1526494 1552397 1648900 1586808 1627219
6717A627219n0962k2356K38640j62483k51035Q2089J82573N428M2980j76778J5841
$$ 1627219 1576257 1553901 1792541 1630058 1379023 1461112 1643685 1649113 1692093 1515315 1531156
6706A531156K14071p0606q3723L7252L26826J3341K5120N2441j77039m068J89723
$$ 1531156 1745227 1674621 1590898 1628150 1954976 1968317 1993437 2045878 1868839 1864771 2054494
6695B054494J5984L0301k4477N4540L6892K2240o747q6952J65040j351j63846
$$ 2054494 2070478 2100779 2076302 2130842 2167734 2189974 2183227 2096275 2261315 2259964 2096118
6684B096118j55022K158K23187n7181k08237L1629J25948j9785o0850j67866K68266
$$ 2096118 1941096 1943254 2166441 2109260 1901023 1932652 2058600 2038815 1977965 1810099 2078365
6673B078365M3482k17515k8980j0820J84723o625j32755K9654r5558j90183j2795
$$ 2078365 2121847 1904332 1875352 1864532 2049255 2042630 1909875 1939529 1843971 1653788 1640993
6662A640993J08063k34701J46515m5931r2558J29997J47769K759k00157j02928
$$ 1640993 1749056 1514355 1660870 1614939 1522381 1652378 1800147 1802906 1602749 1499821
6652A499821l136L423L0551J80820J6190J3573k23643j04686Q5222O5475O7199
$$ 1499821 1496685 1500108 1530659 1711479 1727669 1741242 1517599 1412913 1498135 1563610 1630809
6641A630809J35863k2165j39630O030J494J8730J09783j27702R6423J56947R7842
$$ 1630809 1766672 1744507 1604877 1610907 1612401 1631131 1740914 1613212 1709635 1866582 1964424
6630A964424P3783o0390P0042J45615N6123K09576N9288J21153n9333M3077J92674
$$ 1964424 2038207 1977817 2047859 2193474 2249597 2459173 2518461 2639614 2580281 2623358 2816032
6619B816032j64958j74084o6881J849P9958o5503N4360j91223m8430j20256k31217
$$ 2816032 2651074 2476990 2410109 2411958 2491916 2426413 2480773 2289550 2241120 2120864 1889647
6608A889647J9355q120j4626j64010J99581N1784j19106r6534j02508N1166j8568
$$ 1889647 1909002 1900882 1886256 1722246 1921827 1973611 1854505 1757971 1655463 1706629 1688061
6597A688061m3485J45624P2158j05140J10329J04029J8041j970J80774j17994
$$ 1688061 1644576 1790200 1862358 1757218 1867547 1971576 1989617 1987647 2168421 2050427
6587B050427R163Q769l344q7319n669K27302n4777K3656j09949j87488K06888
$$ 2050427 2059590 2068359 2065015 1977696 1972027 2199329 2144552 2168208 2058259 1870771 2077659
6576B077659O4347k3539j7968k1579m1564j01431J97888j40893r6662l5909r9515
$$ 2077659 2142006 2118467 2100499 2078920 2037356 1935925 2133813 1992920 1896258 1860349 1760834
6565A760834R5538k13312J26498j6936q1739j20547p2225K50063m6927j56816
$$ 1760834 1856372 1643060 1769558 1752622 1670883 1550336 1478111 1728174 1681247 1524431
6555A524431j67010k4573j47873J20934R2540r6351J12717K6805m0836j02040
$$ 1524431 1357421 1332848 1184975 1305909 1398449 1302098 1414815 1441620 1400784 1298744
6545A298744J00397P0334n3837J63975n4566q2669m5973j80562O4340J27653j87298
$$ 1298744 1399141 1469475 1415638 1579613 1525047 1442378 1396405 1215843 1280183 1407836 1220538
6534A220538K64529J10068r2915l2482r0045o6070J44676Q8125l417q2236j57748
$$ 1220538 1485067 1595135 1502220 1469738 1379693 1313623 1458299 1546424 1543007 1460771 1303023
6523A303023N4600m6795K09862N378k00620r3846J84778Q4917K1280L8351O7496
$$ 1303023 1357623 1310828 1520690 1526068 1325448 1231602 1416380 1501297 1522577 1560928 1628424
6512A628424K69902l03447j8427j0827O2377J6022J08139K9550j37507r9188r4852
$$ 1628424 1898326 1594879 1576452 1565625 1628002 1644024 1752163 1781713 1644206 1545018 1450166
6501A450166j0433L22988p032j65059m3194q6582L18150K4687k0153J6508j33692
$$ 1450166 1439733 1762721 1755689 1590630 1547436 1460854 1779004 1803691 1783538 1800046 1666354
6490A666354j9891j2069M2463j03856j56019J97819O1721k01553J12733K1096
$$ 1666354 1646463 1634394 1676857 1573001 1416982 1614801 1676522 1474969 1587702 1608798
6480A608798J40409O9747K5547P4154p1633j75574p141J51748K8234o6592p7402
$$ 1608798 1749207 1818954 1844501 1918655 1847022 1671448 1664307 1816055 1844289 1777697 1700295
6469A700295O1305J28195k52493j04752J549M4299J86058k2935Q09J61691N806
$$ 1700295 1761600 1889795 1637302 1532550 1534099 1578398 1764456 1741521 1742330 1904021 1909827
6458A909827k32539J61087q7168J52283N1830J11995n7179j1646m1011k317M289
$$ 1909827 1677288 1838375 1751207 1903490 1955320 2067315 2010136 1998490 1957479 1955162 1959451
6447A959451j09337O4956N8439P1785J51536k45899J0349K04007J56998j8686
$$ 1959451 1850114 1915070 1973509 2045294 2196830 1950931 1961280 2165287 2322285 2303599
6437B303599q9315j09621j10614P8766J97030J72492J12805k82009P8693J07909
$$ 2303599 2214284 2104663 1994049 2072815 2269845 2442337 2555142 2273133 2351826 2459735
6427B459735O472j41720j10406Q4817p6834K21068J34979j21852r1012n5285p0995
$$ 2459735 2466207 2324487 2214081 2298898 2222064 2443132 2578111 2456259 2365247 2309962 2238967
6416B238967J35496J5614J12331q3033l04132Q4438J18926J9933J5433N5642J06532
$$ 2238967 2374463 2390077 2502408 2419375 2115243 2199681 2318607 2338540 2353973 2409615 2516147
6405B516147J50498j05159O4702J06454k7730J37254j52091N4821k76080Q5218
$$ 2516147 2666645 2561486 2626188 2732642 2704912 2842166 2690075 2744896 2468816 2554034
6395B554034J65371j21428n3482N0120J7115P6151j42826J26976J53860J58068
$$ 2554034 2719405 2597977 2544495 2594615 2611730 2687881 2545055 2672031 2825891 2983959
6385B983959J75652N342o8647k06925K41219M02335N2306j41970o1551P1637R1463
$$ 2983959 3159611 3164953 3096306 2889381 3130600 3532935 3585241 3443271 3381720 3453357 3544820
6374C544820J29067p3757J9883N9860K1458o3753J44927J32735K57494Q1642n0137
$$ 3544820 3673887 3600130 3620013 3679873 3701331 3637578 3782505 3915240 4172734 4254376 4204239
6363D204239K41738K05491J79674J92148K67835M54569M13410N11028P88319O37353
$$ 4204239 4445977 4651468 4831142 5023290 5291125 5745694 6159104 6670132 7458451 8095804
6353H095804K32765K14822l04122p63491o14192n63213k10143m15654l36664l23866
$$ 8095804 8328569 8543391 8239269 7475778 6861586 6298373 6088230 5672576 5335912 5012046
6343E012046N3213j00021k44632o0001J07658L5402j05805M960J22358r371k4008
$$ 5012046 5065259 4965238 4720606 4660605 4768263 4803665 4697860 4702820 4825178 4815807 4791799
6332D791799J21616j49294O7877J89940J11219O3142j98016j75675P1221K23103
$$ 4791799 4913415 4764121 4831998 5021938 5133157 5196299 4998283 4822608 4893829 5116932
6322E116932J32495j7789J20550J23193p0259J56935K35589k32934o9922j62114
$$ 5116932 5249427 5231638 5352188 5475381 5405122 5562057 5797646 5564712 5494790 5332676
6312E332676K45424J54818M3978J05312j10316J78837L16738L09862l2342J03154
$$ 5332676 5578100 5732918 5776896 5882208 5771892 5950729 6267467 6577329 6544987 6648141
6302F648141J42436K76170K44136L57616J26556N7813K96319L82168J21583P3171
$$ 6648141 6790577 7066747 7310883 7668499 7795055 7852868 8149187 8531355 8652938 8726109
6292H726109J90903M52311K92152J70816K85552K37679M02415L32979K81551L95034
$$ 8726109 8917012 9369323 9661475 9832291 10117843 10355522 10757937 11090916 11372467 11767501
6282A1767501M53516K05234M92278N23043M39698P80404P74211O61956Q72593
$$ 11767501 12221017 12426251 12918529 13441572 13881270 14661674 15435885 16097841 16970434
6273A6970434J273257J137506J550923J905953K550401K942624L678087M403501
$$ 16970434 18243691 19381197 20932120 22838073 25388474 28331098 32009185 36412686
6265C6412686N441507P040359Q865712J0765224J3577844J7389743J9568894J2343835
$$ 36412686 41854193 48894552 57760264 68525488 82103332 99493075 119061969 131405804
6257A31405804o970519j8922092k0459936j8020781j3374624r185956o559759
$$ 131405804 124435285 105513193 85053257 67032476 53657852 44471896 37912137
6250C7912137m834552l520361k882803l015169k554143j841418j625140j269373
$$ 37912137 33077585 29557224 26674421 23659252 21105109 19263691 17638551 16369178
6242A6369178j029046r18864j087764o45801p31603n20734o23304m24145m86116
$$ 16369178 15340132 14421268 13333504 12687703 11956100 11435366 10812062 10387917 9901801
6233I901801l60068l77975k91824l16482j23803m24196l67844j48973j62961j42131
$$ 9901801 9541733 9163758 8871934 8555452 8431649 8007453 7639609 7490636 7327675 7185544
6223G185544l20375k58942q5456O8169p1361k06773j10272J0659j05322j20274
$$ 7185544 6865169 6606227 6520771 6588940 6517579 6310806 6200534 6211193 6105871 5985597
6213E985597j78616n1466q3710j05311j57368l19721P6764p4866l1005j19396
$$ 5985597 5806981 5755515 5671805 5566494 5409126 5089405 5166169 5091303 5060298 4940902
6203D940902M5637R7431k30896N5459j21271J8350j70664j0455j98298J11381
$$ 4940902 4986539 5083970 4853074 4908533 4787262 4805612 4634948 4624493 4426195 4537576
6193D537576p9264j42429j64310L4139l8099J20765m1127j31217j18997j8m1445
$$ 4537576 4458312 4315883 4151573 4185712 4147613 4268378 4227251 4096034 3977037 3977019 3935574
6182C935574N6700p4594j2764Q157k45591P3816O5429k8152J1599Q6192q8545
$$ 3935574 3992274 3917680 3904916 3913073 3667482 3741298 3806727 3778575 3790174 3876366 3787821
6171C787821r2449l2232R1771L00838j92490K16201m20596j60467Q2215j36859
$$ 3787821 3695372 3663140 3754911 4055749 3863259 4079460 3658864 3498397 3580612 3443753
6161C443753J57564k03589j11286j30900J06967k5487j92654K93488J81551k63194
$$ 3443753 3601317 3397728 3286442 3155542 3262509 3237022 3044368 3337856 3519407 3256213
6151C256213J24815j03592J31806j12867j084R5553j98275k22421J40025J88452
$$ 3256213 3381028 3277436 3409242 3296375 3295291 3390844 3192569 2970148 3110173 3298625
6141C298625J35933L782J39128l98501J35935J30246k0065r1426J21111N5889
$$ 3298625 3434558 3438340 3577468 3178967 3314902 3445148 3425083 3333657 3454768 3510657
6131C510657J40197J7931j24651K36607j2852j37103r1889j3993k5292O889J63366
$$ 3510657 3650854 3668785 3544134 3780741 3767889 3630786 3538897 3524904 3499612 3506501 3669867
6120C669867J23226M5053m3444j31576J57378R2008L8249L3622m7854j8176J27803
$$ 3669867 3793093 3838146 3794702 3663126 3820504 3912512 3950761 3984383 3936529 3918353 4046156
6109D046156N0513K3416k9660r9995J2748J00238P362K04336N0492J9129p6298
$$ 4046156 4096669 4120085 4090425 3990430 4003178 4103416 4110778 4315114 4365606 4384735 4308437
6098D308437L7615l1466Q5296J36034p0200K4903J52033j08192J12112J03823
$$ 4308437 4346052 4314586 4399882 4535916 4465716 4490619 4642652 4534460 4646572 4750395
6088D750395j82083R7647J67513P7420L11307J05817J04429L13418J83058L63442
$$ 4750395 4568312 4665959 4833472 4910892 5222199 5328016 5432445 5745863 5928921 6292363
6078F292363N10296L15601j98420k70965j54448l84202k25928J44926K96334J82266
$$ 6292363 6802659 7118260 6919840 6648875 6494427 6110225 5884297 6029223 6325557 6507823
6068F507823l6519J47260K30243L53213M35812L92242K25817J27939k10261p61853
$$ 6507823 6471304 6618564 6848807 7202020 7637832 8030074 8255891 8383830 8173569 7411716
6058G411716o32346k63032j42923k16657J32960j37605j84809l8960k27134P8718
$$ 7411716 6779370 6516338 6373415 6156758 6289718 6152113 5967304 5928344 5701210 5779928
6048E779928K04854K18844J5136j6501M500K61266O1347J65143L56459K35528
$$ 5779928 5984782 6203626 6218762 6202261 6206761 6468027 6529374 6694517 7050976 7286504
6038G286504K54813J63523P01047L92407L48517N35798L96974l7377l45502k47398
$$ 7286504 7541317 7704840 8405887 8798294 9146811 9682609 10079583 10042206 9696704 9449306
6028I449306n23090n58588l39318m21297j96425j25718k20073J43053j92290j72288
$$ 9449306 8926216 8367628 8028310 7607013 7410588 7284870 7064797 7207850 7015560 6843272
6018F843272k20078r4913J27386K63422J84791l7777O3316K74240J41089J44519
$$ 6843272 6623194 6528281 6655667 6919089 7103880 7066103 7129419 7403659 7544748 7689267
6008G689267J63804P535K62534L29750K91875K38219o0293J38481K2449l46046
$$ 7689267 7853071 7860606 8123140 8452890 8744765 8982984 8922691 9061172 9083621 8737575
5998H737575j21920P5614n7957K26657J9823M4831K04725J3276K26355k6566j5830
$$ 8737575 8615655 8691269 8633312 8859969 8879792 8924623 9129348 9142624 9368979 9342413 9326583
5987I326583j06877k8535j61444J49610J76345J37478K07052J63652K3452j21757
$$ 9326583 9219706 9191171 9029727 9179337 9355682 9493160 9700212 9863864 9887316 9765559
5977I765559o7960J49605L84619K45472J66241J44792o4942q2318J09265J32249
$$ 9765559 9697599 9847204 10231823 10477295 10643536 10788328 10723386 10641068 10750333 10882582
5967A0882582M5114K43221K06977K77003K69730L02330O03173M64239K51982L63622
$$ 10882582 10927696 11170917 11377894 11654897 11924627 12226957 12830130 13294369 13546351 13909973
5957A3909973Q6121k71152j57267j83705j97968p3431q6651L6244m612j20739
$$ 13909973 13996094 13724942 13567675 13383970 13186002 13112571 13025920 13062164 13057552 12936813
5947A2936813j1190M21136K23762j7216K29526N3496K41108K13132L7200q0277
$$ 12936813 12925623 13346759 13570521 13553305 13782831 13836327 14077435 14290567 14327767 14247490
5937A4247490j79109m57247m818J74675J94470J10857M13848J53541N24776O24471
$$ 14247490 14068381 13611134 13606316 13780991 13975461 14086318 14500166 14653707 15178483 15802954
5927A5802954N98404O27437R8999j4363m19214l64609j58607l36150N8217Q7933
$$ 15802954 16401358 17028795 17127794 17113431 16694217 16329608 16171001 15834851 15893068 15981001
5917A5981001J04755K94202J97549K26273P31258P98230O01525Q87379R55807
$$ 15981001 16085756 16379958 16577507 16803780 17535038 18333268 18934793 19822172 20777979
5908B0777979J116276J270888J419318J334155Q15011q80689j593194j706599
$$ 20777979 21894255 23165143 24584461 25918616 26733627 25852938 24259744 22553145
5900B2553145j382932r56900o20200m15746k36293m0505M9031n8099l38172J18582
$$ 22553145 21170213 20213313 19593113 19177367 18941074 18900569 18949600 18891501 18553329 18671911
5890A8671911n3296j08426L21374K46084L59191N23457P46583Q54595R17733J187443
$$ 18671911 18618615 18510189 18831563 19077647 19436838 19960295 20706878 21561473 22479206 23666649
5880B3666649J669865J892168K265052K754550L104128L923067M753832N160210
$$ 23666649 25336514 27228682 29493734 32248284 35352412 39275479 44029311 49189521
5872D9189521L133220k281489n025198n371929m745406l415537k320659j443607
$$ 49189521 52322741 50041252 45016054 39644125 34898719 31483182 29162523 27718916
5864B7718916j083391m79532l90249m66757k9678K73521K8714q3013J5984P0968
$$ 27718916 26635525 26155993 25765744 25298987 25269309 25542830 25571544 25488531 25504515 25575483
5854B5575483j85041O2869L51264M62940Q19196Q31269J146109J527114J880972
$$ 25575483 25390442 25453311 25804575 26267515 27086711 27917980 29064089 30591203 32472175
5845C2472175K387671K856296L726226M864708N123848L050346k362567n256239
$$ 32472175 34859846 37716142 41442368 46307076 51430924 54481270 52118703 46862464
5837D6862464n657329n105991l513199k629119j804029j371967j688413j240936
$$ 46862464 41205135 36099144 32585945 29956826 28152797 26780830 25092417 23851481
5829B3851481r95144q95822p18639o58899k72239l48736J1039j28342J20528J66164
$$ 23851481 22856337 21960515 21241876 20582977 20310738 19962002 19973041 19844699 19965227 20131391
5819B0131391K79703K86271P70903N65973P46333J081732J280626J463353J308051
$$ 20131391 20411094 20697365 21468268 22034241 22780574 23862306 25142932 26606285 27914336
5810B7914336J246123J100911O4770j408180k089174k227730j971455j399061
$$ 27914336 29160459 30261370 30326140 28917960 26828786 24601056 22629601 21230540
5802B1230540j192590q62567n50902l35802m55073n06920l48448k11361m22818
$$ 21230540 20037950 19175383 18624481 18288679 17833606 17326686 16978238 16766877 16344059
5793A6344059j21409l22220l26820J20616j02349O6383q6397k63864J1734J88788
$$ 16344059 16222650 15900430 15573610 15694226 15591877 15658260 15571863 15307999 15319733 15508521
5783A5508521p5699J67279J94635J0501K21457k9714K52568L21639j20568j69571
$$ 15508521 15432822 15600101 15794736 15805237 16026694 15996980 16249548 16571187 16450619 16281048
5773A6281048k03460k08411j46626K25397Q191l357J15149K02077P4887J01485
$$ 16281048 16077588 15869177 15722551 15947948 15956139 15952782 16067931 16270008 16344895 16446380
5763A6446380J78800K3981J10109J16986J97176J12511M4502J38853R0216L4404
$$ 16446380 16625180 16649161 16759270 16876256 17073432 17185943 17230445 17369298 17459514 17493918
5753A7493918J04010q9845J24331l1314J15413j9730Q3358K65406J9206K00855
$$ 17493918 17597928 17508083 17632414 17601100 17716513 17696783 17780141 18045547 18064753 18265608
5743A8265608J41527K60687R3215K26445K78127K39523K24049J86600M14105L35107
$$ 18265608 18407135 18667822 18761037 18987482 19265609 19505132 19729181 19915781 20329886 20664993
5733B0664993P2003M67393K30628L73265M84473J28320M0291K26926J69849k6413
$$ 20664993 20736996 21204389 21435017 21808282 22292755 22421075 22461366 22688292 22858141 22831728
5723B2831728j67215l36684m14735m35759k12150J65593J03249K73145K74485
$$ 22831728 22664513 22327829 21913094 21477335 21265185 21430778 21534027 21807172 22081657
5714B2081657L90358M57680P96386M01661J47153K38715Q2887k18057n09835m89498
$$ 22081657 22472015 22929695 23726081 24127742 24274895 24513610 24596497 24378440 23868605 23379107
5704B3379107p73309p99837m91376m88986m59760k4451j06892j67353k78186o1684
$$ 23379107 22605798 21805961 21314585 20825599 20365839 20341388 20234496 20067143 19788957 19727273
5694A9727273J3618J24937j87809k41072j37364j63578k06171k26591k76776r1068
$$ 19727273 19740891 19865828 19678019 19436947 19299583 19136005 18929834 18703243 18426467 18335399
5684A8335399r451k0074r8066k9557j47408O6286m4619r6978K36314k28134n7287
$$ 18335399 18325948 18305874 18207808 18178251 18030843 18097129 18052510 17955532 18191846 17963712 17906425
5673A7906425J40640n0729m3571M2333K2860K08245J3928k00266l62343O5313
$$ 17906425 18047065 17996336 17952765 17995098 18017958 18226203 18240131 18039865 17677522 17742835
5663A7742835q2252p7665r3515j39758k70853m7293J29305j39167p8940l90462
$$ 17742835 17660583 17582918 17489403 17349645 17078792 17031499 17160804 17021637 16942697 16552235
5653A6552235k68798k6508l68181m05295j4918L5508j2723k31716k0719J48930
$$ 16552235 16283437 16256929 15888748 15483453 15468535 15504043 15491320 15259604 15238885 15387815
5643A5387815J8786K93550P1356J85710K19989J55018k8456N7515k8274j32554
$$ 15387815 15406601 15700151 15771507 15957217 16177206 16332224 16303768 16361283 16333009 16200455
5633A6200455j80488m03095m38858j64530l71k18291k02547p3497j82492k90338
$$ 16200455 16019967 15616872 15178014 15013484 15013113 14794822 14592275 14518778 14336286 14045948
5623A4045948k25263q0027p7099l87747l73980k14167p40k05807N7073k76891
$$ 14045948 13820685 13740658 13663559 13275812 12901832 12687665 12686925 12481118 12538191 12261300
5613A2261300k05197j48437O2474L0248p234L7697o3336L5286k17638N4389j92427
$$ 12261300 12056103 11907666 11970140 12000388 11993154 12030851 11967515 12002801 11785163 11839552 11647125
5602A1647125k2090l3353k20213P7335j49592j57991q4840j16156j06606r1087
$$ 11647125 11625035 11591682 11371469 11448804 11299212 11141221 11056381 10940225 10833619 10742532
5592A0742532k806K79079j39314j61354j70880J78798J3457l1987K03586J68440
$$ 10742532 10739726 11018805 10879491 10718137 10547257 10726055 10739512 10707525 10911111 11079551
5582A1079551j71781m9977J62232J1035K7436L25627q1388J02209K47250n856
$$ 11079551 10907770 10857793 11020025 11031060 11058496 11384123 11302735 11404944 11652194 11646338
5572A1646338j02678k99224j99043j91249R5159p786l27374j0443j29103L1646
$$ 11646338 11543660 11244436 11045393 10854144 10949303 10941517 10614143 10603700 10474597 10506243
5562A0506243M7816L5496M8960J46833J78868j4450J56844J85363M19989J89532
$$ 10506243 10554059 10589555 10638515 10785348 10964216 10949766 11106610 11291973 11711962 11901494
5552A1901494o1310l64064k26791l59730l36823l14351k76232k17861j48632j09048
$$ 11901494 11840184 11476120 11249329 10889599 10552776 10238425 9962193 9744332 9595700 9486652
5542I486652p4855j40225J1472L8273j25126k89298l7128o4844j55807R7586j17537
$$ 9486652 9411797 9271572 9283044 9321317 9196191 8906893 8869765 8804921 8649114 8746700 8629163
5531H629163n2783n2558J0587J07273l60l1135l150K4635j19669O923O975L5454
$$ 8629163 8576380 8523822 8534409 8641682 8641322 8610187 8607037 8631672 8512003 8518926 8525901 8561355
5519H561355K22148J9312q8487l3508J28162j3085m3652P9439j74422K600N1928
$$ 8561355 8783503 8802815 8714328 8680820 8808982 8795897 8752245 8831684 8657262 8659862 8711790
5508H711790P7762j0335j8930K01610J08213J2582J85950J78449k0091J25188
$$ 8711790 8789552 8779217 8760287 8961897 9070110 9082692 9268642 9447091 9427000 9552188
5498I552188J84059J31156K70493l15325j71203k25436j54988n7047j68706l32000
$$ 9552188 9736247 9867403 10137896 9822571 9651368 9425932 9270944 9213897 9045191 8713191
5488H713191J95985J70551n3216p2072q3638K97591O5736j24678M2902l01182
$$ 8713191 8909176 9079727 9026511 8954439 8870801 9168392 9234128 9109450 9152352 8851170
5478H851170j23102j67819P9331J81432K0972J97852R1327j18353M5789q5738
$$ 8851170 8728068 8560249 8639580 8821012 8841984 9039836 9131163 9012810 9058599 8972861
5468H972861J22405q5414j73897j03785j15981L10588n8588k38785r6050J35756
$$ 8972861 9095266 9009852 8835955 8732170 8616189 8926777 8868189 8629404 8533354 8669110
5458H669110K642k1516k00967k2374L53795K3531J76283Q7199k5074m8211m0928
$$ 8669110 8671752 8650236 8449269 8426895 8780690 8804221 8980504 9067703 9042629 8994418 8953490
5447H953490K34524q3906j53301r8212n2839j21456j70466m6422J01669q126J05921
$$ 8953490 9188014 9104108 8950807 8852595 8799756 8678300 8507834 8461412 8563081 8554955 8660876
5436H660876j0604L7378J29844N5032j64847P9946j8056P2742j9527K20520M7520
$$ 8660876 8650272 8687650 8817494 8872526 8707679 8787625 8769569 8842311 8822784 9043304 9090824
5425I090824R7993J44408J85626L63459K92053P3870J06562n129l7652O4207j93713
$$ 9090824 9188817 9333225 9518851 9882310 10174363 10248233 10354795 10349666 10312014 10376221 10182508
5414A0182508j90165J66284r980k95920l4489j6041P799L06870R2665q778k10224
$$ 10182508 9992343 10158627 10148647 9852727 9818238 9802197 9809996 10116866 10209531 10200753 9990529
5403I990529j65096K47199K80725J34740R8571J37270J55627k49878k72851j92371
$$ 9990529 9825433 10072632 10353357 10488097 10586668 10723938 10879565 10629687 10356836 10164465
5393A0164465l16794j93031j40207m2146j01370o2168m7058j29914O597l15953
$$ 10164465 9847671 9654640 9514433 9472287 9370917 9308749 9261691 9131777 9138374 8822421
5383H822421j97840j2771j71979l39332k49756q4275j14277M5095N7347P3846
$$ 8822421 8624581 8611810 8439831 8100499 7850743 7766468 7652191 7697286 7754633 7828479
5373G828479N2148j84437j31159L5008M7229j72077m7070N995j73454N6377O3801
$$ 7828479 7880627 7696190 7565031 7600039 7647268 7475191 7428121 7434116 7260662 7317039 7380840
5362G380840O7155O0532l7104k49842j99200K96438Q3099j1799J0896o5949K0148
$$ 7380840 7447995 7508527 7471423 7221581 7022381 7318819 7401918 7390119 7401015 7335066 7355214
5351G355214j6117l1540j70418J1927J61982p7572K5730K25527k08446j27998
$$ 7355214 7339097 7307557 7137139 7149066 7311048 7233476 7259206 7484733 7276287 7148289
5341G148289O6197J97850k44946j8623j44457R0243j5950Q1802j8580J84592R7756
$$ 7148289 7214486 7412336 7167390 7148767 7004310 7094553 7078603 7160405 7141825 7326417 7424173
5330G424173M8475O9652O9096R325r6392K4356j72116o8580j0296M6669P4781
$$ 7424173 7472648 7542300 7611396 7620721 7524329 7548685 7376569 7307989 7297693 7344362 7419143
5319G419143J18621k7144N1426n3118J78193R1010K23488O5350j88220J47528
$$ 7419143 7537764 7510620 7562046 7508928 7687121 7778131 8001619 8066969 7878749 8026277
5309H026277L840k32510k37396J51193j60892q2071j51998L4057n6448j45345
$$ 8026277 8030117 7797607 7560211 7711404 7550512 7468441 7316443 7350500 7294052 7148707
5299G148707N5926m5659R1561j64790j21211l01728J21204N6807l3375J9294j98390
$$ 7148707 7204633 7158974 7250535 7085745 6964534 6662806 6784010 6840817 6807442 6826736 6628346
5288F628346L4839n9197k8380K1750J10250q0588l05949O8913j93674J05494J17527
$$ 6628346 6663185 6603988 6575608 6597358 6707608 6627020 6321071 6389984 6196310 6301804 6419331
5277F419331J58303j28411K5328k158k53643p6296P6218J56057K34034o3342k80410
$$ 6419331 6577634 6449223 6474551 6472393 6218750 6142454 6218672 6374729 6608763 6545421 6265011
5266F265011J96980r749j33211o1426k669l34926R1902j5216Q6768m0914k15211
$$ 6265011 6461991 6452242 6319031 6257605 6254936 5920010 6011912 5996696 6083464 6042550 5827339
5255E827339P5125k80334J21642L44320j82744o6518k7270J95870o4275j91084
$$ 5827339 5902464 5622130 5743772 6088092 5905348 5838830 5811560 6007430 5943155 5752071
5245E752071k5017j52784O3086J16977j86332K68724K5643n3538J30832j13612
$$ 5752071 5727054 5574270 5637356 5754333 5568001 5836725 5862368 5808830 5939662 5826050
5235E826050R3551q4285l5982K84603J01476j29793J1514l7941j12237p6282p5691
$$ 5826050 5919601 5835316 5799334 6083937 6185413 6055620 6067134 6029193 5916956 5840674 5764983
5224E764983K7607O495q3377L0000J04967K28159l0736L0990R011M6507Q3769
$$ 5764983 5792590 5799085 5715708 5745708 5850675 6078834 6048098 6079088 6088099 6134606 6218375
5213F218375k56095j50883L2089k22340M6424P0165j24859k17220O7482j20661
$$ 6218375 5962280 5811397 5843486 5621146 5667570 5737735 5612876 5395656 5463138 5342477
5203E342477j8093J08612p427n8789j19708K83025n2168r4180M1216j88124j1391
$$ 5342477 5324384 5432996 5425569 5366780 5247072 5530097 5477929 5383749 5424965 5236841 5225450
5192E225450L5759K20564k37654K5671j6478J14365j06118J7709k22427o6783
$$ 5225450 5261209 5481773 5244119 5269790 5253312 5367677 5261559 5279268 5056841 4990058
5182D990058M20814Q6643p5508r1200J52224J30582J04965j11573J45609j42525
$$ 4990058 5410872 5497515 5422007 5330807 5483031 5613613 5718578 5607005 5752614 5610089
5172E610089J31957K52531L9522J1995l1374j61223n2964q0469n0066K5234q2085
$$ 5610089 5742046 5994577 6034099 6046094 6014720 5853497 5800533 5720064 5669998 5695232 5613147
5161E613147J1614Q5866J86793J6794J60487J48861K25951M3593j57273K07995
$$ 5613147 5624761 5710627 5897420 5914214 6074701 6223562 6449513 6493106 6335833 6543828
5151F543828P8564n0472O8305K69878K54703L8141M56846L36799O5442R0899k63551
$$ 6543828 6622392 6571920 6640225 6910103 7164806 7202947 7659793 7996592 8062034 8152933 7889382
5140G889382k16431k78511k99840l04040J00179J92780j64655j91848J29923M68751
$$ 7889382 7672951 7394440 7094600 6790560 6890739 7083519 6918864 6727016 6856939 7325690
5130G325690K93826J01012L9206J81837J47586N2664K28914K57174K52696J83424
$$ 7325690 7619516 7720528 7759734 7941571 8089157 8141821 8370735 8627909 8880605 9064029
5120I064029k3156q3795M4233q6832J43824j36952l80547m63434j97605o2352
$$ 9064029 9040873 8957078 9001311 8914479 9058303 8921351 8540804 8077370 7879765 7817413
5110G817413j57468l12702j70444L9396r6724j7488J15693J88434L19141K94655
$$ 7817413 7659945 7347243 7176799 7216195 7119471 7101983 7217676 7406110 7725251 8019906
5100H019906J11654J99424K35522J33063J77921j07643m77161l04553l45093m96359
$$ 8019906 8131560 8330984 8566506 8699569 8877490 8769847 8292686 7988133 7643040 7146681
5090G146681j67466j7246N8007K69638k53739l55249k78557j96189R7171p2825
$$ 7146681 6979215 6961969 7019976 7289614 7035875 6680626 6402069 6205880 6303051 6230226
5080F230226J35671o1278L0977K13964L3281J64538L27130J93429J20252m0333
$$ 6230226 6365897 6304619 6335596 6549560 6582841 6747379 7074509 7267938 7388190 7347857
5070G347857o1109P9248j03481k20407l01786r6360l1194j4639k96339j97170
$$ 7347857 7286748 7365996 7262515 7042108 6740322 6643962 6612768 6598129 6301790 6104620
5060F104620k07896K6623J74333n8544j18794j7118R523l3156k9188P1838M0463
$$ 6104620 5896724 5923347 6097680 6039136 5920342 5903224 5912747 5879591 5850403 5922241 5962704
5049E962704O2612J43083k65849k4808j24091j42734q011J3707n1032m5491k08767
$$ 5962704 6025316 6168399 5902550 5877742 5753651 5610917 5602906 5616613 5565581 5520090 5311323
5038E311323o7554J10352n6980J23499j11922j23607L16999M2339J39002K68016
$$ 5311323 5243769 5354121 5297141 5420640 5308718 5185111 5502110 5544449 5683451 5951467
5028E951467J18521J71174J46585L4599J3824J01056m37556j61687k458l1135
$$ 5951467 6069988 6241162 6387747 6422346 6436170 6537226 6099670 5937983 5935525 5904390
5018E904390j07735o9625m9113Q5847j70062M7852J179j16112L0498l6428J3375
$$ 5904390 5796655 5727030 5677917 5763764 5593702 5641554 5642733 5526621 5557119 5520691 5534066
5007E534066J16127J17683O577J48464J65476J50151M4998k67073l60981q3320
$$ 5534066 5650193 5767876 5774453 5922917 6088393 6238544 6283542 6016469 5655488 5572168
4997E572168k6361J72869j66110J16438J40042K06328J43659k24719j42395j9915
$$ 5572168 5545807 5718676 5552566 5669004 5809046 6015374 6159033 5934314 5791919 5772004
4987E772004K87080L57377O3419o4356J33214k43779k27677N0963P7987j80384
$$ 5772004 6059084 6416461 6479880 6415524 6548738 6304959 6077282 6128245 6206232 6025848
4977F025848j16215K44005j1067j16148K0931J01487J89496r294j65156K9773
$$ 6025848 5909633 6153638 6142571 6026423 6047354 6148841 6338337 6329043 6163887 6193660
4967F193660J2793K26860J35589r5232J9938M5654J73856r103J27232j7415j98319
$$ 6193660 6206453 6433313 6568902 6473670 6493608 6539262 6713118 6704015 6831247 6813832 6615513
4956F615513j58908j39176j02225M7926m6529r7952J3804o2j164j72344n2312
$$ 6615513 6456605 6317429 6215204 6263130 6216601 6118649 6132453 6132391 6131227 5958883 5906571
4945E906571q7530K95977J65053J09094N5076O3231L8136J75919R13j62795J49416
$$ 5906571 5819041 6115018 6280071 6389165 6444241 6507472 6545608 6721527 6722440 6559645 6709061
4934F709061P8324k543n1300M6271J51968K37214J60424J89355K13638Q9960M87237
$$ 6709061 6787385 6784842 6733542 6779813 6931781 7168995 7329419 7518774 7732412 7822372 8309609
4923H309609M7429J53821M34237J45057r1957k75113k97161j74795m3621j61436
$$ 8309609 8357038 8510859 8945096 9090153 8998196 8723083 8425922 8251127 8207506 8046070
4913H046070p8562p4651J17177j65860K732J32940l8106k96723J51374j77233
$$ 8046070 7967508 7892857 8010034 7844174 7846906 7979846 7941740 7645017 7796391 7619158
4903G619158j2557O792K4101J68590J24987J65325O117M3488J48024l47315j87103
$$ 7619158 7606601 7613393 7637494 7806084 7931071 8096396 8102513 8146001 8294025 7946710 7759607
4892G759607j34664l53197k48537M6670j25952k56349P0805l9960J2715j25217
$$ 7759607 7624943 7271746 7023209 7069879 6943927 6687578 6758383 6718423 6731138 6605921
4882F605921k14580N7127J64819L5858j18040j10728L4309K1427j16936Q3007
$$ 6605921 6391341 6448468 6613287 6649145 6531105 6420377 6454686 6476113 6359177 6442184
4872F442184J25507j53533J9338p4514M3946L809P5686J7251N8140r7406K4835
$$ 6442184 6567691 6414158 6433496 6358982 6402928 6406737 6482423 6499674 6557814 6460408 6485243
4861F485243P6343P8967J05727K31309L2456J52731R6638J31612P7873K29484
$$ 6485243 6561586 6640553 6746280 6977589 7010045 7162776 7259414 7391026 7468899 7698383
4851G698383J92166N6516K00378j20817K1739L14897q3719j74424J14099R6315
$$ 7698383 7890549 7947065 8147443 8026626 8048365 8363262 8279543 8105119 8219218 8315533
4841H315533k38168n516k4271q141O6797j49118L0090k72565q3985k71905k79979
$$ 8315533 8077365 8071849 8047578 8039437 8106234 7957116 7987206 7714641 7630656 7358751 7078772
4830G078772J67974J89592k92915l03516K4636r63q5287k74858N8498N4958l1429
$$ 7078772 7246746 7436338 7143423 6839907 6864543 6863580 6778293 6503435 6561933 6616891 6585462
4819F585462j48466o2349J17360l8649n1782l1711n5067R1019P8512q0606O4377
$$ 6585462 6436996 6374647 6492007 6453358 6401576 6369865 6314798 6405817 6484329 6403723 6468100
4808F468100M1327k08268k4154J7324L9270R1377O7249R9459l05477J55979J88995
$$ 6468100 6509427 6301159 6277005 6294329 6333599 6424976 6492225 6591684 6286207 6442186 6631181
4797F631181j0028j40134j13802O7275O8553o9762j32425j05647J49890n8756
$$ 6631181 6621153 6481019 6367217 6434492 6503045 6433283 6300858 6195211 6345101 6286345
4787F286345k38191J09651m537n4977j9435R0010J06292M131j29320Q8802N0908
$$ 6286345 6048154 6157805 6153268 6098291 6078856 6168866 6275158 6279289 6149969 6238771 6289679
4776F289679r094j78104K20568J16828K09300m8522k25702L12697j89458K32382
$$ 6289679 6280585 6102481 6323049 6439877 6649177 6600655 6374953 6687650 6498192 6730574
4766F730574M9039j53376J0765j6045O4885K47013j15977o0804R8631n3848M6799
$$ 6730574 6779613 6626237 6637002 6620957 6685842 6932855 6816878 6756074 6854705 6800857 6847656
4755F847656J42677J7539P7343O6858J14899p1374l54395O6478L3355K36297J77970
$$ 6847656 6990333 7007872 7085215 7152073 7266972 7195598 6841203 6907681 6941036 7177333 7355303
4744G355303j27678J60725j1474J15463M6530J13643Q9735o8793M9591J21534
$$ 7355303 7227625 7388350 7376876 7492339 7538869 7652512 7742247 7673454 7723045 7844579
4734G844579j20472j41052J32080l69817J22049J30035J07863j29040m7778J07064
$$ 7844579 7724107 7583055 7715135 7345318 7467367 7597402 7705265 7576225 7528447 7635511
4724G635511j14160J890J87566K4001K0400j70147K05925O1501J37890K39995
$$ 7635511 7521351 7523241 7710807 7734808 7755208 7585061 7790986 7852487 7990377 8230372
4714H230372K9621R2413j24468j20586O3931P4682P6488J57571m4917N0710J10678
$$ 8230372 8259993 8352406 8227938 8107352 8171283 8245965 8322453 8480024 8435107 8485817 8596495
4703H596495j5407k4345J42421K99615J31877j4387J47768k6815J9857j7976P3819
$$ 8596495 8581088 8556743 8699164 8998779 9130656 9116269 9264037 9237222 9257079 9239103 9312922
4692I312922J44009J5310k93289j16277K22922J44347k47617j75074m9173L55223
$$ 9312922 9456931 9472241 9178952 9062675 9285597 9429944 9182327 9007253 8958080 9313303
4682I313303P4508n1249k47934J19629j73924q7208L9641l17956j49713l4895
$$ 9313303 9387811 9336562 9088628 9208257 9034333 8947125 8986766 8668810 8519097 8484202
4672H484202L10173j46838Q1537n7996j257J7873J24842L7097k10649L482J12337
$$ 8484202 8794375 8647537 8729074 8671078 8669821 8687694 8812536 8849633 8638984 8642466 8754803
4661H754803K17048L4692J43590j72508o094j84735j6790q6071J15995K16565
$$ 8754803 8971851 9006543 9150133 8977625 8971531 8786796 8770006 8683935 8799930 9016495
4651I016495O9713J60873K4008J7610J81363k543J49954Q613M0159m261J8625
$$ 9016495 9086208 9247081 9271089 9288699 9470062 9467519 9617473 9626086 9666245 9661984 9680609
4640I680609J08228J12375J44037R5234K34545J68688L09996q1292J46135Q8874
$$ 9680609 9788837 9901212 10045249 10140483 10375028 10543716 10853712 10772420 10918555 11007429
4630A1007429L18418o6428M0927j49906r1125K1626m9755L0820P7117J66771L8151
$$ 11007429 11325847 11259419 11300346 11150440 11059315 11080941 11031186 11062006 11139123 11305894 11344045
4619A1344045J5412J49976j56405k15162J84018J1089l76719k14559N357M0461
$$ 11344045 11359457 11509433 11353028 11137866 11321884 11332973 10956254 10741695 10747052 10787513
4609A0787513l1203j85440M2912K042l0778k8719r3737j14979q7746J50222j2857
$$ 10787513 10756310 10570870 10613782 10615824 10585046 10556327 10462590 10347611 10259865 10410087 10397230
4598A0397230J5191K19129o1166p2498J46498Q6490r1692J06266j20351K7325
$$ 10397230 10412421 10631550 10570384 10497886 10644384 10730874 10639182 10745448 10625097 10652422
4588A0652422M81899K70980j1624N8162j13605J8828p0852q7144J47524o4890
$$ 10652422 11134321 11405301 11393677 11451839 11338234 11357062 11286210 11199066 11346590 11281700
4578A1281700J83729N5827R436J26775O9171p6715K94211M8253N2522j25194J13366
$$ 11281700 11465429 11521256 11530692 11657467 11726638 11649923 11944134 11992387 12044909 11919715 12033081
4567A2033081l8527P3276K57207j560J38374L65024L29012N4959J92543J53100
$$ 12033081 11994554 12067830 12325037 12323477 12461851 12826875 13155887 13210846 13403389 13556489
4557A3556489n6344O8298p4862J84891Q3332J30554r1971K60197J68607p3712
$$ 13556489 13500145 13568443 13493581 13678472 13761804 13892358 13800387 14060584 14229191 14155479
4547A4155479M15275J07517k35597l76651n3823j31890j42320l6417j71338k043
$$ 14155479 14570754 14678271 14442674 14066023 14012200 13880310 13737990 13701573 13530235 13528192
4537A3528192M5532k09715p1171K14490K61759N5071R329k4179L30477J30239
$$ 13528192 13573724 13364009 13292838 13507328 13769087 13824158 13833487 13809308 14139785 14270024
4527A4270024J90312J91325J36411J59433P1492j14376K71653J76314P6564l9057
$$ 14270024 14460336 14651661 14788072 14947505 15018997 14904621 15176274 15352588 15429152 15390095
4517A5390095J2654q5082J42964K36955M0705k82489k00414q838l29794k13181
$$ 15390095 15402749 15317667 15460631 15697586 15738291 15455802 15255388 15246550 14916756 14703575
4507A4703575K56978j1903M4473j12756j15560P1438q922j10889K3887P1534K6505
$$ 14703575 14960553 14948650 14993123 14880367 14764807 14836245 14827323 14716434 14740321 14811855 14838360
4496A4838360J80871k646J49676R7078K0968K51431K45723J74676J37546Q0970
$$ 14838360 15019231 15016585 15166261 15263339 15284307 15535738 15781461 15956137 16093683 16174653
4486A6174653m891P1029K87380K14452K65460K72728P2094Q7395m4040J13711
$$ 16174653 16169762 16240791 16528171 16742623 17008083 17280811 17352905 17440300 17396260 17509971
4476A7509971O7850K08633K7017M2798P955J142J97044J82286J69765J07231K55211
$$ 17509971 17577821 17786454 17813471 17856269 17864224 17865366 18062410 18244696 18414461 18521692 18776903
4465A8776903J59757M10463L75364J91988Q5389J95447k8785N9634R8944J58725
$$ 18776903 18936660 19347123 19722487 19914475 19999864 20195311 20166526 20226160 20325104 20483829
4455B0483829O0475j45810J25434J01308r9013J56691J26326K82792M02850K79958
$$ 20483829 20544304 20398494 20523928 20625236 20526223 20682914 20809240 21092032 21494882 21774840
4445B1774840M12523Q2211K34565P3707K15571N11005L66227K66709M27234O0903
$$ 21774840 22187363 22269574 22504139 22577846 22793417 23304422 23670649 23937358 24364592 24425495
4435B4425495K48891L55739M14990K61601N08498O24162L50208P96909N34464
$$ 24425495 24674386 25030125 25445115 25706716 26215214 26839376 27189584 27986493 28520957
4426B8520957O77509Q97049R10302N32629P90686J052967J408952J378711J255119
$$ 28520957 29198466 30095515 31005817 31538446 32329132 33382099 34791051 36169762 37424881
4417C7424881J318444J641393J064181R75822R04598J086917J612962K049753
$$ 37424881 38743325 40384718 41448899 42424721 43329319 44416236 46029198 48078951
4409D8078951J823341J947011K231052L236288M476552M042851K03186l781517
$$ 48078951 49902292 51849303 54080355 57316643 61793195 65836046 66039232 62257715
4401F2257715m692261m561243l692748k837916j934090k168236j367422j066786
$$ 62257715 57565454 53004211 49311463 46473547 44539457 42371221 41003799 39937013
4393C9937013q00847n23390m37807k40579J33797N78118P50577J076617N92370
$$ 39937013 39136166 38612776 38174969 37934390 38068187 38646305 39396882 40473499 41065869
4384D1065869l43136j308319j774855j905872j410354j234857q49937k98999m13331
$$ 41065869 40722733 39414414 37639559 35733687 34323333 33088476 32238539 31939540 31526209
4375C1526209n27249j04846l02167j92907j9139M0253k1900J62330K23362l5771
$$ 31526209 30998960 30894114 30591947 30399040 30379901 30420154 30398254 30560584 30783946 30748175
4365C0748175J53318P3808K04221L5104L739K8864J57198J87953r0993M5926M46626
$$ 30748175 30901493 30975301 31179522 31214626 31218365 31247229 31404427 31592380 31501387 31547313 31993939
4354C1993939L81017K06424K04284K72160L28469L10068N85929K92368K62452
$$ 31993939 32374956 32581380 32785664 33057824 33386293 33696361 34282290 34574658 34837110
4345C4837110K09676L58699L03465M88566M52179M74248P00087O96886O42300
$$ 34837110 35046786 35405485 35708950 36197516 36649695 37123943 37824030 38520916 39163216
4336C9163216N50295N76684P21945Q44573R50539R41023J163613J523937J575036
$$ 39163216 39713511 40290195 41012140 41856713 42807252 43748275 44911888 46435825 48010861
4327D8010861K085734K292236K842379L075970L470098K479026R09625j3652M46059
$$ 48010861 50096595 52388831 55231210 58307180 61777278 64256304 65165929 65152277 65598336
4318F5598336J066492R49181m68039j431334j396329j140975m28445J02343Q30428
$$ 65598336 66664828 67614009 67145970 65714636 64318307 63177332 62748887 62851230 63681658
4309F3681658J182015J620491J121680P11102N69470M21980J044244J238950J328510
$$ 63681658 64863673 66484164 67605844 68316946 68886416 69308396 70352640 71591590 72920100
4300G2920100K172123K374080K885155L420673M197251M976571N390110N518157
$$ 72920100 75092223 77466303 80351458 83772131 87969382 92945953 98336063 103854220
4292A03854220N470703N220431M514850L525223K736792K220045K144200K344558
$$ 103854220 109324923 114545354 119060204 122585427 125322219 127542264 129686464 132031022
4284A32031022K617028L914637N429718P211345R590160J2588929J5025743J6638245
$$ 132031022 134648050 138562687 143992405 151203750 160793910 173382839 188408582 205046827
4276B05046827J6139981J4504367J1228160N875651Q566n070139q836180j0471740
$$ 205046827 221186808 235691175 246919335 252794986 252803552 247733413 238897233 228425493
4268B28425493j0140932p553845m077293P8253M503333Q166038J0798973J2146919
$$ 228425493 218284561 210730716 206653423 206731676 211235009 219401047 230200020 242346939
4260B42346939J1407017R101942M889249l64784o300779j0877491j3719025j5075646
$$ 242346939 253753956 262855898 267745147 267380363 261079584 250202093 236483068 221407422
4252B21407422j4435372j2823974r807771o913136m692084k945564j439136j94535
$$ 221407422 206972050 194148076 184340305 177427169 172735085 169789521 168350385 168155850
4244A68155850Q53344J587833J391204J037873L90464n70859r70203j105887j462171
$$ 168155850 169009194 170597027 171988231 173026104 173416568 172845709 171875506 170769619 169307448
4235A69307448k765294l720213m544295m994280n229932n700352n469773n210176
$$ 169307448 166542154 162821941 158277646 153283366 148053434 142353082 136883309 131673133
4227A31673133m958045m503330l965133l135867k646131k323714k011721j531346
$$ 131673133 126715088 122211758 118246625 115110758 112464627 110140913 108129192 106597846
4219A06597846j193839j212323j116400q69768r56455j271569o98436n81557m45862
$$ 106597846 105404007 104191684 103075284 102205516 101249061 99977492 99279056 98697499 98251637
4210I8251637j21189K3068m43531l10897k96384m78869k86425k31874K00427N84734
$$ 98251637 98130448 98153516 97709985 97399088 97102704 96623835 96337410 96105536 96305963 96890697
4200I6890697O56194P00776R05988J047505J521724J805704J857013K456734L063497
$$ 96890697 97546891 98247667 99153655 100201160 101722884 103528588 105385601 107842335 110905832
4191A10905832L490715L922155N032406N711542O958552Q384873R944832J2496046
$$ 110905832 114396547 118318702 123351108 129062650 136021202 144406075 154350907 166846953
4183A66846953J5344691J8534086K2466988K7701343L3921125L6369346K8278553
$$ 166846953 182191644 200725730 223192718 250894061 284815186 321184532 349463085
4176C49463085J6071666J760879m731828k831248J392383P751138N403045q372014
$$ 349463085 365534751 367295630 362563802 359732554 361124937 368876075 374279120 365907106
4168C65907106k3897070l6774294l5634066k9246996k0111898j1574739m513999
$$ 365907106 342010036 305235742 269601676 240354680 220242782 208668043 204154044
4161B04154044J364143N801438R436273J6162218K3058896K7188436O892495k5819721
$$ 204154044 205518187 211319625 220755898 236918116 259977012 287165448 294057943 268238222
4153B68238222l3792635l3088641k7423355j9911531j4179759j2213925j0297161
$$ 268238222 234445587 201356946 173933591 154022060 139842301 127628376 117331215
4146A17331215q738309p194676n952565m842353m087033l488103l308788k732042
$$ 117331215 108592906 101398230 95445665 90603312 86516279 83028176 79719388 76987346
4138G6987346k520520k178166k159903j546315j504230j295991j185858j258796
$$ 76987346 74466826 72288660 70128757 68582442 67078212 65782221 64596363 63337567
4130F3337567j089642j137344j077330j110983j162128j312532j337259j241154
$$ 63337567 62247925 61110581 60033251 58922268 57760140 56447608 55110349 53869195
4122E3869195p32643p84739o92920n71440p66429q38335q40818o85347r74744
$$ 53869195 53136552 52351813 51658893 51087453 50321024 49482689 48641871 47956524 46981780
4113D6981780p84037o86127o74702p52491n62565n53501n55246l42508l38119
$$ 46981780 46197743 45511616 44836914 44084423 43521858 42968357 42413111 42070603 41732484
4104D1732484n35683n59987j49427l21589k14269k81338l22892l14509m33413
$$ 41732484 41196801 40636814 40487387 40165798 39951529 39670191 39347299 39032790 38599377
4095C8599377l00827m93614l29866l44278l06607n20149n89828k68631l98220
$$ 38599377 38298550 37804936 37475070 37130792 36824185 36304036 35714208 35445577 35047357
4086C5047357k19706k61872j48123k75497j79933j66101j70164j77335k41520
$$ 35047357 34827651 34565779 34417656 34142159 33962226 33796125 33625961 33448626 33207106
4077C3207106j79096k17385k11477k50223p1915J2766k48796p1827N7008j00180
$$ 33207106 33028010 32810625 32599148 32348925 32277010 32289776 32040980 31969153 32026161 31925981
4067C1925981q6722M2789J94946n5729j43845J27339K54901K85650J53464J75216
$$ 31925981 31839259 31882048 32076994 32021265 31877420 32004759 32259660 32545310 32698774 32873990
4057C2873990L34906K62435L48048q5771o10029o18985n41117n74747k41280j3804
$$ 32873990 33208896 33471331 33819379 33733608 33123579 32504594 31963477 31388730 31147450 31133646
4047C1133646k56776j50311j5289Q4863J93074o9545p0478l4105l4554J359k7447
$$ 31133646 30876870 30726559 30711270 30796133 30989207 30919662 30849184 30815079 30780525 30781884 30754437
4036C0754437K61136L95453j23426j77740l554l06858l3294k40341l61441k36710
$$ 30754437 31015573 31411026 31287600 31109860 31106306 30799448 30766154 30525813 30164372 29927662
4026B9927662k75503k74557k66863j12473k7565j04647l13116l25552n2485J8913
$$ 29927662 29652159 29377602 29110739 28998266 28970701 28866054 28552938 28227386 28174901 28193814
4016B8193814l33927j84708k63018q8668j66643N8914J33410L0814k26999j73719
$$ 28193814 27859887 27675179 27412161 27323493 27156850 27215764 27349174 27379988 27152989 26979270
4006B6979270M652j54967K11588Q4106M73464K96323r3471l69918m39317k90705
$$ 26979270 26983922 26828955 27040543 27124649 27598113 27894436 27800965 27431047 26991730 26701025
3996B6701025m08125l32261J20005l51775j63799l2319K3173l73069m39807l65515
$$ 26701025 26292900 25960639 26080644 25728869 25565070 25532751 25555924 25182855 24743048 24377533
3986B4377533l46369k90650j44419k15685q7077j08675K3367q7679j77538l5870
$$ 24377533 24031164 23740514 23596095 23380410 23293333 23184658 23208025 23120346 22942808 22906938
3976B2906938q3284K33174M5157J46277O2595k28571m62569j65039j43685k56221
$$ 22906938 22823654 23056828 23101985 23248262 23310857 23082286 22619717 22454678 22310993 22054772
3966B2054772m02328m71397J7043j31995k79175l08747l34008R809j21493k74566
$$ 22054772 21652444 21181047 21198090 21066095 20786920 20478173 20144165 20153974 20032481 19757915
3956A9757915j44075j36513k34783J37320m3436j24156O0488N500j45125j08699
$$ 19757915 19613840 19477327 19242544 19379864 19336428 19212272 19272760 19278260 19133135 19024436
3946A9024436J49986J89844K10135L03017L96525L46299K21097k04441l94984
$$ 19024436 19174422 19364266 19574401 19877418 20273943 20620242 20841339 20636898 20241914
3937B0241914l20883l54544m51997k19118k05380k06114j11509j06750q5609M062
$$ 20241914 19921031 19566487 19114490 18895372 18689992 18483878 18372369 18265619 18180010 18184072
3927A8184072j70402j03388j3833p7784k4699L062k46795j09477l2036k45456
$$ 18184072 18013670 17910282 17896449 17818665 17793966 17797028 17550233 17440756 17408720 17163264
3917A7163264L4600p7230j87140o1912j14775k4071K7419L2244J87494P2958K88355
$$ 17163264 17197864 17120634 16933494 16871582 16756807 16732736 16760155 16792399 16979893 17052851 17341206
3906A7341206K6218K44797K88154K61809j9298j88352j81421n9988O103j24573
$$ 17341206 17367424 17612221 17900375 18162184 18142886 17954534 17773113 17713125 17719228 17594655
3896A7594655k04945l77147j41641j66636m028L970k02389J20045J65151K09853
$$ 17594655 17389710 17012563 16870922 16704286 16700258 16704228 16501839 16621884 16787035 16996888
3886A6996888k4944j68268j22691J47303K30964k06254J03742j8423K2038n615
$$ 16996888 16971944 16803676 16680985 16828288 17059252 16852998 16956740 16938317 16960355 16954740
3876A6954740k79851k69270j58636O3364j46318J2854l3017j08814M0593M0883
$$ 16954740 16674889 16405619 16246983 16310347 16164029 16176883 16143866 16035052 16075645 16116528
3866A6116528J25121R4554J2031m436j14538J9303k03767k68011l19588j43305
$$ 16116528 16241649 16336203 16348234 16343798 16229260 16248563 16044796 15776785 15457197 15313892
3856A5313892j33493P2192l9335Q6875j61021N9607N8466J50691k9023j43263
$$ 15313892 15180399 15252591 15213256 15300131 15139110 15198717 15257183 15407874 15378851 15235588
3846A5235588J92859j25813j91136q4451j5350J83088J73018L9331k6211J49362
$$ 15235588 15428447 15302634 15111498 15027047 15011697 15194785 15367803 15407134 15380923 15530285
3836A5530285K21535J01278J43992m4105M7969K95249l9496k67286K34834k50163
$$ 15530285 15751820 15853098 15997090 15952985 16000954 16296203 16256707 15989421 16224255 15974092
3826A5974092M0935Q8984j32302k69389j60446j33044J31891Q2687J47782j9278
$$ 15974092 16015027 16104011 15971709 15702320 15541874 15408830 15540721 15623408 15771190 15751912
3816A5751912n6683P3861P6000n5871k6080N9445J81486k0384N3337K70707K0419
$$ 15751912 15695229 15769090 15845090 15789219 15763139 15822584 16004070 15983686 16037023 16307730 16328149
3805A6328149N1936J52962q266P7643j51496r1883L55050N2648M3431N7030q1042
$$ 16328149 16380085 16533047 16524781 16602424 16450928 16359045 16714095 16766743 16810174 16867204 16786162
3794A6786162J59752K40143J44159K3905K8658Q1890L25332K9146J72326k0048
$$ 16786162 16945914 17186057 17330216 17354121 17382779 17464669 17790001 17819147 17991473 17971425
3784A7971425P9849K06292n74k22426N6311K28209J84906J0726j45451Q4873k0229
$$ 17971425 18051274 18257566 18256992 18034566 18090877 18319086 18503992 18514718 18369267 18454140 18433911
3773A8433911R282J33851j36461m6162n9687L6598J73497k15486K12558Q1114
$$ 18433911 18443193 18577044 18440583 18394421 18334734 18371332 18544829 18329343 18541901 18623015
3763A8623015j00694n0244o0716J71783K06857q7315N6968j42211J7376O2735
$$ 18623015 18522321 18472077 18411361 18583144 18790001 18702686 18759654 18617443 18634819 18697554
3753A8697554K65058P6201J14984l9490j21785N4568k7350M6861J73533l644j8470
$$ 18697554 18962612 19038813 19153797 19114307 18992522 19047090 19019740 19066601 19240134 19236490 19218020
3742A9218020o0380J40871q7951J07369J31434J10420O6672J65527J29469J13229
$$ 19218020 19157640 19298511 19210560 19317929 19449363 19559783 19626455 19791982 19921451 20034680
3732B0034680n3325K43363K67885k0201K30683K36572K36353L47318L07350P4570
$$ 20034680 19981355 20224718 20492603 20472402 20703085 20939657 21176010 21523328 21830678 21905248
3722B1905248J87044J98434K92713R5642J88583L29652J53353J66463K37556R6707
$$ 21905248 22092292 22290726 22583439 22679081 22867664 23197316 23350669 23517132 23754688 23851395
3712B3851395M44072K27125K06761J16536K22007J94162K16521J92945k0430M5040
$$ 23851395 24295467 24522592 24729353 24845889 25067896 25262058 25478579 25671524 25651094 25696134
3702B5696134J75367K2483J03464K55396L94019K38192J33122J08248j59082R0244
$$ 25696134 25871501 25893984 25997448 26252844 26646863 26885055 27018177 27126425 26967343 27057587
3692B7057587K68716K04381o8644p2703l37432p3691K9767k69097k30753m2759
$$ 27057587 27326303 27530684 27462040 27389337 27051905 26978214 27007981 26738884 26508131 26465372
3682B6465372n6261k28137R3039l3393q536p6360k94137k52504J10943l2467k31171
$$ 26465372 26409111 26180974 26274013 26240620 26232084 26155724 25861587 25609083 25720026 25687559 25456388
3671B5456388j2677J60683k5412q2009Q1880o0063n5037l5600K90965M9868m0896
$$ 25456388 25443711 25604394 25578982 25496973 25578853 25518790 25463753 25428153 25719118 25768986 25728090
3660B5728090L04676K08379J04160K1947L25818K11544J39392J24924M3413N9560
$$ 25728090 26032766 26241145 26345305 26367252 26693070 26904614 27044006 27168930 27212343 27271903
3650B7271903J05766R316O0925P714j7619n3655J51151Q9801K3704p4631K05936
$$ 27271903 27377669 27386985 27447910 27455624 27438005 27384350 27535501 27625302 27649006 27574375 27780311
3639B7780311K28685n8640Q715J73631K02130k50528J24927J83143O074J07958
$$ 27780311 28008996 27950356 27959071 28132702 28334832 28084304 28209231 28392374 28398448 28506406
3629B8506406K63123j65231J9459J93749K30622m9974Q6299L69037j8156n1645
$$ 28506406 28769529 28604298 28623757 28817506 29048128 28998154 29084453 29453490 29435334 29383689
3619B9383689K01230K28235K1513L3837J35073K3438J40883K49191J16346Q4466
$$ 29383689 29584919 29813154 29834667 29868504 30003577 30027015 30167898 30417089 30533435 30617901
3609C0617901K15941P4697j36609n5106q1156J01689J99978k49315P0547K3415
$$ 30617901 30833842 30908539 30771930 30716824 30635668 30737357 30937335 30688020 30758567 30781982
3599C0781982J64493J04839j77605K4154Q8964R6598J26571J27617k7124l9669
$$ 30781982 30946475 31051314 30873709 30897863 30986827 31083425 31209996 31337613 31310489 31270820
3589C1270820J07242J26213r9930L9474k7307l7760P7918Q8973K51563L46654
$$ 31270820 31378062 31504275 31404345 31443819 31416512 31378752 31456670 31545643 31797206 32143860
3579C2143860K2350j07600K50453J89416j90096L8337P095J37651O0255J95557
$$ 32143860 32166210 32058610 32309063 32498479 32308383 32346720 32353815 32491466 32551721 32747278
3569C2747278r7300n4128J60660O0268J68018q6474Q8246P2575q401K40043K92939
$$ 32747278 32649978 32595850 32756510 32816778 32984796 32898322 32986568 33059143 33050742 33290785 33583724
3558C3583724k29363J61301O2114K640K13061K22428k1986p6942K91403J85911
$$ 33583724 33354361 33515662 33577776 33580416 33793477 34015905 33993919 33916977 34208380 34394291
3548C4394291J48568J44462N0633L71461M57465J52552K98667L76285K29996L37628
$$ 34394291 34542859 34687321 34737954 35109415 35566880 35719432 36018099 36394384 36624380 36962008
3538C6962008L00130J37560K64962L14846M63291J95137J83204K22454K53743
$$ 36962008 37262138 37399698 37664660 37979506 38442797 38637934 38821138 39043592 39297335
3529C9297335K44548M86254M69530O8606K76844J85307K54874K24335J78252J61824
$$ 39297335 39541883 40028137 40497667 40566273 40843117 41028424 41283298 41507633 41685885 41847709
3519D1847709J30248k0063n1113J32185O1280M860j20879L1740O0320m2755j23082
$$ 41847709 41977957 41957894 41906781 42038966 42100246 42105106 41984227 42015967 42076287 42033532 41910450
3508D1910450J63701q2884j41759j5601j07848j46715j1653p9248M2222l49766
$$ 41910450 42074151 41991267 41849508 41833907 41726059 41579344 41567691 41488443 41530665 41180899
3498D1180899k16773K3357j9260K7376m1980J17744J36829P1716K92387M4910
$$ 41180899 40964126 40987483 40968223 40995599 40953619 41071363 41208192 41279908 41572295 41617205
3488D1617205J98826L16331K96848L11619J73051L91093K70432K90287K23213
$$ 41617205 41816031 42132362 42429210 42740829 42913880 43304973 43575405 43865692 44088905
3479D4088905R4607J08607J82300R62J85097j97131J82263L26938l3565L29253
$$ 44088905 44183512 44292119 44474419 44475381 44660478 44463347 44645610 44972548 44938983 45268236
3469D5268236M46210K32757K94607J00833N9716M94528N02208M17455O24513N73964
$$ 45268236 45714446 45947203 46241810 46342643 46402359 46896887 47399095 47816550 48441063 49015027
3459D9015027P85632O19993P66739Q81414Q19428J356457J265341J548579J851907
$$ 49015027 49800659 50420652 51187391 52068805 52888233 54244690 55510031 57058610 58910517
3450E8910517J972151K437749L070727L549798L853390M698869N682846O682749
$$ 58910517 60882668 63320417 66391144 69940942 73794332 78493201 84176047 90858796
3442I0858796N618581p5479m963734o197351o115344m630758l139500k115564
$$ 90858796 96477377 96401898 91438164 85240813 79125469 74494711 71355211 69239647
3434F9239647j447606p48279m07691l04565O3817M82780O05444Q89492J039604
$$ 69239647 67792041 67043762 66636071 66331506 66395323 66878103 67483547 68373039 69412643
3425F9412643J061578J322187J642006K147582K482708K821237K494584K070785
$$ 69412643 70474221 71796408 73438414 75585996 78068704 80889941 83384525 85455310
3417H5455310K764365L647955M691089N943053P583618R680887J1765740R787901
$$ 85455310 88219675 91867630 96558719 102501772 110085390 119766277 131532017 141319918
3409A41319918j786669r890633j1252709j0298038p475306m879049l198213k351104
$$ 141319918 139533249 129642616 118389907 108091869 100616563 95737514 92539301 90188197
3401I0188197r62411m54607j15252l83166j312506j408961j176895r68065m13487
$$ 90188197 89225786 88771179 88655927 88272761 86960255 85551294 84374399 83406334 82992847
3392H2992847Q8974N46917O95526R23757J055311J309031J539999K098273K384657
$$ 82992847 83081821 83628738 84324264 85248021 86303332 87612363 89152362 91250635 93635292
3383I3635292L004285L342606L786866M407852M978351M189003l00097m112068
$$ 93635292 96639577 99982183 103769049 108176901 113155252 117344255 117044158 112932090
3375A12932090m723168m604212l577026k925416k547510k407976j781544j384996
$$ 112932090 108208922 103604710 100027684 97102268 94554758 92146782 90365238 88980242
3367H8980242j253311q75569o15715l07537j86866j24195L26225M37090M70776
$$ 88980242 87726931 86851362 86235647 85928110 85741244 85617049 85943274 86380364 86851140
3358H6851140O83617Q00054P18334J098234J171849J032902Q37921N22766O65811
$$ 86851140 87534757 88334811 89053145 90151379 91323228 92356130 93194051 93716817 94382628
3349I4382628O13662Q45023O88523Q73002J124135J157820J458350J821956K057706
$$ 94382628 94996290 95841313 96529836 97402838 98526973 99684793 101143143 102965099 105022805
3340A05022805K118232J672592O78361l27141o04366p09992k7080K59301M37490
$$ 105022805 107141037 108813629 109491990 109164849 108560483 107850491 107823411 108082712 108520202
3331A08520202N56983P66636Q58804J089540J439194J802054K542614K814893
$$ 108520202 109077185 109843821 110702625 111792165 113231359 115033413 117576027 120390920
3323A20390920K351539J172090P04953M61337J5083j243j33475L52674K71084
$$ 120390920 122742459 123914549 124619502 125080839 125095922 125094679 124961204 125313878 125584962
3314A25584962L54904N03846N97512R59327J367172J546392K034892K031396K095807
$$ 125584962 125939866 126443712 127041224 128000551 129367723 130914115 132949007 134980403 137076210
3305A37076210K171534J968467K265966K293399K756478K968620K770918K677297
$$ 137076210 139247744 141216211 143482177 145775576 148532054 151500674 154271592 156948889
3297A56948889K823203L474586L723013M388725M908754M783840M262642L062699
$$ 156948889 159772092 163246678 166969691 171358416 176267170 181051010 185313652 188376351
3289A88376351K276871K682050L573699M042696L219900K690994K779409L183831
$$ 188376351 190653222 193335272 196908971 200951667 204171567 206862561 209641970 212825801
3281B12825801M065697N146170O180239P379058Q359108Q934082J0461823J1110433
$$ 212825801 216891498 222037668 228217907 235596965 243956073 252890155 263351978 274462411
3273B74462411J1811071J2405241J2962859J2755677J1844942J0283718P426296
$$ 274462411 286273482 298678723 311641582 324397259 336242201 346525919 353952215
3266C53952215K638364l711227j0094467j5429429j8859619j9375420j7820561
$$ 353952215 356590579 352879352 342784885 327355456 308495837 289120417 271299856
3259B71299856j5507203j3031341j1117356r865263q737716p478888o604273n718762
$$ 271299856 255792653 242761312 231643956 221778693 213040977 205562089 198957816 193239054
3251A93239054n170304m737384m287756l467569l182490l054250k487148k571110
$$ 193239054 188068750 183331366 179043610 175576041 172393551 169339301 166852153 164281043
3243A64281043k205535j915323k153038k132484k210762j932218j745288j885068
$$ 164281043 162075508 160160185 158007147 155874663 153663901 151731683 149986395 148101327
3235A48101327j640965j964841j960779j585969j409416j578501j632415j691805
$$ 148101327 146460362 144495521 142534742 140948773 139539357 137960856 136328441 134636636
3227A34636636j884947k039704k023226j864858j740655j762811j598444j309952
$$ 134636636 132751689 130711985 128688759 126823901 125083246 123320435 121721991 120412039
3219A20412039j623471j527558j142761j157145q81782j360017j226666j135310
$$ 120412039 118788568 117261010 116118249 114961104 114079322 112719305 111492639 110357329
3211A10357329j398770j187484j060733j085977j069581q54550p94524q41174
$$ 110357329 108958559 107771075 106710342 105624365 104554784 103700234 102905710 102064536
3203A02064536j065277q41441r34894j036751j004819j196053j203565r57306
$$ 102064536 100999259 100157818 99222924 98186173 97181354 95985301 94781736 93824430
3195I3824430j158875j186888r83393j108206j142293j059832q75437o91154p23252
$$ 93824430 92665555 91478667 90495274 89387068 88244775 87184943 86309506 85618352 84895100
3186H4895100o25032p20330q01717m40761n46235q52206n61379q02120p67240
$$ 84895100 84270068 83549738 82748021 82307260 81761025 80908819 80347440 79545320 78778080
3177G8778080m25734n27245p23602n47498k76079l32013l13866n88372m09100
$$ 78778080 78352346 77825101 77101499 76554001 76277922 75945909 75632043 75043671 74634571
3168G4634571m00239k99115m87075o43747m71506l08499k56575l30195n86761
$$ 74634571 74234332 73935217 73448142 72804395 72332889 72024390 71767815 71437620 70850859
3159G0850859n09742k70763k99896m75556m40708m78732m26437m11330m20552
$$ 70850859 70341117 70070354 69770458 69294902 68854194 68375462 67949025 67537695 67117143
3150F7117143n17962n89009m19582l99395k61174m04156m92339n33895l29922
$$ 67117143 66599181 66010172 65590590 65191195 64930021 64525865 64033526 63499631 63169709
3141F3169709k93160k88164l74320l61820l61571m39967l77018j51062j23976
$$ 63169709 62876549 62588385 62214065 61852245 61490674 61050707 60673689 60522627 60398651
3132F0398651m2730j19204k42983m7306J03550j42322J77338j87741l35761k75461
$$ 60398651 60355921 60236717 59993734 59946428 60049978 59907656 60084994 59897253 59561492 59286031
3122E9286031k80055j15893r4958m96916n61318l82084j87392k27978j65314l81393
$$ 59286031 59005976 58890083 58795125 58298209 57736891 57354807 57167415 56939437 56774123 56392730
3112E6392730j36214j25663k92343j70905j69735K4653k13704j72186j67265k07012
$$ 56392730 56256516 56130853 55838510 55667605 55497870 55522523 55308819 55136633 54969368 54762356
3102E4762356o5929m57697m95698K9273j39681l06064l06706l01171l63470l97423
$$ 54762356 54696427 54238730 53743032 53772305 53632624 53326560 53019854 52718683 52355213 51957790
3092E1957790m73702m16214l41132l60063o19312m25595o27688l90494l88118
$$ 51957790 51484088 51067874 50726742 50366679 49747367 49321772 48694084 48303590 47915472
3083D7915472m43489l57224p19415m17225l94485k83924k29656k6542q4287l58432
$$ 47915472 47471983 47114759 46395344 45978119 45583634 45299710 45070054 45043512 44959225 44600793
3073D4600793k31024k12066j87413m87473l23589k87873l00877l03490k29763
$$ 44600793 44369769 44157703 43970290 43482817 43159228 42871355 42570478 42266988 42037225
3064D2037225r855k61159j26394j40165k14335k9756L5642j95437K5978Q5859
$$ 42037225 42027370 41766211 41639817 41499652 41285317 41255561 41291203 41095766 41121744 41207603
3054D1207603l6607l2365j37961J44335J5850j42949j55327O4079k70909P8456
$$ 41207603 41170996 41138631 41000670 41145005 41160855 41017906 40862579 40926658 40655749 40734205
3044D0734205J50869k0292J4413j15750J16264k3764j23129J62706J22673J08337
$$ 40734205 40885074 40864782 40879195 40763445 40879709 40855945 40732816 40895522 41018195 41126532
3034D1126532K79680L27135K54878J07822P5603J99549J84950q1522l47531j22318
$$ 41126532 41406212 41733347 41988225 42096047 42171650 42371199 42556149 42474627 42127096 42004778
3024D2004778m53391k14506j69875j78154J42188K48653j47654J36725K83835
$$ 42004778 41551387 41336881 41167006 40988852 41131040 41379693 41232039 41368764 41652599
3015D1652599k839N8384K24195J5421J15479L59801M78654K42654K85284N01567
$$ 41652599 41649760 41708144 41932339 41947760 42063239 42423040 42901694 43144348 43429632 43931199
3005D3931199N70480N47665O82990Q83094Q32720R28203J064087J238835J211003
$$ 43931199 44501679 45049344 45732334 46615428 47448148 48376351 49440438 50679273 51890276
2996E1890276J258300O85676J75052j71366k52358k74674l23495j24470p6170
$$ 51890276 53148576 53834252 54009304 53837938 53585580 53310906 52987411 52862941 52786771
2987E2786771j00238K06938J74347K06817J48020M10711M32955Q45843L45328
$$ 52786771 52686533 52893471 53067818 53274635 53422655 53833366 54266321 55112164 55457492
2978E5457492M32533N11210O89213N46131P71341J069928J020294J062199J341671
$$ 55457492 55890025 56401235 57090448 57636579 58407920 59477848 60498142 61560341 62902012
2969F2902012J540521J534456J735637K004918K165836K466056K507325K873590
$$ 62902012 64442533 65976989 67712626 69717544 71883380 74349436 76856761 79730351
2961G9730351L166827L186047K845174J473996P0799j036270j209329j035596
$$ 79730351 82897178 86083225 88928399 90402395 90473194 89436924 88227595 87191999
2953H7191999q06135l79696O0450J96564K25066N5001J46367L10800L92057N18167
$$ 87191999 86385864 86006168 86066618 86263182 86488248 86543249 86689616 87000416 87392473 87910640
2943H7910640O01915Q26693Q86467J111527J301507J602167J680355J976005K068946
$$ 87910640 88512555 89339248 90225715 91337242 92638749 94240916 95921271 97897276 99966222
2934I9966222K550880K619610K782623L239097L489786L616351L596584L185965
$$ 99966222 102517102 105136712 107919335 111158432 114648218 118264569 121861153 125047118
2926A25047118K677643J958063O14696m05995j606637k355941k460058k038584
$$ 125047118 127724761 129682824 130297520 129891525 128284888 125928947 123468889 121430305
2918A21430305j651399j055874m50549K00728O71320J169058J184127J588109
$$ 121430305 119778906 118723032 118272483 118473211 119144531 120313589 121497716 123085825
2910A23085825K089013K128397K648074L004791K971348L106773L311253L482248
$$ 123085825 125174838 127303235 129951309 132956100 135927448 139034221 142345474 145827722
2902A45827722K883434K464595J129611k19759n99858r67064q00336j030523j285683
$$ 145827722 148711156 151175751 152305362 152085603 151485745 150518681 149718345 148687822 147402139
2893A47402139o52948m39348n35022o72318q59222j656365j942975k259182k178780
$$ 147402139 146749191 146309843 145774821 145102503 144243281 142586916 140643941 138384759 136205979
2884A36205979j807989j747517j599507j539792j409743j508031j477495j652243
$$ 136205979 134397990 132650473 131050966 129511174 128101431 126593400 125115905 123463662
2876A23463662j492790j369684j145605r38185j116998j018433j039615p20159
$$ 123463662 121970872 120601188 119455583 118517398 117400400 116381967 115342352 114622193
2868A14622193j044596j290228j496387j652096j852290j410527j290321j160069
$$ 114622193 113577597 112287369 110790982 109138886 107286596 105876069 104585748 103425679
2860A03425679j027114j090382j146960p56041n84789o88279n10540l43583j83411
$$ 103425679 102398565 101308183 100161223 99405182 98820393 98132114 97621574 97277991 97094580
2851I7094580J06832J92263K84710M32340M14342M69753K35161l4990n86478p16087
$$ 97094580 97201412 97393675 97678385 98110725 98525067 98994820 99229981 99194991 98608513 97892426
2841I7892426j115141j272766j155297j041197j556689j840842k465406k957493
$$ 97892426 96777285 95504519 94349222 93308025 91751336 89910494 87445088 84487595
2833H4487595k937508l124312l279272k819215k867553k624476k354582k272902
$$ 84487595 81550087 78425775 75146503 72327288 69459735 66835259 64480677 62207775
2825F2207775k189241j971702j659479j457682j508292j524381j088906j230339
$$ 62207775 60018534 58046832 56387353 54929671 53421379 51896998 50808092 49577753
2817D9577753j416861j049467q95351q20233j157086j036049p15843r08996r53821
$$ 49577753 48160892 47111425 46216074 45395841 44238755 43202706 42486863 41577867 40624046
2808D0624046q23033q39894j102836o43654o93758q25521n88551q21452o29988
$$ 40624046 39801013 38961119 37858283 37214629 36520871 35695350 35106799 34285347 33655359
2799C3655359n70794r36273p39313o01981m34928p55346m15220m43044o95402
$$ 33655359 33084565 32148292 31408979 30806998 30372070 29616724 29201504 28758460 28063058
2790B8063058m73858n86246m94463k86334k39091k95767m08082n40575l29507
$$ 28063058 27589200 27002954 26508491 26222157 25983066 25687299 25279217 24738642 24409135
2781B4409135n02315l70480k84994k15895n21868j49627m47914k66841j22559
$$ 24409135 23906820 23536340 23251346 23035451 22513583 22363956 21916042 21649201 21526642
2772B1526642m87837j61582j50483m11983m28172j64608k80177k14561j59301
$$ 21526642 21038805 20877223 20726740 20314757 19886585 19721977 19441800 19227239 19067938
2763A9067938l83852l80552k05649k00051k93220l77952j75610k7228q0763k57040
$$ 19067938 18684086 18303534 18097885 17897834 17604614 17226662 17051052 17023824 16943061 16686021
2753A6686021l71882k51713j64136m38700j12214k72763j52955J40348q8625k62079
$$ 16686021 16314139 16062426 15898290 15459590 15347376 15074613 14921658 15062006 14973381 14711302
2743A4711302k40934j54898k64690j03090k29389m20754l58126p820j78586l66037
$$ 14711302 14470368 14315470 14050780 13947690 13718301 13297547 12939421 12931601 12753015 12386978
2733A2386978k59276j42817j38209K48408j40162j59550j07637l86096k99577
$$ 12386978 12127702 11984885 11846676 12095084 11954922 11795372 11687735 11301639 11002062
2724A1002062o6084k9912n0888o1395k36758k72777m16969n2125p901l15854j7610
$$ 11002062 10935978 10906066 10855178 10793783 10557025 10284248 9867279 9815154 9807253 9491399 9473789
2713I473789J1739j53582k7727m343j98358k33887J81239p5989n1349l33638j49137
$$ 9473789 9485528 9331946 9304219 9299876 9101518 8867631 9048870 8972881 8921532 8587894 8438757
2702H438757o3216J18751k67754k49170Q1661j12344n6026k28542m6795J34124
$$ 8438757 8375541 8494292 8226538 7977368 8059029 7946685 7890659 7662117 7615322 7749446
2692G749446m6703k12108l4524p3304k21372k16313J95965j21370j94683J1643
$$ 7749446 7702743 7490635 7456111 7382807 7161435 6945122 7141087 7019717 6825034 6836677
2682F836677q6405q4603q8465m4269P1450J63934j43546j22898O9270L3581p972
$$ 6836677 6750272 6665669 6577204 6532935 6604385 6768319 6624773 6501875 6571145 6604726 6596754
2671F596754p7367k19816q4982k13709j62650p3451K0113j7695R079q262J53913
$$ 6596754 6519387 6299571 6214589 6000880 5838230 5764779 5784892 5767197 5776276 5768014 5921927
2660E921927j32039l28407O217j76788J5018K49278r7098j91183n6723K8045o3336
$$ 5921927 5789888 5461481 5467698 5290910 5305928 5555206 5458108 5266925 5210202 5238247 5174911
2649E174911O1584O7787k0536j24832n9365M3897N1052K02573l7995o620k84687
$$ 5174911 5236495 5304282 5283746 5158914 5099549 5143446 5194498 5397071 5359076 5352456 5067769
2638E067769j26493J5860k3008j3896k9704k3086m2219K69845r0219j47041p6641
$$ 5067769 4941276 4957136 4934128 4920232 4890528 4867442 4825223 5095068 5004849 4857808 4781167
2627D781167P8887j28930J8810j31233Q6083J02549j08648r262J44292J09080
$$ 4781167 4860054 4731124 4749934 4618701 4704784 4807333 4698685 4689423 4833715 4942795
2617D942795j00441o4730j37963K06913j23416J9910P6872l9188j10603l16575
$$ 4942795 4842354 4777624 4639661 4846574 4723158 4743068 4819940 4780752 4670149 4353574
2607D353574j62212P4514j90997K09170j11919l12638J72890j16502L7319J07322
$$ 4353574 4191362 4265876 4074879 4284049 4172130 3859492 4032382 3915880 3953199 4060521
2597D060521j6655j74027j02064m731K9436j9945K3823j61874N2651R717k632
$$ 4060521 4043866 3869839 3767775 3763044 3792480 3772535 3796358 3634484 3687135 3696852 3694220
2586C694220R7655j38797n3746j59459J24363j60864j08219N8035K34704k3903
$$ 3694220 3791875 3653078 3599332 3439873 3564236 3403372 3295153 3353188 3587892 3563989
2576C563989j02508j05726j17308j04554O4615l7339j67338J07121r4322r2675
$$ 3563989 3461481 3355755 3238447 3133893 3198508 3161169 2993831 3100952 3006630 2913955
2566B913955m1045n2033K08992j92097o9401J44764n9243j97840k7802J85180
$$ 2913955 2872910 2820877 3029869 2837772 2768371 2913135 2853892 2656052 2628250 2813430
2556B813430p1981l29927j03356K89634k0647n0175l8583n3812p8279n9313n7189
$$ 2813430 2741449 2411522 2308166 2597800 2577153 2526978 2488395 2434583 2356304 2296991 2239802
2545B239802k40938J25863n8192J83103p9483j92044J36744l8604J64334k33964
$$ 2239802 1998864 2124727 2066535 2249638 2170155 1978111 2114855 2076251 2240585 2006621
2535B006621r1878r7932k45826m5781N8269J29599K0888j01062m4045O0713J39387
$$ 2006621 1914743 1816811 1570985 1525204 1583473 1713072 1733960 1632898 1588853 1649566 1788953
2524A788953j89112l7688O7397k96927Q0988k9139j24907K47791P4570k09589
$$ 1788953 1599841 1562153 1629550 1332623 1413611 1384472 1259565 1507356 1581926 1372337
2514A372337j14420M2200J23855R94j34399K4160r7804m9951J20138J28771l3151
$$ 1372337 1257917 1300117 1423972 1424966 1290567 1314727 1216923 1166972 1287110 1415881 1382730
2503A382730j93058J13071L5904k6015n3008j93711k4511m8553m212J70136R8602
$$ 1382730 1189672 1302743 1338647 1312632 1259624 1065913 1041402 992849 988637 1158773 1257375
2492A257375J9794l22300J09239J80391k07291j58147P831q2902M0429J04664
$$ 1257375 1277169 954869 1064108 1244499 1037208 879061 886892 803990 844419 949083
2482I49083j07672O8720J922J16961J34323o2359k36341M9901O6632O4670k12273
$$ 949083 841411 910131 912053 1029014 1163337 1100978 864637 914538 981170 1045840 833567
2471H33567j6459J32661K118M9768L1899p3850j18305K1451K3641k7170O976k18151
$$ 833567 817108 949769 951887 1001655 1033554 959704 841399 862850 886491 859321 866297 648146
2459F48146N0343O7254j77362j40470J61539J02881M4779J21088J15532k43647
$$ 648146 698489 765743 588381 447911 609450 712331 757110 878198 993730 750083
2449G50083j4800k5276j74069k6743o749J6376J12253j49054l3205L4116P5455
$$ 750083 735283 710007 535938 509195 502446 518822 631075 482021 448816 482932 558387
2438E58387q480p0287J13889M5187J02302j03647n3958J32799J60364n0075j21982
$$ 558387 549907 479620 593509 638696 740998 637351 583393 716192 876556 826481 704499
2427G04499k19081J72965n8324L7416k0170m4586N6132j08846J17020j9670j34444
$$ 704499 485418 658383 600059 637475 617305 572719 628851 520005 637025 617355 482911
2416D82911P305l9617m3631j8022Q5906O7022J4329R4913R5335m8265r1989j46959
$$ 482911 490216 450599 406968 388946 474852 541874 556203 651116 746451 698186 606197 459238
2404D59238Q4001k0706q8104J27037j03138O8778K06796m8519J37838J07509p0287
$$ 459238 543239 522533 434429 561466 458328 527106 733902 685383 823221 930730 860443
2393H60443l5257o2678L9948j21484J16749J26714j34209n2807J32243J37965
$$ 860443 825186 762508 802456 680972 797721 924435 790226 737419 869662 1007627
2383A007627j48231k33919j06122P5852O8154R8069J17471j49239n6097k8269
$$ 1007627 859396 625477 519355 595207 663361 761430 878901 729662 673565 645296
2373F45296P5707j39995j57570N1655q2259O4695L2036k4559l0983J5986l5482
$$ 645296 721003 581008 423438 475093 392834 457529 489565 465006 434023 450009 414527
2362D14527q3902J9801K2824l400k6616Q0917n0864O5544j01399m52K25917P7236
$$ 414527 330625 350426 373250 369850 343234 424151 373287 438831 337432 336980 562897 640133
2350F40133O754r3885l8816o1855p9163J68537Q7737j68908k35198Q6832K03729
$$ 640133 646887 553002 514186 452331 373168 541705 629442 460534 225336 312168 515897
2339E15897k51251J83974J48638o2303l29249M8138K67204O7489q6854j2181J1397
$$ 515897 264646 448620 597258 534955 205706 253844 521048 588537 501683 489502 500899
2328E00899k3586j25327m7353J10185J28532j54364j29593P4575K41531j59229
$$ 500899 477313 351986 304633 414818 543350 388986 259393 333968 575499 416270
2318D16270k10030j3431R9514J01169P7704j9215O5458k1385J57726R5771k01241
$$ 416270 206240 192809 292323 393492 471196 451981 517439 496054 653780 749551 548310
2307E48310N422q323P4552r3767j92422K0069M5964L5857j12081k7727K42641
$$ 548310 553732 545409 619961 526194 333772 353841 399805 435662 323581 295854 538495
2296E38495J3617p1765N8040q508q4676J09361q5684j60590J61336j5816k04120
$$ 538495 552112 480347 538387 529879 445203 554564 468880 308290 469626 453810 249690
2285B49690N5341J18103J1869j22992P355p3736J28057J62324L9684M7074L3376
$$ 249690 305031 423134 435003 312011 319366 245630 373687 536011 575695 622769 656145
2274F56145l9171j72272k61342J33534J22772r7932p8192k6394K55109m0631O7411
$$ 656145 616974 444702 183360 316894 439666 341734 263542 237148 492257 451626 519037
2263E19037j38741K9436Q0667J96052P577j10305o3277R006J19453j21407L07021
$$ 519037 380296 409732 490399 686451 694028 583723 520446 529452 648905 527498 834519
2252H34519j62371R8486j35685q0484J92007N7527j38526j3911m2494j86472J12757
$$ 834519 672148 770634 634949 554465 746472 803999 665473 651562 609068 422596 535353
2241E35353K68707R7007M2451K1238l2683J800J09527k41433j14958R7620J63072
$$ 535353 804060 901067 943518 964756 932073 933873 1043400 801967 687009 784629 947701
2230I47701j05272J48328K1682l9551J30719P77K7109K3611J6512N1464r1574
$$ 947701 842429 990757 1012439 972888 1103607 1104384 1131493 1155104 1171616 1223080 1131506
2219A131506P2892K1605N0530K58319K17065l5058j94392p3730l7125R8713J24192
$$ 1131506 1204398 1226003 1276533 1534852 1751917 1716859 1522467 1448737 1411612 1510325 1634517
2208A634517j6291k9298O5819J15850q2128j36354K19721P4823N8210J64663P1867
$$ 1634517 1618226 1588928 1654747 1770597 1688469 1552115 1771836 1846659 1904869 2069532 2141399
2197B141399M7458r3859J93016p911J4450j20219J19340j18292J5421J6720N8757
$$ 2141399 2188857 2094998 2288014 2280103 2294553 2174334 2293674 2175382 2190803 2207523 2266280
2186B266280J55441p2985p9569j96814K0200K87101R1983M0783J10171m7745L06196
$$ 2266280 2421721 2348736 2269167 2072353 2092553 2379654 2471637 2512420 2622591 2574846 2881042
2175B881042J18806J65494r9111l4884K3132K26344J8448K15199J04756J33089
$$ 2881042 2999848 3165342 3066231 3031347 3054479 3280823 3299271 3514470 3619226 3752315
2165C752315J68133M32046J01563J57127K56371K44159K74199j9312J57119K77849
$$ 3752315 3920448 4352494 4454057 4611184 4867555 5111714 5385913 5366601 5523720 5801569
2155E801569J46172j85399K53737K76077K65260N00772K50722M56600L23828N96802
$$ 5801569 5947741 5762342 6016079 6292156 6557416 7058188 7308910 7765510 8089338 8686140
2145H686140O72502O02080N78716Q86386J284060J007828M18937Q04594J140963
$$ 8686140 9358642 9960722 10539438 11425824 12709884 13717712 14136649 14941243 16082206
2136A6082206J450844J899684K929716L533682N111299O553528P495354Q058568
$$ 16082206 17533050 19432734 22362450 25896132 31007431 37560959 45056313 53114881
2128E3114881J2007061J6379445J9176952j214865j8185627j7191573j5826838
$$ 53114881 65121942 81501387 100678339 99463474 81277847 64086274 48259436
2121D8259436j0204411p181176m444522l582474k326085k288350j764818j427383
$$ 48259436 38055025 30873849 26429327 22846853 20520768 18232418 16467600 15040217
2113A5040217j051190j038002l92294q46631j231377j010910p98737p03403l81468
$$ 15040217 13989027 12951025 12558731 11712100 10480723 9469813 8671076 7967673 7586205
2104G586205n96106l58273m95995k37266l23336j73734k71433l74126k58735k89578
$$ 7586205 6990099 6631826 6135831 5898565 5575229 5401495 5130062 4755936 4497201 4207623
2094D207623l23006o245L7118n7725k59145j14822J9953l2370k48881j08295M8668
$$ 4207623 3884617 3878372 3915490 3857765 3598620 3483798 3503751 3471381 3222500 3114205 3162873
2083C162873l17818J28638j0000r3400l9622n4824q2694q1202k55960p6627l05248
$$ 3162873 2845055 2973693 2963693 2870293 2830671 2775847 2693153 2611951 2355991 2279364 1974116
2072A974116O7417K6728j45692N5429j49407n598p3824Q2928j46636J0023j70045
$$ 1974116 2041533 2068261 1922569 1977998 1828591 1822993 1749169 1832097 1685461 1695484 1525439
2061A525439j36951n1732J5131k8209O8682q9755J991M662J57614l309j03739
$$ 1525439 1388488 1336756 1351887 1323678 1392360 1302605 1304596 1309258 1466872 1463563 1359824
2050A359824m5657o9154n8663n4004J63957q1607j98291R7976L0097k63881J25923
$$ 1359824 1314167 1245013 1186350 1132346 1296303 1214696 1016405 1114381 1144478 880597 1006520
2039A006520Q0172j81632M1324j3435j99320M3071N9646m7339K0948r4189q991
$$ 1006520 1086692 905060 946384 932949 733629 776700 836346 789007 809955 715766 706775
2028G06775J84484n9781k0527j09132m6621J74811j29041j68541o8126K09509
$$ 706775 891259 831478 810951 701819 655198 830009 700968 532427 464301 673810
2018F73810j9913j77495P5648N2803P2686L6719K44092k03194m0303p9153j15837
$$ 673810 653897 476402 552050 604853 677539 714258 958350 755156 714853 635700 519863
2007E19863j00962j23984J60527L26520j57364k14759j73814K7579p3061K10245
$$ 519863 418901 294917 455444 781964 624600 409841 236027 263606 190545 400790
1997D00790J44637j83184j64681p1729K20175J08930j81957Q9654K1332n5654
$$ 400790 545427 362243 197562 125833 346008 454938 272981 362635 383967 328313
1987C28313k2406m1014L826J0150J90911j03767P9297L8295o9768O1884p3185
$$ 328313 305907 264893 268719 278869 469780 366013 445310 483605 413837 475721 402536
1976D02536k9668j19876J43621p5436o5745q3216P743P5611O5912O0305j23364
$$ 402536 372868 252992 396613 321177 255432 172216 179959 255570 321482 381787 258423
1965B58423R3914j8126j76921M6124J58224k9150l09933O8314J03715p9547K5450
$$ 258423 352337 334211 157290 203414 361638 332488 22555 90869 194584 115037 140487
1954A40487J05764O29N0592L8349p1116J13617N6521n1402k9967R945q3228J46433
$$ 140487 246251 246880 297472 335821 264705 378322 434843 383441 353474 363419 280191 426624
1942D26624j65009l3836j65891j54689K34900J22197q8079R634k5565J61217k27381
$$ 426624 261615 227779 61888 -92801 142099 264296 176217 185851 160286 321503 94122
1931I4122q7474K65759r2713M4017M174j42038J24545r5552J03209N4116j20564
$$ 94122 6648 272407 179694 223711 227885 85847 210392 114840 218049 272165 151601
1920A51601j5155j2854o8640J83852q7747q8495M5560j76021P6476L4476J48953
$$ 151601 136446 123592 54952 238804 151057 62562 108122 -67899 8577 43053 192006
1909A92006p68j16958k0652m7850L2767j03333J18903Q2956q5476Q1569j40557
$$ 192006 191238 74280 53628 5778 38545 -64788 54115 137071 51595 133164 -7393
1898g393p9900L1057Q4273q8013J09892J04728j57391k26478N7397Q2775J28356
$$ -7393 -87293 -56236 28037 -59976 49916 154644 -2747 -229225 -171828 -89053 39303
1887C9303M1549o7239P502J36139J26378j22976N0476j02524L1074k7080o463
$$ 39303 80852 13613 21115 157254 283632 160656 211132 108608 139682 112602 106139
1876A06139J95040l2569j02421j38586K24820j49914j31993J21210q6789J86164
$$ 106139 301179 268610 166189 27603 252423 102509 -29484 91726 4937 191101
1866A91101O2340q5053R8570K13796n0315r8764k0927J12340M5309K1774j22160
$$ 191101 253441 168388 266958 480754 430439 331675 310748 423088 468397 490171 368011
1855C68011M0963j6291m337k72925j80832J00121Q6945m3690M392J9069k62668
$$ 368011 408974 392683 388346 115421 -65411 34710 121655 77965 82357 101426 -161242
1844a61242K34347o8109j21259J6503J26898L1096l8475N6808O7937k25235j1268
$$ -161242 73105 4996 -116263 -99760 27138 58234 19759 76567 144504 -80731 -91999
1833i1999K50555O8054j62660j02846k6071l6958J47507J4898k13000J81662l0715
$$ -91999 158556 226610 63950 -38896 -64967 -101925 45582 60480 -152520 29142 -1573
1822a573k48188m7914p9640J20409K69455r9899j91786O8867J57890J160P2533
$$ -1573 -249761 -297675 -377315 -256906 12549 -87350 -279136 -210269 -52379 -51219 21314
1811B1314q487l37963J97904P8179r8816J72074L4646p2293M1255o3997j59974
$$ 21314 12827 -325136 -127232 -49053 -147869 24205 58851 -13442 27813 -36184 -196158
1800a96158j42135K62875Q0315L8923J92410q3223m2886q7206r0957L8489k7284
$$ -196158 -338293 -75418 4897 43820 236230 153007 110121 22915 -68042 -29553 -56837
1789e6837j2773J45528j84340j73620K0736l7308K33886J48692N2799l2156p8734
$$ -56837 -69610 75918 -108422 -282042 -261306 -298614 -64728 83964 136763 104607 25873
1778B5873R659P7120K177N2734j40574j8945l2029J53759Q4805k68656m9603K76432
$$ 25873 35532 112652 114829 167563 26989 8044 -23985 129774 214579 -54077 -103680 172752
1766A72752o236o6292l5307k4033j34643j1074n1688M8632q6676m5953J53878
$$ 172752 166516 100224 64917 40884 -93759 -104833 -156521 -107889 -194565 -240518 -86640
1755h6640j80162K42392j95909R5451j48767J06817L4221l597J63248k9105R5769
$$ -86640 -266802 -24410 -220319 -124868 -273635 -166818 -132597 -136194 27054 -2051 93718
1744I3718j68746j23932K19883m9662l9359J0892o6738K45083j76314r3927R2881
$$ 93718 -75028 -198960 20923 -28739 -68098 -57206 -123944 121139 -55175 -149102 -56221
1733e6221J9390j37223k1815J41529j35500N9144j76173m0303K29476J42838j80288
$$ -56221 -36831 -174054 -195869 -54340 -189840 -130696 -306869 -347172 -117696 25142 -155146
1722a55146k11087J81680K1315J45240J80325q6988k13307J19392m8159o4591
$$ -155146 -366233 -184553 -163238 -17998 162327 75339 -137968 -18576 -66735 -131326
1712a31326R0319p4557n2264K04249m6322j68977Q5559o2598m8830J19625j10368
$$ -131326 -41007 -115564 -167828 36421 -9901 -178878 -93319 -155917 -204747 -85122 -195490
1701a95490j30727o130J04432K17025J29994j95436j42641J31739m4250Q7908
$$ -195490 -326217 -332347 -227915 -10890 119104 -76332 -218973 -87234 -131484 -43576
1691d3576J40120L2412j42426L8672j39526l2013K2027N9832J84554q0437p89
$$ -43576 96544 128956 -13470 25202 -114324 -146337 -124310 -64478 120076 39639 38850
1680C8850j9426J2650N972j58675q8340J0213L2700K7640R6834L8188L6659J39097
$$ 38850 19424 32074 38046 -120629 -208969 -198756 -166056 -138416 -41582 -3394 33265 172362
1668A72362k15654r3118l7N5194j05554J6382L3128J54853j37794j02322m893
$$ 172362 -43292 -136410 -136447 -81253 -186807 -170425 -137297 17556 -120238 -222560 -227453
1657b27453M0194K3194J01148K52694M7178j88981k59405r710J25084L0749N6599
$$ -227453 -187259 -164065 -62917 189777 236955 47974 -211431 -221141 -96057 -65308 -8709
1646h709J43756l6506j07278k5050l8868j33104r910k7687K6567N3184l299J83346
$$ -8709 135047 98541 -8737 -33787 -72655 -205759 -215669 -243356 -216789 -163605 -166904 16442
1634A6442K0725k31055J1796J75627J32929j77207q0810n2707L8451l3509n9880
$$ 16442 37167 -193888 -182092 -6465 126464 -50743 -131553 -184260 -145809 -179318 -239198
1623b39198R1569K3810O8930R9289q1031l6661R1056n6711k07056R2937Q8243
$$ -239198 -147629 -123819 -54889 44400 -36631 -73292 17764 -38947 -246003 -153066 -64823
1612f4823K28384j9967k08408k3539m057j67083J24505Q86J21468P3324K035o0568
$$ -64823 163561 143594 -64814 -88353 -92410 -259493 -134988 -134102 -12634 60690 62725 2157
1600B157j10866q6697l5319K37501O1629k7529j19360O8409J7465k00261N4106
$$ 2157 -108709 -195406 -230725 6776 68405 40876 -78484 -10075 7390 -192871 -138765
1589a38765K67940j01751p8402K2885O6743J83195j45323K6421n4725j91626j9222
$$ -138765 129175 27424 -50978 -28093 38650 221845 76522 102943 48218 -143408 -162630
1578a62630N8625O567q082K5760P7109K4278j77715P8156k2051j32551J32002
$$ -162630 -104005 -97438 -105520 -79760 -2651 21627 -156088 -77932 -99983 -232534 -100532
1567a00532Q3815J18321n2531J83177j22372j89455l6280j54781O6083j3169J18989
$$ -100532 -16717 101604 49073 232250 109878 -79577 -115857 -270638 -204555 -217724 -98735
1556i8735r6243K71045Q7612k22709J7849L6942R0194J34935j35168j92815l9904
$$ -98735 -194978 76067 163679 -59030 -41181 -4239 85955 220890 85722 -107093 -146997
1545a46997M4737K12359k2709q6566J01278k89249p7439J64788J78591n7729j93322
$$ -146997 -102260 110099 87390 824 102102 -187147 -264586 -99798 78793 21064 -172258
1534a72258j23362K76093J32248j31042p0674J12253P2633r9742l36877j4276
$$ -172258 -295620 -19527 112721 -18321 -88995 23258 95891 -3851 -340728 -355004
1524c55004K51638J50128p937J3182o607q5328J08993j4439l6986J91391j84757
$$ -355004 -103366 46762 38825 52007 45400 -39928 69065 54626 17640 209031 24274
1513B4274n7243P7227k19568j07389K11631J6004J02606N4282J03860o0609j26753
$$ 24274 -32969 44258 -175310 -282699 -71068 -55064 47542 101824 205684 145075 18322
1502A8322N9800j74191k7808p1913M3391K56736L9805L9021r0741q3259l3873
$$ 18322 78122 -96069 -123877 -195790 -152399 104337 144142 183163 92422 9163 -24710
1491b4710N4199J3381j85430m9301p7386R8556P4148J73721o1252q5257L4521
$$ -24710 29489 42870 -142560 -191861 -269247 -170691 -96543 77178 15926 -69331 -34810
1480c4810J05087n7728J4281j30746J305J222K28036l6308k50497J35752R0545
$$ -34810 70277 12549 26830 -103916 -102611 -101389 126647 90339 -160158 -24406 66139
1469F6139J1315o5618l3614m6079R8628k0045r8197J7082P0534P9262k13264M0812
$$ 66139 77454 11836 -21778 -67857 30771 10726 -87471 -70389 145 79407 -133857 -93045
1457i3045k9696K4231Q8698N1158j02700j09235K62716j17895k9370q299K51197
$$ -93045 -122741 -98510 -9812 41346 -61354 -170589 92127 -25768 -55138 -63437 187760
1446A87760Q6427k21646j23302J03983N7109n2211j9010j97301p1414J03529Q2768
$$ 187760 274187 52541 -70761 33222 90331 38120 19110 -178191 -249605 -146076 -63308
1435f3308p0420M6173K9722k0956n9700J20601N2855L6456r6914p6104N7446j6059
$$ -63308 -133728 -87555 -57833 -78789 -138489 -17888 34967 71423 -25491 -101595 -44149 -60208
1423f0208k95018Q9048L3770m3423J66297n6726Q3796K0009k3896j6604K02263
$$ -60208 -355226 -266178 -232408 -275831 -109534 -166260 -82464 -62455 -86351 -102955 99308
1412I9308m7338q9860J06465j11329J39040o0861P973J12456O3403k69018l6504
$$ 99308 51970 -37890 68575 -42754 96286 35425 43398 155854 219257 -49761 -86265
1401h6265R3392p1375l1917N1727L3305J28766O9871j55873j47930J93712J30444
$$ -86265 7127 -64248 -96165 -44438 -11133 117633 187504 31631 -116299 77413 207857
1390B07857j4294l24257k5780P4490q169M5800j13834P0952J13849P3275j02103
$$ 207857 193563 -130694 -156474 -81984 -90153 -44353 -158187 -87235 26614 99889 -2214
1379b214K71l6348j8551n5925Q5115Q9320j03464j01695R4772j6310k287N3989
$$ -2214 -1943 -38291 -56842 -112767 -27652 61668 -41796 -143491 -48719 -65029 -67316 -13327
1367a3327k35716K2930K57939J0580Q4117J6313j41946M2694m7665P9213K3026
$$ -13327 -249043 -226113 31826 42406 126523 142836 890 43584 -4081 75132 98158
1356I8158K049o8310r4517N0003P0463Q6829k26228k7372p322l6283l7431K45285
$$ 98158 100207 31897 -62620 -12617 57846 144675 -81553 -108925 -116247 -152530 -189961 55324
$$ [...]
##END NTUPLES=NMR SPECTRUM
##END=
