##TITLE=1H_TG-2352-x
 DMSO
 8 sc, 
 16.03.2022
##JCAMPDX= 6.0         $$ Bruker NMR JCAMP-DX V2.0
##DATA TYPE= NMR SPECTRUM
##DATA CLASS= NTUPLES
##ORIGIN= UXNMR, Bruker Analytische Messtechnik GmbH
##OWNER= root
$$ XWIN-NMR		Version 3.5
$$ Wed Mar 16 10:53:42 2022 Russian Standard Time (UT+4h)  she@DPX200
##.OBSERVE FREQUENCY= 200.131346
##.OBSERVE NUCLEUS= ^1H
##.ACQUISITION MODE= SIMULTANEOUS
##.ACQUISITION SCHEME= undefined
##.AVERAGES= 8
##.DIGITISER RES= 18
##SPECTROMETER/DATA SYSTEM= spect
##.PULSE SEQUENCE= zg30
##.SOLVENT NAME= DMSO
##.SHIFT REFERENCE= (INTERNAL, DMSO, 0, 15.8312)
##AUDIT TRAIL= $$ (NUMBER, WHEN, WHO, WHERE, WHAT)
$$ ##TITLE= Audit trail, XWIN-NMR		Version 3.5
$$ ##JCAMPDX= 5.01
$$ ##ORIGIN= Bruker BioSpin GmbH
$$ ##OWNER= she
$$ F:/spectra/data/she/nmr/H-F/1/pdata/1/auditp.txt
$$ ##AUDIT TRAIL=  $$ (NUMBER, WHEN, WHO, WHERE, WHAT)
(   1,<2022-03-16 10:52:38.04 +0400>,<she>,<DPX200>,
      <created by zg, POWCHK disabled, PULCHK disabled
       configuration hash MD5:
       00 E9 B6 7A A2 85 ED C7 34 08 36 98 17 FE 4E 26
       data hash MD5: 16K
       4D 68 AB 0C 3E 2A 94 BC 3D 5B 12 4E 75 7F 19 7F>)
(   2,<2022-03-16 10:52:40.48 +0400>,<she>,<DPX200>,
      <Start of raw data processing
       efp BC_mod = 2 LB = 0.24 FT_mod = 6 PKNL = 1 PHC0 = -17030.9 PHC1 = 13.80078 SI = 16K 
       data hash MD5: 16K
       54 FB 71 C8 64 E4 98 C1 3D 7C DA 52 08 1D A2 3E>)
(   3,<2022-03-16 10:52:58.01 +0400>,<she>,<DPX200>,
      <pk PHC0 = 79.3233 PHC1 = -2.4 
       data hash MD5: 16K
       EB 20 C7 30 7C F0 A0 89 9D F3 D9 7C 0C 18 25 9D>)
(   4,<2022-03-16 10:53:01.18 +0400>,<she>,<DPX200>,
      <abs ABSG = 5 
       data hash MD5: 16K
       4D 7B 7F 88 2A EB 52 F5 F2 D8 13 09 37 2B 65 DA>)
$$ ##END=
$$ 
$$ hash MD5
$$ 9A 70 49 37 0E AE DE DF 87 D3 17 D9 1B 6B A7 3F
##$RELAX= 
##$RELAX= 
##$RELAX= 
##$RELAX= 
##$RELAX= 
##$RELAX= 
$$ Bruker specific parameters
$$ --------------------------
##$DU= <F:/spectra>
##$EXPNO= 1
##$NAME= <H-F>
##$PROCNO= 1
##$TYPE= <nmr>
##$USER= <she>
##$AMP= (0..31)
100 100 100 100 100 100 100 100 100 100 100 100 100 100 100 100 100 100 
100 100 100 100 100 100 100 100 100 100 100 100 100 100 
##$AQSEQ= 0
##$AQ_mod= 1
##$AUNM= <au_zg>
##$AUTOPOS= <>
##$BF1= 200.13
##$BF2= 200.13
##$BF3= 200.13
##$BF4= 200.13
##$BF5= 200.13
##$BF6= 200.13
##$BF7= 200.13
##$BF8= 200.13
##$BYTORDA= 1
##$CFDGTYP= 0
##$CFRGTYP= 5
##$CHEMSTR= <none>
##$CNST= (0..31)
1 1 145 1 1 1 1 1 1 1 1 1 1 1 1 1 1 1 1 1 1 1 1 1 1 1 1 1 1 1 1 1 
##$CPDPRG= <>
##$CPDPRG1= <>
##$CPDPRG2= <>
##$CPDPRG3= <>
##$CPDPRG4= <mlev>
##$CPDPRG5= <mlev>
##$CPDPRG6= <mlev>
##$CPDPRG7= <mlev>
##$CPDPRG8= <mlev>
##$CPDPRGB= <>
##$CPDPRGT= <>
##$D= (0..31)
0 1.2 0 0 0 0 0 0 0 0.06 0 0.03 0 0 0 0 0.0002 0 0 0 0 0 0 0 0 0 0 0 0 
0 0 0 
##$DATE= 1647413557
##$DBL= (0..7)
120 120 120 120 120 120 120 120 
##$DBP= (0..7)
150 150 150 150 150 150 150 150 
##$DBP07= 0
##$DBPNAM0= <>
##$DBPNAM1= <>
##$DBPNAM2= <>
##$DBPNAM3= <>
##$DBPNAM4= <>
##$DBPNAM5= <>
$$ [...]
##$SUBNAM2= <"">
##$SUBNAM3= <"">
##$SUBNAM4= <"">
##$SUBNAM5= <"">
##$SUBNAM6= <"">
##$SUBNAM7= <"">
##$SUBNAM8= <"">
##$SUBNAM9= <"">
##$SW= 18.0517287032376
##$SWIBOX= (0..15)
0 0 2 0 0 0 0 0 0 0 0 0 0 0 0 0 
##$SW_h= 3612.71676300578
##$TD= 16384
##$TD0= 1
##$TE= 0
##$TE2= 300
##$TE3= 300
##$TEG= 300
##$TL= (0..7)
0 120 120 120 120 120 120 120 
##$TP= (0..7)
150 150 150 150 150 150 150 150 
##$TP07= 0
##$TPNAME0= <>
##$TPNAME1= <>
##$TPNAME2= <>
##$TPNAME3= <>
##$TPNAME4= <>
##$TPNAME5= <>
##$TPNAME6= <>
##$TPNAME7= <>
##$TPOAL= (0..7)
0.5 0.5 0.5 0.5 0.5 0.5 0.5 0.5 
##$TPOFFS= (0..7)
0 0 0 0 0 0 0 0 
##$TUNHIN= 0
##$TUNHOUT= 0
##$TUNXOUT= 0
##$USERA1= <user>
##$USERA2= <user>
##$USERA3= <user>
##$USERA4= <user>
##$USERA5= <user>
##$V9= 5
##$VALIST= <valist>
##$VCLIST= <CCCCCCCCCCCCCCC>
##$VD= 0
##$VDLIST= <DDDDDDDDDDDDDDD>
##$VPLIST= <PPPPPPPPPPPPPPP>
##$VTLIST= <TTTTTTTTTTTTTTT>
##$WBST= 1024
##$WBSW= 4
##$XGAIN= (0..3)
0 0 0 0 
##$XL= 0
##$YL= 0
##$YMAX_a= 96459
##$YMIN_a= -166940
##$ZGOPTNS= <>
##$ZL1= 120
##$ZL2= 120
##$ZL3= 120
##$ZL4= 120
##$ABSF1= 15.8312
##$ABSF2= -2.220652
##$ABSG= 5
##$ABSL= 3
##$ALPHA= 0
##$AQORDER= 0
##$ASSFAC= 0
##$ASSFACI= 0
##$ASSFACX= 0
##$ASSWID= 0
##$AUNMP= <proc_1d>
##$AZFE= 0.1
##$AZFW= 0.1
##$BCFW= 0
##$BC_mod= 2
##$BYTORDP= 0
##$COROFFS= 0
##$CY= -3
##$DATMOD= 1
##$DC= 0
##$DFILT= <>
##$DTYPP= 0
##$F1P= 0
##$F2P= 0
##$FCOR= 1
##$FTSIZE= 16384
##$FT_mod= 6
##$GAMMA= 0
##$GB= 0
##$INTBC= 1
##$INTSCL= 0
##$ISEN= 128
##$LB= 0.24
##$LEV0= 0
##$LPBIN= 0
##$MAXI= 10000
##$MC2= 0
##$MEAN= 0
##$ME_mod= 0
##$MI= 1.114404
##$NCOEF= 0
##$NC_proc= -8
##$NLEV= 6
##$NOISF1= 3.799351
##$NOISF2= 2.8
##$NSP= 0
##$NTH_PI= 0
##$NZP= 0
##$OFFSET= 15.8312
##$PC= 1
##$PHC0= -16951.58
##$PHC1= 11.40078
##$PH_mod= 1
##$PKNL= yes
##$PPARMOD= 0
##$PSCAL= 0
##$PSIGN= 0
##$REVERSE= no
##$SF= 200.129984061432
##$SI= 16384
##$SIGF1= 3
##$SIGF2= 2
##$SINO= 5.538805
##$SIOLD= 16384
##$SREGLST= <1H.CDCl3>
##$SSB= 0
##$STSI= 16384
##$STSR= 0
##$SW_p= 3612.71676300578
##$SYMM= 0
##$S_DEV= 0
##$TDeff= 16384
##$TDoff= 0
##$TI= <>
##$TILT= no
##$TM1= 0
##$TM2= 0
##$TOPLEV= 0
##$USERP1= <user>
##$USERP2= <user>
##$USERP3= <user>
##$USERP4= <user>
##$USERP5= <user>
##$WDW= 1
##$XDIM= 16384
##$YMAX_p= 397381241
##$YMIN_p= -4012962
$$ End of Bruker specific parameters
$$ ---------------------------------
##NTUPLES= NMR SPECTRUM
##VAR_NAME=  FREQUENCY,     SPECTRUM/REAL,   SPECTRUM/IMAG
##SYMBOL=    X,             R,               I
##VAR_TYPE=  INDEPENDENT,   DEPENDENT,       DEPENDENT
##VAR_FORM=  AFFN,          ASDF,            ASDF
##VAR_DIM=   16384,         16384,           16384
##UNITS=     HZ,            ARBITRARY UNITS, ARBITRARY UNITS
##FACTOR=    0.220516191357247, 1,           1
##FIRST=     3168.29773282655, 0,            0
##LAST=      -444.419030179234, 0,           0
##MIN=       -444.419030179234, -4012962,    0
##MAX=       3168.29773282655, 397381241,    0
$$ Real data points
##PAGE= N=1
##DATA TABLE= (X++(R..R)), XYDATA
$$ [...]
8482B26266J3568P1918J19076l5012K44834j3508k07639r4669K77025l58977j77129
8471F5753K49708O0073j95685j64616J82463J96041m6176l08426L4710k36867
8461a63022R6301K6378l3460O8729J10794M29996l00714l31927J84005j58272
8451g1192j11688J11064l29890M7324J49879M40605J75563j05079m45005j29024
8441b67443N7523K49427l2361r5196k99843L41006j61532M4405Q5269J8135K51647
8430A91037l94574j43275J27013q6108J46176L35417l50582j28123L854j99905
8420d99070j11580o9657L4321K0269j36623N04544K05615J38208L6906o3936j21941
8409f2944k05846L7489K17957j51837O9695M0741K25778m24998M16375k08705
$$ plain form
8482 226266 239834 311752 430828 395816 640650 627142 419503 324834 601859 242882 65753
8471 65753 315461 375534 179849 15233 197696 393737 347561 39135 73845 -163022
8461 -163022 -66721 -40343 -73803 -5074 105720 535716 235002 -96925 87080 -71192
8451 -71192 -182880 -71816 -401706 -354382 -204503 236102 411665 306586 -138419 -267443
8441 -267443 -209920 39507 7146 -88050 -387893 -46887 -208419 -164014 -78745 -60610 191037
8430 191037 -203537 -346812 -219799 -305907 -159731 175686 -174896 -303019 -299165 -499070
8420 -499070 -610650 -680307 -645986 -625717 -762340 -257796 -52181 86027 122933 58997 -62944
8409 -62944 -268790 -231301 -13344 -165181 -95486 -54745 171033 -253965 162410 -46295
8399d6295k93277p98n6141J46954p2123L07271l2422L6584J69601J64704k06582
8388A17476k69824J72284L90661j3342j53953k89269p4510j95156J02860j69516
8378c82289J07913L73082m68598K40133K11478r3254o283N3554o1277O7782k12901
8367a70660j5852k83783l7497J84676K03960K35466m07294L94055O801k59560
8357a49688L49119M64656q9901l77437r4239j31581J7703P9392n5781J55252R5841
8346B63336p3718M5987j95848j45073r3141J67132j38924l2656o809j99334K75175
8335a33873k60266M62320K56958n16438J50639K56789K38179l72805l33635k6125
8325b78257R3137n1643K08587k39369L05272m60471K80949J25758k26611K57211
$$ plain form
8399 -46295 -339572 -340370 -396511 -249557 -321680 -14409 -46831 -10247 159354 324058 117476
8388 117476 -152348 19936 410597 397255 243302 -45967 -120477 -315633 -212773 -382289
8378 -382289 -274376 98706 -369892 -129759 81719 -11535 -17818 35736 -25541 42241 -170660
8367 -170660 -186512 -470295 -507792 -323116 -119156 116310 -290984 103071 109872 -149688
8357 -149688 199431 664087 574186 196749 102510 -29071 -11368 68024 12243 167495 263336
8346 263336 189618 235605 39757 -105316 -198457 -31325 -170249 -202905 -209714 -409048 -133873
8335 -133873 -394139 68181 325139 -191299 -40660 216129 454308 81503 -252132 -278257
8325 -278257 -185120 -236763 -28176 -267545 37727 -422744 -141795 -16037 -242648 14563
8315A4563k99975J02227j5742K80153J13991m33920j80475O2388K78485k52959
8305c31264J03468k50699k90649O37743K45011M80432j55016l0260m51050j75764
8295b18048n07672j00194L32434J89281J49544l04356J09591Q557J392L06165
8285c3306j30653k11997Q9532M37948k32140P9364k30026j77112J42697O3037
8275b02656m4407k52377J16547j46992K00021K87484j47468J95623J3808j0057
8265I526k79115l1238J06967K4757j21187p8062j08846o7580M98222L64088l25482
8254g950o8012L98474j46960r9814l20977r3706l98637K17264Q44282l38724r6311
8243a11071M63794j87737j77694l15993K2911j43588R4230J93125k82598J56666
$$ plain form
8315 14563 -285412 -183185 -198927 81226 195217 -238703 -419178 -356790 -78305 -331264
8305 -331264 -227796 -478495 -769144 -131401 113610 594042 439026 408766 -42284 -218048
8295 -218048 -725720 -825914 -493480 -304199 -154655 -459011 -349420 -340863 -339471 -33306
8285 -33306 -163959 -375956 -286424 151524 -80616 -1252 -231278 -408390 -265693 -202656
8275 -202656 -247063 -499440 -382893 -529885 -329864 -42380 -189848 5775 19583 9526
8265 9526 -269589 -300827 -193860 -169103 -290290 -368352 -477198 -544778 -46556 317532 -7950
8254 -7950 -75962 322512 175552 75738 -245239 -338945 -737582 -520318 323964 -14760 -111071
8243 -111071 352723 164986 -12708 -328701 -305790 -449378 -355148 -162023 -444621 -287955
8233b87955k16434L69706N8484k24866M3177K02900j00900q9235j3133J02125
8223a56131J41593M9654o3391J7244m24831j59878J5455n575M0036k37081L88003
8212c94902O06129l38431M31305j50359j27905K87621o44686J01815K22774k28371
8202b35010K48571k22452J27872K32181q7415j32708j43150j86652K34911p46769
8192i10621l102341J633252J247120L08635N50564l96099k3401K61518N0299N4461
8182c26613K32876J16968j87230j25014R6985m85r0001k52344j727M06896K82796
8171A53107k62479l19566K95895M1870j75765N94866m7218l9857n22852J41517
8161a40482K83494p23178O35729M54819o16855k409j51779j22500K56834K76676
$$ plain form
8233 -287955 -504389 -134683 -76199 -301065 -257888 -54988 -155888 -245123 -258256 -156131
8223 -156131 -14538 35116 -28275 -11031 -435862 -595740 -580285 -585860 -545824 -782905 -394902
8212 -394902 211227 -127204 304101 153742 25837 313458 -331228 -229413 -6639 -235010
8202 -235010 13561 -208891 -81019 151162 63747 -68961 -212111 -398763 -163852 -910621
8192 -910621 -4012962 -2379710 -1132590 -823955 -273391 -669490 -692891 -431373 -381074 -326613
8182 -326613 -93737 23231 -163999 -289013 -192028 -192513 -282514 -534858 -536585 -129689 153107
8171 153107 -109372 -428938 -133043 -91173 -266938 327928 280710 240853 -281999 -140482
8161 -140482 143012 -580166 55563 510382 -106473 -108882 -260661 -383161 -126327 150349
8151A50349n02798J00860j169j31763J94878m65272K10702J11085J86045m983
8141a52066P1629k93599M37747N9398n59010K28691l03011J04159K51752j07847
8131b62157j01292J42280k8614K94849l15076k9553k39323J17790L80182J46032
8121A05118l83590j50100J21209N1520M87901l79439j2122P8468q0270R3512K88568
8110B20775k55526j21920k99674J42950o878k81064m7981Q9859K53604N3550j45159
8099c97464j31087k12854K44089L65817M6884m25197k67724O2977N34173l15935
8089d96321P0087N06413J11473l15146l20338J26779j79071J17348M17581n9110
8079b0305m68504n02058K04451L58785o6653J56920J46228k26786n9195L15700
$$ plain form
8151 150349 -352449 -251589 -252758 -384521 -189643 -654915 -444213 -333128 -147083 -152066
8141 -152066 -80437 -374036 63711 123109 -435901 -207210 -510221 -406062 -154310 -262157
8131 -262157 -363449 -221169 -249783 45066 -270010 -299563 -538886 -421096 -40914 105118
8121 105118 -278472 -428572 -307363 -255843 232058 -147381 -159503 -81035 -161305 -67793 220775
8110 220775 -34751 -156671 -456345 -313395 -320273 -601337 -649318 -559459 -305855 -252305 -397464
8099 -397464 -528551 -741405 -497316 -131499 -84615 -509812 -777536 -714559 -180386 -496321
8089 -496321 -426234 80179 191652 -123494 -443832 -317053 -496124 -378776 38805 -20305
8079 -20305 -488809 -990867 -786416 -427631 -494284 -337364 -191136 -417922 -477117 -161417
8069a61417O01078l1342l56423p5226M6046k0815l34711J09141k31288K50624
8059b04333L9756K88l50855r3858J17713m6430M49782N0450m46873L1026J21709
8048c31625l2717K49940J18728j92325k33603L972K54809m47233q432o5909K79153
8037d05242J10441l94351J42693O9104j80208K95818p7599j76381k1587J08178
8027e29134R4115L47642L52785K89769n28334m0462k4244j50868M0999k04778
8017c52510k05399N03607K4967q3991J09109k87040l5275K06406J32370n11509
8007d99265k95093P12758J88616l50240l7497N62089j44411l11901L44658n1538
7997A18176M6072m6908o4461L9670L6190k58667L8945P025R9205Q0342o3041k60519
$$ plain form
8069 -161417 439661 408319 51896 -23330 22716 1901 -332810 -223669 -454957 -204333
8059 -204333 -164577 -164289 -515144 -609002 -491289 -537719 -87937 -37487 -484360 -453334 -331625
8048 -331625 -364342 -114402 4326 -187999 -421602 -417630 -162821 -610054 -618486 -684395 -405242
8037 -405242 -294801 -689152 -546459 -477355 -657563 -361745 -439344 -615725 -637312 -529134
8027 -529134 -435019 -87377 265408 555177 26843 -13619 -37863 -188731 -147732 -352510
8017 -352510 -557909 -54302 -29335 -113326 -4217 -291257 -326532 -120126 12244 -499265
8007 -499265 -794358 -81600 107016 -243224 -280721 281368 136957 -174944 169714 118176
7997 118176 164248 117340 52879 92549 128739 -129928 -90983 -83958 15247 95589 32548 -227971
7985b27971j09454q9530M20345j1955j44454R9563J84222l38009j67745K54266
7975a30722n1163m1993L39163l26070j92215N3748L02489J17947k12798J04816
7965c6798p4866k61106r8532o8326J49367L07045j2822r3476Q5066L96006k0551
7954B71007j45970Q6712r7366k52918K08836j56391l42014K4117O3347j15578
7944d56218o46884N79156M87691N7466m3035k99151j26623L14488k00779J30135
7934b03754k00781j08147O11372j61183o01667M14491M24419Q3823m6681k80711
7924f8819k0798K96234k26639m8955k69593r8395J7900k4830M30161j67625l2350
7913b13709K2882j32013m963Q1870j47633j6848K85939j29740j49839L53852K53736
$$ plain form
7985 -227971 -337425 -426955 -6610 -18565 -163019 -63456 120766 -217243 -384988 -130722
7975 -130722 -181885 -223878 115285 -210785 -403000 -349252 -46763 71184 -141614 -36798
7965 -36798 -111664 -372770 -471302 -539628 -390261 -83216 -96038 -189514 -104448 291558 271007
7954 271007 125037 211749 114383 -138535 70301 -86090 -428104 -403987 -340640 -456218
7944 -456218 -1103102 -523946 -36255 21211 -21824 -320975 -447598 -133110 -333889 -203754
7934 -203754 -404535 -512682 98690 -62493 -664160 -249669 174750 258573 211892 -68819
7924 -68819 -89617 206617 -20022 -68977 -338570 -436965 -419065 -443895 -13734 -181359 -213709
7913 -213709 -190827 -322840 -327803 -245933 -393566 -410414 -124475 -254215 -404054 -50202 203534
7902B03534m71390p2620N01423J60393m49043j15006R5562j87482j1486N4267
7892b91848q2532m33973J72930L32143L17308L3788N5118j91089k9268j5664j26551
7881b59638j10022J80151K88346J6069k99551K74072j02546K27292l59803l35613
7871d81243k64516K16177J68021k73712Q9840Q1784K4561l5412P0862j30471K17750
7860c16359J19381J75820j21802j11234K6936R1783Q5869k06518O578K08371J20460
7849G9285p6295l53960J2620L13165l39114O4984J93652j2053K52948k66763k48246
7838c79777L29133j690L2743o36411j19721O4040J16689N8788n5682J29694O6340
7827c95854L82174k89854K9422J95884j81196J18365j78716j89379J61149j3371
$$ plain form
7902 203534 -267856 -340476 160947 321340 -127703 -242709 -147147 -334629 -346115 -291848
7892 -291848 -374380 -808353 -635423 -303280 14028 47816 102934 -88155 -117423 -133087 -259638
7881 -259638 -369660 -189509 98837 114906 -184645 89427 -13119 214173 -145630 -481243
7871 -481243 -745759 -529582 -361561 -635273 -545433 -463649 -439088 -474500 -403638 -534109 -316359
7860 -316359 -196978 -21158 -142960 -254194 -227258 -135475 -49606 -256124 -249546 -41175 79285
7849 79285 2990 -350970 -338350 -25185 -364299 -299315 -105663 -117716 135232 -131531 -379777
7838 -379777 -50644 -52334 -19591 -656002 -775723 -711683 -594994 -536206 -591888 -462194 -395854
7827 -395854 -13680 -303534 -274112 -78228 -259424 -141059 -319775 -509154 -348005 -361376
7817c61376K17981k41641n357K55740M7431m80505n343j23292R7687q93196K8520
7806a463351J410882Q0808l15856m1335J30488J62817j5385P1461m04538k32553
7796f16562J38376k523J94390K14111M11356k82193P5049j47264k75435J5685
7786b75010L72843j41668M9952j61570K39443J4313m18188M20561j38101k79470
7776c16895M05680L16195j26550l84901k70298M15448J03503o19089M5334M1681
7766c89892K06827k76767J0538M22400R0977l33818m20272J91127K82943L34817
7756A18880J08149j81790j18549K37266j84211j02071L89873k44203n92421J3676
7746e55401J51692J8822j46913L44940J46157N0778n4542J67380j47523J1772
$$ plain form
7817 -361376 -143395 -385036 -390393 -134653 -87222 -567727 -573070 -696362 -598675 -1491871 -1463351
7806 -1463351 -52469 28339 -287517 -328852 -198364 -35547 -50932 20529 -384009 -616562
7796 -616562 -478186 -480709 -286319 -72208 339148 56955 132004 -15260 -290695 -275010
7786 -275010 97833 -43835 6117 -155453 83990 98303 -319885 100676 -37425 -316895
7776 -316895 88785 404980 278430 -106471 -376769 38679 142182 -476907 -431573 -389892
7766 -389892 -183065 -459832 -449294 -26894 64083 -269735 -690007 -498880 -215937 118880
7756 118880 227029 45239 -73310 163956 -20255 -122326 267547 23344 -569077 -555401
7746 -555401 -403709 -384887 -531800 -186860 -40703 10075 -44467 122913 -24610 -12838
7736a2838k9991K57904l93112R262q4201M9761J54765j35m57361J54960M45806
7725I4820K7368m7111j13038J49538j69380L16835K3749l31076r3602K45355L2455
7714A35913k69439P3781j54849k24265k48961N0641M07453J759k9948j95667K54079
7703a99503K78511P2521l42582Q3709M29525o3507k70831k21139M93639k23067
7693C7276J44322k76326l84239N42985Q0637L04145J85825m80429J92094J02716
7683D49006l21959m84020j79830O64860K04231l19263l76066K33817K60141j64678
7673c3761l85444M60266Q7951q3651J38028J54141r3634q3615M3840j15232l15557
7662b26668k61789M70429K96527m3200p3914j8471k46227m28789L93339N34786
$$ plain form
7736 -12838 -42829 215075 -178037 -168775 -252976 -203215 -48450 -48585 -505946 -350986 94820
7725 94820 122188 75077 -37961 111577 -57803 259032 282781 -48295 -141897 103458 135913
7714 135913 -133526 -59745 -214594 -438859 -687820 -637179 -229726 -227967 -257915 -453582 -199503
7703 -199503 79008 151529 -191053 -107344 322181 258674 -12157 -233296 260343 37276
7693 37276 181598 -94728 -478967 64018 144655 448800 634625 154196 346290 449006
7683 449006 127047 -356973 -536803 128057 332288 13025 -363041 -129224 130917 -33761
7673 -33761 -419205 41061 129012 45361 183389 337530 243896 160281 204121 88889 -226668
7662 -226668 -488457 -18028 278499 235299 161385 142914 -103313 -532102 -138763 396023
7652C96023j55731l68521J8773r7550o1214n4309k59417j79936O78845n2799K2147
7641a13689q8928j12332R4948J07836j19254L7273J20283j34980p3122J03616
7631a78349K99576J10603K4260N4274m44388M4787J62323k84571K17074l54240
7621c48651J10315k66089j70258M72234J97380j49675k12381M15486l59638J48896
7611a62381O2201M5441P8439k27270J51442K5545k34643K63954N2407J27404j43344
7600C9195K13071l90032l43202L26910j01641K91517r7429R0663k19556O5257
7590a25247p9888q9862j18488J45729P5876P0462K0805J11136n8539j66810L07168
7579I2342N97625n31137l54942L9413N08837j36699k2171L55951j0929o96286
$$ plain form
7652 396023 240292 -128229 -109456 -207006 -268220 -322529 -581946 -761882 -83037 -135836 -113689
7641 -113689 -202617 -314949 -220001 -112165 -231419 -194146 -73863 -208843 -281965 -178349
7631 -178349 121227 231830 256090 310364 -134024 -89237 73086 -211485 5589 -348651
7621 -348651 -238336 -504425 -674683 -202449 -5069 -154744 -367125 48361 -311277 -162381
7611 -162381 -100180 -54739 23700 -203570 -52128 -26583 -261226 2728 55135 182539 39195
7600 39195 252266 -137766 -480968 -154058 -255699 35818 -61611 29052 -190504 -125247
7590 -125247 -205135 -294997 -413485 -267756 -191880 -121418 -100613 10523 -48016 -214826 92342
7579 92342 689967 158830 -196112 -156699 352138 215439 193268 549219 538290 -157996
7569a57996j9187L1690J55381k8282L84847K05421J7063o1336l55708k62950n324
7558i6381K05370n7989j44718k91584N6511j4222K64416J50353J74008k84747
7548c8983J39602J45053l06713j05926K2843J84792L9957l18631L7633j45212
7538c45585M5320J53079J48503R0691p9119M428K31843j51821J7034K45288j14419
7527B45242n18556J21306M8162J13906k10670L66572J71323k10372m31854J61057
7517a43884M48163k14026m043j93407O9000M11394l2047l02602k45005r6477J82856
7506a20078J11548K7590J26696j06272J336K46494k42017l8400N5687K7815j48001
7495e7602Q6822P856j00951m5269K69470R1227K85286j35903O545L2008l96047
$$ plain form
7569 -157996 -177183 -145493 9888 -18394 366453 571874 588937 527601 171893 -91057 -96381
7558 -96381 108989 51000 -93718 -385302 -328791 -343013 -78597 71756 245764 -38983
7548 -38983 100619 245672 -61041 -166967 -144124 40668 80625 -238006 -200373 -345585
7538 -345585 -300265 -147186 1317 92008 12889 17317 249160 97339 114373 359661 245242
7527 245242 -273314 -152008 -103846 10060 -200610 165962 337285 126913 -304941 -143884
7517 -143884 304279 90253 86210 -107197 -38197 373197 341150 38548 -206457 -302934 -120078
7506 -120078 -8530 19060 145756 39484 40820 287314 45297 6897 62584 90399 -57602
7495 -57602 29220 37076 -63875 -109144 160326 251553 536839 400936 407481 439489 43442
7484D3442J33910K6743P416O4830l11126L54164L08754l72000k37214j7384M2719
7473D4254j6249O25490m53271k56715N48507p6019m34204l6329p4339P1582O08278
7462E50985R3475L85591J73747j92595M0030k08531j23613J57091r1683K35166
7452A019663j03334q820M96098m01135l22580N5796j11108j84353J71179K31903
7442H43309m75654P163k14701P79528K25197m75748K26043l11441Q9174L16908
7432A009778j43876k5335M5246l19551n7363L4621J80633J9681l67076O3209L15489
7421G55456k60100m94302J66592O6121K4557L47229L39960K03118j62006p82927
7411B03698L08115K01734j80517K84436K48241j99879j49245J30341J32267j01547
$$ plain form
7484 43442 177352 204095 211511 276341 -34785 319379 628133 256133 18919 1535 44254
7473 44254 28005 653495 200224 -56491 492016 415997 -18207 -54536 -128875 -57293 550985
7462 550985 644460 1030051 1203798 1011203 1051233 842702 719089 876180 784497 1019663
7452 1019663 916329 907509 1403607 1002472 679892 735688 624580 440227 611406 843309
7442 843309 367655 374818 160117 939645 1164842 689094 915137 603696 692870 1009778
7432 1009778 865902 840567 885813 566262 508899 543520 724153 743834 376758 439967 755456
7421 755456 495356 1054 167646 233767 258324 605553 945513 1148631 986625 203698
7411 203698 511813 713547 533030 817466 1065707 865828 716583 846924 979191 877644
7401H77644J76598K3082k4461k6798j59213M07048m56072K2617O6250R6582j08836
7390H94441J95226n4814o9919L1030L52515k72309K14893Q3831O3713j78773m8434
7379A211400J05252J59550K44328R028P9853K04730o4622r7596L89413j88502
7369B052834P9638K32351M17059K07876j92524j03254K71176k34242n2940r7116
7359B580858N32058K39661K78459N51792j17935j22100K40024M68048M84031K37603
7349E372499P1616l25504J46821N62957R1547Q33735K57740K80050Q08957K94138
7339H394556N45728P88090O24980Q33650J112457J549542J955830K354170K643924
7330B0802927L498356K781645K863161J734784n38643k539635l208131l740300
$$ plain form
7401 877644 1054242 1077324 1052863 1026065 866852 1273900 817828 840445 906695 1003277 894441
7390 894441 1089667 1034853 964934 995964 1348479 1076170 1291063 1374894 1438607 1259834 1211400
7379 1211400 1316652 1476202 1720530 1729558 1809411 2014141 1949519 1851923 2241336 2052834
7369 2052834 2132472 2364823 2781882 2989758 2797234 2693980 2965156 2730914 2677974 2580858
7359 2580858 3112916 3352577 3631036 4182828 4064893 3942793 4182817 4650865 5134896 5372499
7349 5372499 5444115 5118611 5265432 5828389 5919936 6753671 7011411 7291461 8100418 8394556
7339 8394556 8940284 9728374 10353354 11187004 12299461 13849003 15804833 18159003 20802927
7330 20802927 24301283 27082928 29946089 31680873 31142230 28602595 25394464 21654164
7322B1654164l405432k502667k311002j416574j362357q15739r70057l15750m02412
7313H152174n48254p63556q46497n52969l66056j25613j02986k94487Q505n23859
7303D036402n62241J03868K11967n66527O4250J22370o6335n11979k41860o4902
7293B525013l90742J78253J63852l22741p0688n1760K33430J16059K64373l10156
7283B334893l05974k32793k00181K80255O523j42506o27847j23400l04951J21626
7273H05645j08266R8655J80688o899O9420L08290k53217o8145P7848M9175o27610
7262E25584k31935L78278N12041j06112l69280L29921J34886L6141j94837J38542
7252A153229j78224R3578J10879N1322j34321K99584K07914l08638l12924j13565
$$ plain form
7322 21654164 18248732 15746065 13435063 12018489 10656132 9840393 8870336 8554586 8152174
7313 8152174 7603920 6840364 5993867 5440898 5074842 4949229 4846243 4551756 4560261 4036402
7303 4036402 3474161 3578029 3789996 3223469 3287719 3410089 3343754 2831775 2589915 2525013
7293 2525013 2134271 2312524 2476376 2153635 2082947 2031187 2264617 2380676 2645049 2334893
7283 2334893 2028919 1796126 1595945 1876200 1882723 1740217 1112370 988970 684019 805645
7273 805645 697379 796034 976722 969823 1039243 1347533 1094316 1026171 1104019 1153194 525584
7262 525584 293649 671927 1183968 1077856 708576 1038497 1173383 1209524 1014687 1153229
7252 1153229 975005 1068583 1179462 1230784 1096463 1396047 1603961 1295323 982399 868834
7242H68834k30143m19648j16707m390o0573J72593N04807j1239q42183N79056
7232D40407p5965l91046L58193m6002J03222K21086N36160M7639j48900k56586
7222G88208K72155n22243J33511j58871j81620j98806M8910M25545k58190l92438
7212d3839L45262N5571j84465L26274k75425j11245K26979m68485j55831J7007
7202b68197J16733N02501J60125K69475j11890k19059q9079K88072J9409Q412
7192F76502m04197P4250k27947j43116J39444N7525N5999J29763M3497k01187
7182B00533j01305J88241j51819k20783N3142K34895k03709N0092L52262o8692
7172C32857K7896n0678k1901J5167L47632j51332l21676p3229J7923J51731N44529
$$ plain form
7242 868834 638691 219043 102336 97946 37373 209966 714773 703534 -138649 440407
7232 440407 364442 -26604 331589 285587 388809 609895 1146055 1193694 1044794 788208
7222 788208 1060363 538120 671631 512760 331140 132334 181244 606789 348599 -43839
7212 -43839 301423 356994 172529 498803 223378 112133 339112 -129373 -285204 -268197
7202 -268197 -151464 351037 511162 780637 668747 449688 360609 648681 668090 676502
7192 676502 272305 346555 118608 -24508 114936 172461 228460 358223 401720 200533
7182 200533 99228 287469 135650 -85133 -31991 202904 -805 49287 401549 332857
7172 332857 360753 310075 288174 303341 650973 499641 177965 104736 122659 274390 818919
7161H18919l01292L6137j48631j46819k93156M13784L73664j59682n31682j99983
7151a38741L13290N8294L841r8455J89011l07832L14241k9296r4250L63662R1514
7140F65279l49033j34106L12881n7074j71800j12300j16519L40172J95314j28540
7130D44274K031J01536n242L6020k038L34296n06038N1890J75573m29598N1237
7119B53941l03343K95184O977Q88j9740K42325l9054j89377j05133M282K24758
7108C71708j30617k66078O5141M19469J77103j51890k14251j57271N7579M38891
7098F09784r8385k95068n0887J26459J00031o04569L64317K61873l75346K55230
7088B93439K14661j55521l42017M3638K02288o4776l79192R5408p0531J42657
$$ plain form
7161 818919 517627 553764 405133 258314 -34842 378942 752606 592924 61242 -138741
7151 -138741 174549 232843 236684 138229 327240 19408 333649 304353 210103 573765 665279
7140 665279 316246 182140 495021 437947 266147 153847 37328 377500 572814 444274
7130 444274 446305 547841 542599 578619 576581 910877 404839 456729 632302 202704 253941
7119 253941 -49402 245782 252759 253647 233907 476232 437178 247801 142668 146950 371708
7108 371708 241091 -24987 40154 459623 636726 484836 270585 113314 170893 609784
7098 609784 511399 216331 165444 291903 391934 -212635 151682 413555 38209 293439
7088 293439 508100 352579 10562 54200 256488 191712 -187480 -92072 -162603 -19946
7078a9946O56294K7683n32279j8208J28941M00568l28419Q0678J6603k10781m86150
7067b85016j10457l28414R2762M84197K83332K17425j87681J28455J32075N2156
7057D78834j47907J10387o8148k33435n2893l4061J20934k36258l51356Q7820
7047c26083L18611K10987j62758M49421J64006l20803o77593L55864K95902J32311
7037D39865j03498l58510J00464r7804N2336J60807P3521J057P5490N6120O4092
7026D63940j53946m33172j14825j6978l43847M01236J57420J316K27839p518j62473
7015A8992j83250J8277l0078J45187n4368M0532J55633K66453J03407M15017p9102
7004H16700j82611L15100j12679k51205j37825j42344j5516j62837r4510q8791
$$ plain form
7078 -19946 636348 664031 131752 113544 242485 643053 314634 395312 411915 201134 -285016
7067 -285016 -395473 -723887 -631125 -146928 136404 353829 166148 294603 426678 478834
7057 478834 330927 441314 373166 139731 86838 52777 173711 -62547 -413903 -326083
7047 -326083 -7472 203515 40757 490178 654184 333381 -344212 11652 307554 439865
7037 439865 336367 -22143 78321 -19483 32853 193660 267181 268238 343728 399848 463940
7026 463940 309994 -123178 -238003 -254981 -598828 -197592 -40172 -38856 188983 181465 18992
7015 18992 -164258 -145981 -176059 -30872 -85240 -44708 110925 377378 480785 895802 816700
7004 816700 634089 949189 836510 585305 447480 305136 289620 126783 32273 -56518
6994e6518j83277J92494P2247q5144n61801J55628M15273K45384J16366K70322
6984E80974m79583n2632J10230m81433L78617K38079J66650l08262k544R7806
6974B47902J0128J75124m2831M4793k43524j64731M66793l40432K29413k73824
6964A08811L67340p0135p6043P5002N0956k82964k04054K72915k0707M376j40087
6953H5410K68696k85848j31586K58446j18434m9608J49628l68885J85900R8164
6943I1883Q8612K18089J59117k27673j17726r2400J1397j84846k0430K04751j44439
6932a3665l9496K68290k82786L24704J09218J43391k70209O7258J84780k31632
6922B59853J6026J43433N7309J18542O4760n70285k87639K58492L05593J38573
$$ plain form
6994 -56518 -239795 -47301 24946 -60198 -621999 -466371 -51098 194286 310652 580974
6984 580974 101391 48759 158989 -322444 56173 294252 460902 152640 150096 247902
6974 247902 258030 433154 390323 435116 191592 26861 493654 153222 382635 108811
6964 108811 476151 406016 329973 404975 455931 172967 -31087 241828 221121 225497 85410
6953 85410 354106 68258 -63328 195118 76684 27076 176704 -192181 -6281 91883
6943 91883 180495 398584 557701 330028 212302 119902 131299 -53547 -73977 130774 -13665
6932 -13665 -53161 215129 -67657 257047 366265 509656 239447 306705 491485 259853
6922 259853 275879 419312 476621 595163 659923 89638 -198001 60491 366084 504657
6912E04657j11749m45089P670J66003l45680l01932q3387J66089K73149J88582
6902A8313L7069k6496j24644N6127M23611K34115p978l50627M6123j5837j84101
6891A05675m9224K3473J65560J5589K65778l3394j68849k76613J28648J12857
6881B89500J3347P4612j96009J26134k36455P5077p2659k49003k37283L50711
6871f2028J83336L82661n3550J27192j94311o6907p4314l09200J85497J64957
6861B83333J54137j38344j01498k6928M8939j34465o2253o2206k19715K33098
6851b5902J28143l7967j88849L4334M53225m757p1307m02406R7134K05663L3453
6840B20764J0638k56987J50334L45834k9441n03917M2946l05460O21655J43707
$$ plain form
6912 504657 392908 -52181 -44511 121492 -224188 -526120 -609507 -443418 -170269 18313
6902 18313 55382 28886 -95758 -39631 383980 618095 610117 259490 305613 289776 105675
6891 105675 56451 79924 245484 261073 526851 493457 324608 47995 176643 289500
6881 289500 302847 377459 181450 307584 71129 146206 73547 -175456 -412739 -62028
6871 -62028 121308 503969 450419 577611 383300 316393 242079 -67121 118376 283333
6861 283333 437470 299126 197628 170700 219639 85174 22921 -39285 -259000 -25902
6851 -25902 102241 64274 -124575 -90241 362984 358227 286920 -115486 -18352 187311 220764
6840 220764 231402 -25585 124749 470583 441142 -62775 -19829 -325289 296366 440073
6830D40073k49269l1896Q7894L34426k77348k22959J19216M59176M7562J38879
6820H45754m25736n1274l5363k72551m57082O77239j07408q7174J29597k97492
6810h1490J30371J78091k19005q808N64486l19909m3838k68759o1271J68082k26462
6799a88512K50610K42062R9349j54257k4542K65838l51425m84734j8787J18815
6789b45583o5586M44502M03269n28099N3098K65503L50124J2652m31032l85067
6779a26219M327L68778J34298l34285J89594N910M9604j17331j20319K04959L85392
6768F44708J45372p3078j87252J58375k76396k08537K29446K08771N9709m06581
6758B94537N26690o02217j65669J041R4042N1599J12633K97382j43954n7354m41692
$$ plain form
6830 440073 190804 158908 246802 581228 303880 80921 200137 659313 706875 845754
6820 845754 420018 368744 333381 60830 -396252 280987 173579 86405 216002 -81490
6810 -81490 48881 226972 7967 -841 563645 243736 199898 -68861 -130132 37950 -188512
6799 -188512 62098 304160 403509 249252 224710 490548 139123 -345611 -364398 -245583
6789 -245583 -311169 133333 536602 8503 61601 327104 677228 689880 258848 -126219
6779 -126219 -121892 246886 381184 46899 236493 242403 292007 174676 54357 259316 644708
6768 644708 790080 717002 529750 688125 411729 203192 432638 641409 701118 294537
6758 294537 821227 219010 53341 54382 148424 200023 312656 610038 466084 408730 -32962
6747c2962J89910K58358k64066K23978n5031m7617j71823J55613J40334K05312
6737F02006J5851l65219l08195R8071M56012l43120K03875j71225j74253L61760
6727C75563j69762L9394n9454p5492L60790r2873k24503k37036j99165J87160
6717i5378N039j50171M9323r4262P5780L28467j89936j24583O01068J20229m13936
6706A11640L30902K60886k13497k23098k7631N4507J65785n4433l4104j8813j22850
6695B29294K43055N4643o25574L32004R6807j59093j11807L25890k69936j9218
6685I6065K03709j63344k28356M69181L050m10455M61468L49854R8860k19452
6675F60580k98906k39823N867N2220K07941O8867L1587K6174j14682J86380n41534
$$ plain form
6747 -32962 156948 415306 151240 375218 320187 272570 100747 256360 396694 602006
6737 602006 617857 252638 -55557 42514 498526 155406 359281 188056 13803 375563
6727 375563 205801 245195 185741 110249 471039 378166 153663 -83373 -282538 -95378
6717 -95378 -90339 -240510 -191187 -285449 -209669 118798 -71138 -195721 405347 525576 111640
6706 111640 442542 703428 489931 266833 239202 293709 459494 405061 370957 352144 229294
6695 229294 472349 526992 -98582 233422 330229 171136 59329 385219 115283 96065
6685 96065 299774 136430 -91926 377255 380305 -30150 431318 781172 880032 660580
6675 660580 361674 121851 127718 179938 387879 456746 488333 514507 399825 586205 44671
6664D4671l9834Q75964n36226N5777q0695L4155L74423J47467o9108l65010j76409
6653B65175j8436R7546K74315J63978n6754j68624J89152l03256k02835L2543
6643B72804k7087P1973K74768J50858k99958p04398J48558L28863P9110M089J49509
6632D49089l3055k02938J53636o5352j54031K30661j19282l41774L03343J84468
6622D04765k12893j17432K67395K73798m15492k79440J37340L55439L02959k42068
6612D74371L07446p2196l16733j8984K26733l16614N196K17948j14947M00843
6602G93063p3041M4306J09886m8951l83569R0086L42564J83214j51000k41955
6592F64603k6838L71562L2772K64293k00893L1725o3681j37613J40750j14847
$$ plain form
6664 44671 4837 880801 344575 400352 319657 353812 728235 875702 806594 441584 265175
6653 265175 246739 344285 618600 782578 725824 557200 746352 443096 240261 272804
6643 272804 245717 317690 592458 743316 443358 -261040 -112482 216381 295491 299580 449089
6632 449089 416034 213096 366732 301380 147349 378010 258728 -83046 220297 404765
6622 404765 191872 74440 341835 615633 200141 -79299 58041 413480 716439 474371
6612 474371 781817 709621 392888 373904 600637 284023 289219 507167 392220 793063
6602 793063 720022 764328 874214 825263 441694 531780 874344 1057558 906558 664603
6592 664603 637765 1009327 1042099 1306392 1105499 1137224 1073543 935930 1076680 961833
6582I61833J5819L01547O098j82609j39538r7452j19442l39609M6709k12352j34211
6571A06793J19221J78094M14257k15713p02685R9100J39027L93373k72424J97592
6561D56635j6048j70959l05721J57523j62890J20265L52713J36406k92392m49277
6551a73745Q8623J96142M12556k20589J93826J91910l55321M88079J55318l60278
6541F16521j68912Q8132m85592L20673J70343m62932L49355M8354j22910M6053
6531C99085m0623k02234k73788L05014N51538l49611L28903L54557k95140K36219
6521A013920k82636j97137j1056o8341P7360Q1374m10306n7015J20111j73494
6511I2780L34747O237m2691j50100L19580m0755r6976r285M17528L41694k65147
$$ plain form
6582 961833 977652 1279199 1285297 1102688 963150 865698 746256 406647 453356 241004 106793
6571 106793 226014 404108 818365 602652 -100033 -933 138094 531467 259043 456635
6561 456635 440587 269628 -36093 121430 -41460 78805 431518 567924 275532 -173745
6551 -173745 -85122 111020 523576 302987 496813 688723 333402 821481 976799 616521
6541 616521 447609 535741 50149 370822 541165 78233 427588 475942 353032 399085
6531 399085 358462 156228 -117560 187454 738992 389381 718284 1072841 777701 1013920
6521 1013920 731284 534147 523091 454750 532110 613484 203178 146163 266274 92780
6511 92780 427527 433764 391073 240973 560553 519798 422822 413537 831065 1172759 907612
6500I07612j6623n01831p2522j19916J72363L0997K74473M42156m64358M1740
6490F94091L14885j84474j84191l5875k53524K90122k06336j40071J11539o1749
6480C44417P7012j32628m19617O7528O04496P4265q3563K64589l58889J37883
6470E75493J5203M1308J71829Q0689k35663k52232K66259l3889k83641n6054L51450
6459F40752q4712j81937P2437J99143j15263k3714R7254J78122R99k25561n9688
6448D97832J72989K63601L10018m48172K3353k19600l29066M1048L50278K25091
6438H87372m05262L80294J757O8254j71628l40791K39748n6289j59739k52822
6428A90894K79807M16799l69411M18786J18097M4550j87201k63739J45173j27871
$$ plain form
6500 907612 890989 389158 316636 196720 369083 400080 674553 1116709 652351 694091
6490 694091 1008976 824502 640311 604436 350912 641034 434698 294627 406166 344417
6480 344417 421429 288801 -130816 -63288 541208 615473 531910 796499 437610 575493
6470 575493 590696 632004 803833 884522 648859 396627 662886 628997 345356 289302 640752
6459 640752 556040 374103 446540 645683 530420 506706 603960 782082 783081 557520 497832
6448 497832 670821 934422 1244440 796268 819621 600021 270955 312003 662281 887372
6438 887372 482110 862404 864161 932415 760787 419996 659744 603455 443716 190894
6428 190894 470701 887500 518089 936875 1054972 1099522 912321 648582 793755 665884
6418F65884j88702M8374l2657k75969k02364K93550K25776j27816K24701J90283
6408H21060k74427L40608l7715j31462o7457P8454m87523K17959K34776n1718
6398F42555q9414k69358J88274R5980K32632o497R3233m3826k64778p6708n5733
6387D46360P2052O9071M8617J03213p08796J48117K57540N2267L93844Q4913l96236
6376E70962J09693K13725J33286k26912K62245M4825l50691N28J39539k93683
6366F03517R294J26344M39030k7079k0141N6606o10237P5813O76656J88389k85615
6355A232577j77935J72272j49268n75807K6512J83705J74926o0262K50227r1540
6345I85407n81098k8366N44534L53355N6913n872m15046o971J40969l2453r2044
$$ plain form
6418 665884 477182 525556 492899 216930 14566 308116 533892 406076 630777 821060
6408 821060 546633 887241 849526 718064 650607 729061 241538 459497 694273 642555
6398 642555 553141 283783 472057 568037 800669 794172 887405 843579 578801 502093 446360
6387 446360 518412 587483 636100 739313 30517 178634 436174 488441 882285 967198 570962
6376 570962 680655 894380 1027666 800754 1062999 1107824 757133 757661 897200 603517
6366 603517 612811 739155 1178185 1151106 1130965 1187571 577334 653147 1329803 1518192 1232577
6355 1232577 1054642 1226914 1077646 501839 528351 712056 886982 826720 1076947 985407
6345 985407 404309 375943 920477 1273832 1330745 1324873 909827 902856 1043825 1011372 919328
6334I19328l15028j0752M35477J38367m09284K68781N99516l15729n94093n8269
6324F58314L19710n028K80961J53139J17896j74765j72945L01362J5566m44179
6314A050031M2976J08475J66110K1508j06895J56940l97911k63139Q842J69618
6304I56555k43490J48285R5173K11418P1637L66722j36396l29445J79860Q5613
6294A405932l82543J8235J79065j75614J225j32749m54172N03043K45222K2589
6284A230233j21296j41872M57371m60406M09062j04367j0441J48731k44328j5705
6274A146982L44852j7234j90638k1495L94980l31747k78987J76912r8184J66082
6264A291523K22190j83314M31662J67144j59905l30911j18068L09911q7718n6720
$$ plain form
6334 919328 604300 593548 1029025 1167392 758108 1026889 1626405 1310676 716583 658314
6324 658314 978024 972996 1253957 1407096 1524992 1350227 1177282 1478644 1494210 1050031
6314 1050031 1093007 1201482 1367592 1389100 1282205 1439145 1041234 778095 786937 956555
6304 956555 713065 861350 956523 1167941 1239578 1606300 1469904 1140459 1320319 1405932
6294 1405932 1023389 1041624 1220689 1045075 1046300 913551 459379 962422 1207644 1230233
6284 1230233 1108937 967065 1424436 964030 1373092 1268725 1258284 1407015 1162687 1146982
6274 1146982 1491834 1474600 1283962 1262467 1657447 1325700 1046713 1223625 1125441 1291523
6264 1291523 1513713 1330399 1762061 1929205 1769300 1438389 1320321 1630232 1542514 1485794
6254A485794l85178J92211l22459M70568L29401j14307N3979j86505k6953l2382
6244A464169k14173l44797K4588M6605J89916J87781P983N2631K26646J02623
6234A743972J65790L27877m68265K80844K82630k27938j41425r7175k14968J12187
6224A763529K41999J61442l76329O37954l2433j25807K12557N46629J11901o76277
6214B465165l1749M26731L9614M03051M83535L12263O581L13282N06155k51729
6204D672899o1448r0809n57337n95177l20718j35670j41600l62106j5230m65804
6194A927000L74911K23929j45059K46563J84539m97021j00682J6198K1849k02676
6184B049551L09546R8411j42041J52374J63147k99574L32066k2880l66674L8172
$$ plain form
6254 1485794 1100616 1292827 970368 1440936 1770337 1656030 1710009 1523504 1496551 1464169
6244 1464169 1249996 905199 929787 976392 1166308 1354089 1362072 1414703 1641349 1743972
6234 1743972 1909762 2237639 1769374 2050218 2332848 2104910 1963485 1866310 1651342 1763529
6224 1763529 2005528 2166970 1790641 2428595 2396162 2270355 2482912 3029541 3141442 2465165
6214 2465165 2433416 2860147 2899761 3302812 3786347 4098610 4105191 4418473 4924628 4672899
6204 4672899 4611451 4520642 3963305 3368128 3047410 2911740 2770140 2408034 2392804 1927000
6194 1927000 2301911 2525840 2380781 2627344 2811883 2314862 2214180 2230378 2252227 2049551
6184 2049551 2359097 2457508 2315467 2467841 2630988 2331414 2663480 2640600 2273926 2312098
6174B312098O2149K27185j07406k5961q3401L4786J0389J29067J72250k87932
6164B443224J52316N8247m08409J71458N02358j04752j69557q1216q2813j72949
6154B307907J63984K73738m05863O59700J75727o61877N30864K91886J315j36826
6144C200555j02726j30834K61370R3038K52901J67159L8039l96114m58690J2200
6134B936898q5641J23593J04904j86294J0608j73721l86137K74117K69070K34156
6124C121553M9673O49333m32840j51121N24335l74018k52399j41088J56067K79220
6114C428715j32906j13944K51031N3316O4661m5322l31933J84978N77544j20662
6104C815478l34061K5412K07165k81597K62900M11210k22182J01324o6432j92598
$$ plain form
6174 2312098 2374247 2601432 2494026 2468065 2384664 2419450 2429839 2558906 2731156 2443224
6164 2443224 2595540 2653787 2245378 2416836 2919194 2814442 2644885 2563669 2480856 2307907
6154 2307907 2471891 2745629 2339766 2999466 3175193 2513316 3044180 3336066 3337381 3200555
6144 3200555 3097829 2966995 3228365 3321403 3574304 3741463 3779502 3383388 2924698 2936898
6134 2936898 2851257 2974850 3079754 2893460 2904068 2730347 2344210 2618327 2887397 3121553
6124 3121553 3171226 3820559 3387719 3236598 3760933 3386915 3134516 2993428 3149495 3428715
6114 3428715 3295809 3181865 3432896 3486212 3550873 3505551 3173618 3358596 3936140 3815478
6104 3815478 3481417 3506829 3713994 3432397 3695297 4106507 3884325 3985649 3919217 3726619
6094C726619P3849J78047J79179n40954m51214Q6821J62971K33981o3819j22049
6084C463431N19383J23719J0331M12561n66058J83391k15662L02908l31602k65465
6074C636937j21229K89319K32876k32493K41432K16928j44335k90845j40808N5503
6064C743285K72435k96625K02911L26359l67485k78319L49755M15437l31134k91216
6054C745403J03828J17113R2177L02977k03370p6071k97670j72519L42880p2188
6044C882560K44458J29451j52106m61022L93843j42223l1717M94002J05654k79259
6034D183641l5716k59371J106L63824K8069K4790J31045L0169J55427J06643n8086
6023D671541k15403l81130j43019M82357M52565j72965l58104J25330K96986K09458
$$ plain form
6094 3726619 3800468 3978515 4157694 3616740 3165526 3252347 3415318 3649299 3585480 3463431
6084 3463431 3982814 4106533 4116864 4529425 3963367 4146758 3931096 4234004 3902402 3636937
6074 3636937 3515708 3805027 4037903 3805410 4046842 4263770 4119435 3828590 3687782 3743285
6064 3743285 4015720 3719095 3922006 4248365 3880880 3602561 3952316 4367753 4036619 3745403
6054 3745403 3849231 3966344 4058521 4361498 4158128 4082057 3784387 3611868 3954748 3882560
6044 3882560 4127018 4256469 4104363 3643341 4037184 3894961 3863244 4357246 4462900 4183641
6034 4183641 4147925 3888554 3889660 4253484 4281553 4306343 4437388 4467557 4622984 4729627 4671541
6023 4671541 4456138 4075008 3931989 4414346 4866911 4693946 4335842 4461172 4758158 4967616
6013D967616K67393j27352M06914j65511J98395J74916Q2258q909p5856K91594
6003F011458J04320J09660l1161r8107L34756J86914J01446K80322L61726J95313
5993G556647J69680K4545j49982J72121O0200J48275O0521J8070J35436J86573
5983H382086K936J70953L24877K03276M0999J14792L01320K24449M43829M04374
5973A0613891J16116n9806P1420J32277m9952L73214r06j15970N1840J49872P3893
5962A1355889J3060K493M27951J63237M5455l00669l51593L21559L97023J28897
5952A2203302j16200k5303K2357M09374M38780q4071P6831M24729R3728k76174
5942A3167353l9337K79358M4276K55917l98655l07670N43163M6519N26823k09697
$$ plain form
6013 4967616 5235009 5107657 5514571 5349060 5547455 5722371 5804629 5795720 5719864 6011458
6003 6011458 6115778 6225438 6194277 6096170 6430926 6617840 6719286 6999608 7361334 7556647
5993 7556647 7726327 7750872 7600890 7773011 7833211 7981486 8042007 8060077 8195513 8382086
5983 8382086 8385022 8555975 8880852 9084128 9125127 9239919 9541239 9765688 10209517 10613891
5973 10613891 10730007 10670201 10741621 10873898 10823946 11197160 11196254 11080284 11132124 11281996 11355889
5962 11355889 11368949 11371442 11799393 11962630 12008085 11707416 11355823 11677382 12074405 12203302
5952 12203302 12087102 12061799 12084156 12493530 12932310 12848239 12925070 13349799 13443527 13167353
5942 13167353 13128016 13407374 13451650 13707567 13308912 13001242 13544405 13590924 14117747 13908050
5932A3908050n084M1095L7761J32143L58704L52698L55064n9030K01406J81705
5922A5504512n1519J14051J29172R7001n469p8122m00173J9788K94478M09245
5912A6032964r1391l48234l4606K96739k15199k19187J80767N83607J19344J80585
5902A6485389J04917n4751l6300J94708P31448N8401N35746O53179M99273M06309
5892A9578319P47762L65024Q01006Q90300N13476R93087J095250J498386J024234
5883B7506844J303812J126502J431862J188186P42283P33063L85511l65237j16291
5874C3936535q36720j207772q73357j091937q52266o23740p80662k21249l27646
5865B7121186k45240m8826L0694K15071j10924j61092O9727j43297k2672m26552
$$ plain form
5932 13908050 13902966 13944061 13981822 14113965 14472669 14825367 15180431 15121401 15322807 15504512
5922 15504512 15452993 15567044 15696216 15793217 15787748 15709626 15309453 15329241 15623719 16032964
5912 16032964 15941573 15593339 15558733 15855472 15640273 15421086 15601853 16185460 16304804 16485389
5902 16485389 16590306 16535555 16499255 16693963 17425411 17483812 18019558 18672737 19172010 19578319
5892 19578319 20326081 20691105 21492111 22382411 22895887 23888974 24984224 26482610 27506844
5883 27506844 28810656 29937158 31369020 32557206 33299489 34032552 34418063 34052826 33936535
5874 33936535 33099815 31892043 31018686 29926749 29074483 28450743 27670081 27448832 27121186
5865 27121186 26875946 26827120 26857814 27072885 26961961 26800869 26870596 26727299 26704627 26278075
5855B6278075j97159o69029o28104k78720p11276n78239j65802o59011p98005
5846B1592730o62862l37013p59529o26617p39908j82691o51723m24819k17082
5837A6990486J18547n20574l74505j50928l98021O88818l13016J9135M361l25136
5827A5739167o30622j36260J6512k5854j30892k30865K8028J63218M2238l73407
5817A4461263k3144k0285m62740K73177J04006K5236k6581k61288j10338q4160
5807A3875146q702M43402q3234m03219j56350J91454L4429N17807j78418k29616
5797A4002699l75612k221P2535J59778j62260L14564k5958J77164K08370j04025
5787A4265034j09934K74664k14839j18107J28705J00670M5154j00821J76642K42587
$$ plain form
5855 26278075 26080916 25411887 24783783 24505063 23793787 23215548 23049746 22390735 21592730
5846 21592730 20929868 20592855 19833326 19206709 18466801 18284110 17632387 17207568 16990486
5837 16990486 17109033 16588459 16213954 16063026 15665005 16353823 16040807 16059942 16064303 15739167
5827 15739167 15108545 14972285 14988797 14962943 14832051 14601186 14629214 14792432 14834670 14461263
5817 14461263 14438119 14417834 13955094 14228271 14332277 14357513 14330932 14069644 13959306 13875146
5807 13875146 13866444 14309846 14226612 13823393 13667043 13858497 13892926 14410733 14232315 14002699
5797 14002699 13627087 13624866 13697401 13857179 13694919 14009483 13983525 14160689 14369059 14265034
5787 14265034 14155100 14429764 14214925 14096818 14225523 14326193 14371347 14270526 14447168 14689755
5777A4689755l89648K8910J34112j12037K85792j14160R1846P6843L68791K48361
5767A5308565K58711R0410k7933J96196L35114J22823J42092J13570M8657j16407
5757A6471798K35950L6274J95920J30571K12465o6283j83821j42364P01291n3634
5747A7538167j67713K81486j57049l2164L83467k53061L75163M94467J85946N08171
5737A9156880j13668p7028P7444N21744N6980K76027K92338j58428L99356O60243
5727B1091888O8655J14560J49539N4803M40372K29242J93231N53041k15028K71818
5717B2952121L82485n40540L95558N98890M42395K21243k40127P38363J25295
5708B5075683N1994N70926N14001K82253M8141J9399L88632P65423M31952N02179
$$ plain form
5777 14689755 14300107 14329017 14463129 14351092 14636884 14522724 14614570 14691413 15060204 15308565
5767 15308565 15567276 15657686 15629753 15825949 16161063 16283886 16425978 16539548 16588205 16471798
5757 16471798 16707748 16744022 16939942 17070513 17282978 17216695 17032874 16890510 17591801 17538167
5747 17538167 17370454 17651940 17494891 17462727 17846194 17593133 17968296 18462763 18648709 19156880
5737 19156880 19043212 18966184 19043628 19565372 19622352 19898379 20190717 20032289 20431645 21091888
5727 21091888 21160543 21275103 21424642 21479445 21919817 22149059 22342290 22895331 22680303 22952121
5717 22952121 23334606 22794066 23189624 23788514 24230909 24452152 24212025 24950388 25075683
5708 25075683 25127677 25698603 26212604 26494857 26542998 26562397 26951029 27716452 28148404 28650583
5698B8650583L75346O0475j38420O47534O41536J10046J75742N16035K30315O26679
5688C1895871N16361L43609M17143O87709J82459M50681M74277J47713P58537
5679C5874360M49633L77762J012229N83810L65445O11537P63258N99919M79801
5670D1117754J85172P19914R58274N51547O87754Q97947Q36048N20041P26195
5661D7200646R78494O84928P10761P85696N54960J115823R29099J051093R60006
5652E4971506O99720J390237J053412O43373J342373J191628J453994J023291
5644F3769534J288542J188661J376239J604393J442906J667884J061579J314495
5636G4714233J771894J988649J943086J768474J399211J891204K017447J707788
$$ plain form
5698 28650583 29025929 29086404 28947984 29595518 30237054 30347100 30522842 31038877 31269192 31895871
5688 31895871 32412232 32755841 33172984 33860693 34043152 34493833 34968110 35115823 35874360
5679 35874360 36323993 36701755 37713984 38297794 38663239 39274776 40038034 40637953 41117754
5670 41117754 41302926 42022840 42981114 43532661 44220415 45118362 45954410 46474451 47200646
5661 47200646 48179140 48864068 49574829 50360525 50915485 52031308 52960407 54011500 54971506
5652 54971506 55671226 57061463 58114875 58758248 60100621 61292249 62746243 63769534
5644 63769534 65058076 66246737 67622976 69227369 70670275 72338159 73399738 74714233
5636 74714233 76486127 78474776 80417862 82186336 83585547 85476751 87494198 89201986
5628H9201986K407741K196228K000081J945228J841794K846620K649940K635039
5620A07724657K655172K478635L053844K299637K906748L137941L185261L444186
5612A30886081L073912L185531L677680L548294L193841L741174M341014M529740
5604A60177267L861734M288587M532562M497257M891659M808917N080114M979117
5596A97117214N175711N652585N239961N916529O036914O277418O217929N818577
5588B43452838O452259O327586O798533O511002O746210O625733O442462O479554
5580B95836177O805017O930662O968200O872003O558432O302346O587129N557706
5572C48417672N931063N808188M949704M815651M668888M117484L541074L423529
$$ plain form
5628 89201986 91609727 93805955 95806036 97751264 99593058 102439678 105089618 107724657
5620 107724657 110379829 112858464 115912308 118211945 121118693 124256634 127441895 130886081
5612 130886081 133959993 137145524 140823204 144371498 147565339 151306513 155647527 160177267
5604 160177267 164039001 168327588 172860150 177357407 182249066 187057983 192138097 197117214
5596 197117214 202292925 207945510 213185471 219102000 225138914 231416332 237634261 243452838
5588 243452838 249905097 256232683 263031216 269542218 276288428 282914161 289356623 295836177
5580 295836177 302641194 309571856 316540056 323412059 329970491 336272837 342859966 348417672
5572 348417672 354348735 360156923 365106627 369922278 374591166 378708650 382249724 385673253
5564C85673253K555986K869507J910861J586448J094343J237346M53497k418k13461
5555C97165362m32165j480782k222399k172571k544287l036712k725908l734287
5547C78816251m759864m573860m987913m906240n339021o061251o137726o278512
5539C35771864o826507o880803o675433p014740p262990o882025o705031p203735
5531B80320600p439261p172047p215824o970444o944845o722024o509775o503943
5523B24842437o355919o057549n729365n665117n442652n486827n150505n257955
5515A79696548n317558m634511m951363m125811m142151m546075m456158l881111
5507A43641810l508338l628958l820990l657455l368832l212883k841987k968554
$$ plain form
5564 385673253 388229239 391098746 393009607 394596055 395690398 396927744 397381241 397378823 397165362
5555 397165362 396733197 395252415 393030016 390857445 388313158 385276446 382550538 378816251
5547 378816251 374056387 369482527 364494614 359588374 354249353 348188102 342050376 335771864
5539 335771864 328945357 322064554 315389121 308374381 301111391 294229366 287524335 280320600
5531 280320600 272881339 265709292 258493468 251523024 244578179 237856155 231346380 224842437
5523 224842437 218486518 212428969 206699604 201034487 195591835 190105008 184954503 179696548
5515 179696548 174378990 169744479 164793116 160667305 156525154 151979079 147522921 143641810
5507 143641810 140133472 136504514 132683524 129026069 125657237 122444354 119602367 116633813
5499A16633813k975356k785228k888200k707053k572160k321463k634527k411609
5491I5338217k261730j739705j719990k011008k119703k459819j924679j943359
5483G9158224j433716j996303j476606j375784j704362j276428j365782j277075
5475F7252168j482715j353959j268473j548963j265396j148135j375063r36646
5467E6872818r12462q99588j330226j145213r51612o60714r84550j388154o07524
5458D7992775o88280j078311r12298r44830p60518l52446p88264p85290o56336
5449D1026202q36157o55624o33909o94802m97967l05692o30484m60860n48242
5440C5762465j307057q64506j02401J60893k79750p93453k60324n72687p59233
$$ plain form
5499 116633813 113658457 110873229 107985029 105277976 102705816 100384353 97749826 95338217
5491 95338217 93076487 91336782 89616792 87605784 85486081 83026262 81101583 79158224
5483 79158224 77724508 75728205 74251599 72875815 71171453 69895025 68529243 67252168
5475 67252168 65769453 64415494 63147021 61598058 60332662 59184527 57809464 56872818
5467 56872818 55960356 55060768 53730542 52585329 51633717 50973003 49988453 48600299 47992775
5458 47992775 47304495 46226184 45313886 44369056 43608538 43256092 42467828 41682538 41026202
5449 41026202 40190045 39534421 38900512 38205710 37707743 37402051 36771567 36310707 35762465
5440 35762465 34455408 33590902 33488501 33649394 33369644 32576191 32315867 31743180 30983947
5431C0983947n10553k54526n03671o22125j99924n66044o17683m38698J42436
5422B7413159q85255n10536P6381m46899k78305n0752k36712k72925n13929k15605
5412B4078622q09420m40719l01549l30189j34876l27644k79724K2554l96326n59660
5402B0521069m76412r8650r2274j06924j99911j5816j21103o65407J60279m22072
5392A8482779N6124l54858n37786L5947l68877l68735K14641k54109k17736O08910
5382A7296300k96640p49417k09511J16134l07033m40252K4799j07568J13187l83415
5372A5056584l81612P8099m66855k27993j9845l19107L0290r0150K885M4805M4212
5361A3751313l49845k36099j40182n6305j76935l2163k34473k54598l95719k67800
$$ plain form
5431 30983947 30473394 30218868 29715197 29093072 28893148 28327104 27709421 27270723 27413159
5422 27413159 26527904 26017368 26093749 25646850 25368545 25317793 25081081 24808156 24294227 24078622
5412 24078622 23269202 22828483 22526934 22196745 22061869 21734225 21454501 21477055 21080729 20521069
5402 20521069 20044657 19946007 19853733 19746809 19546898 19531082 19409979 18744572 18904851 18482779
5392 18482779 18538903 18184045 17646259 17682206 17313329 16944594 17159235 16905126 16687390 17296300
5382 17296300 16999660 16250243 16040732 16156866 15849833 15409581 15434380 15326812 15439999 15056584
5372 15056584 14674972 14753071 14286216 14058223 14038378 13719271 13749561 13659411 13662296 13707101 13751313
5361 13751313 13401468 13165369 13025187 12968882 12791947 12759784 12525311 12270713 11874994 11607194
5351A1607194J29245k00445m56234L46250L981j65878J16469m5153L16755p22214
5341A0929970k40756K56012j84979k27585k16779l44147J53871K92628j37202
5332A0281033k66668O0554L07003k54443j97009r5198N1301l81912k7264N2712
5322I530109m84114K77992m88690j85877R0560M38598k496K92516J11390m88407
5312I091581l5243n9022P1847J03443k88817m29187k5598L39870j98431l96370
5302H174073q7339j58558K987J07044J30481k31377P7729k15563m08829K7500
5292G418148L47085j37310J96892J35337K23964j43102k30563o0842k3250k32591
5282G493768M6J92804j28236N2574k27553k9363P8908l40768K2460J30443k99799
$$ plain form
5351 11607194 11736439 11535994 11079760 11426010 11429991 11264113 11380582 11335429 11652184 10929970
5341 10929970 10689214 10945226 10760247 10532662 10315883 9971736 10125607 10418235 10281033
5332 10281033 10014365 10074919 10381922 10127479 9930470 9835272 9886573 9504661 9477397 9530109
5322 9530109 9045995 9323987 8835297 8649420 8739980 9178578 9176082 9468598 9579988 9091581
5312 9091581 9056338 8997316 9069163 9172606 8883789 8454602 8429004 8768874 8570443 8174073
5302 8174073 8086734 7928176 7931163 8038207 8168688 7937311 8015040 7799477 7390648 7418148
5292 7418148 7765233 7627923 7824815 7960152 8184116 8041014 7810451 7749609 7726359 7493768
5282 7493768 7493814 7686618 7558382 7610956 7383403 7354040 7432948 7092180 7114640 7245083 6945284
5271F945284l0015l70206j04206N92437m1862n72329l99581K99551M2524k14262
5261F147335K27540J19498l45514K70374L9841k4773l19373J89985L6678P9030
5251F420621J30836k60295K2659j2569o5525o7312K34970R4676j16794m23905
5241E957362J57404j84744m24614K29545K11605M8654K21647j5415k7356j02277
5231F071811m31175P3413j06624P5402K02079o25974k40974k05229O45694q8198
5221E370225m9120l02442j1269J71348m1180o4143Q1021l54198m4129J35301J47136
5210E038550q0474m51956J42761L26172M78413l49050j23703k58900j20870j56298
5200D444645p7329N01667k28344j37588K94966r6318j74565K92014l07972M18620
$$ plain form
5271 6945284 6915269 6545063 6440857 7033294 6991432 6419103 6019522 6319073 6361597 6147335
5261 6147335 6374875 6494373 6148859 6419233 6459074 6434301 6114928 6304913 6341591 6420621
5251 6420621 6551457 6291162 6313821 6301252 6235727 6168415 6403385 6498061 6381267 5957362
5241 5957362 6114766 5930022 5505408 5734953 5946558 5995212 6216859 6201444 6174088 6071811
5231 6071811 5640636 5714049 5607425 5682827 5884906 5258932 5017958 4812729 5458423 5370225
5221 5370225 5321105 5018663 5007394 5178742 5137562 5073419 5154440 4800242 4756113 4891414 5038550
5210 5038550 4958076 4506120 4648881 4975053 5453466 5104416 4980713 4721813 4600943 4444645
5200 4444645 4367316 4868983 4640639 4503051 4798017 4701699 4527134 4819148 4511176 4929796
5190D929796l55851j73104L95471l84273K34636L74953j42254m58748k54253L19265
5180D485638k71931n3687L13361j66506K70778M9260j79366J14423R1700K19012
5170D872682l26719k18866J12378m6150L3806Q6679n2552m18587O8727j99200
5160C912198K24181P0926J36859j40606m01253r4758n4065r7738O88210j69321
5150D074633L7419m645J05071K73839L5720k06655q28939K34038K16635L9732
5140C976848l9727J95497L76434m33158m15867k54477k01759L29547N05888m2395
5130C996831j42066m02750L08182j79191o3635N12671K13643m22244l52252n9369
5120C409820N36538j20847r3021j91745J38430p2043l99988J62409r001K66122
$$ plain form
5190 4929796 4573945 4400841 4796312 4412039 4646675 5021628 4879374 4420626 4166373 4485638
5180 4485638 4213707 4160020 4473381 4306875 4577653 4626913 4447547 4561970 4653670 4872682
5170 4872682 4545963 4327097 4439475 4393325 4427131 4513810 4461258 4042671 4111398 3912198
5160 3912198 4136379 4207305 4344164 4203558 3802305 3707547 3653482 3555744 4243954 4074633
5150 4074633 4112052 4107407 4212478 4486317 4522037 4315382 3486443 3720481 3937116 3976848
5140 3976848 3937121 4132618 4509052 4075894 3660027 3405550 3203791 3533338 4039226 3996831
5130 3996831 3854765 3452015 3760197 3581006 3517371 4030042 4243685 3821441 3469189 3409820
5120 3409820 3946358 3825511 3732490 3540745 3679175 3607132 3207144 3369553 3360552 3626674
5110C626674o2450N89238n83506j0024L43293j42405n37393o4263m0590K54296
5100C372870j2930K59641o3773L09397J45568j2704k01743l56407j61450k21205
5090C057264J64666P4432J58652N407m5789l71111J66915j29414K21315K24637
5080C526974k33254L54735N052n52896K76150K64357J47131J20996l88758o00543
5070B919944O3679J59911J5652j98623N03738J59423j31661n9824j08190j17875
5060C206174K44821L37203m38289j26173R3204L3845J17087l6561N00192m38999
5050C492504l09756P481K36709l4397k61255L52232r3232L07772l0067l22367
5040C345624J30839j19219q1786L2462j07877K56647J12658L5885o3075j07937
$$ plain form
5110 3626674 3564224 4153462 3569956 3559932 3903225 3760820 3223427 3159164 3118574 3372870
5100 3372870 3359940 3619581 3555808 3865205 4010773 3998069 3796326 3439919 3278469 3057264
5090 3057264 3221930 3296362 3455014 3460421 3414632 3043521 3210436 3081022 3302337 3526974
5080 3526974 3293720 3648455 3653507 3100611 3376761 3641118 3788249 3909245 3520487 2919944
5070 2919944 2983623 3143534 3159186 2960563 3464301 3623724 3492063 3432239 3324049 3206174
5060 3206174 3450995 3788198 3349909 3223736 3316940 3350785 3467872 3431311 3931503 3492504
5050 3492504 3182748 3190229 3426938 3392541 3131286 3483518 3390286 3698058 3667991 3345624
5040 3345624 3476463 3357244 3275458 3307920 3200043 3456690 3569348 3605233 3542158 3434221
5030C434221N35945l69494k49091K70495J87445J63401M2457K20566j54042M69485
5020D551388l15574J11191k79695q8146K19144J36169J27462l48793Q0355o271
5010D187230J96652K89012J09277p6212p8149L47632p0953J60421j13588K77104
5000E228426J29554l9219J08774Q519l5853k24140p087k45908n7131N8428J95840
4989E120203J1540K2226J03545M46767m44190n20766L96455m9096K04025p7778
4979E212931O2862J72757J58284k97316j43945l08896K94194M18822o755m7435
4969E515503K05468M73888M31888n76370k94616L97806M33813J14764j48726j23453
4959F429965N4627K08356K81724J58955q0223J7820j16973J00020J13837J86478
$$ plain form
5030 3434221 3970166 3600672 3351581 3622076 3809521 3972922 4015379 4235945 4081903 4551388
5020 4551388 4235814 4347005 4067310 3979164 4198308 4334477 4461939 4113146 4193501 4187230
5010 4187230 4383882 4672894 4782171 4705959 4627810 4975442 4904489 5064910 4951322 5228426
5000 5228426 5357980 5318761 5427535 5436054 5400201 5176061 5168974 4923066 4865935 4924363 5120203
4989 5120203 5131743 5153969 5257514 5704281 5260091 4739325 5135780 5086684 5290709 5212931
4979 5212931 5275793 5448550 5606834 5309518 5165573 4856677 5150871 5569693 5562938 5515503
4969 5515503 5720971 6194859 6626747 6050377 5755761 6153567 6587380 6702144 6553418 6429965
4959 6429965 6484592 6692948 6974672 7133627 7053404 7071224 6954251 7054271 7168108 7354586
4949G354586N2245J02555N77175l18712j50516K8528m8034m5349j63957k6583
4939G361938o18043j22548J00595K18435m30935m1629j53925K06681J38393O6407
4929F725369l97048O9465J86095j31742m48371L52171q254k25920k18147J22405
4919F026023L76700L8959k95740J21024K44335k70605m65800K25120N89802r6373
4909F493445l05445j55699n3235L4749K41037R9532m8461J60750k98055m14345
4899E754273m2503O020Q2971J21786k71823K2077j07824k85067P6342j91986r5710
4888E068556k71264l82798L75947n6348j76436k48628K06597l77880l24725L56553
4878D169574j36447M80080k61413j404n49274k43474N19803R549l75342J17930
$$ plain form
4949 7354586 7406831 7509386 8086561 7767849 7617333 7645861 7597827 7552478 7388521 7361938
4939 7361938 6743895 6621347 6721942 6940377 6509442 6467813 6313888 6520569 6658962 6725369
4929 6725369 6328321 6397786 6583881 6452139 6003768 6355939 6347685 6121765 5903618 6026023
4919 6026023 6402723 6441682 6145942 6266966 6511301 6240696 5774896 6000016 6589818 6493445
4909 6493445 6188000 6032301 5979066 6013815 6254852 6354384 6305923 6466673 6168618 5754273
4899 5754273 5711770 5717790 5800761 5922547 5650724 5672801 5564977 5279910 5356252 5164266 5068556
4888 5068556 4797292 4414494 4790441 4734093 4557657 4309029 4515626 4137746 3813021 4169574
4878 4169574 4033127 4513207 4251794 4250390 3701116 3457642 3977445 3986994 3611652 3729582
4868C729582l7581K67605j2293K2746l89465l3555K92278n2001j23679k03775
4858C459862l03511M0252N9919k76061k39665k71939L68959M18719m44329m4423
4848B767783j3237j4048L15811l01762L52344R1387p7043L33910J09427q5657
4838C478915l6578j59440R157R3255J583l1954k1377l731j74967K61831j42613
4827C274081o6539l66199K904o400K43401k4340j6854L34680k32803o6939R5P6121
4815C151208l76097J15214L15263M5598l6717j00103q4135M33948M28947O765
4805C899891K66684l77632k79407j3256j13345J67334J02858J05206P7748L13105
4795D149186l0740N18195M6806K8354Q311L5865j26095k55449K39058L50310k7048
$$ plain form
4868 3729582 3692001 3959606 3947313 3970059 3580594 3547039 3839317 3787316 3663637 3459862
4858 3459862 3156351 3196603 3256522 2980461 2740796 2468857 2837816 3256535 2812206 2767783
4848 2767783 2754546 2740498 3056309 2754547 3106891 3198278 3121235 3455145 3564572 3478915
4838 3478915 3442337 3282897 3292054 3385309 3386892 3354938 3333561 3329830 3154863 3416694 3274081
4827 3274081 3207542 2841343 2844247 2837847 3081248 3056908 3040054 3374734 3141931 3074992 3075087 3151208
4815 3151208 2775111 2890325 3205588 3251186 3214469 3114366 3030231 3464179 3893126 3899891
4805 3899891 4166575 3788943 3509536 3496280 3382935 3550269 3653127 3758333 3836081 4149186
4795 4149186 4118446 4636641 4683447 4711801 4720112 4755977 4629882 4374433 4613491 4963801 4936753
4784D936753l53597L00912r4954p9869M52113K83630k1665k42980j53904q3056
4774D943383k71958m7859O41409L1709k12612J88257O8923k43407N734J62434
4764E266013j92149l00866J53953M74712n205m2720J8358K70207j98194L23539
4754E767648J28802K04944O0529m3627j06265m0811K01060j17379k28742L34726
4744F160885k16075J88248J28925L11881J98494k86504J3601K3962q990l5710
4734F478717L9066k47693j88435K15595J2705q1927K82318l8822K93709n99819
4724F165414j57145L4483n921K6280K40481q1128P1583j49876j48959j98749J45258
4713E941721J62177j16078K21068l418m53342N0055L37698j87773j62287K76125
$$ plain form
4784 4936753 4583156 4884068 4789114 4709245 5161358 5444988 5423323 5180343 5026439 4943383
4774 4943383 4671425 4623566 5264975 5296684 5084072 5272329 5341252 5097845 5103579 5266013
4764 5266013 5073864 4772998 4926951 5401663 5396458 5353738 5372096 5642303 5444109 5767648
4754 5767648 5896450 6101394 6161923 6118296 6012031 5971220 6172280 6054901 5826159 6160885
4744 6160885 5944810 6133058 6261983 6573864 6772358 6485854 6499455 6523417 6514427 6478717
4734 6478717 6517783 6270090 6081655 6297250 6309955 6228028 6510346 6471524 6765233 6165414
4724 6165414 6008269 6042752 6036831 6063111 6303592 6222464 6294047 6144171 5995212 5796463 5941721
4713 5941721 6103898 5987820 6208888 6205470 5752128 5802183 6139881 5952108 5789821 6065946
4703F065946O0362N54427J27201l94459M00466q6449K75522K44079m14247k94324
4693F538524P4997J07176k15656M8929K17025K06822j76236l27664l1759r0626
4683F351532m6704l9417J78165m39707n86553L2697J50358n91470K0195J89496
4673E218592K316l00659K38563J75635k24220m93997j37204K83738P6452k36388
4663D602828o73391j16052r9181m2487l8146R134J84171J55421j26535J3493p1389
4652C797866L49947K8680r4361r9815k72714o7223L54357k28075o5045O3439n6944
4641C710112j3078k28415l5122K4636L95218j54039o2873m03661q6436K15469
4631C361811j92956j17674j73189l59845l5047K85037N6350k8585J37082j66704
$$ plain form
4703 6065946 6126308 6680735 6807936 6413477 6813943 6727494 7003016 7247095 6832848 6538524
4693 6538524 6613521 6720697 6505041 6553970 6770995 6977817 6801581 6473917 6442158 6351532
4683 6351532 6304828 6265411 6443576 6003869 5417316 5450013 5600371 5008901 5029096 5218592
4673 5218592 5220908 4920249 5158812 5334447 5110227 4616230 4479026 4762764 4839216 4602828
4663 4602828 3929437 3813385 3714204 3671717 3633571 3642705 3826876 3982297 3855762 3869255 3797866
4652 3797866 4147813 4176493 4082132 3982317 3709603 3642380 3996737 3768662 3703617 3767056 3710112
4641 3710112 3697034 3468619 3433497 3458133 3853351 3699312 3636439 3232778 3146342 3361811
4631 3361811 3168855 3051181 2877992 2518147 2483100 2768137 2824487 2795902 2932984 2766280
4621B766280J66605m620j92965j2569m02346L38458K42526j66000j77970l8002
4611B519397J55408k84487J37307K98970l865q248l04791o8460L7929L56090K49634
4600C084884l03386j96319q8952K31341L37152k5358p4297q6107J07802l04858
4590B681902Q4847k62655L28462j00662N621M6968r8172K14455O7922j19122k59880
4579B589686j78182l7944K17087N55785R8032k10886P4929m84274L4631j22913
4569B535951L76239J56213j45172j98227O9990K59788j82604j03537P17617J8017
4559C504275m01292k0695o8615O8019j00774l45088n53679J02020L99856K47727
4549B831754n2023K24523M13006P4231k10642l32658K14584J52469J31002q6407
$$ plain form
4621 2766280 2932885 2928265 2735300 2722731 2320385 2658843 2901369 2735369 2557399 2519397
4611 2519397 2674805 2390318 2527625 2826595 2822730 2814482 2509691 2441231 2479160 2835250 3084884
4600 3084884 2781498 2585179 2496227 2727568 3064720 3039362 2965065 2878958 2986760 2681902
4590 2681902 2766749 2504094 2832556 2731894 2737515 2784483 2686311 2900766 2968688 2849566 2589686
4579 2589686 2411504 2373560 2590647 3146432 3244464 3033578 3108507 2624233 2658864 2535951
4569 2535951 2912190 3068403 2923231 2725004 2794994 3054782 2872178 2768641 3486258 3504275
4559 3504275 3102983 3082288 3013673 3081692 2980918 2635830 2082151 2184171 2584027 2831754
4549 2831754 2779731 3004254 3417260 3491491 3280849 2948191 3162775 3315244 3446246 3359839
4539C359839n239m61847M77308N500q7444O20296M7049n10188O7511j67981J99536
4528C544340l4543j18796L60001j17188k83049q761J21767N21789M95550N3716
4518D534826l57198k9969k42703K63090K95127l65957J64112J95544R0750J39404
4508D687026j80516j64556L4333M2638K96033j69904J25571q1212L69900J28624
4498E087937j5809l58515p0368N91125N48801K05448k0099l6840j36972R9389
4488E894097k28397n19659K70552L45422J40356M1067R4204j85121k1783L39020
4478F169758K3796L74760Q2018j66940K29491j03301N27248m2306J59927l19916
4468F934535Q4797L22175L12513J10457l98582J59542R2337L26848P26431J81337
$$ plain form
4539 3359839 3354600 2892753 3370061 3375561 3288117 3908413 3955462 3445274 3512785 3344804 3544340
4528 3544340 3509797 3391001 3751002 3633814 3350765 3342004 3463771 3985560 4481110 4534826
4518 4534826 4177628 4147659 3904956 4168046 4463173 4097216 4261328 4456872 4547622 4687026
4508 4687026 4506510 4341954 4376287 4418925 4714958 4545054 4670625 4589413 4959313 5087937
4498 5087937 5072128 4713613 4643245 5234370 5783171 5988619 5968520 5931680 5794708 5894097
4488 5894097 5665700 5146041 5416593 5762015 5902371 5943438 6037642 5852521 5830738 6169758
4478 6169758 6193554 6568314 6650332 6483392 6712883 6609582 7136830 7094524 7254451 6934535
4468 6934535 7019332 7341507 7654020 7764477 7365895 7525437 7617774 7944622 8671053 8852390
4458H852390R2223P39917l58620k62807J96669N0974O44886N64495J55368k34340
4448A0441155K89429O45656J07382K41002L75815J17820l7151K09930L59992Q14181
4438A3565211P9257M01771Q26103j43622K50195O90523L72334M14591L37440K93574
4428A7087377N40561M66947Q81235O78452M91984M88780J118176N20033Q35859
4419B3109404Q63494M82967J048865J772412J301904R12948J266163J505549J995417
4410C4259123J802145K201851L055215L248305L381844M092451M404781N405244
4402F1850959O455781P565938Q791162R070989P690835N162803M037086M894590
4394A15520143O233099P979912J0802997J2630788J0832737N765191j43755k058870
$$ plain form
4458 8852390 8944613 9684530 9325910 9063103 9259772 9310746 9955632 10520127 10675495 10441155
4448 10441155 10730584 11376240 11483622 11724624 12100439 12218259 12181108 12391038 12751030 13565211
4438 13565211 13644468 14046239 14872342 14728720 14978915 15669438 16041772 16456363 16793803 17087377
4428 17087377 17627938 18094885 18976120 19654572 20146556 20635336 21753512 22273545 23109404
4419 23109404 23972898 24455865 25504730 27277142 28579046 29491994 30758157 32263706 34259123
4410 34259123 36061268 38263119 41318334 44566639 47948483 52040934 56445715 61850959
4402 61850959 68306740 75872678 84663840 93734829 101425664 106588467 110625553 115520143
4394 115520143 121753242 129733154 140536151 153166939 163999676 169764867 169621112 167562242
4386A67562242j54132L870078P550517J0212157J0306623L676621o505698j2573176
4378A83945232j2250275q874135m536138p24704N68883k16418o176743j2182638
4370A39553064j3289527j1852156q761083n436703l776580l855407m747054o924435
4362H0910119q750317q280880p232777n447616m829199l395562l111647k289223
4354C7572898k016075k045215j563709j985895j756178r34989o73319j252709
4346B5344809j043516j032067r74414p97619m21830j004534o50334p18531r70283
4337A7731681j56632n0824m32700o11376n63927k01824J85157n22963n11349n25579
4327A4339664o23631m25306N1127j00089n95614k06475k01699J11474k271m75197
$$ plain form
4386 167562242 167408110 171278188 178828705 189040862 199347485 203024106 196518408 183945232
4378 183945232 171694957 162820822 158284684 157559980 158128863 157912445 151735702 139553064
4370 139553064 126263537 114411381 105650298 100213595 96437015 92581608 87834554 80910119
4362 80910119 72159802 63878922 56646145 51198529 46369330 42973768 39862121 37572898
4354 37572898 35556823 33511608 31947899 29962004 28205826 27270837 26597518 25344809
4346 25344809 24301293 23269226 22294812 21497193 21075363 20070829 19420495 18701964 17731681
4337 17731681 17575049 17524225 17091525 16480149 15916222 15714398 15899555 15376592 14865243 14339664
4327 14339664 13716033 13290727 13341854 13241765 12646151 12439676 12237977 12349451 12347180 11871983
4317A1871983j50133j22461l42521n83090k46960K24577k51536k06394J33610
4308A0327075k95703N4614N8566k54556j23694j78917L0771o8986K68492k55511
4298I562151o09202L24104L40837l29993J101n5495q8670j3081r2994k98926J18383
4287H858215j72928L44583J64915K88478m76454k18995K14657N6395j08503J28722
4277I079085L33220j73276K69314K67201J03804r8289Q3742k07474J35283P7378
4267I869988K34064l50273j11323L65472L17736J78858N70287L2718J46812N77253
4257A1831592J91031K70099j44821N91175N65637o3802k18507L63008N80414L04323
4247A4270149K93360O55281N35918N38601Q28557M32680P07908O56704L09799
$$ plain form
4317 11871983 11721850 11599389 11256868 10673778 10426818 10651395 10399859 10193465 10327075
4308 10327075 10031372 10085986 10144552 9889996 9766302 9587385 9618156 9549170 9817662 9562151
4298 9562151 8952949 9277053 9617890 9287897 9288998 9233503 9144833 9131752 9038758 8739832 8858215
4287 8858215 8685287 9029870 9194785 9483263 9006809 8787814 9002471 9058866 8950363 9079085
4277 9079085 9412305 9239029 9508343 9775544 9879348 9781059 9864801 9657327 9792610 9869988
4267 9869988 10104052 9753779 9642456 10007928 10325664 10504522 11074809 11107527 11254339 11831592
4257 11831592 12022623 12292722 12147901 12739076 13304713 13240911 13022404 13385412 13965826 14270149
4247 14270149 14563509 15218790 15754708 16293309 17121866 17554546 18262454 18919158 19228957
4238A9228957L31968R15866N39514N51707M50779N3357J517139R52540P48906
4229B5290733J234284J049982J052138J544241J801182J996591J913845K213275
4221C8096271K706741K535653K893614L736784M093546M421729N367451N795806
4213F9647595N173919M736741L552008J957497N5147k419991m162130n533264
4205G3007522o265247n982895n071556m478782l840120l377569k365251k261624
4197C9364478j637731j518594j670605q79278q43901o75373l17552o59736o77682
4188C0484026m04073p11929j054473j91893l62830j304310j036666k39973j36012
4179B5041867l35988o34459p57606k36589p7980m61984q12630l03670m95958p86117
$$ plain form
4238 19228957 19560925 20476791 21016305 21568012 22018791 22072148 23589287 24541827 25290733
4229 25290733 26525017 27574999 28627137 30171378 31972560 33969151 35882996 38096271
4221 38096271 40803012 43338665 46232279 49969063 54062609 58484338 63851789 69647595
4213 69647595 74821514 79558255 83110263 85067760 85122907 82702916 78540786 73007522
4205 73007522 66742275 60759380 55687824 51209042 47368922 43991353 41626102 39364478
4197 39364478 37726747 36208153 34537548 33658270 32814369 32138996 31821444 31161708 30484026
4188 30484026 30079953 29368024 28313551 28121658 27758828 26454518 25417852 25177879 25041867
4179 25041867 24705879 24071420 23313814 23077225 22999245 22537261 21724631 21420961 20925003 20138886
4169B0138886n42092q25232l79755L28215j90147k68636k52159j03448j68493
4160A7737139j64554K1440j13209K3345J91330m98803n81947k16665m87805k80996
4150A5629275p4515j66399k67155j32005m89899k59603j26336m5848J77057K76090
4140A4520662K16938j57596J21162R779K98813j2141M39203j80006M4556M27571
4130A5728941K37547k7094r4372l09582M60532M77685p5791j32734q7083J04833
4120A6282882N20294J15470K33836K98540J5468R02878K12924M21223M86286K54678
4110A9744479O89153O46792M02827O62826O033L48569K16562O94417l5260O60854
4100B4037252J337398M72505N9643Q70328N18459N04691J019687J011965N12682
$$ plain form
4169 20138886 19596794 18771562 18391807 18720022 18529875 18261239 18009080 17905632 17737139
4160 17737139 17572585 17594025 17480816 17504161 17695491 17196688 16614741 16398076 15910271 15629275
4150 15629275 15554760 15388361 15121206 14989201 14499302 14239699 14113363 14067515 14244572 14520662
4140 14520662 14737600 14580004 14701166 14710945 15009758 14997617 15436820 15256814 15301370 15728941
4130 15728941 15966488 15939394 15845022 15535440 15995972 16473657 16397866 16265132 16178049 16282882
4120 16282882 16803176 16918646 17152482 17451022 17466490 18369368 18582292 19003515 19489801 19744479
4110 19744479 20433632 21080424 21483251 22146077 22152110 22500679 22717241 23411658 23376398 24037252
4100 24037252 25374650 25847155 25906798 26777126 27295585 27800276 28819963 29831928 30344610
4091C0344610P04519R99634R71697J124111P55850J626533K024948J853101K291020
4082D2696023J588149K810798L175878L282993L825659M816943N575745N519322
4074G3291510N615913O050108P028837P624950P506815N917037N88823m656727
4066A08967266q517815j0486248r080789p845512o355061m944526m180455m111122
4058E3445738l598741k704142k744753k285781j899798k247128j523262j357121
4050C5085012j033704j585952r69168j588437j007190k57776r85452o30805n32647
4041B6493881j45498m11312m24353p18587n60642o16779o05361j93674m27928
4032B2389747o76554m03300l96369n26187m55936o4010K94096j22714k20744j63917
$$ plain form
4091 30344610 31049129 32048763 33020460 34144571 34900421 36526954 38551902 40405003 42696023
4082 42696023 44284172 47094970 50270848 53553841 57379500 62196443 67772188 73291510
4074 73291510 78907423 84957531 91986368 99611318 107118133 113035170 113623993 108967266
4066 108967266 100449451 89963203 80882414 73036902 66681841 61737315 57556860 53445738
4058 53445738 49846997 47142855 44398102 42112321 40212523 37965395 36442133 35085012
4050 35085012 34051308 32465356 31496188 29907751 28900561 28642785 27657333 27026528 26493881
4041 26493881 26348383 25937071 25512718 24794131 24233489 23616710 23011349 22817675 22389747
4032 22389747 21713193 21309893 20913524 20387337 19931401 19867391 20161487 20038773 19818029 19654112
4022A9654112J65301K37118K72508L69861P6679N07778R90395J248881J030272
4013B4552905J037110J815769J286566J855160K180008L117093M455328O019462
4005D6319401N814863P846922J0014786J4152794J8628063J6253437j4021393
3998A05008873k7470469j8229261j3082452q201862n345645l376195l677381k213183
3990B3412425j964024j382075j404185n75294q40860n23405j120062q95477m55649
3981A4251394o62377l44539j93884l10623n64958m65076j84538m62589k30142
3972A0832668l1072o9773j6001J52702l75315j31544l17570k34229l46997J97274
3962I660143J2270j69959o01862p7230m65040r4297j40295J16122j66781l80293
$$ plain form
4022 19654112 19819413 20056531 20329039 20698900 20775579 21283357 22273752 23522633 24552905
4013 24552905 25590015 27405784 28692350 30547510 32727518 35844611 40299939 46319401
4005 46319401 52134264 59981186 69995972 84148766 102776829 119030266 105008873
3998 105008873 77538404 59309143 46226691 38024829 32679184 29302989 25625608 23412425
3990 23412425 21448401 20066326 18662141 18086847 17245987 16722582 15602520 14707043 14251394
3981 14251394 13589017 13244478 13050594 12739971 12175013 11709937 11525399 11062810 10832668
3972 10832668 10801596 10731823 10715822 10868524 10493209 10361665 10044095 9809866 9462869 9660143
3962 9660143 9672413 9502454 8900592 8823362 8358322 8264025 8123730 8239852 8073071 7692778
3952G692778l84781M3637k25876J40937j61403m47822j05787k75263n7921L38717
3942F557216r5594J8995j78015m02008K92182j61278l07094L4979l64236j20297
3932E274850j10759k27958L62618K90405l57444M25177j78244K18407n35645n57380
3922D604027O68861L074n42063k8965K66551k56521l1954l8410j20768L41049
3912D864881m52164K29626l06151l51722J06305k323N15773k89603J17969j60602
3902D271989O0280J63967l75824k97536K38061K39346K07058k28195j80536j90534
3892C908076l88712n5064J0916K38940K91799k13479M09926l89849L41838k04491
3882C949900m27685p4968K60774l6889j16883j84836J84755N6705m7605j45025
$$ plain form
3952 7692778 7307997 7351634 7125758 7266695 7105292 6657470 6551683 6276420 6218499 6557216
3942 6557216 6461622 6480617 6302602 5900594 6192776 6031498 5724404 5759383 5395147 5274850
3932 5274850 5164091 4936133 5298751 5589156 5231712 5656889 5478645 5697052 5161407 4604027
3922 4604027 5272888 5275962 4733899 4704934 4971485 4714964 4683010 4644600 4523832 4864881
3912 4864881 4412717 4642343 4336192 3984470 4090775 4088452 4604225 4314622 4432591 4271989
3902 4271989 4332269 4496236 4120412 3822876 4060937 4300283 4507341 4279146 4098610 3908076
3892 3908076 3519364 3464300 3475216 3714156 4005955 3792476 4202402 3812553 4154391 3949900
3882 3949900 3522215 3447247 3708021 3671132 3554249 3369413 3554168 3610873 3563268 3418243
3872C418243K11127K25787m0916l68613J12435M4985k20905J7071r1011K16448
3862C524651N34944J36408j30627n00219k68206M95382J72013l58010O3780j89805
3852C480311J98122j77787k15660K87005M05305K92689J30046r5711o8921j37990
3842D097409n4993L19097j3017m520k08373j9035j56100n5762J12599J60124q4348
3831D093081L17817J50288N2458n41605n12974J74292N4566k0659L02406j94259
3821C875411M8585M24648j29259N5091J88260J33245R8878k88702l33489K90051
3811D362719L95046J06341K14163k02755J10816N764Q0968N1745j28012m9174
3801D947621K80580k12327o4293L8412M71623k10927j80888K91164J57936N6527
$$ plain form
3872 3418243 3629370 3855157 3814241 3445628 3558063 3603048 3382143 3399214 3308203 3524651
3862 3524651 4059595 4196003 4065376 3565157 3296951 3792333 3964346 3606336 3670116 3480311
3852 3480311 3678433 3500646 3284986 3571991 3977296 4269985 4400031 4304320 4235399 4097409
3842 4097409 4042416 4361513 4348496 4343976 4135603 4116568 3960468 3904706 4017305 4177429 4093081
3831 4093081 4410898 4561186 4613644 4072039 3559065 3733357 3787923 3767264 4069670 3875411
3821 3875411 3923996 4348644 4219385 4274476 4462736 4595981 4694859 4406157 4072668 4362719
3811 4362719 4757765 4864106 5078269 4875514 4986330 4992094 5073062 5124807 4996795 4947621
3801 4947621 5228201 5015874 4951581 4989993 5461616 5250689 5069801 5360965 5518901 5575428
3791E575428L91540J75348j99891O4820K96755N8882J20874M51761j12928l22269
3781F500320j53607K32661j32221K09037q9716l87695j08266K95458J13275k4674
3771F454572k99654j49073L80950j54903N4438j25287p5586K06422k20539J44325
3761F215665M03319p0136k2792L6519L71169O6660j79637n5006L83478j91910
3751F957329l29763K29154K37935k90862K22971M84631l8982O7565l51865J30943
3741G319056P1319J09305J91689M07804J02038M7736k22409l0083P2979O4120
3731H133554m82842J08872L3265j45481K56562L59647j41457N4791N02027l2074
3721H646864k1991L2860K19351l05050P0338M53174Q5416K33802K3201K21413
$$ plain form
3791 5575428 5966968 6142316 5942425 6007245 6304000 6362882 6483756 6935517 6822589 6500320
3781 6500320 6346713 6579374 6447153 6656190 6566474 6178779 6070513 6365971 6479246 6454572
3771 6454572 6154918 6005845 6386795 6231892 6286330 6161043 6085457 6291879 6071340 6215665
3761 6215665 6618984 6548848 6526056 6562575 6933744 7000404 6820767 6765761 7149239 6957329
3751 6957329 6627566 6856720 7094655 6803793 7026764 7511395 7472413 7539978 7188113 7319056
3741 7319056 7390375 7499680 7691369 8099173 8201211 8248947 8026538 7996455 8069434 8133554
3731 8133554 7650712 7759584 7792849 7647368 7903930 8263577 8122120 8176911 8678938 8646864
3721 8646864 8624873 8657733 8877084 8572034 8642372 9095546 9180962 9414764 9437965 9659378
3711I659378J45613J53368N08853K30001k32191L59864N65047N20747J99523J29537
3701A2239740M62866J95350N52149O44581M37962K04989R9331M67895O12492M96634
3691A6413989O44284M25788O24077Q3527J24842J47225J04585M38959L60702j221
3681A9366757K38870J51440K10500P10979K68754m71418R0320M51438K68621l66190
3671B0920071o18709K46029n0022l25781m65332q2547j04979n41050m09084k88713
3661A8279883M88364j37428l79162l57408l45253m50310m73685m96048k34872
3652A5894081o47757p59361J99107n40618m24571j34859l12561n27554m78288
3643A2267619K9076O6330q37513j32157n3197k47400k38269p7742j13819K68904
$$ plain form
3711 9659378 9804991 9958359 10467212 10697213 10465022 10824886 11389933 11910680 12110203 12239740
3701 12239740 12702606 12897956 13450105 14094686 14532648 14737637 14836968 15304863 15917355 16413989
3691 16413989 17058273 17484061 18108138 18191665 18316507 18463732 18568317 19007276 19367978 19366757
3681 19366757 19605627 19757067 19967567 20678546 20947300 20475882 20566202 21017640 21286261 20920071
3671 20920071 20301362 20547391 20497369 20171588 19706256 19623709 19518730 18977680 18568596 18279883
3661 18279883 18768247 18630819 18251657 17894249 17548996 17098686 16625001 16128953 15894081
3652 15894081 15246324 14486963 14686070 14145452 13720881 13586022 13273461 12745907 12267619
3643 12267619 12296695 12363025 11525512 11393355 11340158 11092758 10854489 10776747 10662928 10931832
3633A0931832k29854o6915N54590o41025j00590M35923j83479n8029K92731l96268
3623A0538916R6912P11456k34215j90115L68906k8791l96633J26788L48085n33163
3613A0808146J54644L3028j7602j30809J67733K64223K391M9174P9020k49412
3603A1160536K55780j30927j92160K53539P2473K71785m78421L0140K26481Q8905
3593A1558131k34336N8426l87584k47785L17540K70970L68335m18604o7870j43875
3583A1073348L8602L59631k44925L38552P3502K09976O6018j11540J89782j96021
3573A1796925J06807N35416j31057m2609L8231K31578O38617N99583k72702k70832
3563A3229957L38249L7586j05651N21875J97112j92680p5233l349K8869r5816
$$ plain form
3633 10931832 10701978 10635063 11189653 10548628 10448038 10883961 10700482 10642453 10935184 10538916
3623 10538916 10635828 11347284 11113069 10922954 11291860 11263069 10866436 10993224 11341309 10808146
3613 10808146 10962790 10995818 10978216 10847407 11015140 11279363 11281754 11330928 11409948 11160536
3603 11160536 11416316 11285389 11093229 11346768 11419241 11691026 11212605 11242745 11469226 11558131
3593 11558131 11323795 11382221 10994637 10746852 11064392 11335362 11703697 11285093 11217223 11073348
3583 11073348 11111950 11471581 11226656 11565208 11638710 11848686 11914704 11803164 11992946 11796925
3573 11796925 11903732 12439148 12308091 12265482 12303713 12535291 13173908 13773491 13500789 13229957
3563 13229957 13568206 13605792 13500141 14022016 14219128 14026448 13951215 13947866 13976735 13880919
3553A3880919j83763j90772J17972o94554L40964N36152L9664j43317k66183M34177
3543A3871259j03200o83651L44942J40937M48332l3902k10797j60288P84009P8337
3533A4475978L10995K62935o0370J50541J73162N99502N4606J55829J71029J52967
3523A6447174L30944O80798K57786L25597M96635J078488L56579M59428M07656
3514B0841085J152994R51085L69031M34183J075967R69767R49547Q52877Q58251
3505B8454787L73024R39302O25352J58730J191841O77917N02974R89046Q33286
3496C4746259M39648J221494Q01668Q11314J034339Q26957O84036L09471R06448
3487D1781634K68464J61676n41215p2677n30410q95360q53623j073876r05716
$$ plain form
3553 13880919 13697156 13506384 13624356 12929802 13270766 13806918 13846582 13703265 13437082 13871259
3543 13871259 13768059 13084408 13429350 13570287 14018619 13984717 13773920 13613632 14397641 14475978
3533 14475978 14786973 15049908 14989538 15140079 15313241 15912743 15967349 16123178 16294207 16447174
3523 16447174 16778118 17458916 17716702 18042299 18538934 19617422 19974001 20433429 20841085
3514 20841085 21994079 22945164 23314195 23748378 24824345 25794112 26743659 27596536 28454787
3505 28454787 28827811 29767113 30392465 30551195 31743036 32420953 32923927 33912973 34746259
3496 34746259 35185907 36407401 37209069 38020383 39054722 39881679 40565715 40875186 41781634
3487 41781634 42050098 42211774 41670559 41597882 41067472 40172112 39318489 38244613 37338897
3478C7338897r15079j010730r16658j031628r21713j093774q89528j049769j032980
3469B8477038r96628r07345l70195q09932j012436j130573k75107j382924o47811
3460B0944087o79690o05532j148390o93992n39258k66753p85810q74048k83483
3451A5067131R8093k60010l45645l68947p28524j96447j25544p1463n09799k76470
3441A2282375l02045j06409K03j10114n5193j01343j88576N7803J31706L64770
3431A1973177n2423k30002l01547j2649o6676J27113K37606p3936l56949k83153
3421A0960561K40304n1152m55655k49121j93103K5690n571n70085m35148M9094
3411I315814L16536k83200l44348l38706K5246k19839J74262M9510l20038k25965
$$ plain form
3478 37338897 36423818 35413088 34496430 33464802 32543089 31449315 30559787 29510018 28477038
3469 28477038 27480410 26573065 26202870 25392938 24380502 23249929 22974822 21591898 20944087
3460 20944087 20264397 19658865 18510475 17816483 17277225 17010472 16224662 15350614 15067131
3451 15067131 15165224 14905214 14559569 14190622 13462098 13265651 13140107 13068644 12558845 12282375
3441 12282375 11980330 11873921 11874124 11764010 11708817 11607474 11418898 11476701 11608407 11973177
3431 11973177 11920754 11690752 11389205 11376556 11309880 11436993 11674599 11600663 11243714 10960561
3421 10960561 11200865 11149713 10694058 10444937 10251834 10277524 10271953 9701868 9266720 9315814
3411 9315814 9632350 9349150 9004802 8666096 8691342 8471503 8645765 8695275 8375237 8149272
3401H149272j78185k67153k81039L14565J54917m0955O06524j65075m49988k98489
3391G544394K61861j86593j79262n8800j09408K75622J47039k11612l20410q34
3381G161997L61236K49130R4541j12432l30772m7654L6140K00080k91747j89885
3371G130634L0088J43843m1029j3126Q7592L98243k05002k8734M25717j099R6875
3360H024002M57635m09473Q0665j5929l6123J31470J33819J00573K98760o7054
3350H698345m9536M00021L53263q340k07242J48540l36632J8588R14485k51131
3340I680361L25682M49209K09002N98976l2415p3549P2668O5939N28202R54561
3330A2778636j47126K03830K74357J20330K75910N28880N11186N53076Q33058
$$ plain form
3401 8149272 7971087 7703934 7422895 7737460 7892377 7851422 8457946 8292871 7842883 7544394
3391 7544394 7806255 7619662 7440400 7381600 7272192 7547814 7694853 7483241 7162831 7161997
3381 7161997 7523233 7772363 7866904 7754472 7423700 7376046 7412186 7612266 7320519 7130634
3371 7130634 7160722 7304565 7263536 7250410 7338002 7736245 7531243 7502509 7928226 7927127 8024002
3360 8024002 8481637 8072164 8152829 8136900 8100777 8232247 8366066 8466639 8765399 8698345
3350 8698345 8648809 9048830 9402093 9393753 9186511 9335051 8998419 9017007 9931492 9680361
3340 9680361 10006043 10455252 10664254 11263230 11230815 11157266 11229934 11295873 11824075 12778636
3330 12778636 12631510 12835340 13109697 13230027 13505937 14034817 14546003 15099079 15932137
3321A5932137K62320L22636J73728O66682Q77241L09985J96021Q68355Q44072
3312B0453177O71249Q79018P16594Q72375J419141J288668J062834J290171J545565
3303C0198792J470384J643033J605412J501267K141801K150433J796706J776390
3295D4284218J975937J986587J698265J735126J471458N52425J172118O17868
3287E5494002K16550N08103K16697J2619k35606r1096O0743n16632o73812p14790
3277E4276778n00353r85509j426067j656519j533217j328355j475868j946445
3269D3424445j762684j324004j782410j174958j625093j465907j501275j502268
3261C1285846q13367r77754q90990q84734j010314n36820r53304o81001o19531
$$ plain form
3321 15932137 16194457 16517093 16690821 17357503 18234744 18544729 18740750 19609105 20453177
3312 20453177 21124426 22003444 22720038 23592413 25011554 26300222 27363056 28653227 30198792
3303 30198792 31669176 33312209 34917621 36418888 38560689 40711122 42507828 44284218
3295 44284218 46260155 48246742 49945007 51680133 53151591 53704016 54876134 55494002
3287 55494002 55710552 56218655 56435352 56447971 56212365 56121269 56182012 55665380 54991568 54276778
3277 54276778 53776425 52790916 51364849 49708330 48175113 46846758 45370890 43424445
3269 43424445 41661761 40337757 38555347 37380389 35755296 34289389 32788114 31285846
3261 31285846 30472479 29494725 28603735 27719001 26708687 26171867 25218563 24537562 23918031
3252B3918031p78615m18501r70013p61600m32395j25618m85079m46712l39509
3243A9159989m61541l386p22874l40137J67543m96760M50537m39080l90523L11850
3233A7235618l85035m44082p27573M2816L4060j30366r5263j60900k42538l37988
3223A4788749M5446j29312K40424j24040k32125k49866P1729k88611j11036j93760
3213A3817598J77723M10502j96817j31715M92263L21907m64336m99111M1365J57153
3203A4126532j49494j43058J36732r7074K36146m45765n21643k7887k05531Q7316
3193A2996274o08865l32585j90836n1365r7925q6736o6856q127K23639j35954
3183A1640664P9355k62183j55777K10385k97514P7353L17654K66149R1777K75102
$$ plain form
3252 23918031 23139416 22720915 21750902 20989302 20556907 20431289 19946210 19499498 19159989
3243 19159989 18698448 18695062 17972188 17632051 17799594 17302834 17753371 17314291 16923768 17235618
3233 17235618 16850583 16406501 15678928 15721744 15755804 15625438 15530175 15369275 15126737 14788749
3223 14788749 14834195 14704883 14945307 14821267 14589142 14339276 14411005 14122394 14011358 13817598
3213 13817598 13995321 14405823 14209006 14077291 14569554 14891461 14427125 13928014 13969379 14126532
3203 14126532 13977038 13833980 13970712 13873638 14109784 13664019 13142376 13114489 12908958 12996274
3193 12996274 12387409 12054824 11863988 11812623 11714698 11627962 11561106 11552979 11776618 11640664
3183 11640664 11720019 11457836 11302059 11512444 11214930 11292283 11609937 11876086 11967863 12242965
3173A2242965p2192K49049R4429M61008J20454L4558p5032J94552L67350O01817
3163A4218958M16413J44433O93002L29269J94321L34496M98465M03245R58869
3154A8191471R08859N07138O70759P44045O78685M43003K01669J21415M08997
3145B2876041l5038K69944L47702J24619p0044n86274j76703o8206m29955j016912
3135B1235174k95954L68998J62820j38777l44286j64838j02199M45655P58633
3126B1925226n5039M00253P33807L8469j89968l37034j9971M13935j95585m36242
3116B2277851o35419r56785o47030p3961p50519o70613q82834p39174m02185o60543
3106A5858788l29588n38368o17488p51822k42408n68701k71819l23341n68541
$$ plain form
3173 12242965 12170773 12419822 12514251 12975259 13095713 13130271 13055239 13249791 13617141 14218958
3163 14218958 14635371 14779804 15472806 15802075 15996396 16330892 16829357 17232602 18191471
3154 18191471 19100330 19607468 20278227 21022272 21700957 22143960 22345629 22467044 22876041
3145 22876041 22841003 23110947 23458649 23583268 23513224 22926950 22750247 22682041 22252086 21235174
3135 21235174 20939220 21308218 21471038 21332261 20987975 20823137 20720938 21166593 21925226
3126 21925226 21870187 22270440 23004247 23042716 22852748 22515714 22495743 22909678 22714093 22277851
3116 22277851 21642432 20685647 20038617 19964656 19214137 18543524 17660690 16921516 16519331 15858788
3106 15858788 15529200 14990832 14373344 13621522 13379114 12810413 12538594 12215253 11646712
3097A1646712k74356K1149j37898m04516L79758n18444l18362r2119m57298l94243
3087I450383j93495R1165J33246J16925j98780j84505k18282L3903m10483k3597
3077H596480j75457M16265N9205n8404l4241j54610L617K35635r9979j54299N18612
3066I152824M17350r3368m39315J4173l76792N1187l0224l62575m52932j61849
3056G718479j8250N263l9667m69367k34295k45952q0845L86067k17369N8463n02201
3045F360326k62342k3231n13307r0353k01815j32797L39513o5680o9288J31282
3035E472308M6842R9744P1461Q3486n61841j80462q3106k19658M26827j9048n59992
3024D576561L7456M22797J37197k03980Q144K37920l14536k10349k74732J99876
$$ plain form
3097 11646712 11372356 11393505 11255607 10851091 11230849 10712405 10394043 10301924 9844626 9450383
3087 9450383 9256888 9348053 9481299 9598224 9399444 9214939 8996657 9030560 8620077 8596480
3077 8596480 8421023 8837288 8896493 8838089 8803848 8649238 8652855 8888490 8788511 8634212 9152824
3066 9152824 9570174 9476806 9037491 9051664 8674872 8726059 8695835 8333260 7880328 7718479
3056 7718479 7700229 7705492 7665825 7196458 6962163 6716211 6635366 7021433 6804064 6862527 6360326
3045 6360326 6097984 6074753 5561446 5471093 5269278 5136481 5475994 5410314 5341026 5472308
3035 5472308 5519150 5618894 5690355 5773841 5212000 5031538 4948432 4728774 5155601 5136553 4576561
3024 4576561 4614017 5036814 5174011 4970031 4978175 5216095 4901559 4691210 4416478 4616354
3014D616354K48740m88861J81242Q3297j79949q9361K28968l26070L09055K12058
3004D795473l8655M27729j99995P2282K1485m49907j61828K00931L96030j547
2994E061998J64579K06998K63680k90369l14773O8659k45719K05703k08288k61477
2984D650991r1351M21300M8500K71626K76999k96802K59524K18501m4519o8256
2974E646513j25742J47205K28597O10636j77026l7223L33584k04171R5789K88762
2964F806924K1180j3967k56471M63211L05159k26726j5078j17556M43003L25175
2954G734854K60133K73845l3812o1080M19611K61616K27009J02630L32407K37490
2944I754703J12391K00221K51648L55479J50202L91839M33283J19006j08140N54615
$$ plain form
3014 4616354 4865094 4376233 4557475 4640772 4460823 4371462 4600430 4274360 4583415 4795473
3004 4795473 4756818 5184547 4984552 5056834 5078319 4628412 4466584 4667515 5063545 5061998
2994 5061998 5226577 5433575 5697255 5406886 5092113 5160772 4915053 5120756 4912468 4650991
2984 4650991 4559640 4980940 5029440 5301066 5578065 5281263 5540787 5759288 5714769 5646513
2974 5646513 5520771 5667976 5896573 6507209 6330183 6292960 6626544 6422373 6518162 6806924
2964 6806924 6828104 6814137 6557666 7020877 7326036 7099310 7084232 6966676 7409679 7734854
2954 7734854 7994987 8268832 8235020 8173940 8593551 8855167 9082176 9184806 9517213 9754703
2944 9754703 9867094 10067315 10318963 10674442 10824644 11216483 11649766 11768772 11660632 12215247
2934A2215247K82035O38422L00937R95731M06521k7928M29185M75483L58904N22750
2924A6597287P25012O87784J240686O37752K79141K39794R17675J191956J041899
2915B3558986R12659Q77865R92092J119114O09782J545024J837526J182917J543001
2906C4178966J659085J883103J726350K547837K451203K426410L157829L671222
2898E3702005M233787M416123M965265N256606N797778O117577O736125P856214
2890I9081480P901789P040826P028659N473683L176501R54858k533229n704865
2882A22419702o844435p989405p829996p814094o442739n136063n234308m476290
2874G0652372l676741l242979l099383k822579k919795k268553k016031k064329
$$ plain form
2934 12215247 12497282 13135704 13436641 14432372 14838893 14810965 15240150 15715633 16074537 16597287
2924 16597287 17322299 18010083 19250769 19888521 20167662 20407456 21325131 22517087 23558986
2915 23558986 24471645 25349510 26341602 27460716 28070498 29615522 31453048 32635965 34178966
2906 34178966 35838051 37721154 39447504 41995341 44446544 46872954 50030783 53702005
2898 53702005 57935792 62351915 67317180 72573786 78371564 84489141 91225266 99081480
2890 99081480 106983269 114024095 121052754 126526437 129702938 130657796 128124567 122419702
2882 122419702 115575267 107585862 99755866 91941772 85499033 80362970 75128662 70652372
2874 70652372 66975631 63732652 60633269 57810690 54890895 52622342 50606311 48541982
2866D8541982j694784j638815j682593k016875j046440j571055j503028j475764
2858C5912628r33994j160372j352597j367700j075192m69349r70975j413872n17626
2849B6650951l76577r81736j126019p04444m24574m72530n16342o13392q43644
2840B0591693p66465k54175l65749n76874l83327n58193q47622J54184j46183
2831A6847289p56526l53671K6972j22367m84526q6119j91092k45292o92956k91735
2821A3649977K03467k03109k89050o95845p1688j15393l44684n49045j32359O96120
2811A2148391L82485o32947J2684n79303k70376n84252q6963k18053m63159j67409
2801I541098j01681l95355o47555j24385L62768n22108m25655m91425K07453j30676
$$ plain form
2866 48541982 46847198 45208383 43525790 41508915 40462475 38891420 37388392 35912628
2858 35912628 34978634 33818262 32465665 31097965 30022773 29553424 28582449 27168577 26650951
2849 26650951 26274374 25292638 24166619 23462175 23037601 22565071 22048729 21435337 20591693
2840 20591693 19825228 19571053 19205304 18628430 18245103 17686910 16839288 16993472 16847289
2831 16847289 16090763 15737092 15764064 15641697 15157171 15071052 14879960 14634668 13941712 13649977
2821 13649977 13853444 13650335 13361285 12665440 12593752 12478359 12133675 11584630 11452271 12148391
2811 12148391 12530876 11897929 11910613 11331310 11060934 10476682 10389719 10171666 9708507 9541098
2801 9541098 9439417 9044062 8396507 8272122 8634890 8112782 7687127 7195702 7403155 7272479
2791G272479K5473j99450n87818Q3056r3960R7484o36824q1025n3299j16429m0264
2780E669423j14594n52401l8012J39023l90915Q9291K7398j49461O674N3665q4510
2769D655581L27461K12768m87186m54261J95902k03970k48814M42966O2508j46764
2759D356191n0220l78326N96341k98408l58422j68802K69466p1219n14084N65936
$$ plain form
2791 7272479 7297952 7098502 6510684 6593740 6499780 6597264 5960440 5879415 5826116 5709687 5669423
2780 5669423 5554829 5002428 4964416 5103439 4712524 4801815 4829213 4679752 4686426 4740091 4655581
2769 4655581 4983042 5195810 4708624 4254363 4450265 4246295 3997481 4440447 4502955 4356191
2759 4356191 4305971 3927645 4523986 4225578 3867156 3698354 3967820 3896601 3382517 3948453
$$ [...]
##END NTUPLES=NMR SPECTRUM
##END=
