##TITLE=1H_TG-2352-XY
 DMSO
 8 sc, 
 16.03.2022
##JCAMPDX= 6.0         $$ Bruker NMR JCAMP-DX V2.0
##DATA TYPE= NMR SPECTRUM
##DATA CLASS= NTUPLES
##ORIGIN= UXNMR, Bruker Analytische Messtechnik GmbH
##OWNER= root
$$ XWIN-NMR		Version 3.5
$$ Wed Mar 16 13:09:26 2022 Russian Standard Time (UT+4h)  she@DPX200
##.OBSERVE FREQUENCY= 200.131346
##.OBSERVE NUCLEUS= ^1H
##.ACQUISITION MODE= SIMULTANEOUS
##.ACQUISITION SCHEME= undefined
##.AVERAGES= 8
##.DIGITISER RES= 18
##SPECTROMETER/DATA SYSTEM= spect
##.PULSE SEQUENCE= zg30
##.SOLVENT NAME= DMSO
##.SHIFT REFERENCE= (INTERNAL, DMSO, 0, 15.7249)
##AUDIT TRAIL= $$ (NUMBER, WHEN, WHO, WHERE, WHAT)
$$ ##TITLE= Audit trail, XWIN-NMR		Version 3.5
$$ ##JCAMPDX= 5.01
$$ ##ORIGIN= Bruker BioSpin GmbH
$$ ##OWNER= she
$$ F:/spectra/data/she/nmr/H-F/1/pdata/1/auditp.txt
$$ ##AUDIT TRAIL=  $$ (NUMBER, WHEN, WHO, WHERE, WHAT)
(   1,<2022-03-16 13:08:25.76 +0400>,<she>,<DPX200>,
      <created by zg, POWCHK disabled, PULCHK disabled
       configuration hash MD5:
       00 E9 B6 7A A2 85 ED C7 34 08 36 98 17 FE 4E 26
       data hash MD5: 16K
       B0 D2 55 A1 C9 0F AC 04 69 A9 5B D4 30 FA C0 5D>)
(   2,<2022-03-16 13:08:28.60 +0400>,<she>,<DPX200>,
      <Start of raw data processing
       efp BC_mod = 2 LB = 0.24 FT_mod = 6 PKNL = 1 PHC0 = -16949.04 PHC1 = 11.00078 SI = 16K 
       data hash MD5: 16K
       82 1C 72 79 1D CF 94 B3 04 26 97 11 07 12 C5 A1>)
(   3,<2022-03-16 13:08:45.70 +0400>,<she>,<DPX200>,
      <pk PHC0 = -0.1962985 PHC1 = -5 
       data hash MD5: 16K
       29 2B B8 83 71 CA 6C A7 7B 3F D8 7D 03 FB FD C7>)
(   4,<2022-03-16 13:08:48.75 +0400>,<she>,<DPX200>,
      <abs ABSG = 5 
       data hash MD5: 16K
       B5 9E AA FC 09 BC 40 A0 AD C1 DC C6 11 4F 9B 8F>)
$$ ##END=
$$ 
$$ hash MD5
$$ E3 DB CA 04 22 E4 DC 43 4A 7F 41 56 A8 DE 2D 96
##$RELAX= 
##$RELAX= 
##$RELAX= 
##$RELAX= 
##$RELAX= 
##$RELAX= 
$$ Bruker specific parameters
$$ --------------------------
##$DU= <F:/spectra>
##$EXPNO= 1
##$NAME= <H-F>
##$PROCNO= 1
##$TYPE= <nmr>
##$USER= <she>
##$AMP= (0..31)
100 100 100 100 100 100 100 100 100 100 100 100 100 100 100 100 100 100 
100 100 100 100 100 100 100 100 100 100 100 100 100 100 
##$AQSEQ= 0
##$AQ_mod= 1
##$AUNM= <au_zg>
##$AUTOPOS= <>
##$BF1= 200.13
##$BF2= 200.13
##$BF3= 200.13
##$BF4= 200.13
##$BF5= 200.13
##$BF6= 200.13
##$BF7= 200.13
##$BF8= 200.13
##$BYTORDA= 1
##$CFDGTYP= 0
##$CFRGTYP= 5
##$CHEMSTR= <none>
##$CNST= (0..31)
1 1 145 1 1 1 1 1 1 1 1 1 1 1 1 1 1 1 1 1 1 1 1 1 1 1 1 1 1 1 1 1 
##$CPDPRG= <>
##$CPDPRG1= <>
##$CPDPRG2= <>
##$CPDPRG3= <>
##$CPDPRG4= <mlev>
##$CPDPRG5= <mlev>
##$CPDPRG6= <mlev>
##$CPDPRG7= <mlev>
##$CPDPRG8= <mlev>
##$CPDPRGB= <>
##$CPDPRGT= <>
##$D= (0..31)
0 1.2 0 0 0 0 0 0 0 0.06 0 0.03 0 0 0 0 0.0002 0 0 0 0 0 0 0 0 0 0 0 0 
0 0 0 
##$DATE= 1647421705
##$DBL= (0..7)
120 120 120 120 120 120 120 120 
##$DBP= (0..7)
150 150 150 150 150 150 150 150 
##$DBP07= 0
##$DBPNAM0= <>
##$DBPNAM1= <>
##$DBPNAM2= <>
##$DBPNAM3= <>
##$DBPNAM4= <>
$$ [...]
##$SUBNAM2= <"">
##$SUBNAM3= <"">
##$SUBNAM4= <"">
##$SUBNAM5= <"">
##$SUBNAM6= <"">
##$SUBNAM7= <"">
##$SUBNAM8= <"">
##$SUBNAM9= <"">
##$SW= 18.0517287032376
##$SWIBOX= (0..15)
0 0 2 0 0 0 0 0 0 0 0 0 0 0 0 0 
##$SW_h= 3612.71676300578
##$TD= 16384
##$TD0= 1
##$TE= 0
##$TE2= 300
##$TE3= 300
##$TEG= 300
##$TL= (0..7)
0 120 120 120 120 120 120 120 
##$TP= (0..7)
150 150 150 150 150 150 150 150 
##$TP07= 0
##$TPNAME0= <>
##$TPNAME1= <>
##$TPNAME2= <>
##$TPNAME3= <>
##$TPNAME4= <>
##$TPNAME5= <>
##$TPNAME6= <>
##$TPNAME7= <>
##$TPOAL= (0..7)
0.5 0.5 0.5 0.5 0.5 0.5 0.5 0.5 
##$TPOFFS= (0..7)
0 0 0 0 0 0 0 0 
##$TUNHIN= 0
##$TUNHOUT= 0
##$TUNXOUT= 0
##$USERA1= <user>
##$USERA2= <user>
##$USERA3= <user>
##$USERA4= <user>
##$USERA5= <user>
##$V9= 5
##$VALIST= <valist>
##$VCLIST= <CCCCCCCCCCCCCCC>
##$VD= 0
##$VDLIST= <DDDDDDDDDDDDDDD>
##$VPLIST= <PPPPPPPPPPPPPPP>
##$VTLIST= <TTTTTTTTTTTTTTT>
##$WBST= 1024
##$WBSW= 4
##$XGAIN= (0..3)
0 0 0 0 
##$XL= 0
##$YL= 0
##$YMAX_a= 170583
##$YMIN_a= -130718
##$ZGOPTNS= <>
##$ZL1= 120
##$ZL2= 120
##$ZL3= 120
##$ZL4= 120
##$ABSF1= 15.72486
##$ABSF2= -2.326989
##$ABSG= 5
##$ABSL= 3
##$ALPHA= 0
##$AQORDER= 0
##$ASSFAC= 0
##$ASSFACI= 0
##$ASSFACX= 0
##$ASSWID= 0
##$AUNMP= <proc_1d>
##$AZFE= 0.1
##$AZFW= 0.1
##$BCFW= 0
##$BC_mod= 2
##$BYTORDP= 0
##$COROFFS= 0
##$CY= -3
##$DATMOD= 1
##$DC= 0
##$DFILT= <>
##$DTYPP= 0
##$F1P= 0
##$F2P= 0
##$FCOR= 1
##$FTSIZE= 16384
##$FT_mod= 6
##$GAMMA= 0
##$GB= 0
##$INTBC= 1
##$INTSCL= 0
##$ISEN= 128
##$LB= 0.24
##$LEV0= 0
##$LPBIN= 0
##$MAXI= 10000
##$MC2= 0
##$MEAN= 0
##$ME_mod= 0
##$MI= 1.114404
##$NCOEF= 0
##$NC_proc= -8
##$NLEV= 6
##$NOISF1= 3.799351
##$NOISF2= 2.8
##$NSP= 0
##$NTH_PI= 0
##$NZP= 0
##$OFFSET= 15.72486
##$PC= 1
##$PHC0= -16949.24
##$PHC1= 6.00078
##$PH_mod= 1
##$PKNL= yes
##$PPARMOD= 0
##$PSCAL= 0
##$PSIGN= 0
##$REVERSE= no
##$SF= 200.130005342674
##$SI= 16384
##$SIGF1= 3
##$SIGF2= 2
##$SINO= 5.538805
##$SIOLD= 16384
##$SREGLST= <1H.CDCl3>
##$SSB= 0
##$STSI= 16384
##$STSR= 0
##$SW_p= 3612.71676300578
##$SYMM= 0
##$S_DEV= 0
##$TDeff= 16384
##$TDoff= 0
##$TI= <>
##$TILT= no
##$TM1= 0
##$TM2= 0
##$TOPLEV= 0
##$USERP1= <user>
##$USERP2= <user>
##$USERP3= <user>
##$USERP4= <user>
##$USERP5= <user>
##$WDW= 1
##$XDIM= 16384
##$YMAX_p= 410433617
##$YMIN_p= -1143731
$$ End of Bruker specific parameters
$$ ---------------------------------
##NTUPLES= NMR SPECTRUM
##VAR_NAME=  FREQUENCY,     SPECTRUM/REAL,   SPECTRUM/IMAG
##SYMBOL=    X,             R,               I
##VAR_TYPE=  INDEPENDENT,   DEPENDENT,       DEPENDENT
##VAR_FORM=  AFFN,          ASDF,            ASDF
##VAR_DIM=   16384,         16384,           16384
##UNITS=     HZ,            ARBITRARY UNITS, ARBITRARY UNITS
##FACTOR=    0.220516191357247, 1,           1
##FIRST=     3147.01635410672, 0,            0
##LAST=      -465.700408899061, 0,           0
##MIN=       -465.700408899061, -1143731,    0
##MAX=       3147.01635410672, 410433617,    0
$$ Real data points
##PAGE= N=1
##DATA TABLE= (X++(R..R)), XYDATA
$$ [...]
15143 -384039 76842 -182549 49074 70962 127861 72391 71972 -1892 119733 76815 -38206
15132 -38206 -136861 353396 413262 329253 507077 419500 204814 -8381 73664 270003 432870
15121 432870 579794 243833 -109750 -216157 23372 320724 413900 206159 224687 99843
15111 99843 -32637 -7887 -224346 -218988 197679 712576 744389 210049 40065 -224785
15101 -224785 -313731 -201082 147993 240262 -251962 -157902 -102859 -412056 -295025 -203450
15091 -203450 -330476 -470329 -43772 -211580 -7593 25108 252268 30495 -115294 -476086
15081 -476086 -323117 138679 49068 333081 376178 406770 421330 -292110 -205260 72236
15071 72236 267588 229398 -65246 -443477 -844913 -704673 -667435 -254584 70527 -112832
15061 -112832 -218311 -99279 -7404 -183785 -606175 -708955 -574075 -539280 -483407 -42085
15051 -42085 -29688 -647004 -365692 -32773 -247436 -300316 -35455 360898 35075 137756
15041 137756 237849 327911 -47830 -406967 234324 81303 -389156 -342715 -147020 -129792
15031 -129792 -309878 -70120 -143043 -285941 6797 172790 182568 121682 82864 308706
15021 308706 272008 76976 27922 579454 113061 50785 170983 148149 -400085 -91874
15011 -91874 272383 245262 -188226 -142628 243279 149477 43227 -179358 -259869 -23057
15001 -23057 206089 112005 55392 224705 399824 233976 36856 19426 180671 86451
14991 86451 142265 19627 -375159 90521 138411 -152504 -144874 118837 245490 -232677
14981 -232677 -433271 -152716 -99120 216423 -76192 -557130 -472323 -141714 118289 105756
14971 105756 29546 -15513 1661 -61790 187854 58701 -246971 -224399 -238742 -280363 44261
14960 44261 210687 -30196 -379707 -246134 -396557 42207 137235 -393973 127544 94253
14950 94253 -310338 -164459 251834 199490 106115 -24141 143772 11705 -172951 -118906
14940 -118906 44631 235459 93692 404196 -5416 -29948 -50701 91906 21309 -74302
14930 -74302 138138 -8068 -101755 -278286 -33883 288098 138376 204564 385577 -145893
14920 -145893 -169872 -280249 170851 308252 -56474 148146 -199909 389870 580993 265975
14910 265975 14652 -22645 -190870 -97457 -68350 -81005 -59210 -117444 -447668 -255880 -221063
14899 -221063 -92158 38533 174901 148070 -21358 -119412 201949 259446 236513 326090
14889 326090 267194 162037 -15183 33873 217565 80979 -202202 -200591 1917 -77715
14879 -77715 -110362 -233160 -142522 -225478 -49806 206863 175368 559628 444127 128614
14869 128614 -268465 -78548 -209317 13354 194040 -19425 -201971 -228859 207510 556426
14859 556426 531378 387432 486386 166607 320087 32166 81911 93380 -322914 -28436
14849 -28436 126853 42764 -405649 -62640 -111606 -624643 -754087 -64532 49239 -1557
14839 -1557 -289884 -223799 -103002 -189404 183232 90506 -12624 246865 149618 182044 37203
14828 37203 -23406 -71645 129452 112182 249686 79660 74084 263964 191360 -107831 -237878
14817 -237878 -25166 50755 222869 209574 47962 -169477 -46406 -186870 -340408 -306392
14807 -306392 -268724 -383350 -219709 -54372 262420 23182 -17508 345457 308874 72855
14797 72855 122766 282338 659 -93442 -353645 -92877 70165 46831 199696 264680
14787 264680 170938 -177980 269998 720372 615245 411127 -77083 78279 291845 18002
14777 18002 -23213 -185751 117893 218755 -13984 -28496 -54092 -117023 -110542 -237138 -392622
14766 -392622 85886 50297 -179977 -559931 -570048 -253423 -276071 -14467 351516 309072
14756 309072 164612 26454 -159773 -10309 12421 -102343 -393424 -527681 -554496 -313765
14746 -313765 -103605 -248428 -450883 -350490 -439617 -157839 41989 229675 278286 14281
14736 14281 -17707 -243793 -247703 -470191 28722 283267 198434 33657 -30256 -137277 -220924
14725 -220924 -23325 52697 -18824 -139054 -228018 196838 72380 75706 32958 16605 -84554
14714 -84554 -35005 102340 -100651 134183 174428 34277 -67410 176968 -228543 87892
14704 87892 177552 -172953 -183375 -91001 -124383 270577 462537 304646 -53815 -96749 -113387
14693 -113387 46118 224583 114469 -4312 -71796 15885 -75918 -310560 -170350 -464721
14683 -464721 -399185 -40154 -36374 130100 110778 -270910 -120845 240659 488474 247648
14673 247648 237689 61581 259509 328049 88600 -231471 -213159 -82053 -145242 -200114 -153174
14662 -153174 -71673 -317875 -642 111230 539003 569551 83275 199796 264142 522269
14652 522269 377098 212492 318489 117489 9519 189777 516494 403838 430370 534447
14642 534447 207216 -56494 154188 195270 395934 -28862 -111439 89062 104634 225937
14632 225937 289089 605105 470487 -672 81834 -166600 -186610 48284 261005 185030
14622 185030 96803 -102968 -178888 -294747 -223715 96216 18197 -88794 281860 -22443
14612 -22443 -46202 -210981 -453272 -158042 57001 155062 -18047 -198497 -224951 -268523
14602 -268523 -256884 -126471 244579 229220 38610 -147856 -513240 -223516 72969 -175720
14592 -175720 4664 180412 48752 -111712 143244 309573 397547 320649 -133731 -146164
14582 -146164 -92825 93615 -111440 -174007 10930 264791 212227 218559 60936 50558 6550
14571 6550 -7092 402886 308146 265724 306394 -1788 267249 161957 262974 389018 610199
14560 610199 585341 348389 547302 479697 475694 185997 224040 -63543 -96103 -32800 -64781
14549 -64781 62186 224307 77264 -46970 -208005 435008 247799 301087 117562 -168447
14539 -168447 -210898 -536737 -579260 -308876 97921 -73152 65446 -72984 -348553 -369599
14529 -369599 -286990 -234829 98580 75583 229562 457197 271329 -693408 -626262 -358166
14519 -358166 -11593 300269 131758 -77109 -204664 -12452 168487 -208756 -329302 -464022
14509 -464022 -470784 -231413 -80469 212946 364770 6524 36064 -126072 -285090 -332555
14499 -332555 -116794 73556 292433 398101 234169 -44070 -63091 227431 -66074 176414
14489 176414 153810 -48475 10805 -74550 208899 242058 73050 266628 174748 -64902
14479 -64902 146812 184322 -239047 -169072 413126 557353 169571 -325186 -107073 23260
14469 23260 68176 -165937 -201301 -161399 -47188 219748 207405 224535 -141114 134056 421935
14458 421935 392783 186735 -193342 -238888 -72239 90565 58451 201714 466953 521247
14448 521247 236980 90329 -116295 -113930 -183401 46072 265444 129563 175259 39088
14438 39088 176014 -182976 -357512 -149005 -48409 -56698 146742 98142 -106808 -478505
14428 -478505 -311283 89577 107308 -183007 120514 330068 -116784 -278698 -183135 -335847
14418 -335847 -155958 -123342 -539928 -18851 178470 -323206 -285733 -183136 -190787 -201522
14408 -201522 -110954 181799 -13362 95815 364373 229789 -271332 -461193 95326 188109
14398 188109 178144 378326 162048 -256542 -54073 13843 176596 8001 -352282 -611617
14388 -611617 -368506 -185469 -527308 -432247 -89891 -175952 -265606 -358850 -180759 17630
14378 17630 -49160 213018 390164 169154 196349 37816 8278 -149236 -400823 -93173
14368 -93173 568330 368176 47220 -359558 -595924 -162114 47365 56294 162931 -275629
14358 -275629 -67767 51959 157508 515238 233537 532409 723454 457995 290790 343473
14348 343473 452239 5047 223179 84281 -149741 122081 141863 -45942 -81298 26356
14338 26356 163525 794273 340592 282235 233545 -13685 -94840 -102672 -40555 -282075 -152654
14327 -152654 123803 -237372 171218 156391 -2865 86163 512940 545384 108479 -376466
14317 -376466 -166775 332141 255503 19409 41270 -274746 -108749 21741 625749 338886
14307 338886 186068 -151677 -287663 -77211 -508199 -331239 74298 54842 90584 126309
14297 126309 89700 -112268 -270803 -193928 -39048 -66921 250300 326610 89714 -148319
14287 -148319 -240502 -237313 -279617 66598 179845 215524 -95046 -30905 -17400 2594 78623
14276 78623 217499 332370 352439 566054 455909 -90037 -274984 -199747 95243 136142
14266 136142 89729 -2103 -209608 -93470 -139735 18773 53554 -265435 -353329 108987
14256 108987 316611 116358 330998 148933 220007 -299465 -313360 49898 150960 202176
14246 202176 236923 320325 190827 -89687 -284398 -234073 62926 79323 175185 -77060
14236 -77060 -167070 -256255 31613 54997 -226491 -30877 526344 205914 55849 202377
14226 202377 -45820 336892 377924 406783 125477 48460 191686 5836 336176 113872
14216 113872 -454604 -265347 -277279 16755 -162915 -313660 -340869 -10007 -16336 -62592
14206 -62592 -39972 288908 675216 285519 -61794 -302465 -291019 -28630 -106649 -221801
14196 -221801 148636 106660 258098 -155994 -347989 -608559 -166212 25540 -117463 -216006
14186 -216006 -387186 -218606 -134691 -182191 114245 227364 85472 11861 96490 19384
14176 19384 -203240 -235323 334628 187004 197428 266243 581437 661685 295915 376103 122642
14165 122642 -58768 7802 -56011 15851 329879 73119 130088 -168879 -90863 91147
14155 91147 -182421 -146863 -23647 -187551 -71524 124707 368946 149860 204361 231755
14145 231755 26193 -135899 -34794 149491 74328 -172281 35327 -95614 -185990 604097
14135 604097 667197 495134 37922 -330457 -375505 -152124 -98954 -87308 -10121 -245165
14125 -245165 13146 167333 -152606 -399054 -237597 -167195 -386839 -391262 -437569 -320247
14115 -320247 166832 134225 -136785 287777 416784 34333 39383 -456309 -39654 -279484
14105 -279484 -210570 -417822 -193160 27338 -211339 -362164 -151246 -142259 28536 -195749
14095 -195749 -405601 -321354 -189800 7273 48359 79586 162076 114780 -338508 -293751 -74904
14084 -74904 -81626 -333730 -546255 80101 334590 394823 128838 -508170 -222773 154935
14074 154935 61828 -292839 -33345 183622 145643 158845 -149336 70220 239628 -163589
14064 -163589 146227 187143 287396 -43551 -220054 -344699 -403509 -225198 118619 -91505
14054 -91505 -105705 -118409 -293555 -184368 57633 89564 278030 132404 -251421 -675768
14044 -675768 -574372 -367407 -234805 -11260 240127 -53782 -195673 -64668 -278091 -249417
14034 -249417 227923 403539 443495 25004 -143601 -218220 -357508 -81040 -247618 -269400
14024 -269400 358234 96166 -245340 -244741 -239296 -238130 15845 297137 136497 -24907 156255
14013 156255 343427 241334 255607 350871 355526 431777 -89362 -239664 -310682 -582830 -495067
14002 -495067 -238001 -381499 -493390 -271650 -316356 -222051 -169306 -424796 -286403 25043
13992 25043 -165196 -163342 261299 372529 211173 562052 385998 132165 -61367 29258
13982 29258 -104330 -28584 -100390 -112295 -62375 263062 -207752 -35173 -291786 -488089
13972 -488089 -605836 -929851 -409053 -536558 -388748 -65500 114620 14271 -420756 -230922
13962 -230922 104039 201738 114199 321020 295006 81670 -80055 -234645 141169 -327019
13952 -327019 -204702 21890 239749 253139 118782 236800 89620 -312625 -508616 23031
13942 23031 462257 512374 83293 200452 337466 45423 -174075 34146 141820 269591
13932 269591 333911 147455 40746 -127716 -317338 -403442 -213109 70210 -9001 101898
13922 101898 425506 -6498 -240028 131204 279245 306415 510408 151134 67639 -298405
13912 -298405 -488942 23964 -295035 -298318 -179392 -79038 149664 89278 -52960 -284731
13902 -284731 -2659 -19305 185975 232620 175958 499951 403201 224954 180450 124354 48029
13891 48029 106262 -326368 -353816 -479542 -496217 -266858 -238976 -104073 -163513 -543515 -77318
13880 -77318 312100 538923 709984 465435 492652 231056 -290856 -322692 -15025 47405
13870 47405 21086 293142 317972 -51211 -58959 -185519 82864 33932 132436 302756 266389
13859 266389 286355 425758 262013 81616 96943 -143722 100153 594640 430676 149195
13849 149195 -319977 -200382 -89246 -138169 75209 121922 456693 508484 505189 337527
13839 337527 332363 60506 -270957 -122564 -48490 150297 111652 -108057 -8265 -86140 49142
13828 49142 281770 159543 178581 302184 -30931 550426 579658 283382 261962 129532
13818 129532 64575 30980 -20438 -174344 -173550 -342865 -186561 -201874 47429 73426 -23925
13807 -23925 -35192 -222914 -240197 -414989 -888613 -383162 -260489 -315405 -334849 -187226
13797 -187226 280254 151172 -67957 -428455 -193227 -101775 -307266 -449651 -173482 -53711
13787 -53711 -380531 -181119 -92223 -451713 -196565 -196851 -212008 -83205 -19161 108548 -113465
13776 -113465 187753 91096 212449 -109605 -128201 -359119 -256319 -114923 -190935 10798
13766 10798 -132445 69697 111840 3460 376936 261283 121935 270540 43886 398459
13756 398459 419993 131823 -256201 -126733 -284355 -684209 -234873 373948 391525 454393
13746 454393 63929 185815 198219 215866 229565 -12237 -136699 -13547 256349 -120877
13736 -120877 260505 305976 257366 266027 92609 200569 454832 661400 -4866 236176
13726 236176 179371 -289722 -156627 75258 264371 444351 135746 -196567 107225 199933
13716 199933 78884 -336886 -433650 -113110 65481 -165550 50940 -168709 -276908 72911
13706 72911 326626 3469 -124809 -255602 41802 -42957 10151 75724 129325 34941 -315281
13695 -315281 105493 203054 141002 77887 238222 348096 267788 274885 329130 43430 290645
13684 290645 -185458 283548 86146 -58515 -148679 -69791 -133088 -10944 69524 -15012
13674 -15012 15294 -189031 -407419 -370862 -186457 -139782 -98517 -146000 -98845 -146800 -80891
13663 -80891 111675 -6266 18478 72230 -73251 51891 -199676 -77088 -569135 -190308
13653 -190308 -196348 -192301 161309 -106844 -447978 -208249 -157115 295965 304970 626606 250276
13642 250276 -542407 -226720 -247330 -201429 205087 -399410 -617359 82933 220250 35380
13632 35380 -30165 -252560 -218846 -206928 102754 232931 135211 78984 -420704 -311351 -131270
13621 -131270 -226873 -118363 -60703 -77061 277071 238653 38094 113054 497448 -39288
13611 -39288 -96264 -379015 -235630 347600 449587 22461 -23100 384887 58559 -62080
13601 -62080 -149466 -49437 -417786 -407351 -151706 -197455 -439816 -297808 -148947 144410
13591 144410 402259 144060 -248160 -501940 -316157 -442238 -402778 -177951 1750 -304346
13581 -304346 -114728 -240240 12230 99329 -65142 475691 349089 -122561 151505 291093
13571 291093 330048 -31802 -531158 -190714 -158861 -296439 -407040 -443722 -539340 -72153
13561 -72153 72046 25736 161317 -162170 -1018 -23157 -259284 -205578 61174 -257675
13551 -257675 -537837 -257255 -76254 75782 715740 604825 134484 -120771 -277695 -323382
13541 -323382 -262591 231654 -13528 98248 -293170 -327885 -430733 -577892 -450202 -323776
13531 -323776 -229675 -258371 -98761 502729 303511 -28550 -116290 137201 91658 -673956
13521 -673956 -266091 282740 582040 -29667 68396 -192922 -187788 289965 137134 30045
13511 30045 124232 296321 -5314 -229338 -144000 -336043 -249737 -269633 -311630 -451747 -312171
13500 -312171 -170387 266424 378262 58223 -138205 -227160 195472 225863 197303 338268
13490 338268 327274 275363 -63341 -373172 -435532 -324798 -68872 -97587 -191030 -423789
13480 -423789 -61527 180866 160092 -105329 -196903 -233176 40131 -153306 -10107 -226807
13470 -226807 -240251 -271762 143437 45904 -297455 125375 -368795 -553809 -349021 -584641
13460 -584641 -640383 -543207 -245290 -105449 -1584 262017 95697 -345480 -383677 47850
13450 47850 -411659 -170076 -48358 -54366 44146 265231 210269 1233 86454 69183 77549
13439 77549 33768 208350 253735 16166 -103724 -13668 227557 616376 774759 410996
13429 410996 67101 -155224 -34643 -10738 212487 72778 -217105 -76270 -97918 -213194
13419 -213194 -124504 -82095 -388191 -29487 406173 203362 107956 337904 542559 227820
13409 227820 -92102 26669 151030 134378 35010 -61582 -226 -68252 -108646 -212751 -43685
13398 -43685 53732 42956 -101750 -263297 189610 -135298 -174350 -296877 -218187 -220772 -204563
13387 -204563 -253198 15400 -156366 -277250 -356597 -2079 -294922 -839723 -409329 76212
13377 76212 285501 222374 -131064 -363097 245181 500824 300289 28438 41888 -338325
13367 -338325 -343160 31351 460828 106251 -16060 -10877 -41030 -97612 -21181 65053 99605
13356 99605 149448 146099 -101975 -114416 398494 240787 -108757 97742 -233595 -126628
13346 -126628 28132 249874 216699 137271 -32302 126843 216970 402085 542173 453645
13336 453645 450420 210970 -146160 -86706 -31805 50956 -27453 -77158 -14734 -341230 -174059
13325 -174059 -348100 -21202 129455 -20813 126464 105048 46904 236366 558727 206668
13315 206668 105334 230945 -436053 -573810 -292567 60594 -121259 3553 87562 -120041
13305 -120041 -289658 -44196 167199 -153017 -380786 -478978 52091 -114864 -252978 30215
13295 30215 175911 -273273 -256025 -287817 -149166 -141255 -212722 -150459 -394700 -303791 -309129
13284 -309129 -203507 -114816 -305391 -307409 -257517 -364335 -198840 -56468 96928 50200
13274 50200 72556 -53730 -244106 -552260 -13005 95345 -127953 -504959 45089 -55560
13264 -55560 -268023 -95924 -91074 -81638 148307 234999 51124 217453 103352 371902 75030
13253 75030 -117793 264950 -126412 299965 294762 -32727 40373 371110 183794 198365
13243 198365 492562 317976 177125 -103149 -24968 -102822 -118296 -118097 -99030 71305 -425822
13232 -425822 -278968 18249 -35223 -147671 -142126 -161788 -87295 -324546 -598752 35305
13222 35305 -252286 -44273 94046 -24086 378642 299812 -221885 -450382 -480703 23228
13212 23228 242711 20487 -381592 -422771 -140645 -231545 -34251 201143 12230 7467
13202 7467 -204083 117128 145679 -77134 79249 284782 136214 60943 -77051 -36687
13192 -36687 401870 -458409 -524733 -188745 -255882 40538 -222661 -70423 -170944 -259
13182 -259 -198033 -334686 -30623 -76915 -30869 -354208 -138084 173814 262459 -11040 18257
13171 18257 -40766 -235879 -98251 -74637 -465294 -396744 -227353 -5103 63699 -658514
13161 -658514 -412209 -171190 382853 529488 81373 -271813 -175756 -6767 224254 -197024
13151 -197024 62661 -166328 -511694 -216378 -37813 -64204 237544 -108470 -552670 -132473
13141 -132473 51039 83558 -130101 -485977 -293144 -511117 -635527 -382321 -268149 -232653
13131 -232653 -463701 60851 118367 413927 448599 301161 77137 91907 -142373 -225619
13121 -225619 -52090 146465 170592 -69072 -172839 20851 -337886 -146928 249296 196100
13111 196100 187663 -268494 81061 43736 -208375 -332706 -111605 -273643 -167732 85373
13101 85373 -112263 -139894 51080 170339 -286698 -156598 -332123 -351518 -125938 -444625
13091 -444625 -419341 38495 -178356 -231904 -247403 -216769 -320949 432 -185179 -235514
13081 -235514 217178 204264 119488 83314 309825 215648 115797 -229296 -378468 -403646 -260451
13070 -260451 87505 -179008 -338457 -121541 36399 346152 584859 790800 484010 36693
13060 36693 74841 322664 -450400 -930697 -274484 -220834 -296873 -208191 -199319 -428436 12726
13049 12726 12078 140222 19929 -355464 -59569 21430 -389235 -441226 -638927 -395399 -95873
13038 -95873 106597 -62491 112139 275835 134845 49781 536325 122472 -181795 123265
13028 123265 -158071 -136247 -181636 -313203 -460845 -337287 -617975 -692648 -389575 -245728
13018 -245728 -218881 -248951 118645 -40809 -471132 -406822 -215352 -302171 -256330 282401
13008 282401 362040 321420 -30451 -334349 -310152 11119 254415 254326 72314 38542 -58294
12997 -58294 -72276 -14339 289087 101144 2841 -325608 -256508 20305 641345 408883
12987 408883 -61936 104184 306624 -123170 -61233 -358845 -477689 -60873 -227970 -183146
12977 -183146 -100175 246161 189651 -427387 -304560 -87689 -91027 182194 -68192 -133625
12967 -133625 -210049 -522817 -410003 -156426 -122347 110968 488249 228953 -168155 246856
12957 246856 403859 202933 101847 -30847 -216933 -276010 -309005 -647163 -356645 -374185
12947 -374185 -488838 16953 118181 13968 -604651 -723469 -679022 -628312 -503398 -166305
12937 -166305 74768 -431242 311013 319282 12288 269848 445607 282524 293752 404607
12927 404607 292937 -247570 -371955 -214907 -300348 -257762 2182 279106 421204 349112
12917 349112 231942 -120023 -450560 -339704 -68894 333591 145976 -181158 -327597 161442
12907 161442 485807 257137 281354 454946 -40795 -50504 88342 422784 161565 -88660
12897 -88660 -221777 -405098 -349124 152399 35657 -327871 -178018 -175439 -316949 -127073
12887 -127073 -93263 -60738 -35595 9157 63805 -106427 -219411 -382294 -255303 88598
12877 88598 -24436 183648 261353 210407 2082 -133775 -22741 168004 52310 -239358
12867 -239358 -221245 261120 215796 -162012 -129604 -196509 -104101 82670 321403 234448 260259
12856 260259 51862 100924 -103120 55836 -193520 170029 366873 -302505 -541358 -298686
12846 -298686 329867 161752 94693 -317080 -156359 -87396 -60267 43730 -280094 40205
12836 40205 290749 276186 186503 82313 -408984 -629278 -320751 -379145 -198221 -216743
12826 -216743 -125900 178158 -403039 -300304 64776 21730 55216 -53541 -175355 -183241
12816 -183241 -92306 -206212 -307603 -301465 -287080 -31251 -107461 -148458 12593 -292662 -227595
12805 -227595 94126 1438 79210 -187672 26852 -50698 -151223 -59104 -351582 -414041
12795 -414041 -498894 -388612 -177929 160435 -81346 -132055 -18043 101960 -73644 -87687
12785 -87687 -15741 46207 280798 234000 -82746 -141874 -153305 -72999 -232419 -368200 -81906
12774 -81906 154475 187860 189439 169880 -275736 -325793 262487 164146 70250 168705 138759
12763 138759 489097 307719 100193 -80493 285147 185750 8366 -167432 -220146 -263552
12753 -263552 -213619 -318873 -339390 -26516 398088 42929 -87901 -115533 -52656 104934
12743 104934 160666 210583 254146 -391221 -258455 286546 41811 176243 209208 251175
12733 251175 -76280 118154 384833 566129 461810 207601 19102 -14384 -221030 104316
12723 104316 261473 -324831 -354648 107711 216951 -36477 -352452 -133934 -366848 -593973
12713 -593973 -543397 -533436 -576691 -497071 -280126 -261921 -130981 -160104 -368754 -24136 72195
12702 72195 -160380 -347655 -44159 -235700 -330880 -20823 -30055 23071 163975 239468 208388
12691 208388 130512 -130588 -6700 140801 347528 245618 -158012 -310659 -148826 -61773
12681 -61773 74606 -307792 -200889 -218242 -248232 -99710 248052 363005 243002 33114
12671 33114 -47852 -126762 -18144 -174209 -227465 -394871 -216309 10407 -318359 -142646
12661 -142646 108418 -79166 -122220 -217492 -79429 30677 -515089 -469479 -73478 309811
12651 309811 64395 -37333 48961 -207298 -468979 -381801 -186054 -355516 -234911 43185
12641 43185 -170898 -208581 -165779 -334668 32972 -81286 -44425 209048 -289281 -366206
12631 -366206 -320729 -288389 -545125 -254994 -256626 -104009 -140755 216479 -88643 167049
12621 167049 -88442 -74738 -278372 -455527 -267449 -108889 -193805 -439806 -412327 -355151
12611 -355151 -161134 285575 226455 -151764 86627 -63492 -130740 -183682 262832 263597 109677
12600 109677 -230277 -578690 -410001 -288722 53690 161036 461039 343293 3598 -35978
12590 -35978 -235589 -3599 -152669 175 -71980 421506 -27334 -45098 251293 509234
12580 509234 543249 281288 157722 -94158 151274 141721 -142271 -355858 -243367 -63956
12570 -63956 -192707 43204 -273288 -483037 -32904 177504 89302 106956 -12763 176485
12560 176485 -186170 178587 294987 -114984 57060 -117901 -165619 -181967 -268798 -420219
12550 -420219 -223349 -436865 -536972 -655754 -650693 -673825 -184338 19664 74162 45868
12540 45868 -263880 -195201 46392 -97239 -384848 -138970 -228726 -431885 -352574 -174143
12530 -174143 -66082 -174213 -186886 -100040 63925 -217848 -249839 -75809 -124439 -132795 -32801
12519 -32801 -90528 -199775 221069 -141511 -30280 -359263 -357631 -361835 -373340 136670 301588
12508 301588 46410 -211523 -419074 -482008 -369615 -125304 -117585 -80769 -22346 99982
12498 99982 261747 -210977 -266872 32921 -191174 13748 332530 -241666 50123 739571
12488 739571 296232 -242175 -255392 -98570 36043 19237 296566 -1273 155622 63018
12478 63018 112536 -273586 -470582 -233930 -42911 -291551 -116559 239819 -89859 -637062
12468 -637062 -398531 -202305 -265213 -299111 -155987 -100419 -120314 -187166 -252149 -301305 -21972
12457 -21972 -637076 -781684 -477941 -134084 81530 153813 237366 125584 24325 -67737
12447 -67737 121307 406093 200020 -74269 -22609 -4818 121676 35795 -10147 9400 111055
12436 111055 362360 264921 -245514 -43693 -96294 191146 -37040 -164690 -118815 -89097
12426 -89097 -180641 -146404 99204 63911 92537 489873 273012 215580 22752 243777 -84033
12415 -84033 -314953 -354210 -505404 -154562 -180810 -11010 161259 -112591 -338028 -63731
12405 -63731 142038 226374 51778 -199121 143578 44449 139058 -98591 108320 276760
12395 276760 491026 223651 407591 466290 -6304 -99844 2383 -210977 -328500 88780
12385 88780 -31620 -88279 37853 -40276 -240365 -194482 192262 121580 -75245 -5479 -368359
12374 -368359 59954 -268640 -305525 -285432 -567923 -407183 -294545 -318614 -69207 49124
12364 49124 -210812 -213253 -85017 -61516 -66860 87735 364146 253130 113141 571083 375772
12353 375772 8586 265388 -22946 -166458 58734 -248587 20956 201463 -159267 -68208
12343 -68208 -117237 315721 605903 452121 239328 -143486 19312 380531 282316 15224
12333 15224 -223873 -455733 -673276 -73926 541487 532201 31857 -26759 -124816 -45434 -6873
12322 -6873 -9707 -122702 -90581 93219 179605 -141137 -290709 -303153 -168769 13037 301472
12311 301472 240088 26520 205906 252982 -139529 -83353 -162065 -278769 -253659 -277443 -79598
12300 -79598 -159497 -68179 -7419 -254723 -207389 -77240 -372084 -441447 -14275 -273105 -246044
12289 -246044 208713 405252 105969 -214940 -182490 169772 591365 159144 162832 150254
12279 150254 -181057 -220434 -182585 217431 119286 -342796 -448896 -12 -218365 -376422
12269 -376422 -318193 -456410 -393471 -350527 -33984 -28998 215626 117642 251749 445958 200113
12258 200113 -203662 -62849 256192 -83402 -131385 128242 6759 80778 120250 -302460
12248 -302460 -169195 -57855 -589935 -456984 -507680 -134119 133321 174647 -357533 -209965
12238 -209965 101832 190772 -169406 -89932 4630 4008 -294646 -215940 287077 269446 38115
12227 38115 213231 104133 -273288 -140571 19037 256176 134248 103926 118274 88581
12217 88581 437392 -82477 -618469 -502504 -509991 -720253 -358579 -501297 -401043 -29013
12207 -29013 351135 188578 236009 119631 381549 108971 -280293 229700 200207 90683
12197 90683 -231926 -541620 -271576 246852 -141898 -231084 -233049 -126830 -313254 -196453
12187 -196453 -23008 -237657 -2506 42833 4189 59487 84465 130657 -427083 51342
12177 51342 902 -152667 -38072 -243731 -363231 -282148 -167796 -166199 -162944 -261048 -130033
12166 -130033 -119576 -627495 -359914 -457435 -1109959 -805954 -325157 -67938 68689 -369131
12156 -369131 -293201 -134737 -87876 -221833 -182848 -372767 -240605 177673 -54921 -321687
12146 -321687 -81437 -258096 -201131 96154 319778 -113047 -165085 89900 8957 -122988
12136 -122988 -141274 -352143 -218089 -579448 -451020 -275286 -304160 415695 239458 117691
12126 117691 437207 328685 -110996 -187468 -204403 -106444 -197241 -389264 -327872 -186192
12116 -186192 117588 -392952 -174350 -139578 -161185 183409 347074 395066 403074 189822
12106 189822 25100 55604 39518 20237 1214 -173496 93750 290570 215629 1510
12096 1510 120097 586560 357507 264330 44758 85457 -83159 -412997 -388615 175533
12086 175533 525147 376205 153906 37926 235431 -178183 -363612 -134207 -22109 162300
12076 162300 -228111 120724 -295792 -151716 186763 434287 214074 27268 -224954 110037
12066 110037 -52324 -51666 37032 247350 162449 -204966 -452467 -159903 -87205 2140 78381
12055 78381 174433 76734 -127044 -23804 357600 368644 -151221 137532 585952 307580
12045 307580 -206311 -415278 -847537 -680639 -32138 -69810 -277998 -340917 -280085 49960
12035 49960 437876 116522 -72477 209399 56269 -2673 299601 360416 -132378 205171
12025 205171 176914 -55401 -149566 -220406 -164902 -209340 -231370 -181036 -223126 -70409 88104
12014 88104 441074 402872 70193 -156474 -86162 70619 274832 86304 487906 -116391
12004 -116391 -103971 228917 150404 152204 -143535 90663 -105252 -358187 -304888 90857
11994 90857 70506 -108035 -382602 -489912 -492586 -215343 -348612 -321909 -217869 -12019
11984 -12019 -132441 -360702 257413 605746 522862 141992 153528 253588 191390 126713
11974 126713 41646 53427 264184 227637 128498 -20569 -105202 202190 102617 92316 -86193
11963 -86193 -209153 -382638 -326296 40561 -131910 -139616 -294125 -441642 -663449 -513364
11953 -513364 -450931 -585297 -217857 -240027 -220339 -141306 81069 137468 -197715 -61978
11943 -61978 -70400 -326027 -248279 -294504 -255877 -628 -277485 -467132 -284536 -69096 -174152
11932 -174152 72168 38318 -483781 -258894 -193722 -137440 -64769 47276 -74338 -384715
11922 -384715 -226448 -366910 -191329 -527320 -340626 -118957 -233955 -183367 -263534 -613043
11912 -613043 -395671 -460567 -985703 -803445 -294122 -296249 -327044 -244924 -204266 -243859 193242
11901 193242 -37578 -339951 116715 28838 201637 70495 31392 89394 -331009 -437583
11891 -437583 131055 53575 -129769 6601 -83378 70990 278871 -230297 -526806 -176671
11881 -176671 318453 56771 -599912 -53507 158873 10493 141339 151038 209205 24212
11871 24212 193919 2690 7136 -199754 -15242 238074 -147203 144039 509341 830252
11861 830252 155793 237103 -50494 -401799 -113867 -271557 -332421 -406339 -160346 152167
11851 152167 107694 354675 254285 169920 26369 -284289 -30028 109313 76643 -320197
11841 -320197 -247567 -410125 -690660 -328441 -150695 -375928 9064 53024 169404 64640
11831 64640 204743 162812 -170914 -471763 80653 93950 65362 -265424 26901 22764 -1539
11820 -1539 69110 15217 -62543 347779 536571 -59616 -92420 -99478 -9629 17333 207782
11809 207782 162069 439202 -19857 -230342 -24047 -132299 138390 47181 -41121 158843
11799 158843 -110846 112849 -102366 -19445 159831 -35286 -55547 -18140 39969 396144
11789 396144 371684 117949 -36266 140117 220886 242452 363703 351819 -9941 -138780
11779 -138780 -161485 -322675 -393261 -565505 -706312 -496028 -545521 -639471 -316526 -283316
11769 -283316 406975 -291702 -359278 334157 349159 303370 146592 83241 -241956 11547
11759 11547 150398 -10452 -74727 -219555 -65420 -73056 -202721 571706 454516 210560
11749 210560 203530 70715 -120337 -11654 209082 -40776 -62653 -280034 -421930 -513889
11739 -513889 -380668 -386508 -179533 -354824 -468267 -245990 -365592 -485248 -313261 -218832
11729 -218832 96156 -5633 -198970 122908 221287 -60045 -199648 26406 -144444 -144602
11719 -144602 117901 9874 277524 61497 -94848 304039 322566 404980 -38209 -483862
11709 -483862 -301671 -240485 -139201 14670 250977 210047 -305094 394098 352127 53794
11699 53794 -255658 -617049 -452898 -485697 -463708 206091 -36695 -296486 -291205 -393177
11689 -393177 -305688 260192 219671 285960 107545 165898 310033 258603 -122129 -129176 -57039
11678 -57039 8003 -100998 -325221 -477627 -135956 -138764 -411982 -43068 -11049 -243237
11668 -243237 -144372 147308 -142359 46861 -36588 176274 434148 5054 -43495 77707
11658 77707 156089 315162 204504 44750 108817 -187021 -152123 175847 194501 -55041
11648 -55041 -200491 4526 -358098 -61549 280403 210832 250120 54550 -230620 -237213
11638 -237213 -378018 -188551 -108882 324042 235754 396139 101669 470188 181563 -439897
11628 -439897 -475104 -121930 5463 -245896 15670 327878 -25928 27311 112856 -19041
11618 -19041 -53870 228701 103439 -68753 209770 189230 -8196 206480 38179 -196677
11608 -196677 -12249 81692 47336 -253419 19161 157489 210218 259883 244405 158299 259626
11597 259626 -124082 -275364 166127 299320 618108 757726 467726 269610 13352 -152123
11587 -152123 -242862 -247660 73545 196220 97735 106886 287673 211818 36032 68383 195975
11576 195975 21055 -177965 -246270 -294235 65459 -191476 -164716 -309527 -463817 -506603
11566 -506603 -504515 -672462 -194879 -131885 -280807 -65305 -340084 -369823 -109228 20016
11556 20016 22950 -15183 210921 180240 -93314 -488689 -104498 268061 117200 -18761
11546 -18761 -554380 -422217 -282735 105464 49631 106451 188108 -36115 -180038 -467959
11536 -467959 -352771 -306749 -231186 -550853 -264716 6853 204005 294949 -137020 105671
11526 105671 138671 285228 350872 252015 35013 -442284 -68241 434544 522573 463736
11516 463736 132746 98856 134377 349240 323506 374898 308293 290402 646153 420055 106499
11505 106499 73583 127412 -345240 -181393 -242522 -86601 46717 -34073 373915 452510
11495 452510 543256 440595 82591 16173 -4183 -35647 215572 589534 181813 160221
11485 160221 267420 355398 189371 -92751 224924 8713 -25940 -78237 230205 236800
11475 236800 -264287 330629 284620 92320 -245438 -486337 -231729 234073 -36964 -512491
11465 -512491 -446417 -117048 -54077 -203393 -7392 54632 -107831 798 514375 227810
11455 227810 -70611 -424902 -388155 -125565 74395 -76036 14239 340730 322414 -62300
11445 -62300 40524 -457912 -579251 -10836 -431720 -174984 99506 -272505 130505 -93022
11435 -93022 -71243 -124670 -597321 -532480 -77972 75898 76961 103012 371584 63480 -254062
11424 -254062 -98143 196041 265843 46646 84591 66912 383379 59111 399939 146480
11414 146480 -252258 -207665 64914 144872 -187033 -94326 73515 117422 -89807 -53911
11404 -53911 81226 429691 430112 425874 279260 209879 229394 594050 543076 143156 -94283
11393 -94283 92460 -1126 -112693 233012 -25907 -399865 -222196 -372688 -81514 154983
11383 154983 6010 73930 217824 140252 16601 176393 207785 456104 241192 49736
11373 49736 -34889 288049 330859 112146 -132893 73332 208937 130449 356618 684947
11363 684947 390150 -130088 -72578 11444 -50398 -188818 -123311 169643 30680 -110623
11353 -110623 -272000 -126786 -45136 -46516 429944 306475 238115 415616 338388 328511 135507
11342 135507 122228 314496 337422 206369 340689 433780 352355 304724 -6469 -147021
11332 -147021 11796 164898 146286 199729 404184 105146 -466761 59375 490211 312465
11322 312465 -274027 -404039 -32033 16464 -47305 -55449 44251 -130760 95322 -35598
11312 -35598 36535 131035 86266 67120 376423 274927 247152 -56281 -7825 12883 135208
11301 135208 543969 132322 180676 421484 245578 -70675 -6791 58009 127204 64204
11291 64204 189722 81460 -143882 113414 -41879 132800 627530 433059 391117 334557
11281 334557 -355107 -356783 252774 62254 -74828 -16925 -106802 -13724 2483 -428891 -189272
11270 -189272 -351744 -514283 -604833 -336014 -43461 7746 -137962 -172646 -106372 346982
11260 346982 -95610 -123236 52826 113065 134888 30872 258634 -49194 -909 -90082
11250 -90082 15053 151916 -135978 -75178 243743 193872 121654 -8202 319880 174204
11240 174204 397690 285609 405808 -100564 -169003 639242 638224 219237 149870 301030
11230 301030 113600 -4981 -144117 11928 208218 248954 -239642 -218770 -96512 77130
11220 77130 158534 353731 31763 119502 -51973 150608 -195020 -257476 351415 565509
11210 565509 641390 604836 701529 287630 508183 447785 535688 530472 312680 -9345 218826
11199 218826 -152009 287551 75272 -300209 -211171 -361420 119953 140388 93497 154235
11189 154235 404055 530247 195897 -71972 79773 282060 113493 422273 796474 930183
11179 930183 546106 72745 -147878 55779 319889 -54688 155557 -6415 -87487 172056
11169 172056 284818 191956 251865 117313 -4480 -23424 139805 215846 411050 535437
11159 535437 436557 467228 434173 202962 -69301 45063 -89027 369108 12483 -225861
11149 -225861 -87195 75591 199366 363873 513997 252322 220919 295636 475193 384746
11139 384746 267173 118333 453352 502572 575201 567502 601950 656291 308529 262027 321497
11128 321497 51635 194078 344699 524291 307698 264465 659682 592808 335896 358533
11118 358533 784068 786720 829304 154526 71737 -43776 -252919 -52612 -14296 291407
11108 291407 391466 206607 316861 -82895 -102665 526660 540406 684135 189773 -105648
11098 -105648 360105 334007 -22187 -436455 -473882 -191774 61158 123896 74941 251829
11088 251829 224790 331110 630111 270931 340376 812706 746957 646043 292456 501620
11078 501620 734135 773613 519027 372043 20706 351553 602093 395639 205348 276610
11068 276610 329597 399238 301807 297630 439677 694747 630104 371318 424711 24899 26902
11057 26902 385361 752674 574561 -4697 -139151 370702 656819 245008 156484 735148
11047 735148 610630 410929 172864 77660 255822 58819 37570 135414 350205 300218
11037 300218 180059 406145 314608 189374 407584 552656 855691 821681 455434 299760
11027 299760 399214 697753 278280 474019 963039 653122 608103 485108 744502 679733
11017 679733 637877 757553 729971 393117 526524 614723 726747 654198 412824 602189
11007 602189 368716 691629 533137 283410 336751 440918 598860 386617 544407 897233
10997 897233 526718 131457 157484 350432 244380 364365 361585 542798 559240 574694
10987 574694 10370 31307 673126 785415 665257 324430 75647 -23431 97984 600661
10977 600661 924375 753639 451261 352175 156636 457470 580895 616087 330720 254496
10967 254496 408341 644403 481627 511764 550137 -35064 344327 574142 565934 771842
10957 771842 525204 288579 332994 242610 586474 508601 258797 370946 517524 820667
10947 820667 921184 788179 490497 273530 484827 366059 -302071 -88336 303863 584658
10937 584658 658478 481338 541036 512937 683734 992896 861944 653479 664023 388189
10927 388189 448843 431381 731495 707851 646040 579088 601427 316183 511757 677314 685820
10916 685820 933254 853816 804824 833587 738055 607329 771809 674776 427393 663935
10906 663935 538761 327354 722051 708533 867635 591604 802077 914806 640305 761081
10896 761081 560400 617219 729659 652835 162933 22577 295213 440516 330753 437504
10886 437504 462875 197272 -122457 496693 699168 203622 249267 571930 600398 453005
10876 453005 447007 689336 831115 787216 650001 489929 465915 614656 584835 430724
10866 430724 199267 72480 538467 472082 715934 730001 472110 642498 1098126 1287452
10856 1287452 901569 617157 312551 604091 462510 151460 269246 431306 276113
10847 276113 307254 488244 800182 1016321 681110 869341 647687 882103 880198 837762
10837 837762 910395 519647 691003 455569 70513 -49409 533566 335331 334516 529095
10827 529095 724860 551077 562277 678969 885355 644012 18749 739207 533311 800706
10817 800706 723629 578210 655492 616062 441739 483863 625374 803646 457959 314614
10807 314614 384344 462267 537171 559990 689180 520276 773064 938163 927017 778308
10797 778308 794453 458859 76317 342875 -53772 323029 633398 556888 866274 558657
10787 558657 307278 250565 492780 580687 858027 747614 689035 729467 446761 644326
10777 644326 577455 480841 717553 659854 590298 390631 459558 874880 694707 458552
10767 458552 501468 274923 618203 490247 622237 787025 497463 704720 1030331 902681
10757 902681 642540 786449 719971 578804 567239 849170 847911 767596 694624 511828 496770
10746 496770 763002 911409 887670 446902 652641 848578 702800 886034 876435 1169307
10736 1169307 1136128 1186039 1207565 976830 772815 938241 1231929 815946 789132 883450
10726 883450 851001 1107005 1207190 1162167 1046204 566563 573549 668744 473245 572746 571610
10715 571610 751272 1119422 1198164 1281435 951462 891849 906765 1105415 1212179 781689
10705 781689 798648 1015973 986248 1222074 1296825 976774 704586 760246 558137 483119
10695 483119 802380 1312805 1362673 1112919 975343 528478 1117425 832432 853248 1110277
10685 1110277 1090036 1134236 1067912 1164504 997523 1025705 890141 1091571 968561 850538
10675 850538 747626 660602 737390 847483 1189594 1405357 1162384 1134223 1017441 1275638
10665 1275638 1393512 1449673 1298471 840225 1094997 1330521 1528284 1272670 1215438 1116884
10655 1116884 1118210 1403296 1038687 601378 817292 1195906 829181 388508 937156 1108838
10645 1108838 1467875 1414833 1195275 1143069 998050 1139444 1507377 1726404 1497514 1525874
10635 1525874 1623688 1623566 1606677 1032245 952559 875996 1280211 1275968 1016201 1223122 1297923
10624 1297923 1318808 1742347 1286857 741569 944521 1509675 1942837 1842165 1475314 1157192
10614 1157192 1739360 1684025 1719349 1652707 1290119 1297743 1176299 941869 975818 1382731
10604 1382731 1202621 1009473 1100030 1071228 1285660 1399053 1530473 1313266 1250898 1286081
10594 1286081 1446873 1395555 1559774 1617509 1863158 1611916 1452184 1344797 1422349 1635477
10584 1635477 1476574 1365927 1497811 1924308 1720343 1749064 1600044 1419862 1249095 1563609
10574 1563609 1297434 837105 389198 795216 1139050 1635184 1582895 1529675 1541249 1796988
10564 1796988 1918611 1638720 1944392 1866246 1400685 1141256 1048015 1114721 1393375 1472943
10554 1472943 1791057 1862315 1768244 1671805 1676383 1460557 1690594 1833649 1998444 1590383
10544 1590383 1751691 1929704 1745773 1601909 2060297 1995242 1313950 1439747 1466907 1512451
10534 1512451 1843797 1646811 1430624 1668028 1773616 1761888 2058492 1981866 2116045 2086029
10524 2086029 1921126 1314691 1656672 2023713 1904263 1683116 1710526 1857039 2188071 2196134
10514 2196134 2100255 2222178 2406050 1853731 1758220 1773115 1526926 2011997 2390526 2422138
10504 2422138 2383958 1746642 1587534 1905839 2003028 2381088 2232853 1866396 2008879 1955804
10494 1955804 1832714 1964640 1923881 2128796 2019695 1746882 1598380 1898969 1940029 1864635
10484 1864635 2451901 3043159 2307523 1738698 1809059 2018879 2004146 1992371 1817873 1985757
10474 1985757 1965094 2061064 2025413 2003672 1998653 2123276 1978021 1961755 1873324 1700092 1886314
10463 1886314 1975327 1993224 2067120 2085700 2569689 2336506 1946308 2291124 2102063 2073170
10453 2073170 2376430 2681363 2565882 2531644 2552894 2482510 2445345 2602388 2613927 2316178
10443 2316178 2670272 2633896 2631976 2647101 2474405 2339359 2418742 2199814 2060589 2201208
10433 2201208 2223742 2499512 2870319 2980949 2882729 2595752 2497752 2355910 2454063 2025033
10423 2025033 2041333 2220412 2799355 3290169 2914011 2593046 2691811 2820344 2651238 3008450
10413 3008450 2992799 2670538 2823049 2854135 2722948 2608696 2828317 3176610 3091598 2814967
10403 2814967 2907992 2621980 3030173 3256448 3203149 3164803 3064739 3134107 2705650 2834987
10393 2834987 3004867 3194639 3207935 3353911 2859996 2789877 2698175 3206171 3196116 3243939
10383 3243939 3451452 3163082 3066254 2905125 3064477 3047335 3232130 2939358 3085166 3192503
10373 3192503 3055592 3235639 3282993 3405293 3413280 3494183 3402323 3041938 3114777 3917030
10363 3917030 3631512 3320239 3395385 3617317 3851616 3528322 3233833 3341049 3443735 4033711
10353 4033711 3688469 4007657 3989300 3929530 4052243 3688886 3703580 3612815 3500837 3934760
10343 3934760 4325956 3829743 3855485 4294446 4414216 4176053 4144140 4141600 4078533 4039798
10333 4039798 4041423 4320069 4829374 4760799 4108567 4030684 4100583 4256779 4195838 3783620
10323 3783620 4141710 4473356 4443124 4369507 4438492 4767333 4765109 4527362 4649366 4554557
10313 4554557 4402280 4560731 5049125 4776535 4505585 4844379 5138753 5128562 4999669 4782323
10303 4782323 4639628 5301590 5189994 4950789 5391025 5656041 5207574 5098156 5491553
10294 5491553 5848851 5758690 5735557 5797928 5505776 5280102 5354471 5523323 5310546 5362827
10284 5362827 5462531 5884538 5674006 5346421 5411949 5524698 5199812 5492508 5917047 6224509
10274 6224509 6115829 5812895 5536523 6014075 6890096 6527654 6418958 6523386 6540363 6202254
10264 6202254 6490847 6384334 6140273 6225220 6189012 6617097 6737911 6856772 6960914 6659432
10254 6659432 6547627 7220916 7187054 6857371 6906129 6521841 6985058 7405081 7237027 7375544
10244 7375544 7318740 7418328 7168610 7468261 7311626 7330994 7843594 8179787 7958441 7853590
10234 7853590 7625339 7400579 7256199 7759732 8176346 8249973 8094894 8292686 8096568 7928354
10224 7928354 8064701 8095632 8139931 8263054 8739212 8466680 8974410 8972650 8923301 8879269
10214 8879269 9137838 9434143 9474433 9275186 9555757 9555537 9685808 9962736 9671707 9897395
10204 9897395 10063224 9803854 9717462 9686865 9776845 10286031 10301083 10061902 10281817 10750255
10194 10750255 10922429 10701944 10785935 10567117 11189615 11086843 11091707 11005853 11479371 11484723
10184 11484723 11726382 11876204 11591006 12077225 12296699 12327165 12838088 12936884 12527902 12677592
10174 12677592 13016789 13198357 13026794 13475629 13261797 13022520 13294659 13523182 13715889
10165 13715889 14189310 14075917 13933723 14001409 14532143 14572963 14282876 14625029 15203643 14742871
10155 14742871 14988215 14900432 14913719 15332445 15750854 15241866 15087825 15241918 15562568 15920757
10145 15920757 16084119 16230276 16222939 16076865 16093065 16622644 17009238 17624034 17850602 18145463
10135 18145463 18247950 18149444 18333896 18457636 18285788 18498974 18674359 18742397 18911719 18877302
10125 18877302 19138505 19588657 19750398 20118860 20816564 20783328 20562843 20616379 20665709 21032925
10115 21032925 21413259 21128099 21172549 21708874 21482337 21825007 21938619 22035248 22074228 22087595
10105 22087595 22187933 22730064 23017550 23141440 22673706 22676830 23179816 23320489 23055738 23375022
10095 23375022 23370501 23741011 23948530 23871182 24037428 23843590 24356973 24710740 24903578 24920909
10085 24920909 25331134 25234266 25275719 25801673 26421217 26804709 26784973 26876423 27216925 27299967
10075 27299967 27401557 27810935 27873557 28149770 28341424 28388610 28296786 28216588 28524365 29129150
10065 29129150 29647880 30050734 29889884 29850057 30441233 30790243 30836171 31023600 31583953 32192267
10055 32192267 32206561 32219563 32734446 32947390 32930290 33662470 34141798 34341143 34643315 35087298
10045 35087298 35914195 35904629 36224435 36399941 36310979 36387883 36662871 37211497 37859907 38072302
10035 38072302 38865533 39214606 39726479 40302865 40401336 41039900 41728916 42141393 42611763
10026 42611763 43109670 43568376 43636370 44451855 44963200 45764354 46353212 47157268 48177475
10017 48177475 48522322 49511539 49827073 50472188 51194975 52190893 52850864 53189455 54412843
10008 54412843 55061073 55905823 56816371 57211348 58364754 59202582 59952030 60971344 61668146
9999 61668146 62805154 63700659 64145320 65315209 66546809 67560617 68098606 69662585 71126159
9990 71126159 72453472 73387226 74441943 76099914 77513956 79205247 80193544 81631160
9982 81631160 83206142 84573582 86010687 86954021 88714203 90454616 92582450 94518463
9974 94518463 96273596 97978904 99480989 100857233 102682663 104341222 106399073 108726027
9966 108726027 110629624 112573643 114579950 116885227 119125448 121320851 123498578 126254583
9958 126254583 128716160 131107653 133628351 135901165 138599877 141428644 144272482 146473764
9950 146473764 149542490 152603297 155388188 158464767 161203477 164447279 167737387 171234668
9942 171234668 174631362 178053092 181587417 184879886 188035642 191591359 195168429 198936890
9934 198936890 202642004 206757485 210595460 214333565 218545032 222967729 227187031 231483368
9926 231483368 235252296 238885548 243427237 247854462 252032984 255957665 260247047 264905042
9918 264905042 269119494 273827843 278103333 282542384 287355354 291554358 296171329 300577680
9910 300577680 305067059 309677525 313925702 317762469 322316694 326216505 330109284 334916549
9902 334916549 338951043 343116288 346762120 350378228 353962770 357734386 361344590 365051242
9894 365051242 368190272 371833838 375181296 378551705 381344315 384137157 386756162 389489935
9886 389489935 391471004 393876127 396168556 398306217 399916685 401404337 403175676 404581477
9878 404581477 406242122 407440461 407931840 408545175 409590262 410087980 410362100 410433617 410174789
9869 410174789 410040961 409491849 408943706 408459072 407365798 406258159 404762980 403620853 402367282
9860 402367282 400378877 398348920 396231927 393626845 391171826 388814564 386318574 383354728
9852 383354728 380441387 376838957 373550057 369622668 366035244 362327027 358642523 354223338
9844 354223338 349843202 345745672 341254628 336278631 331920779 327084345 322247438 317422573
9836 317422573 313037907 308121535 302563037 297552722 292894890 287633469 282194530 277696467
9828 277696467 272672956 266924138 262434395 257889035 253250349 248181349 243009952 238056597
9820 238056597 233525854 229189806 225049775 220583537 216011440 211525585 207400261 203213141
9812 203213141 198990574 195117834 191120866 187514199 183446080 179843534 176231754 172752034
9804 172752034 169388238 165874920 162522005 159381391 156551875 153348595 150413985 147239967
9796 147239967 144464783 141503507 138866993 136220472 132798509 130394026 128215666 125962160
9788 125962160 123314040 120779987 118332700 116042061 113430123 111346129 109374656 107470755
9780 107470755 105529974 104034369 102253969 100364099 98545332 96951409 95111412 93373265
9772 93373265 91800090 90622927 88797124 87030898 85844281 83914697 82800339 81464698
9764 81464698 80076961 78199136 76878277 76075487 74737371 73693715 72064502 70882542
9756 70882542 70101601 68749086 67567124 66324240 65464989 64899370 64175931 63054398 61703315
9747 61703315 60935406 59990482 59186744 58368295 57592014 56442849 55844935 54941808 54004400
9738 54004400 53241800 53052889 51748228 50781929 50411842 49575233 48670630 48584056 47818084
9729 47818084 46600815 46300074 45666275 45241465 44400783 43852381 42878500 42336618 41939973
9720 41939973 41231353 41112330 40653463 40026387 39390714 39439027 38823968 37763223 37206727
9711 37206727 36688322 36132453 35745512 35312069 35054935 34542405 34082679 33877897 33420857
9702 33420857 33136255 33122366 32316583 31750136 31554486 30759954 30191489 29975308 29464854 29459496
9692 29459496 29447330 29022096 28383663 28401915 28011799 27598484 27513466 27267165 26900474 26686296
9682 26686296 26572667 26074334 25803845 25787573 25196585 25270789 25049495 24202320 24135092 23778346
9672 23778346 23656723 23304868 23235931 22854752 22714388 22748899 22461024 22154693 21725085 21694148
9662 21694148 21769477 21223204 20946014 20650950 20566456 20094854 20355969 20533449 20041001 19541398
9652 19541398 19494531 19157752 19134144 19043635 18957952 18911619 19057723 18617634 18619239 18173763 17877100
9641 17877100 18191198 17674009 17513981 17436903 16846852 16352420 16200624 16136455 16087139 16328160
9631 16328160 16201728 15781369 15393090 15325629 15267274 15259956 14849166 14840551 14936297 14955711 14558547
9620 14558547 14313633 14137816 14393206 14156895 13821633 13539142 13736348 13471825 13202108
9611 13202108 13264954 12958856 13085770 12636353 12367830 12581644 12695035 12341076 12120911 12642223
9601 12642223 12716616 12387435 12104605 12130813 12184556 12085801 11926396 11882550 11784067 10863106
9591 10863106 10733169 10799187 10909315 10890365 10938210 10801589 10614201 10468168 10563642 10833436
9581 10833436 10761284 10563803 10414908 10084883 10270075 10077452 10195971 10248183 10157389 10369516
9571 10369516 9843022 9438260 9534480 9561958 9414512 9458794 9421508 9016378 9232913 9057863
9561 9057863 9296858 9002033 9056163 8811724 8466723 8559945 8506202 8709939 8801043 8594860
9551 8594860 8355502 8275189 8628930 8161422 8058792 8181691 8318355 8172743 8008956 7592229
9541 7592229 7419017 7608050 7594634 7796359 7929315 7444307 7289513 7491450 7628311 7381217
9531 7381217 7165199 6937928 6760987 6925117 7098303 7011092 7023983 7207725 6844124 6816896
9521 6816896 6737971 6836120 7039607 6851048 6946785 6476540 6364081 6665432 6346461 6504504
9511 6504504 6685758 6756787 6817641 6408976 5948905 5940271 6139018 6094044 5944133 5647182
9501 5647182 5672901 5783512 5665069 5891309 5810789 5598955 5345578 5625716 5393713 5290640
9491 5290640 5288723 5333898 5747002 5473230 5194914 5490891 5309085 5250735 5165654 5117133 5194663
9480 5194663 5414638 5321098 5422625 5127908 5140623 5145292 5270705 5027451 5056708 5225949
9470 5225949 5082301 4810189 4970798 4991195 4894605 4770604 4561390 4585929 4099158 4625353
9460 4625353 4996450 5101943 4852141 4598833 4512233 4885039 4940784 4539394 4459470 4521466
9450 4521466 4774715 4883619 4735007 4235436 4155290 4435859 4800910 4667138 4331368 4264686
9440 4264686 4041226 4070727 3752721 3744299 4353294 4091235 3877188 3940944 3901111 4096908
9430 4096908 3874171 3439047 3671005 3742196 3785903 3815805 3637558 4140256 4254941 4327904
9420 4327904 4035653 3857390 3733121 3769000 3936780 3666093 3616297 3536776 3559702 3402635
9410 3402635 3721443 3538032 3162938 2983432 3153147 3209222 3379204 3476275 3238758 3093056
9400 3093056 3125948 3349017 3388886 3068210 3015776 3437177 3433329 3158774 3388426 3101434
9390 3101434 3111567 3260106 3177741 3445476 3421885 3164071 2694978 2806420 3244422 3352740
9380 3352740 3050528 2709566 2909588 2973472 3136373 3350442 3301802 3442946 3327997 3088491
9370 3088491 3015328 2950065 3192819 3180862 3265160 3245961 2857003 2766647 2823080 2907130 2741242
9359 2741242 3098753 3312316 3393181 3100166 3085327 3012020 2579807 2459800 2299720 2483659
9349 2483659 2789465 2782108 2582749 2500970 2282757 2271253 2187961 2627843 3097253 2942182
9339 2942182 2800293 2488138 2767180 2881449 3038420 2595184 2636228 2489932 2331925 2563824
9329 2563824 2385923 2446659 2933531 2753249 3001883 2982678 2649226 2834563 2884516 2921998
9319 2921998 2772494 2534951 2498624 2203253 2115158 2046057 2373498 2303202 2384940 2439635 2197603
9308 2197603 2272901 1671211 1903103 2278041 1739690 2020060 2668675 2378072 2146665 1919785
9298 1919785 2060491 2413079 2282829 2139240 1959582 1698173 2086884 2202728 2020714 2188652
9288 2188652 2378720 2107655 2267068 2257049 1856223 1804263 2029820 2226618 2007506 2402463
9278 2402463 2164457 1896080 2071018 2147250 2425140 2096810 2071601 2249505 2094332 2008909
9268 2008909 2096601 2225393 2116922 1908654 2047974 1881151 2128357 2060600 2122610 2168956
9258 2168956 2137152 2102011 1989790 1715542 2037813 2252973 2327019 1987337 1873135 1743841
9248 1743841 1550992 1343614 1357030 1717461 1645353 1954854 1928134 1839531 1918929 1915836 1780089
9237 1780089 2087051 2167097 2229583 1832905 1825547 1654611 1488249 1578227 1491660 1450861 1455448
9226 1455448 1642317 1850183 1760386 1840290 1942828 1820010 1989560 1877215 2013008 2203740
9216 2203740 1947142 1557979 1790232 2104230 1969819 1963161 1716473 1656801 1759263 1467334
9206 1467334 1772268 1553463 1446984 1957378 1884422 1403503 1210666 1527833 1856300 2179738
9196 2179738 1973207 1694196 1808028 1747113 1439025 1426553 1342038 1425961 1558202 1687476
9186 1687476 1627106 1768777 1693287 1610928 1701570 1598811 1937018 1776095 2236767 2474835
9176 2474835 2034828 1447805 1593341 1604443 1393926 2060685 1588497 1022205 1159191 1936560
9166 1936560 2006659 1951653 2342236 1911004 1708676 1725474 2393532 2545919 1869226 1612296
9156 1612296 1825625 1658177 1838844 1951563 2019547 1554093 2015340 2235976 2145457 2002127
9146 2002127 1719217 1624806 1261788 1892004 2038519 1928632 1798729 1958702 1986795 2220684
9136 2220684 2170873 1764509 1755182 1735969 1889119 2000969 2078522 1943406 1702581 1881815
9126 1881815 1831534 1962019 1811552 1920753 1939395 1986574 2067828 1557486 1768220 2047371
9116 2047371 2022329 2172192 1828343 1662905 1532444 1788196 1671462 1524881 1698610 1659190
9106 1659190 1520631 1817299 1919648 1560627 1535072 2373081 2143240 1763969 1853556 1871006
9096 1871006 1977314 1985019 1658939 1706733 2077218 2057714 1837417 1560688 1704740 1740570
9086 1740570 1744103 1726766 1734709 1644459 1927132 2330497 2063652 1918022 2370855 2160594 1970340
9075 1970340 1887923 1879646 1973502 2339241 2360602 2261063 1842425 2026737 2228371 2201516 2125490
9064 2125490 2270603 1982210 1841793 1920520 1794160 1792551 1887384 2462922 2454151 2221992 2293011
9053 2293011 2185953 2264766 2090720 2133208 1821889 1907842 2471833 2923910 2784658 2992277
9043 2992277 3091392 2572345 2631667 2493018 2890688 3064401 2730263 2530308 2737107 3330265
9033 3330265 3748932 3355379 3306540 3594379 3767379 3613629 3908308 3904929 4137698 4389180
9023 4389180 4319406 4046857 3933476 4221766 4494813 4718660 4766356 4770045 4762768 4757858 5235787
9012 5235787 5922325 5609995 5615931 5678943 6065695 6438372 6354658 7153732 6987784 6980931 7304425
9001 7304425 7727953 7986128 8323641 8400177 8556693 8768939 9100357 9873617 10640538 10727332
8991 10727332 11409113 12075819 12664510 13404563 14187123 14981669 16183941 17681297 19466912
8982 19466912 21636504 23458289 25598695 26817206 26797905 26458928 25404136 23961598 22846202
8973 22846202 21774703 21556012 20890247 20392957 20160912 19531016 18527450 18263534 17922493
8964 17922493 17419262 16707838 16527622 16477728 16598378 16668477 16717998 16500963 16330807 16999693
8954 16999693 17816235 18549723 19092605 19864028 20920394 21930535 22702745 23627707 24776977
8945 24776977 26475398 28263748 29765945 31647118 32778355 32956610 31832378 29538323
8937 29538323 26732598 24301923 22076359 20634949 19953539 19159417 18201192 17556941 16546828
8928 16546828 15250181 14491772 13951288 13320367 12983250 12834044 11951618 11296119 10688139
8919 10688139 10237609 9730315 9542776 9478919 8958979 8370748 7997436 8125077 7837708 7703653
8909 7703653 7592544 6546082 6346655 6636208 6007947 5737424 5693153 5948072 5622441 5379040
8899 5379040 5007885 4700342 4590194 4545804 4782777 4348039 3837505 3916503 3719586 3991309
8889 3991309 4027316 3870702 4052300 3810006 3777950 3655656 3600209 3713082 3705621 3438902
8879 3438902 3327240 3108309 3129594 2890381 3073009 3104374 3270375 2941781 2930155 3274617
8869 3274617 3049483 2359817 2353300 2459287 3027125 2855086 2572950 2584748 3076350 3243711
8859 3243711 2602444 2471900 2769191 3001088 2646252 2261261 2389841 2451848 2342250 2422949
8849 2422949 2503331 2618685 2169475 2263397 2466330 1986786 2355050 2562380 2060194 2018810
8839 2018810 2275812 2643346 2375570 2313877 1998198 2463800 2123836 1831507 2440509 2614204
8829 2614204 2628870 2511078 2071688 1700977 1999361 1910306 1696209 1823901 2196763 2258956
8819 2258956 1964218 1692962 1755383 1854590 2204478 2199674 2130930 1783478 1665278 1541720
8809 1541720 1558617 1698198 2139528 2024403 2362267 2156212 1946235 2214557 2254639 2565845
8799 2565845 2375600 2172474 2639005 2809232 2176244 2089192 2331512 2195475 2068055 2402215
8789 2402215 2268811 2436249 2322678 2449483 2399634 2592311 2426831 3002315 3190478 2935845
8779 2935845 2726687 2605831 3004989 2972263 2930458 3276368 3528443 3522394 3664228 3445722
8769 3445722 3488505 3659996 3535801 3559620 3917467 4088997 3794310 3688596 3691633 3797058
8759 3797058 3629900 3438462 3658367 4094978 3935396 4308883 4289150 4028501 4132456 3888155
8749 3888155 4020665 4193962 4354556 4288058 4098609 4137273 4570902 4859355 4783228 4842784
8739 4842784 5188834 5213739 5117388 5291204 5320463 5321569 5538978 5579898 6006733 5994557 5795434
8728 5795434 5884209 5951255 6322198 6632115 7126101 7056677 7100576 6991229 7210442 7376142
8718 7376142 7195842 7803882 8614158 8947165 9464885 9490973 9585374 10504453 10704467 10885658
8708 10885658 11170818 11590055 12044018 12729666 13294569 13785566 14302122 15034952 15434973
8699 15434973 16213193 17068677 17788072 18353967 18771674 19967184 21334679 23045308 24829222
8690 24829222 27032710 28735783 29631167 30527634 30707305 30283466 29120212 27681824 26301442
8681 26301442 24905966 23544130 22464839 21440573 21136122 20774744 19578073 18285604
8673 18285604 17637027 17375763 16901416 16660830 16866428 17092025 17297004 17470005 17585091
8664 17585091 17720409 18540062 19308307 19657988 20614787 20987581 21802326 22134873 22451277
8655 22451277 23034169 23706852 24336456 24741693 25837747 26347518 26390080 25699473 24981308
8646 24981308 23421144 21946047 20508268 18580785 16805377 15939753 14787534 13991195
8638 13991195 13908655 13426859 12571192 12098191 11504080 10786039 10730567 9953778 9951099 9726955
8628 9726955 9511741 9619326 9456478 8986436 8876037 9022150 8852542 8811988 8696491 8266390
8618 8266390 7639612 7219539 7446724 7252645 6690839 6303948 5997593 5931133 5474900 5571534
8608 5571534 5544702 5439451 5234229 4928640 4944874 4547937 4353090 4081715 3943057 3918507
8598 3918507 4019265 4037001 4261526 3722447 3625438 4115021 3848110 3701225 3260130 3043465
8588 3043465 3515541 3641984 3027814 3093102 3102945 2865264 2936696 2846234 3261421 2081399
8578 2081399 1479115 2045834 1996123 2433498 2439584 2597941 2496312 2209624 2265421 2327282
8568 2327282 2761108 2152194 1220252 1493885 1594090 1474286 1377553 1441929 1504646 1056493
8558 1056493 1156656 1324355 1145842 1545481 1790887 1896798 1630496 1256345 1703903 1362065
8548 1362065 1223485 1131902 1081013 1576101 1679348 1499508 1385747 1523246 1355616 1680299
8538 1680299 1502768 1294159 1425223 1079862 944595 1110132 1071739 1224570 1187739 1174935
8528 1174935 1205232 1058862 935532 729007 706367 958966 948143 1108652 963144 647752
8518 647752 1041512 1361558 1246069 1036211 945781 1177979 987840 1115605 1075769 594725
8508 594725 548334 552384 993148 1071946 881866 876482 884099 923447 765365 863929 454877
8497 454877 413917 198368 301941 457723 523406 276734 27986 429228 271762 161605
8487 161605 436681 662203 738778 841046 916489 707047 982893 705698 305096 681386
8477 681386 540509 346015 193482 565955 554279 668886 564330 808700 267789 -154240
8467 -154240 171797 111362 345319 622949 216522 500442 363245 431568 310111 351190
8457 351190 527352 471811 8995 -36435 238597 -322902 -148420 -280212 -160883 165615
8447 165615 349620 504591 276143 413449 163874 278693 329696 80811 -249613 156073
8437 156073 584768 -115984 -14624 -36686 -37019 363527 -71025 253636 478611 184024
8427 184024 -168 360845 671450 674877 862037 725989 432710 -29623 -11915 -243778
8417 -243778 210148 182265 254436 461443 247267 187621 356850 134957 317813 306118
8407 306118 581401 225670 15139 -184463 -472133 -189317 -211294 338511 527760 769141
8397 769141 527033 548955 673198 647092 145371 -95667 193597 83603 -134058 -22691
8387 -22691 329433 312336 274470 229637 104041 -217562 -175247 180459 203673 20457 62077
8376 62077 54330 108247 211239 -111451 -293117 75356 -3769 3228 -75857 -465700 -460963
8365 -460963 116406 398145 569521 970916 710724 145112 41844 307671 248614 -168195
8355 -168195 -148758 10803 110424 -152601 -245463 -31456 -195984 -312075 -457590 -353380
8345 -353380 200308 -178094 -139583 146080 358921 252430 -2528 -258362 -405729 79831
8335 79831 165218 105178 -95211 314238 7367 -160208 305295 -3885 97901 531500
8325 531500 412572 197143 105380 -45791 381716 188900 160251 458612 210194 199798
8315 199798 100497 220710 501355 511823 183461 70828 -24582 -262308 -62612 128549
8305 128549 226382 264609 261395 -68803 -303418 -177715 19314 70658 193439 655595 556344
8294 556344 528455 -118018 -45113 -74253 -51376 -65311 -347689 428989 335385 472694 371652
8283 371652 202251 140791 308577 424551 269344 228988 -283 -213372 -316687 -284112
8273 -284112 -328445 -361622 -152456 202418 11009 159259 30197 -168397 -69981 207791
8263 207791 66682 -370507 -472813 -19529 -96276 14504 -73567 248670 -28816 -135881
8253 -135881 473694 407511 21871 184402 -204516 -272711 -62702 31263 -122867 -408015
8243 -408015 -434309 -2441 195888 554699 -172325 -252613 7861 -187455 61908 32859
8233 32859 47606 -352391 -429680 -435520 -129487 -136415 -125298 -172142 121428 -53976 492408
8222 492408 356300 -134817 -57314 82182 177625 334584 160680 321958 -25266 144617
8212 144617 -35800 -136128 -177723 -138899 -191068 -138122 -314928 2213 -108562 -181909 -289385
8201 -289385 155644 72501 -8749 -140459 271702 437446 510419 379062 1357739 2350652
8191 2350652 -695882 -772211 -461678 -177986 -430418 -80199 -23452 -14872 -251311 -487293
8181 -487293 -521411 -423864 -114505 -147960 -102139 35422 320742 158581 -75339 -197119
8171 -197119 1830 159088 -88025 -135176 -101539 -296345 -298646 -75650 130881 -69957
8161 -69957 -30292 146820 76346 273656 -101505 -358333 102998 -43847 -377198 -232712
8151 -232712 -86862 222905 19793 -336793 -335399 -758568 -816008 -458471 -319369 -737387
8141 -737387 -692127 -717642 -748664 -622227 -635914 -605783 -298071 159112 205868 -119845 -151393
8130 -151393 -478006 -551766 -313014 -17810 -120542 -392323 -670466 -446727 11210 -360157
8120 -360157 -437348 -11246 114235 -21508 -313553 -211850 -423605 -315675 -412236 -240407
8110 -240407 -417087 200164 178987 17637 -236513 -329591 -312890 -418940 -125924 -179032
8100 -179032 -435022 -305150 -229114 -475352 -274825 -275820 -561341 -855107 -608087 -198835
8090 -198835 -359791 -450745 -546600 -939932 -204514 -135017 -360087 -347358 -96043 -541511
8080 -541511 -771740 -671368 -467217 -353634 21285 -112764 -339902 -439677 -399466 -402113
8070 -402113 -251209 -716140 -238855 40375 -254354 -363864 -78441 -62515 -185362 -350146
8060 -350146 -277831 -464843 -742596 -592793 -324049 -185224 2563 -321587 -573959 -202424
8050 -202424 -73938 -42040 -166749 -17371 5844 283029 316446 68485 -67726 -282793
8040 -282793 -24091 -420012 -261034 -24106 -97530 -149567 -335552 -277702 -209361 -39272
8030 -39272 -285180 -154912 -288720 -580713 -448823 -155622 24816 15059 -256358 78464
8020 78464 -54546 -62360 -64509 -81093 -351017 -562438 -402135 -287209 65456 195668 351017
8009 351017 163092 -132096 -787855 -958984 -534542 1246 -226964 -491800 -261946 -413005
7999 -413005 -81370 -391659 -515451 -472014 -417081 -241220 102230 29468 -256683 -269537
7989 -269537 -316243 -770131 -570695 -175972 -273217 -653301 -275056 -389689 -286550 -226884
7979 -226884 -239531 -319232 -623074 -453796 -395366 -360653 -466352 -112502 -275203 -845993
7969 -845993 -285483 -437786 -330544 -317219 -337284 -177411 -377260 -460502 -685967 -614022
7959 -614022 -419835 -171705 -93504 4517 -152516 -320167 -78709 99175 -87291 -210312
7949 -210312 -249419 -496896 -419738 -469587 -624629 -393371 -632347 -855219 -668724 -562444
7939 -562444 -634465 -335445 -672800 -499856 -358711 -519125 -473767 -517088 -341929 -506093
7929 -506093 -474784 -431194 -275404 -125716 -47612 -249616 -128194 -49823 -55235 -94001 -206081
7918 -206081 -215388 -329019 -430995 -305501 -130354 -160048 -9321 -273280 -379175 -246846
7908 -246846 -463385 -263503 125989 -264230 -120075 -245903 -176864 -212251 -168693 -498875
7898 -498875 -250098 -332471 -416759 -307981 -437865 -554812 -263762 -260621 -406517 -275211
7888 -275211 -387938 -602358 -498013 -453688 -396001 -349768 -344216 -619281 -388091 -349680 79652
7877 79652 212734 3417 22461 -110082 -225400 -8674 406589 -132356 -312466 -353480
7867 -353480 -386337 -378391 -521784 -729763 -438811 -607081 -397285 288105 -74961 -253637
7857 -253637 46176 -361146 -635583 -554065 -474187 -170405 -508787 -628717 -194299 -232348
7847 -232348 -230024 -23765 -26520 -168063 -348945 -558010 -296871 -457215 -348229 -231300
7837 -231300 -107389 97466 210575 530053 357084 98399 30242 -270694 -479212 -575768
7827 -575768 -178581 94899 162075 -81338 -407242 -440443 -306423 -501572 -621898 -600731
7817 -600731 -738861 -685258 -659556 -1006157 -81178 -322990 -530376 -929838 -919651 -973088
7807 -973088 -1143731 -987026 814908 738642 -67676 -223838 -106662 -36570 -336028 -380987
7797 -380987 -264663 -126810 -180388 -343278 -586146 -31318 -234598 -505013 -552524 -789400
7787 -789400 -749408 -455717 -555246 -195860 -297722 21425 74536 107927 -542317 -463410 -344536
7776 -344536 -58400 -58966 -239492 -525624 -402870 -372441 -404003 -429332 -480715 -620777 -255286
7765 -255286 177896 171362 248103 80384 -332745 -160956 -120107 -422379 -289327 -493886
7755 -493886 -211551 70068 -207328 -96286 -204637 -178822 -108049 246059 -191104 -591035
7745 -591035 -605804 -248079 -381794 -597685 -230086 -169745 5077 -109767 -102565 238816
7735 238816 245773 376911 -42886 -324885 -121169 -467817 -695743 -511636 -205434 20875
7725 20875 -33077 -120701 -13638 189511 570663 -19503 -51437 -173633 -120024 104789 281528
7714 281528 378278 201014 -61536 -47560 134449 478775 254018 211110 18716 -6262
7704 -6262 248115 229850 -93703 -262291 -134853 -381471 -644960 -642149 -301800 -65659 342508
7693 342508 72905 -92821 -299081 -166527 -313206 -290997 -173809 -439295 -585562 -753854
7683 -753854 -692622 -691626 -300463 -308500 -771071 -243099 -149557 -452552 -357279 -220151 203372
7672 203372 192123 390638 99998 -99493 -72044 54151 -46953 -279983 -247249 -269335
7662 -269335 -31872 48144 -69815 -103661 -218091 -365046 -182385 -145072 -249768 -291738
7652 -291738 -282800 53599 140134 -17129 58991 285612 -158582 158439 479875 536182 166679
7641 166679 -541085 -301576 -40686 -38283 191811 -249561 -683087 -307588 -299384 97019
7631 97019 170428 61013 -516453 -180628 -166949 -294355 -150407 -568323 -216961 -427125
7621 -427125 -95352 426112 332351 428279 411327 330981 273386 164243 82537 -395662 -158734
7610 -158734 -125772 -118524 -96986 -125247 -39363 120792 115646 -121893 67019 -206913 -95133
7599 -95133 -78457 -27330 66155 -320533 -127685 84171 -368669 -396974 -59221 -91231 -223612
7588 -223612 -271212 -450365 -164820 -50538 -417812 -88656 93580 -253612 -515401 -464471
7578 -464471 -485695 -419282 -252784 177573 146158 -346090 -338234 -341209 -104778 72404 -115443
7567 -115443 -34766 -244921 -332491 -867 -148611 -432156 -121561 -41386 65986 132458
7557 132458 145158 -211435 -234603 -304337 -188988 -37833 16109 93427 137703 -102514 -328993
7546 -328993 -373989 -402103 100272 -338378 -607123 -473109 -269575 -714157 -220698 -434598
7536 -434598 -659541 -449165 -428022 -340753 -172274 -299169 -115086 -175881 -198665 -173280 -224758
7525 -224758 1518 404441 77796 -371367 -630224 -794690 -421654 -103199 -19815 70136
7515 70136 191841 -215556 -65328 -199885 -143064 -118907 -52516 -40589 -160583 -64023 20007
7504 20007 96226 418946 97215 -116406 -90569 -128321 -12844 216960 192569 83522 74720
7493 74720 -29770 55956 78834 509357 390651 447863 552522 -78510 -241927 173208
7483 173208 -501048 -181292 237862 -66141 -87841 27440 474229 455028 108310 -1873
7473 -1873 -314211 -298096 -84348 22868 -54027 -100329 174643 430958 483928 -138735 398629
7462 398629 402865 78804 -122330 170505 329445 444086 267735 253191 750337 541305
7452 541305 345036 480134 535344 486355 401461 212704 267054 344880 356419 108391 312321
7441 312321 606651 555981 220968 300787 630276 567190 447963 771377 520091 238310
7431 238310 323816 638535 310214 310690 407468 444441 748420 526979 747040 405993 615426
7420 615426 439523 91844 607197 748098 179352 525304 673789 571001 284968 515064
7410 515064 971113 857419 657830 421352 497252 650521 607666 281180 564509 608855
7400 608855 518204 544566 620526 1189808 1264706 1162151 1180141 1447070 1440880 1279723 1173041
7389 1173041 1310891 1172864 1022061 751645 1177768 1413762 1126571 1110995 1111961 1332260
7379 1332260 1476649 1812734 2172523 1933696 2020587 2064644 2085593 2386501 2548209 2737733
7369 2737733 2802515 2571147 2473693 2949532 3207349 2940822 2884379 3105276 3441237 3956114
7359 3956114 4344502 4550750 4522025 4747542 5021114 5326534 5515232 6077965 6343633 7055407
7349 7055407 7535713 8313531 9034101 9343385 10311040 11672647 12820553 14263494 16524269
7340 16524269 19112206 21733058 24431969 27064453 29263553 29315621 27497835 24277940
7332 24277940 21146770 18725927 16007936 13698922 12504513 11278103 9841778 8808854
7324 8808854 7801835 7036231 6767663 6283626 5609787 5164132 4803002 4739840 4486197 4134095
7314 4134095 4034291 3695995 3452178 3431497 3308054 3231589 3425747 2983431 2773510 2564946
7304 2564946 2546818 2304093 2305406 2316129 2127637 2204639 1690552 1882172 1760580 1593817
7294 1593817 1700947 1851539 1716742 1639171 1320840 840019 963965 878366 842882 1104711
7284 1104711 1408791 1399043 1455607 1258637 1099046 721619 802633 663213 779739 780872 979399
7273 979399 1016652 429557 902034 926054 863708 1095332 1060255 383654 662377 798975
7263 798975 886576 981763 775713 1048756 760925 421029 780019 798721 701277 655652 684042
7252 684042 464869 382427 693840 612993 278248 610566 811616 522476 595199 505834
7242 505834 395722 282753 124979 -215793 -14953 524577 598269 594562 383524 378173 19311
7231 19311 39307 -185527 84601 122234 52440 62094 -25199 53407 20761 168028 248517
7220 248517 509574 220156 363029 728968 547442 182906 193574 338722 486021 -3436
7210 -3436 -416688 -97442 -135119 -132116 -191487 138530 174742 323138 290342 114987 256715
7199 256715 105921 -78583 -161486 -174678 -70045 146178 178701 86955 -87639 -58089 -210162
7188 -210162 -293639 109421 -97144 -113875 -317697 -518881 73193 341601 94019 -42998
7178 -42998 226249 644103 362109 323159 -124755 -726405 -355429 -178110 47924 313281
7168 313281 615016 195093 58738 425810 743590 505016 -52618 -143151 257335 417700
7158 417700 459608 741530 523306 205647 420694 303786 -307000 -411347 -128563 -327857
7148 -327857 208816 142489 299801 641966 572896 177921 302283 -37305 150538 150506 -277255
7137 -277255 316352 316823 310049 -88459 -45449 -284446 -82829 89196 77957 227253 288658
7126 288658 377670 161082 216895 557161 423805 197657 -47729 -244299 -101179 75679
7116 75679 262277 -19764 -350524 -142315 -235728 67448 -207927 -140712 -167815 -162733 -255844
7105 -255844 -561026 -334828 -616610 -189899 -240479 222487 43602 -199635 -116035 -262255
7095 -262255 -14783 -214068 181364 77467 -234723 -27277 -396294 -476632 -283185 -313428
7085 -313428 -27191 -454443 -563309 -260490 -549611 -763931 -85126 -262384 -354793 -297932
7075 -297932 -800674 -368157 -131417 193269 130166 319592 89693 -195392 47542 317682
7065 317682 84061 -232790 -214850 315518 49106 -115375 -135350 -754083 -380539 -30669
7055 -30669 -513269 12292 114337 56863 102577 -60340 97848 -190880 -62367 -135513
7045 -135513 -288906 -377858 -503630 -642544 -676800 -484408 -661239 -513600 -444859 -478419
7035 -478419 -584844 -227138 -103932 -517218 -484188 -349735 -228339 -687720 -883623 -611691
7025 -611691 -49413 -67250 41344 277636 157222 -164637 -198459 -468972 -563929 -583676
7015 -583676 -406562 -391327 -510069 -208891 102744 249490 394699 -94173 -344537 -496930
7005 -496930 -124991 -244301 -347817 44898 -124422 -282715 -405648 -198563 -178782 -107930
6995 -107930 -177681 -66542 -305149 -256000 68511 18354 -196292 -425686 -40672 34841
6985 34841 -333778 -578397 -390526 -305179 -620547 -413535 -169513 -357042 -450491 -557626
6975 -557626 -457775 -604825 -563255 -350009 -196595 85303 -249595 -60636 -176369 -440879
6965 -440879 -27742 -227028 -114031 27223 -88410 -55367 -24355 164439 8996 170491
6955 170491 399671 427041 426381 129127 -280253 -298010 -183657 -147940 -479354 -378420 -279602
6944 -279602 -433719 -577917 -343027 -55938 -192772 -4669 24419 -151822 -360037 -535799
6934 -535799 -235815 -121608 -344089 -228102 -309538 -219030 -106719 26532 -130609 -184516
6924 -184516 -370931 -435270 -361149 -488176 -478393 -808139 -635364 -274322 -258610 -467174 -226629
6913 -226629 90221 159142 78472 -224149 -122610 -400351 -394179 -368528 -332102 -922825 -673743
6902 -673743 -66540 -171772 -55781 44076 -216507 58263 192431 -254858 -440218 -539628
6892 -539628 -489179 -906719 -1064532 -594485 -242390 -420637 -193804 -91076 -327977 -336082
6882 -336082 -494453 -249358 -237188 -225050 -159480 -204669 37893 -7539 -11430 -561375 -435291
6871 -435291 -5230 -43223 132245 123469 -86606 -185413 -525129 -117140 135315 230509 -103147
6860 -103147 53126 38426 12117 84010 -384469 -395827 -254080 -278604 -58294 -293671 -264033
6849 -264033 -208190 -309436 -536800 -251756 -137351 -225922 -16060 100521 203956 -203545
6839 -203545 -472685 -259204 30094 -285960 -741179 -635859 -407719 -252119 -318821 -254351
6829 -254351 -147959 -197921 -313894 -324573 -376288 -173642 -211729 -423788 -553737 -560121 -66686
6818 -66686 -45103 -93990 -332204 -97917 107088 -208512 -481605 -290738 -196806 -339654
6808 -339654 -464407 -229739 -7071 77405 -203520 -359687 -60772 -170081 -448 -133197
6798 -133197 211651 326780 92241 709296 143114 -164463 -264328 -16654 2309 156104
6788 156104 263276 -201080 -458090 -502744 -351623 -343464 -165654 201235 -140963 -313105
6778 -313105 -332341 -259292 120987 12788 -429404 -414501 -536537 -252374 -250481 -543751 -614575
6767 -614575 -256418 -114483 -421391 -361176 -457646 -534442 -301178 -216454 -219573 -116178 -304053
6756 -304053 -348854 -77727 -361139 -391252 -518030 -214378 122913 -191271 -333496 -118179
6746 -118179 -466023 -381317 -347063 -401469 -226039 -336085 130996 173304 307036 72008
6736 72008 57773 195881 -231671 -196074 -118955 89513 155361 -122627 93088 -62885 -266142
6725 -266142 -729322 -694102 -386482 -437809 -171301 74649 -50538 -244824 -412525 -197901
6715 -197901 -459061 -211253 228920 471 -355516 -385769 -485202 -438049 -318722 -117988
6705 -117988 -563076 -692665 -446581 -466236 -795 -40102 -246715 -259155 -287119 171909
6695 171909 -88715 -77599 66379 -231364 -95823 23845 -12795 17766 260568 186151
6685 186151 -203983 -300129 299618 112770 157570 -224214 -739664 -389044 -433798 -248130
6675 -248130 -735320 -702440 -55256 307773 94413 109356 -176817 -467920 -202648 -276558
6665 -276558 -204321 8153 56670 209507 188387 1849 -37431 -344774 -400921 -407478 -303890
6654 -303890 -420847 -591548 -414457 -132221 49776 70351 89155 -321502 -504686 -435601
6644 -435601 -347378 -433997 -370020 116063 -3363 171596 -334175 -457766 -528603 -836884
6634 -836884 -66259 176742 23328 -108146 -269683 -493386 -398534 -200693 129832 228645
6624 228645 -357521 -329591 261677 515681 317207 217284 -379714 181713 635601 440656
6614 440656 178909 -432869 -452588 -55881 -408447 -365354 -405628 -265715 -167054 -1241
6604 -1241 218528 241523 275152 243692 359068 -17174 104746 377739 304846 -29244 -53832
6593 -53832 122499 177026 -231678 486790 557632 411680 551450 413527 101687 -110716
6583 -110716 23310 -11990 71036 238539 227375 83925 -195393 -465805 29189 -35752
6573 -35752 86921 -24587 -144996 -182234 -212902 -97497 -105239 386447 168847 -40858 -124294
6562 -124294 -369174 -244174 -154548 -94233 -185084 197672 64969 -78055 270209 111481
6552 111481 -140640 186359 434232 -232963 -293121 59223 -125301 -260928 -447330 -395788
6542 -395788 52095 -30537 151174 16332 26178 -101484 -79887 -122831 172916 -276116 -338488
6531 -338488 -270426 75101 -100545 -157805 250001 84048 379596 223112 -12303 -186299
6521 -186299 -224973 -172168 132517 351764 348827 66950 -214672 18581 -2215 -47775 -17634
6510 -17634 -429337 -288365 -244436 -255181 3580 277188 244810 22494 136871 -372550
6500 -372550 -261040 201937 -224386 -21969 1629 -34948 358515 203639 -499225 -245234
6490 -245234 -225162 -443277 -220484 -72130 38833 169559 7733 -255295 -224973 -169840
6480 -169840 -311350 -275202 -378463 279275 -72916 3800 -45159 -403798 -274310 -207250
6470 -207250 -27128 -64817 6969 249248 211412 220635 -97580 -306492 -219920 239021 420773
6459 420773 97782 -42569 -215534 -376834 -230694 -224908 -264120 -502668 -571967 -370162
6449 -370162 -132749 -315855 -398519 -641853 -392595 224483 332055 222085 -56602 143364
6439 143364 -48857 -36771 -304599 -21408 -153369 -202277 180755 320392 65470 152239
6429 152239 290160 86847 -27777 -387664 -375691 -320585 -294143 -150061 -218294 143924
6419 143924 267674 36897 -234441 -179920 -79074 42763 -383642 -604012 -294150 -279893
6409 -279893 -511724 -265613 -198045 203593 225765 105177 179208 -90315 -128454 119382
6399 119382 141296 -141916 248072 89107 4617 65739 -322515 -393769 -241388 -291277 167298
6388 167298 385720 195823 -117767 -236014 565703 334435 92435 -227771 -96921 -114289
6378 -114289 -220301 -20625 -92714 -67207 182625 278999 580450 177443 -31215 -123051
6368 -123051 32290 47404 -299703 37828 252547 136880 -164268 -228501 -33655 233201
6358 233201 280327 426068 377433 120672 -16745 101739 -228469 -536166 -457138 -333597
6348 -333597 -359291 -367745 -185936 204221 334166 129669 479401 333141 -73614 217057
6338 217057 242259 -47050 -38203 61320 -257794 -700003 -304042 -96104 414216 497682 204953
6327 204953 57000 -19349 258235 64689 84666 -153424 -166401 -563571 25047 153063
6317 153063 233112 198103 -143955 -112868 108863 261063 -64385 -258106 17537 -40704
6307 -40704 -231576 -107952 133192 364687 493575 286421 -61286 -308395 -21574 344391
6297 344391 769121 644232 185792 -212564 246290 57807 180242 19490 -78333 71682
6287 71682 -80327 -8429 268489 405037 134757 46209 403823 587172 304552 335085
6277 335085 270254 344761 392128 625422 553858 314625 120340 150577 262015 291755 232383
6266 232383 101571 48168 385054 176220 145802 -47399 -208297 199422 350092 -48435
6256 -48435 375828 520173 213746 181694 336168 543895 501697 349135 531064 497862
6246 497862 321514 361084 509691 568293 473424 634706 446419 469508 725699 949697
6236 949697 899841 756598 598392 656058 606433 493238 608665 469922 759972 516753
6226 516753 472517 635383 765841 901030 667289 1038142 798517 1067071 805620 471240
6216 471240 329003 622272 946261 930738 892846 984922 1246986 822747 1342221 1484179
6206 1484179 1586954 1407887 1328167 1466016 1532045 1286366 1024813 948189 1676608 1829902
6196 1829902 2094564 2083606 2168779 1977195 2352181 3166059 3449026 4068671 4506701 5655140
6186 5655140 5898797 6752849 8046728 8814831 9121185 8058806 6699757 5390346 4245322
6177 4245322 3295638 3111114 2439523 2203640 2183792 2200895 2166989 1804013 1782112 1642477
6167 1642477 1395042 1384356 1448415 1353859 1362122 1347777 1682907 1577192 1652583 1803248 1832267
6156 1832267 1990569 2133295 2004444 1647184 1410095 1536730 1327768 1239488 1239609 1530754
6146 1530754 1561362 1435377 1448276 1130987 1186056 1116530 1395659 1809018 1638653 1386646
6136 1386646 1184749 1519708 1526402 1528591 1432380 1712846 1704425 1610045 1588485 1590551 1955123
6125 1955123 1668296 1386467 1647229 1570824 1251082 1840325 1897407 1848292 2152407 2144549
6115 2144549 1968506 1792876 1886189 2049029 1853374 1644576 1945497 2412078 1912674 1308157
6105 1308157 1432546 1356991 1386334 1777982 1847083 1970601 2280930 1959196 1781841 1531924
6095 1531924 1632599 1528400 1331613 1771167 1929048 1531191 1854481 2179083 2247027 2217702
6085 2217702 1832074 1822352 1798398 1744359 1929812 2313923 2543564 2039527 1843978 2002881
6075 2002881 2123681 2161412 1752737 1836736 2286299 2039234 1892184 2121239 2091588 1895231
6065 1895231 1493763 1385622 1781438 1922693 1905181 2046953 2178982 1879313 1746906 2067214
6055 2067214 1647239 1751623 1673690 1847240 2161195 2262833 2135485 1817879 1837477 1789659
6045 1789659 1740992 1881406 1710195 1356964 1382006 1687967 1895131 2206874 2384712 2518790
6035 2518790 1898916 1768820 1925538 1739802 2215048 1919892 2140505 1740616 1807781 2007054
6025 2007054 2012212 2006056 2382761 2674571 1916446 1876669 1884689 1786441 1990069 1723582 1801251
6014 1801251 1921388 1782465 1757048 1855324 2143766 2452317 2199145 1580998 2131784 2252125
6004 2252125 2366452 2503932 2139710 2196435 2126482 1960000 1935552 2225852 2370659 2290118
5994 2290118 2202856 2488803 2338196 2459337 2520813 2418890 2421105 2485831 2682899 2498976
5984 2498976 2531840 3115136 2883460 2868997 3101110 2701406 2953493 2938018 3396213 3660399
5974 3660399 3562352 3252129 3282993 3309398 3444699 3457787 3604917 4065170 4358172 3932389
5964 3932389 3838776 3728442 3769837 4516889 4384641 4670719 4667431 4531941 4792660 5064776
5954 5064776 4985888 4953012 5275403 5362177 5163411 5116147 5445152 5869015 6248630 6598113
5944 6598113 7321780 7336957 7345359 7500704 7743792 7718250 7903439 8046499 8243752 8070425
5934 8070425 8284965 8856737 8976183 9200742 9123532 9217834 9564374 9883212 10670648 10641217
5924 10641217 10441938 10438105 10934948 11179778 11477524 11479341 11789596 12221016 12296054 12378602
5914 12378602 12415065 12608796 12596860 12604878 12581535 12914595 13334364 13405030 13363074 13716579 13652115
5903 13652115 13723922 13899493 14386435 14539043 14650164 14915897 15619107 16218804 16449174 17122052
5893 17122052 18008970 18268481 18832012 19263920 20224505 21004353 22021362 23825175 25014794
5884 25014794 26110103 27501549 29426713 30836729 31855506 33358652 34350398 35035319
5876 35035319 35270470 35694122 35454213 34487480 33434144 32140560 30776555 29142315 27782122
5867 27782122 26881536 25890894 25466106 24359975 23182895 21987771 21060006 20472141 19797056
5858 19797056 19036047 18086121 17574171 17557144 16816576 16202069 15590709 14782994 14715522 14453471
5848 14453471 13675213 13363078 13023195 12557610 12344996 11484978 11034797 11371513 10896309
5839 10896309 10191916 10043607 9914588 9938381 9637372 9478101 9388832 9254776 8784595 8506544
5829 8506544 8272562 7825079 7676852 7508644 7297657 7382710 7472108 7355673 6317043 6627887
5819 6627887 6708873 6473874 6435221 6196945 6206419 5942949 5617707 5616065 5794773 5698621 5456983
5808 5456983 5165761 5066574 5069882 5224954 5596361 5232130 4892994 5044445 4906497 5109716
5798 5109716 5149673 4779594 4626029 4232292 4318944 4169725 3785912 4135853 4353100 3454601
5788 3454601 3296477 3698111 3408553 3143039 3452957 3845696 3439194 3587994 3428130 3325731
5778 3325731 3449329 3524494 3200944 3468800 3363531 3137633 2976975 3154274 3480506 3256836
5768 3256836 3253392 3333316 3254961 3038150 3087869 2815996 2804339 2909364 2580166 2592276 2576676
5757 2576676 2476843 2507740 2817885 2891110 2965775 3096939 2870893 2442916 2324277 2281599
5747 2281599 2481258 2954028 2620172 2341970 2271388 2263478 2526779 2783893 2490969 2614765
5737 2614765 2556553 2839483 3036022 2927196 2466254 2322781 2280381 2433055 2597257 2237396
5727 2237396 2528312 2561172 2426381 2271174 2035919 1928979 2399474 2369976 2144092 2402542
5717 2402542 2330694 2277043 2064259 2140166 2162906 2687346 2348222 2015491 2324534 2376122
5707 2376122 2109620 1932874 1715563 1615522 1679087 1761883 1630487 1937429 1994853 2039641
5697 2039641 1869157 2189209 1894035 1903719 2328561 1925578 2023996 1858298 2138835 2077464
5687 2077464 2721944 2422030 1921165 2063261 2201315 2201958 2481332 2438336 2247951 2258688
5677 2258688 2243350 2430749 2214906 2002685 1591546 1640401 2221911 2400666 2451967 2525557
5667 2525557 2491021 2119470 2036985 1436075 1831490 2419672 2006670 1737560 2144875 2264679
5657 2264679 1847119 2235113 2100672 1652972 1589420 1764428 2065491 2404032 1856889 1506832
5647 1506832 1982897 2237072 2248894 2011508 1842262 1576336 1569515 1652841 1670969 1639907 1734778
5636 1734778 1769463 1564189 1300406 1632295 1701106 1965259 2309330 2109154 1973898 1620206
5626 1620206 1763491 2183668 2242661 1722834 1794505 1825091 1537715 2084825 2398972 2317301
5616 2317301 1967735 1852109 2078874 2334167 2003760 2126722 2087529 2225504 2023912 1696973
5606 1696973 1438837 1268208 1555910 1746884 1793527 1852912 1845337 1976504 1778548 1819535
5596 1819535 1838428 1824804 1608138 1559298 1804700 1623676 1920930 2125383 2051291 1856704
5586 1856704 1742406 1863613 2253969 1871979 2148582 2230668 1518074 1348360 1519704 1778115
5576 1778115 1556504 1785997 1868996 1428908 1703375 1590170 1556463 1323418 1611782 1750506
5566 1750506 1863124 2036928 2188549 2472622 2095580 1812430 2014277 1977489 2217061 1976917
5556 1976917 1663785 1609280 1605476 1686501 1777487 1807482 2179615 2076657 1808786 1704584 1675770
5545 1675770 1641159 1583301 1800711 1401546 1616456 1795358 1119395 876247 1146705 1367796
5535 1367796 1546257 1606162 1468788 1534558 1576013 1551381 1565284 1799941 2198521 1920199
5525 1920199 2083259 1795949 1692896 1846884 1697408 1663216 1674489 1604215 1211257 1141850
5515 1141850 1142290 1395559 1737711 2185398 1849709 1935970 1995114 1788128 2047373 1814457
5505 1814457 1713882 1443731 1450517 1773493 1948000 1593106 1444788 1897013 1741165 1937160
5495 1937160 1789239 1414074 1580183 1403405 1225343 1183556 1615113 1711066 1606769 1795768
5485 1795768 1726004 1798051 1743299 1756857 1674549 1543677 1664708 1538222 1401152 1521491
5475 1521491 1236472 851342 916617 1304310 1564238 1908878 1526103 1510703 1624742 1461730
5465 1461730 1501502 1688070 1722800 1221988 918397 1065966 1401386 1491691 1724853 1427662
5455 1427662 1417814 1411159 1433752 2007508 2069636 2093989 1904595 1205437 1262846 1372704 1357458
5444 1357458 1192894 1517753 1643426 2040674 1744182 1888769 1579733 1546333 1907477 1941555
5434 1941555 2279524 1981656 1839402 2237539 1654833 1296525 1574904 1252602 1789707 2226665
5424 2226665 2442349 2293005 2132935 1794446 2096213 2299541 2249276 2142909 2013386 1893489
5414 1893489 1667336 1590303 1490965 1444228 1634470 1841340 1473268 1322154 1435723 1710307
5404 1710307 1379147 1214818 1443334 1780939 2041573 1819314 2041562 1565607 1302891 1330541
5394 1330541 1483594 1639989 1462725 1579545 1616882 1529631 1302325 1185903 1236671 1420970
5384 1420970 1742303 1715124 1584868 1585203 1558547 1765612 1874808 1211863 996312 1222446
5374 1222446 1605074 1901706 1824524 1966574 1752415 1440099 1461015 1698763 1651490 1289378
5364 1289378 1377696 1854503 1600282 1603707 1342530 1329750 1813113 2316388 1829713 1883936
5354 1883936 2109679 2010146 1922970 1926504 1903847 1826254 1455472 1580115 1874776 1669053 1774211
5343 1774211 1390207 1727441 1762309 1647432 1515871 1445009 1478049 1528431 1192768 1027631
5333 1027631 1364663 1503104 1930679 1591726 1545771 1577366 1422962 1588970 1512227 1279779
5323 1279779 1271524 1611815 1430509 1682928 1850778 2129928 2260168 1595135 1479649 1481621
5313 1481621 1629080 1725598 2069136 2201323 1903109 1862832 1353469 1567501 1783992 2004306
5303 2004306 1957947 2112872 1717462 1452727 1548453 1884480 1760689 1951189 1761105 1705217
5293 1705217 1822875 1915795 1956995 1756104 1344393 1499644 1370418 1587402 1486808 1579715
5283 1579715 2032124 1984044 2205859 2119410 2198890 2074811 2191135 1961936 2038085 1903974
5273 1903974 2193971 2011549 2453452 2641311 1845910 2117684 2027110 1928543 2174039 2343864
5263 2343864 2136859 2150713 2443464 2463335 2290335 1939451 2278502 2099981 2175035 2106466
5253 2106466 1831974 1943255 1960203 2023822 2095012 2105927 2185526 2208553 2142699 2522814 2117703
5242 2117703 1633916 1786258 2031915 2503223 2396684 2358311 2469485 2274148 2204996 2383394
5232 2383394 2348532 2132692 2068287 2309788 2488632 1776092 1921732 2366859 2283320 2147031
5222 2147031 1901022 1977175 1748947 2258250 2254706 2238229 1971897 1886654 2307470 2549527
5212 2549527 1971747 2263487 2661612 2676210 2563366 2432354 2195885 2154754 2246944 2256060
5202 2256060 2206212 1925237 1896624 2234873 2287246 1970122 2204748 2092028 2080172 2446702
5192 2446702 2422887 2085557 1900873 2011754 1853773 2039344 1867457 1721719 1775466 1890257
5182 1890257 1639905 1795512 1740539 1698784 1787407 1790002 1886411 1944768 2246357 2096706 1909282
5171 1909282 2218453 2354052 2035088 1934129 1816921 1912240 2126350 2387531 1798557 1716565
5161 1716565 1686298 2057112 2057445 1882694 1603985 1988966 1955897 1672787 2011491 2335544
5151 2335544 2073076 1792821 1663824 1827771 2149327 2180045 1886781 2189829 2261559 2018897
5141 2018897 1826239 1769458 1868128 2321758 2035409 1784328 1944676 1877094 2220267 2084484
5131 2084484 1734157 2083899 2610963 2503712 2108059 1823288 1726404 1673400 1583824 1640345
5121 1640345 1962966 2415042 2357728 2319131 2307177 2145852 1778232 1758118 1816099 2216241
5111 2216241 2645522 2213197 2067979 2534532 2635467 2478054 2440553 2360411 2202607 2028550
5101 2028550 2280078 2439200 2403709 2065546 2001005 1828845 1834022 1750145 1637356 1573474 1988452
5090 1988452 1898934 2372767 2156681 1957726 2255320 2368065 1966722 1683875 1948722 2199006
5080 2199006 2196652 2126214 1725754 1862450 1830880 1736454 2007123 2172500 2366149 2488087
5070 2488087 2287180 2046476 2492256 2399923 2173766 1580429 1680901 2233752 2241286 2187565
5060 2187565 2190698 2047139 2108542 2298340 2031816 1711373 2286967 2412812 2380022 2482655
5050 2482655 2460026 2077312 2329166 2612846 2545030 2545175 2776724 2812275 2516608 2287677 2407298
5039 2407298 2607744 2382645 2359378 2555282 2440276 2416526 2178885 2364086 2378902 2496907
5029 2496907 2476119 2821033 3245552 2708651 2778450 3267380 3174355 2925862 2947616 3064642
5019 3064642 3618470 3332857 3350253 3286979 3492440 3609382 3656891 3950731 3769416 3693219
5009 3693219 4000209 4035062 4036774 4259205 4478205 4655237 4710808 4733256 4134241 4399302
4999 4399302 4880907 4676904 4408637 4012711 4284987 4341307 4338835 4294186 4260278 4064000
4989 4064000 4189457 4220993 4223759 4219299 3861493 3935072 4035839 4108232 4113067 4146733 4277250
4978 4277250 4408666 4537914 4623523 4440113 4466442 4811175 4716221 5180248 5182075 5186458 5166760
4967 5166760 5894896 5759079 5332413 5509819 5524759 5705751 5436727 5970791 6162187 5919513
4957 5919513 6260147 6685165 6473884 6386354 6289955 5975644 6079451 6390124 6506702 6473007
4947 6473007 6126778 6238895 6131342 6294036 6561758 6814708 6837393 6210244 5886143 5770041
4937 5770041 5622318 5672952 5475740 5287546 4882419 5199130 5539317 5272882 5080976 5405671
4927 5405671 5196372 4961452 5019874 4714415 5034007 5264206 5188702 4998373 5146929 4915296
4917 4915296 4930670 5016809 5014477 5136345 5176605 5153421 5227705 5239216 5204692 5514101 5286313
4906 5286313 4772082 4793886 5129456 5176630 5600794 5456629 5292363 4973273 4746526 4884050
4896 4884050 4372619 4577893 4560727 4553035 4333862 4323228 3851455 3743120 3978539 3544327
4886 3544327 3280072 3455037 3716047 3482392 3439767 3105008 3284125 3220164 3464951 3426310
4876 3426310 3419816 3238048 2923304 2711756 2661425 2695646 2519214 2566516 2959978 3355360
4866 3355360 3009263 2770985 3068964 3041345 2812789 2781195 2785235 2533425 2804895 2926518
4856 2926518 2484142 2567164 2527221 2269347 2547138 2568638 2649321 2671494 2465966 2905729
4846 2905729 3046477 2867384 3319365 3077193 2866560 2940335 2635463 2945245 2890298 2666691
4836 2666691 2566652 2731888 2876867 2751038 2490246 2536355 2538281 2460278 2356181 2471181
4826 2471181 2466177 2578833 2637151 2619083 2679227 2497100 2934007 2768927 2459584 2646055
4816 2646055 2815835 3303350 3165802 2812765 2863091 3196418 2944020 2742955 2689836 2751385
4806 2751385 2641603 2328713 3099115 3704847 3132601 3147276 2944388 2739645 2929383 2958803
4796 2958803 3176785 3211690 3430402 3435161 3215849 3137851 3303638 3671239 3399010 3453122
4786 3453122 3439319 3630355 3811621 3851922 4147190 4131346 3695896 3681939 3470253 3688572
4776 3688572 4211088 4009543 4170205 4500236 4709710 4648501 4842669 4947586 4735333 4420532
4766 4420532 4403032 4462343 4411274 4568865 4500149 4803743 4658509 4439143 4602395 4857729
4756 4857729 5037796 4658084 5026448 4979450 4896707 5033648 4921334 4973380 5130584 5540406
4746 5540406 5567007 5774023 5924415 6070393 5865949 5679004 5753815 5724515 5785699 5928282
4736 5928282 5561925 5359891 5848742 6041089 6011409 6373874 6492385 6443019 6014676 5667881
4726 5667881 6042376 6313027 6237834 6259586 6586476 5985971 6005764 6017451 6016474 6170348 6411530
4715 6411530 5886294 5649894 5866108 5935165 6085131 5957262 5635224 5569738 5461048 5291122
4705 5291122 5868730 6183231 5933387 5995431 5634092 5768315 5830824 5955752 6346860 6348061
4695 6348061 6232687 6359943 6652894 6417305 6285215 6546392 6278855 6219839 6173208 6491865
4685 6491865 6673992 6321392 6339965 6396378 6341454 6248071 6217898 5726048 5654724 5459723 5546201
4674 5546201 5980018 5650767 5247452 4924618 5218570 4985368 5088024 5392712 5197047 4714831
4664 4714831 4409342 4208675 4124421 4366155 4084737 4404469 4283585 4122035 3993839 4452148
4654 4452148 4176157 4018949 4274705 4266525 4106221 4303899 4063137 3724340 3927230 3857538
4644 3857538 3804157 4036139 3965672 3491482 3715165 3670375 3906085 4054732 3956476 3859912
4634 3859912 3875891 3693075 3223307 3548111 3359069 3454770 3353101 3210412 3077453 2638149
4624 2638149 2481544 2623918 2749793 2998914 3509388 3186852 3243181 3092875 3169961 3021100
4614 3021100 2885701 2796157 2827105 2893156 3222999 3025303 2532317 2369569 2820290 3064426
$$ [...]
##END NTUPLES=NMR SPECTRUM
##END=
