##TITLE=1H_TG-2352-1
 CDCl3
 8 sc, 
 14.03.2022
##JCAMPDX= 6.0         $$ Bruker NMR JCAMP-DX V2.0
##DATA TYPE= NMR SPECTRUM
##DATA CLASS= NTUPLES
##ORIGIN= UXNMR, Bruker Analytische Messtechnik GmbH
##OWNER= root
$$ XWIN-NMR		Version 3.5
$$ Mon Mar 14 11:19:57 2022 Russian Standard Time (UT+4h)  she@DPX200
##.OBSERVE FREQUENCY= 200.131346
##.OBSERVE NUCLEUS= ^1H
##.ACQUISITION MODE= SIMULTANEOUS
##.ACQUISITION SCHEME= undefined
##.AVERAGES= 8
##.DIGITISER RES= 18
##SPECTROMETER/DATA SYSTEM= spect
##.PULSE SEQUENCE= zg30
##.SOLVENT NAME= CDCl3
##.SHIFT REFERENCE= (INTERNAL, CDCl3, 0, 15.7238)
##AUDIT TRAIL= $$ (NUMBER, WHEN, WHO, WHERE, WHAT)
$$ ##TITLE= Audit trail, XWIN-NMR		Version 3.5
$$ ##JCAMPDX= 5.01
$$ ##ORIGIN= Bruker BioSpin GmbH
$$ ##OWNER= she
$$ F:/spectra/data/she/nmr/H-F/1/pdata/1/auditp.txt
$$ ##AUDIT TRAIL=  $$ (NUMBER, WHEN, WHO, WHERE, WHAT)
(   1,<2022-03-14 11:18:46.89 +0400>,<she>,<DPX200>,
      <created by zg, POWCHK disabled, PULCHK disabled
       configuration hash MD5:
       00 E9 B6 7A A2 85 ED C7 34 08 36 98 17 FE 4E 26
       data hash MD5: 16K
       BC 03 53 9E 82 29 91 41 1B 22 33 CA 7C 18 92 EF>)
(   2,<2022-03-14 11:18:49.67 +0400>,<she>,<DPX200>,
      <Start of raw data processing
       efp BC_mod = 2 LB = 0.24 FT_mod = 6 PKNL = 1 PHC0 = -16949.15 PHC1 = 11.60078 SI = 16K 
       data hash MD5: 16K
       3A 09 CF 90 25 C1 A7 61 0B E6 10 AE D5 41 5F 7E>)
(   3,<2022-03-14 11:19:09.09 +0400>,<she>,<DPX200>,
      <pk PHC0 = 0.1600053 PHC1 = 0 
       data hash MD5: 16K
       1F A0 26 9A 50 AF 04 B5 8F 55 A6 38 7B 3F 63 F6>)
(   4,<2022-03-14 11:19:12.04 +0400>,<she>,<DPX200>,
      <abs ABSG = 5 
       data hash MD5: 16K
       22 72 FF F4 19 08 2B DA 74 9E 74 FB 17 11 9B BE>)
$$ ##END=
$$ 
$$ hash MD5
$$ EE 4A C4 7C 2D 9D B8 82 C9 7F BD 58 F1 E5 C0 53
##$RELAX= 
##$RELAX= 
##$RELAX= 
##$RELAX= 
##$RELAX= 
##$RELAX= 
$$ Bruker specific parameters
$$ --------------------------
##$DU= <F:/spectra>
##$EXPNO= 1
##$NAME= <H-F>
##$PROCNO= 1
##$TYPE= <nmr>
##$USER= <she>
##$AMP= (0..31)
100 100 100 100 100 100 100 100 100 100 100 100 100 100 100 100 100 100 
100 100 100 100 100 100 100 100 100 100 100 100 100 100 
##$AQSEQ= 0
##$AQ_mod= 1
##$AUNM= <au_zg>
##$AUTOPOS= <>
##$BF1= 200.13
##$BF2= 200.13
##$BF3= 200.13
##$BF4= 200.13
##$BF5= 200.13
##$BF6= 200.13
##$BF7= 200.13
##$BF8= 200.13
##$BYTORDA= 1
##$CFDGTYP= 0
##$CFRGTYP= 5
##$CHEMSTR= <none>
##$CNST= (0..31)
1 1 145 1 1 1 1 1 1 1 1 1 1 1 1 1 1 1 1 1 1 1 1 1 1 1 1 1 1 1 1 1 
##$CPDPRG= <>
##$CPDPRG1= <>
##$CPDPRG2= <>
##$CPDPRG3= <>
##$CPDPRG4= <mlev>
##$CPDPRG5= <mlev>
##$CPDPRG6= <mlev>
##$CPDPRG7= <mlev>
##$CPDPRG8= <mlev>
##$CPDPRGB= <>
##$CPDPRGT= <>
##$D= (0..31)
0 1.2 0 0 0 0 0 0 0 0.06 0 0.03 0 0 0 0 0.0002 0 0 0 0 0 0 0 0 0 0 0 0 
0 0 0 
##$DATE= 1647242326
##$DBL= (0..7)
120 120 120 120 120 120 120 120 
##$DBP= (0..7)
150 150 150 150 150 150 150 150 
##$DBP07= 0
##$DBPNAM0= <>
##$DBPNAM1= <>
##$DBPNAM2= <>
##$DBPNAM3= <>
##$DBPNAM4= <>
$$ [...]
##$SUBNAM2= <"">
##$SUBNAM3= <"">
##$SUBNAM4= <"">
##$SUBNAM5= <"">
##$SUBNAM6= <"">
##$SUBNAM7= <"">
##$SUBNAM8= <"">
##$SUBNAM9= <"">
##$SW= 18.0517287032376
##$SWIBOX= (0..15)
0 0 2 0 0 0 0 0 0 0 0 0 0 0 0 0 
##$SW_h= 3612.71676300578
##$TD= 16384
##$TD0= 1
##$TE= 0
##$TE2= 300
##$TE3= 300
##$TEG= 300
##$TL= (0..7)
0 120 120 120 120 120 120 120 
##$TP= (0..7)
150 150 150 150 150 150 150 150 
##$TP07= 0
##$TPNAME0= <>
##$TPNAME1= <>
##$TPNAME2= <>
##$TPNAME3= <>
##$TPNAME4= <>
##$TPNAME5= <>
##$TPNAME6= <>
##$TPNAME7= <>
##$TPOAL= (0..7)
0.5 0.5 0.5 0.5 0.5 0.5 0.5 0.5 
##$TPOFFS= (0..7)
0 0 0 0 0 0 0 0 
##$TUNHIN= 0
##$TUNHOUT= 0
##$TUNXOUT= 0
##$USERA1= <user>
##$USERA2= <user>
##$USERA3= <user>
##$USERA4= <user>
##$USERA5= <user>
##$V9= 5
##$VALIST= <valist>
##$VCLIST= <CCCCCCCCCCCCCCC>
##$VD= 0
##$VDLIST= <DDDDDDDDDDDDDDD>
##$VPLIST= <PPPPPPPPPPPPPPP>
##$VTLIST= <TTTTTTTTTTTTTTT>
##$WBST= 1024
##$WBSW= 4
##$XGAIN= (0..3)
0 0 0 0 
##$XL= 0
##$YL= 0
##$YMAX_a= 351581
##$YMIN_a= -613294
##$ZGOPTNS= <>
##$ZL1= 120
##$ZL2= 120
##$ZL3= 120
##$ZL4= 120
##$ABSF1= 15.70943
##$ABSF2= -2.34242
##$ABSG= 5
##$ABSL= 3
##$ALPHA= 0
##$AQORDER= 0
##$ASSFAC= 0
##$ASSFACI= 0
##$ASSFACX= 0
##$ASSWID= 0
##$AUNMP= <proc_1d>
##$AZFE= 0.1
##$AZFW= 0.1
##$BCFW= 0
##$BC_mod= 2
##$BYTORDP= 0
##$COROFFS= 0
##$CY= -3
##$DATMOD= 1
##$DC= 0
##$DFILT= <>
##$DTYPP= 0
##$F1P= 0
##$F2P= 0
##$FCOR= 1
##$FTSIZE= 16384
##$FT_mod= 6
##$GAMMA= 0
##$GB= 0
##$INTBC= 1
##$INTSCL= 0
##$ISEN= 128
##$LB= 0.24
##$LEV0= 0
##$LPBIN= 0
##$MAXI= 10000
##$MC2= 0
##$MEAN= 0
##$ME_mod= 0
##$MI= 1.114404
##$NCOEF= 0
##$NC_proc= -6
##$NLEV= 6
##$NOISF1= 3.799351
##$NOISF2= 2.8
##$NSP= 0
##$NTH_PI= 0
##$NZP= 0
##$OFFSET= 15.72375
##$PC= 1
##$PHC0= -16948.99
##$PHC1= 11.60078
##$PH_mod= 1
##$PKNL= yes
##$PPARMOD= 0
##$PSCAL= 0
##$PSIGN= 0
##$REVERSE= no
##$SF= 200.130005563652
##$SI= 16384
##$SIGF1= 3
##$SIGF2= 2
##$SINO= 5.538805
##$SIOLD= 16384
##$SREGLST= <1H.CDCl3>
##$SSB= 0
##$STSI= 16384
##$STSR= 0
##$SW_p= 3612.71676300578
##$SYMM= 0
##$S_DEV= 0
##$TDeff= 16384
##$TDoff= 0
##$TI= <>
##$TILT= no
##$TM1= 0
##$TM2= 0
##$TOPLEV= 0
##$USERP1= <user>
##$USERP2= <user>
##$USERP3= <user>
##$USERP4= <user>
##$USERP5= <user>
##$WDW= 1
##$XDIM= 16384
##$YMAX_p= 347418143
##$YMIN_p= -362243
$$ End of Bruker specific parameters
$$ ---------------------------------
##NTUPLES= NMR SPECTRUM
##VAR_NAME=  FREQUENCY,     SPECTRUM/REAL,   SPECTRUM/IMAG
##SYMBOL=    X,             R,               I
##VAR_TYPE=  INDEPENDENT,   DEPENDENT,       DEPENDENT
##VAR_FORM=  AFFN,          ASDF,            ASDF
##VAR_DIM=   16384,         16384,           16384
##UNITS=     HZ,            ARBITRARY UNITS, ARBITRARY UNITS
##FACTOR=    0.220516191357247, 1,           1
##FIRST=     3146.79419788453, 0,            0
##LAST=      -465.922565121245, 0,           0
##MIN=       -465.922565121245, -362243,     0
##MAX=       3146.79419788453, 347418143,    0
$$ Real data points
##PAGE= N=1
##DATA TABLE= (X++(R..R)), XYDATA
$$ [...]
$$ plain form
5719 30509790 30135670 29912679 29597592 29455347 29497483 29521018 29519635 29499680 29625031 29809693
5709 29809693 29990883 30230379 30483839 30641540 30742782 30589131 30336489 29877460 29393956
5700 29393956 28967709 28465577 28069417 27733638 27484831 27235444 27010945 26811201 26683645
5691 26683645 26648712 26820444 26994403 27174062 27214218 27233747 27162751 26926555 26480848 26094944
5681 26094944 25686154 25037868 24442356 23755692 23067244 22390400 21934172 21539870 21138475
5672 21138475 20748640 20435548 20239707 19962012 19701911 19657050 19495243 19394682 19246470 19155512
5662 19155512 18994747 18753854 18560617 18477988 18175190 17988380 17784755 17618455 17392842 17166024
5652 17166024 17045513 16932063 16828974 16695811 16661010 16613503 16531154 16519621 16515730 16507119 16493863
$$ packed form
5719C0509790l74120k22991l15087j42245M2136K3535j383j9955J25351J84662
5709B9809693J81190K39496K53460J57701J01242j53651k52642m59029m83504
5700B9393956m26247n02132l96160l35779k48807k49387k24499j99744j27556
5691B6683645l4933J71732J73959J79659M0156J9529p0996k36196m45707l85904
5681B6094944m08790o48286n95512o86664o88448o76844m56228l94302m01395
5672B1138475l89835l13092j95841k77695k60101m4861j61807j00561j48212r0958
5662A9155512j60765k40893j93237q2629l02798j86810k03625j66300k25613k26818
5652A7166024j20511j13450j03089j33163l4801m7507q2349j1533l891q611j3256
$$ plain form
5641 16493863 16346557 16223077 16269211 16247920 16209698 16193946 16111212 16033691 15937874 15920577 15962342
5630 15962342 15848839 15897157 15884125 15861724 15805900 15805469 15873323 15854059 15958548 16028056 16093695
5619 16093695 16110328 16059154 16120497 16191993 16144462 16146514 16178604 16147313 16165258 16176662 16183089 16212251
5607 16212251 16217464 16223759 16332712 16417020 16399647 16390275 16502526 16483302 16410757 16416688 16444029 16489101
5595 16489101 16450099 16485124 16534677 16573518 16635881 16687756 16728589 16792489 16789553 16915627 16974950
5584 16974950 17001812 17077673 17252267 17247937 17287326 17452077 17623164 17693730 17730187 17813983 17913851
5573 17913851 17993172 18089362 18198851 18390382 18443833 18644003 18784145 18828278 18957650 19190327
5563 19190327 19377299 19485202 19669706 19662675 19674474 19809159 19928173 20068377 20186727 20215896
$$ packed form
5641A6493863j47306j23480M6134k1291l8222j5752q2734p7521r5817j7297M1765
5630A5962342j13503M8318j3032k2401n5824m31O7854j9264J04489O9508O5639
5619A6093695J6633n1174O1343P1496m7531K052L2090l1291J7945J1404O427K9162
5607A6212251N213O295J08953Q4308j7373r372J12251j9224p2545N931K7341M5072
5595A6489101l9002L5025M9553L8841O2363N1875M0833O3900k936J26074N9323
5584A6974950K6862P5861J74594m330L9389J64751J71087P0566L6457Q3796R9868
5573A7913851P9321R6190J09489J91531N3451K00170J40142M4133J29372K32677
5563A9190327J86972J07903J84504p031J1799J34685J19014J40204J18350K9169
$$ plain form
5553 20215896 20150878 20226491 20380038 20394943 20483689 20536199 20573510 20653405 20762688 20718244 20720859
5542 20720859 20827713 20780978 20823074 20976293 21111679 21146102 21232366 21436273 21474522 21668631
5532 21668631 21754884 21935897 22100363 22230948 22321876 22414067 22433974 22516210 22728787 22673514
5522 22673514 22647750 22766873 22943662 23001920 23145500 23268680 23440903 23489975 23493548 23521625
5512 23521625 23711506 23770663 23911475 24000270 23999414 24084612 24100612 24170149 24298174 24438982 24567603
5501 24567603 24531382 24644468 24717922 24797103 24878857 24963945 25069337 25235049 25342992 25469677
5491 25469677 25519272 25581646 25622616 25625062 25624001 25518890 25557532 25623841 25437322 25306317 25321149
5480 25321149 25258153 25218572 25071178 25065654 24984487 24987489 24841647 24854929 24838696 24796836 24799190
$$ packed form
5553B0215896o5018P5613J53547J4905Q8746N2510L7311P9895J09283m4444K615
5542B0720859J06854m6735M2096J53219J35386L4423Q6264K03907L8249J94109
5532B1668631Q6253J81013J64466J30585R0928R2191J9907Q2236K12577n5273
5522B2673514k5764J19123J76789N8258J43580J23180J72223M9072L573K8077
5512B3521625J89881N9157J40812Q8795q56Q5198J6000O9537J28025J40808J28621
5501B4567603l6221J13086P3454P9181Q1754Q5088J05392J65712J07943J26685
5491B5469677M9595O2374M0970K446j061j05111L8642O6309j86519j31005J4832
5480B5321149o2996l9581j47394n524q1167L002j45842J3282j6233m1860K354
$$ plain form
5469 24799190 24706928 24589689 24644090 24676078 24712536 24802368 24830194 25035330 25181413 25232475 25348501
5458 25348501 25468495 25518825 25464616 25309960 24861078 24545138 24036965 23681593 23277251 23016336
5448 23016336 22803253 22585626 22380498 22184116 22075382 21904963 21703031 21481064 21298052
5439 21298052 21084305 21021004 20944893 20814043 20647362 20538190 20514972 20505616 20575557 20632658 20574451
5428 20574451 20684956 20733761 20764313 20667088 20550457 20287065 19908547 19382111 18909493 18499349
5418 18499349 18084172 17811223 17534298 17352460 17178115 16942862 16797477 16674383 16454119
5409 16454119 16305386 16196156 16061269 16092816 16010644 15919022 15811842 15652932 15557982 15603782
5399 15603782 15619384 15582919 15560407 15397485 15252583 15257717 15211708 15070030 14855704 14680530
$$ packed form
5469B4799190r2262j17239N4401L1988L6458Q9832K7826K05136J46083N1062J16026
5458B5348501J19994N0330n4209j54656m48882l15940n08173l55372m04342k60915
5448B3016336k13083k17627k05128j96382j08734j70419k01932k21967j83012
5439B1298052k13747o3301p6111j30850j66681j09172k3218r356O9941N7101n8207
5428B0574451J10505M8805L0552r7225j16631k63392l78518n26436m72618m10144
5418A8499349m15177k72949k76925j81838j74345k35253j45385j23094k20264
5409A6454119j48733j09230j34887L1547q2172r1622j07180j58910r4950M5800
5399A5603782J5602l6465k2512j62922j44902N134m6009j41678k14326j75174
$$ plain form
5389 14680530 14470410 14310842 14124276 13972609 13897582 13645892 13584785 13458541 13332907 13245493
5379 13245493 13093293 13072578 12968424 12742447 12593349 12399302 12321614 12069132 11917741 11750012
5369 11750012 11579172 11438643 11355074 11270283 11123535 11074961 10952911 10801579 10550876 10492544
5359 10492544 10400469 10270846 10160504 10076752 9853296 9706279 9766841 9673398 9653015 9547600
5349 9547600 9419420 9408677 9308264 9115334 9090549 9027052 9032313 8913775 8834340 8741346 8656325
5338 8656325 8647058 8513769 8414566 8421661 8459161 8336872 8269287 8141127 8217912 8134800 8118714
5327 8118714 7994601 7926380 7934796 7896438 7898811 7909963 7843452 7772546 7683207 7606133 7638173 7658917
5315 7658917 7636954 7630073 7730608 7651344 7653798 7788435 7817658 7847866 7825164 7757394 7625214
$$ packed form
5389A4680530k10120j59568j86566j51667p5027k51690o1107j26244j25634q7414
5379A3245493j52200k0715j04154k25977j49098j94047p7688k52482j51391j67729
5369A1750012j70840j40529q3569q4791j46748m8574j22050j51332k50703n8332
5359A0492544r2075j29623j10342q3752k23456j47017O0562r3443k0383j05415
5349I547600j28180j0743j00413j92930k4785o3497N261j18538p9435r2994q5021
5338H656325r267j33289r9203P095L7500j22289o7585j28160P6785q3112j6086
5327H118714j24113o8221Q416l8358K373J1152o6511p0906q9339p7074L2040K0744
5315G658917k1963o881J00535p9264K454J34637K9223L0208k2702o7770j32180
$$ plain form
5304 7625214 7648192 7539356 7339943 7190328 7023002 6942471 6752794 6742078 6711835 6699006
5294 6699006 6651211 6555385 6421778 6395721 6330364 6169888 6165127 6157231 6090286 5956487 5989212
5283 5989212 5844077 5804914 5734734 5600187 5643311 5629613 5505891 5414309 5307435 5187942
5273 5187942 5080336 5183596 5236070 5143355 5152795 5056089 5016598 4995077 4969850 4904309 4855506
5262 4855506 4748345 4661484 4587107 4593561 4605792 4693882 4656689 4534785 4591097 4506784 4467702
5251 4467702 4542971 4488956 4364037 4403433 4402056 4370933 4310902 4175292 4219552 4190414 4049034
5240 4049034 4155267 4216805 4242857 4162012 4016010 4005197 3976864 3915267 3870718 3879918 3844709
5229 3844709 3885065 3818565 3742562 3719113 3815655 3803257 3700719 3680605 3616126 3543711 3502693
$$ packed form
5304G625214K2978j08836j99413j49615j67326q0531j89677j0716l0243j2829
5294F699006m7795r5826j33607k6057o5357j60476m761p896o6945j33799L2725
5283E989212j45135l9163p0180j34547M3124j3698j23722r1582j06874j19493
5273E187942j07606J03260N2474r2715R440r6706l9491k1521k5227o5541m8803
5262D855506j07161q6861p4377O454J2231Q8090l7193j21904N6312q4313l9082
5251D467702P5269n4015j24919L9396j377l1123o0031j35610M4260k9138j41380
5240D049034J06233O1538K6052q0845j46002j0813k8333o1597m4549R200l5209
5229C844709M0356o6500p6003k3449R6542j2398j02538k0114o4479p2415m1018
$$ plain form
5218 3502693 3478842 3495110 3420109 3374767 3476225 3478149 3400810 3341386 3276488 3221153 3180849
5207 3180849 3155825 3171118 3149637 3136578 3092057 3220824 3155807 3045972 3004195 3089695 3111577
5196 3111577 3070426 3076345 2990543 3045406 3014620 3034210 2969642 2939733 2939802 2981509 2971432 2950210
5184 2950210 2911928 2965664 2875098 2898565 2797317 2709316 2755346 2734250 2742757 2753861 2655366
5173 2655366 2639083 2684253 2721242 2660906 2661150 2640967 2612361 2679753 2711689 2627234 2572959 2589324
5161 2589324 2669940 2726383 2574826 2569443 2533800 2593211 2566259 2502575 2481301 2598021 2621247
5150 2621247 2536034 2459599 2528187 2596770 2552347 2612885 2589646 2520210 2518900 2512985 2495463 2495099
5138 2495099 2495652 2498739 2541725 2644582 2645594 2531962 2559177 2495657 2500779 2514451 2370089 2502279
$$ packed form
5218C502693k3851J6268p5001m5342J01458J924p7339n9424o4898n5335m0304
5207C180849k5024J5293k1481j3059m4521J28767o5017j09835m1777Q5500K1882
5196C111577m1151N919q5802N4863l0786J9590o4568k9909O9M1707j0077k1222
5184B950210l8282N3736r0566K3467j01248q8001M6030k1096Q507J1104r8495
5173B655366j6283M5170L6989o0336K44k0183k8606O7392L1936q4455n4275J6365
5161B589324Q0616N6443j51557n383l5643N9411k6952o3684k1274J16720K3226
5150B621247q5213p6435O8588O8583m4423O0538k3239o9436j310n915j7522l64
5138B495099N53L087M2986J02857J012j13632K7215o3520N122J3672j44362J32190
$$ plain form
5126 2502279 2559039 2564413 2624822 2604826 2588667 2630383 2599354 2436538 2522815 2620598 2599529
5115 2599529 2730021 2690238 2591097 2540566 2530495 2591250 2691102 2645289 2603293 2669595 2711392
5104 2711392 2750497 2592221 2570214 2584534 2575662 2589736 2631984 2595928 2566654 2446175 2410335
5093 2410335 2414899 2469811 2439596 2433409 2407863 2460688 2495592 2435916 2518275 2496500 2614288 2699958
5081 2699958 2717619 2773810 2755717 2816766 2784236 2713457 2672761 2642689 2542340 2480109 2378170
5070 2378170 2356560 2289054 2221049 2258831 2249806 2288827 2328707 2229073 2108090 2131358 2191713
5059 2191713 2245386 2281422 2249814 2251621 2301157 2327993 2341153 2305604 2360526 2428294 2302656
5048 2302656 2273631 2234340 2194863 2169764 2158230 2220854 2214367 2201208 2175651 2140371 2130122 2118738
$$ packed form
5126B502279N6760N374O0409j9996j6159M1716l1029j62816Q6277R7783k1069
5115B599529J30492l9783r9141n0531j0071O0755R9852m5813m1996O6302M1797
5104B711392L9105j58276k2007J4320q872J4074M2248l6056k9274j20479l5840
5093B410335M564N4912l0215o187k5546N2825L4904n9676Q2359k1775J17788Q5670
5081B699958J7661N6191j8093O1049l2530p0779m0696l0072j00349o2231j01939
5070B378170k1610o7506o8005L7782r025L9021L9880r9634j20983K3268O0355
5059B191713N3673L6036l1608J807M9536K6836J3160l5549N4922O7768j25638
5048B302656k9025l9291l9477k5099j1534O2624o487j3159k5557l5280j0249j1384
$$ plain form
5036 2118738 2171119 2216280 2185571 2108942 2033724 2013294 2084741 2208454 2163425 2201640 2133041
5025 2133041 2169079 2192694 2232937 2215785 2074599 2071662 2150373 2129951 2116865 2200284 2183491
5014 2183491 2125263 2186726 2212177 2264115 2202026 2193310 2219341 2206875 2261947 2263417 2244352 2236779
5002 2236779 2194967 2281526 2300764 2300311 2332643 2343938 2267939 2232963 2231895 2300176 2384076 2242198
4990 2242198 2225514 2267005 2310022 2417370 2520769 2550592 2462047 2434525 2388279 2319144 2371970
4979 2371970 2371300 2354424 2357471 2393929 2352969 2416014 2470528 2449973 2445670 2558047 2538159 2497202
4967 2497202 2491040 2521424 2543327 2509650 2572557 2417417 2476485 2575154 2643281 2642418 2638060 2587213
4955 2587213 2441636 2360693 2456853 2521044 2499897 2535166 2587520 2749087 2709042 2733837 2807834
$$ packed form
5036B118738N2381M5161l0709p6629p5218k0430P1447J23713m5029L8215o8599
5025B133041L6038K3615M0243j7152j41186k937P8711k0422j3086Q3419j6793
5014B183491n8228O1463K5451N1938o2089q716K6031j2466N5072J470j9065p573
5002B236779m1812Q6559J9238m53L2332J1295p5999l4976j068O8281Q3900j41878
4990B242198j6684M1491M3017J07348J03399K9823q8545k7522m6246o9135N2826
4979B371970o70j6876L047L6458m0960O3045N4514k0555m303J12377j9888m0957
4967B497202o162L0384K1903l3677O2907j55140N9068R8669O8127q63m358n0847
4955B587213j45577q0943R6160O4191k1147L5269N2354J61567m0045K4795P3997
$$ plain form
4944 2807834 2716499 2744203 2829085 2859171 2860037 2787092 2937153 3034408 3124358 3091001 3028002 3165396
4932 3165396 3122840 3104131 3139908 3126257 3162771 3207005 3115857 3169606 3291622 3260491 3197510
4921 3197510 3251859 3215013 3105517 3126857 3177460 3191742 3201639 3174966 3204246 3122648 2942304
4910 2942304 2965868 2995885 2868377 2848491 2887132 2834777 2777564 2817398 2826294 2725484 2649549
4899 2649549 2646344 2673068 2656755 2625372 2648104 2609465 2697282 2725205 2730583 2750964 2791650 2793311
4887 2793311 2730434 2675766 2710210 2722919 2713574 2810059 2816996 2818347 2850646 2881209 2953944 2933916
4875 2933916 2841922 2886510 2950915 3075299 3117947 3213708 3229881 3376228 3472872 3491873 3435093
4864 3435093 3461924 3438259 3485916 3512217 3609974 3641863 3599592 3517534 3485737 3425023 3398736
$$ packed form
4944B807834r1335K7704Q4882L0086Q66p2945J50061R7255Q9950l3357o2999J37394
4932C165396m2556j8709L5777j3651L6514M4234r1148N3749J22016l1131o2981
4921C197510N4349l6846j09496K1340N0603J4282R897k6673K9280q1598j80344
4910B942304K3564L0017j27508j9886L8641n2355n7213L9834Q896j00810p5935
4899B649549l205K6724j6313l1383K2732l8639Q7817K7923N378K0381M0686J661
4887B793311o2877n4668L4444J2709r345R6485O937J351L2299L0563P2735k0028
4875B933916r1994M4588O4405J24384M2648R5761J6173J46347R6644J9001n6780
4864C435093K6831k3665M7657K6301R7757L1889m2271q2058l1797o0714k6287
$$ plain form
4853 3398736 3466581 3473131 3458728 3268075 3349530 3268430 3256192 3274371 3161887 3097523 3034709
4842 3034709 3107564 3118163 3105287 3033966 3089864 3051007 3071765 3089382 3107537 3057390 2948255
4831 2948255 3026270 3022169 2983630 2910581 2810750 2804632 2725642 2792471 2882213 2902817 2929481 2870086
4819 2870086 2737260 2737347 2896249 2864766 2830513 2865821 2945126 2897230 2939905 3032368 3035381 2932454
4807 2932454 2822322 2975417 3048611 3125156 3233103 3213853 3158477 3117660 3166066 3156625 3265395
4796 3265395 3292558 3353242 3351357 3399054 3419007 3375838 3418698 3409023 3412800 3472987 3643287 3659525
4784 3659525 3649187 3729398 3774670 3855353 3864842 3888695 4005607 4025918 4060507 4025256 4047483
4773 4047483 4094431 4128387 4245851 4415160 4471686 4504356 4528883 4501009 4586216 4582382 4713125
$$ packed form
4853C398736O7845O550j4403j90653Q1455q1100j2238J8179j12484o4364o2814
4842C034709P2855J0599j2876p1321N5898l8857K0758J7617J8155n0147j09135
4831B948255P8015m101l8539p3049r9831o118p8990O6829Q9742K0604K6664n9395
4819B870086j32826Q7J58902l1483l4253L5308P9305m7896M2675R2463L013j02927
4807B932454j10132J53095P3194P6545J07947j9250n5376m0817M8406r441J08770
4796C265395K7163O0684j885M7697J9953m3169M2860r675L777O0187J70300J6238
4784C659525j0338Q0211M5272Q0683R489K3853J16912K0311L4589l5251K2227
4773D047483M6948L3956J17464J69309N6526L2670K4527k7874Q5207l834J30743
$$ plain form
4762 4713125 4811270 4849078 4868748 4929383 5029700 5104814 5204716 5265802 5373670 5477108 5594405
4751 5594405 5691751 5776754 5949366 6068564 6138168 6293367 6539438 6812299 7080819 7276671
4741 7276671 7599647 8078631 8472214 8868820 9413307 9974214 10664722 11270680 11823050 12494120
4731 12494120 13163026 13680555 13830263 13843682 13754225 13509486 13159826 12732269 12497478 12337706
4721 12337706 12248274 12371077 12604215 12893536 13328355 13806058 14246434 14574354 14986185 15275500
4711 15275500 15288401 15013613 14524029 13858349 13185879 12596288 11897773 11272304 11080732 10881722
4701 10881722 10613289 10373338 10225805 10166554 10184997 10301474 10264452 10244068 10358263 10603550
4691 10603550 10873734 11062703 11390672 11739334 12256287 12853275 13444777 14216573 14968006
$$ packed form
4762D713125R8145L7808J9670O0635J00317P5114R9902O1086J07868J03438J17297
4751E594405R7346Q5003J72612J19198O9604J55199K46071K72861K68520J95852
4741G276671L22976M78984L93583L96606N44487N60907O90508O05958N52370O71070
4731A2494120O68906N17529J49708J3419q9457k44739l49660m27557k34791j59772
4721A2337706q9432J22803K33138K89321M34819M77703M40376L27920M11831K89315
4711A5275500J2901k74788m89584o65680o72470n89591o98515o25469j91572j99010
4701A0881722k68433k39951j47533n9251J8443J16477l7022k0384J14195K45287
4691A0603550K70184J88969L27969L48662N16953N96988N91502P71796P51433
$$ plain form
4682 14968006 15863431 16989200 18088859 19220845 20380294 21669321 22755100 23493904
4674 23493904 24017023 24134430 23848512 23324830 22740325 22035892 21432847 20997523 20719019
4665 20719019 20697902 20791987 20968189 21282456 21643883 21938227 22196664 22328885 22011370 21449564
4655 21449564 20506737 19352313 18109024 16844973 15613627 14563879 13747940 12968509 12128829
4646 12128829 11541945 11005567 10572738 10199266 9897751 9521814 9333197 8961423 8796074
4637 8796074 8628199 8505428 8376877 8288813 8301484 8182147 8077616 7974079 7965998 7933419
4627 7933419 7909174 7864185 7901010 7945908 8060803 8032043 8064992 8095753 8092695 8179531 8233605
4616 8233605 8346219 8389177 8381557 8436946 8528737 8680253 8825778 8796807 8734261 8802342 8857062
$$ packed form
4682A4968006Q95425J125769J099659J131986J159449J289027J085779P38804
4674B3493904N23119J17407k85918n23682n84505p04433o03045m35324k78504
4665B0719019k1117R4085J76202L14267L61427K94344K58437J32221l17515n61806
4655B1449564r42827j154424j243289j264051j231346j049748q15939p79431q39680
4646A2128829n86884n36378m32829l73472l01515l75937j88617l71774j65349
4637H796074j67875j22771j28551q8064J2671j19337j04531j03537q081l2579
4627G933419k4245m4989L6825M4898J14895k8760L2949L0761l058Q6836N4074
4616H233605J12614M2958p620N5389R1791J51516J45525k8971o2546O8081N4720
$$ plain form
4605 8857062 9013961 9182808 9262002 9346790 9457376 9535558 9672171 9736499 9809817 9943828
4595 9943828 10139014 10356391 10513734 10760635 11002250 11426976 11848726 12318691 12746155 13303043
4585 13303043 14012059 14789972 15622828 16603161 17622540 18786195 19976568 21101834 22079866
4576 22079866 22752777 23068159 22928419 22219291 21287634 20220321 19131596 18184011 17260026
4567 17260026 16505874 15742556 15222866 14801702 14621418 14464155 14185430 14030182 14079010 14012882
4557 14012882 14062530 14216905 14376338 14584014 14921594 15301338 15812697 16421538 17178700 18003141
4547 18003141 18909087 19782806 20810294 21806490 22756950 23325674 23639902 23487708 22903554
4538 22903554 21976579 20864465 19879708 18876676 18161041 17495505 17053661 16654807 16416511
$$ packed form
4605H857062J56899J68847P9194Q4788J10586P8182J36613O4328P3318J34011
4595I943828J95186K17377J57343K46901K41615M24726M21750M69965M27464N56888
4585A3303043P09016P77913Q32856R80333J019379J163655J190373J125266R78032
4576B2079866O72911L15382j39740p09128r31657j067313j088725r47585r23985
4567A7260026p54152p63318n19690m21164j80284j57263k78725j55248M8828o6128
4557A4012882M9648J54375J59433K07676L37580L79744N11359O08841P57162Q24441
4547A8003141R05946Q73719J027488R96196R50460N68724L14228j52194n84154
4538B2903554r26975j112114r84757j003032p15635o65536m41844l98854k38296
$$ plain form
4529 16416511 16364966 16469777 16704738 17028240 17430409 17772480 18138320 18410179 18677242 18619664
4519 18619664 18437391 17958225 17420940 16693623 15851068 15213761 14777361 14299551 13916058
4510 13916058 13624356 13353279 13044361 12816318 12709120 12628667 12614380 12578938 12629944 12561901
4500 12561901 12667384 12738274 12939660 13151840 13317305 13636177 13975893 14426335 14936583 15321093
4490 15321093 15784150 16159938 16352385 16392186 16258680 15765025 15121961 14319479 13602992 12964194
4480 12964194 12390329 11846600 11486121 11149956 10839680 10603255 10312925 10115568 9894795
4471 9894795 9834841 9705766 9615679 9461570 9422340 9411267 9268086 9320526 9352702 9282559 9271874
4460 9271874 9185285 9228355 9193234 9200895 9290615 9266965 9348886 9353677 9308370 9379482 9442746 9545027
$$ packed form
4529A6416511n1545J04811K34961L23502M02169L42071L65840K71859K67063n7578
4519A8619664j82273m79166n37285p27317q42555o37307m36400m77810l83493
4510A3916058k91702k71077l08918k28043j07198q0453j4287l5442N1006o8043
4500A2561901J05483P0890K01386K12180J65465L18872L39716M50442N10248L84510
4490A5321093M63057L75788J92447L9801j33506m93655o43064q02482p16487o38798
4480A2964194n73865n43729l60479l36165l10276k36425k90330j97357k20773
4471I894795n9954j29075r0087j54109l9230j1073j43181N2440L2176p0143j0685
4460I271874q6589M3070l5121P661Q9720k3650Q1921M791m5307P1112O3264J02281
$$ plain form
4448 9545027 9667962 9765307 9880572 9825675 9816097 9778400 9610052 9491878 9485782 9375000 9269892
4437 9269892 9185270 9118159 9016473 8944467 8986717 8938295 8941748 8964635 8907165 9054281 9174644
4426 9174644 9242108 9321320 9467952 9601402 9594692 9679320 9877019 10008649 10147997 10427706
4416 10427706 10659360 10847566 11222086 11480954 11749698 12022625 12098329 12207680 12178136 12156254
4406 12156254 12162058 12022721 11908165 11777028 11611124 11522131 11530943 11611659 11592361 11577999 11671726
4395 11671726 11739395 11689933 11689761 11748195 11659135 11582228 11450620 11382195 11379188 11288832 11347951 11208203
4383 11208203 11131420 11084945 11055854 11163610 11031837 10976838 10962711 10918850 10751621 10654909 10695936
4372 10695936 10720354 10637449 10727112 10738593 10766396 10958677 10981998 11069430 11237654 11355484 11433220
$$ packed form
4448I545027J22935R7345J15265n4897r578l7697j68348j18174o096j10782j05108
4437I269892q4622o7111j01686p2006M2250m8422L453K2887n7470J47116J20363
4426I174644O7464P9212J46632J33450o710Q4628J97699J31630J39348K79709
4416A0427706K31654J88206L74520K58868K68744K72927P5704J09351k9544k1882
4406A2156254N804j39337j14556j31137j65904q8993Q812Q0716j9298j4362R3727
4395A1671726O7669m9462j72N8434q9060p6907j31608o8425l007r0356N9119j39748
4383A1208203p6783m6475k9091J07756j31773n4999j4127m3861j67229r6712M1027
4372A0695936K4418q2905Q9663J1481K7803J92281K3321Q7432J68224J17830P7736
$$ plain form
4361 11433220 11378768 11391925 11353177 11244229 11241072 11210054 11114376 11223646 11299420 11366403 11334793
4350 11334793 11354402 11392008 11453506 11558314 11482896 11564602 11624167 11615854 11683225 11625941 11615867
4339 11615867 11595091 11674787 11738680 11727559 11887215 12004091 12082099 12177066 12292580 12374753 12487060
4328 12487060 12678442 12955350 13137464 13231960 13324192 13423141 13705196 13928161 14125177 14304076
4318 14304076 14564047 14831948 14931376 15138268 15409555 15656610 15886256 16051068 16300132 16572095
4308 16572095 16828395 17030184 17422356 17816110 18031287 18446215 18711895 19206640 19550321
4299 19550321 19881915 20212179 20657048 21163913 21590272 22146816 22495221 22959109 23420932
4290 23420932 24011570 24603491 24987329 25669050 26251496 26859861 27570348 28323873 28970972
$$ packed form
4361A1433220n4452J3157l8748j08948l157l1018r5678J09270P5774O6983l1610
4350A1334793J9609L7606O1498J04808p5418Q1706N9565q313O7371n7284j0074
4339A1615867k0776P9696O3893j1121J59656J16876P8008R4967J15514Q2173J12307
4328A2487060J91382K76908J82114R4496R2232R8949K82055K22965J97016J78899
4318A4304076K59971K67901R9428K06892K71287K47055K29646J64812K49064K71963
4308A6572095K56300K01789L92172L93754K15177M14928K65680M94745L43681
4299A9550321L31594L30264M44869N06865M26359N56544L48405M63888M61823
4290B3420932N90638N91921L83838O81721N82446O08365P10487P53525O47099
$$ plain form
4281 28970972 29757731 30602790 31566357 32501307 33486417 34608211 35833214 37160883 38625535
4272 38625535 39936237 41418979 43013905 44720650 46480080 48157075 50034200 51940776
4264 51940776 53960329 56148701 58308436 60573547 62739144 64811308 66641445 68426924
4256 68426924 70124014 71697748 73419541 75444737 77941114 80971182 84473541 88672804
4248 88672804 93674765 99440067 106101573 113847982 122620761 132767101 144302577 157145334
4240 157145334 170664719 183630245 194605029 202251037 205119779 202863243 195588326 184178633
4232 184178633 170495039 156320063 143012581 131503388 122371525 115558452 110637209
4225 110637209 107015700 104337520 101865111 99382014 96732521 93953404 91038825 88164097
$$ packed form
4281B8970972P86759Q45059R63567R34950R85110J121794J225003J327669J464652
4272C8625535J310702J482742J594926J706745J759430J676995J877125J906576
4264E1940776K019553K188372K159735K265111K165597K072164J830137J785479
4256F8426924J697090J573734J721793K025196K496377L030068L502359M199263
4248H8672804N001961N765302O661506P746409Q772779J0146340J1535476J2842757
4240A57145334J3519385J2965526J0974784P646008K868742k256536p274917j1409693
4232A84178633j3683594j4174976j3307482j1509193r131863o813073m921243
4225A10637209l621509k678180k472409k483097k649493k779117k914579k874728
$$ plain form
4217 88164097 85505263 82943383 80327093 77690979 75005499 72297646 69561364 67048888
4209 67048888 64614931 62454015 60604425 59097954 57859318 56567410 55573670 54626664
4201 54626664 53754302 53107711 52364554 51882986 51333219 50911342 50545969 50344836 50071099
4192 50071099 49952281 49905510 49917435 49939734 50033608 50281412 50734458 51045733 51569464 52171225
4182 52171225 52872111 53694063 54757495 55972417 57356624 59085419 61103492 63524491
4174 63524491 66565634 69983406 74107912 78953625 84561814 91405505 99421734 108977418
4166 108977418 120482045 134228379 150513841 169219328 189917104 212064414 233015776
4159 233015776 246788976 248235259 235734203 214581000 191130155 169372846 150411984
$$ packed form
4217H8164097k658834k561880k616290k636114k685480k707853k736282k512476
4209F7048888k433957k160916j849590j506471j238636j291908r93740r47006
4201E4626664q72362o46591p43157m81568n49767m21877l65373k01133k73737
4192E0071099j18818m6771J1925K2299R3874K47804M53046L11275N23731O01761
4182E2171225P00886Q21952J063432J214922J384207J728795K018073K420999
4174F3524491L041143L417772M124506M845713N608189O843691Q016229R555684
4166A08977418J1504627J3746334J6285462J8705487K0697776K2147310K0951362
4159B33015776J3773200J446283j2501056k1153203k3450845k1757309j8960862
$$ plain form
4152 150411984 134509366 121426358 110673614 101869354 94905409 89429995 85143948 81738342
4144 81738342 78871379 76039198 73252355 70467611 67797379 65588254 63648378 62060685
4136 62060685 60677159 59331819 58154653 57197103 56356799 55509543 54651464 53770737 52688634
4127 52688634 51568593 50470144 49556828 48756214 47990205 47090455 46260929 45474972 44618521
4118 44618521 43876714 43140753 42280748 41443107 40734819 40227708 39700523 39026904 38454345
4109 38454345 37893955 37359154 36926922 36750202 36779059 36740950 36614661 36521189 36676287 36861856
4099 36861856 37072588 37355004 37883663 38418481 39197790 39904381 40878873 41836680 43088744
4090 43088744 44377036 46156340 48321074 51196177 54078688 57827117 62225009 68007758
$$ packed form
4152A50411984j5902618j3083008j0752744q804260o963945n475414m286047l405606
4144H1738342k866963k832181k786843k784744k670232k209125j939876j587693
4136F2060685j383526j345340j177166r57550q40304q47256q58079q80727j082103
4127E2688634j120041j098449r13316q00614p66009q99750q29526p85957q56451
4118D4618521p41807p35961q60005q37641p08288n07111n27185o73619n72559
4109C8454345n60390n34801m32232j76720K8857l8109j26289r3472J55098J85569
4099C6861856K10732K82416N28659N34818P79309P06591R74492R57807J252064
4090D3088744J288292J779304K164734K875103K882511L748429M397892N782749
$$ plain form
4082 68007758 75234510 85100688 96791320 111936665 127666122 144340017 168040689
4075 168040689 192680236 191386271 169891432 140573154 111599466 92214453 78450267
4068 78450267 69563081 62464730 57485647 53436478 50574552 48070569 46756132 45532773
4060 45532773 44746076 43742498 42741721 41890404 41340001 40665985 40655730 40432199 40604222
4051 40604222 40721285 40930608 41072002 41233652 41271170 41397428 41334817 41402298 41296858 41098773
4041 41098773 40902555 40713511 40491103 40378086 40280950 40456882 40651887 40739051 40671996 40370163
4031 40370163 40044055 39667647 39050597 38481589 37850012 37250648 36746624 36286822 35911321
4022 35911321 35578899 35173916 34697973 34203457 33682472 32909427 32211831 31357593 30451482
$$ packed form
4082F8007758P226752R866178J1690632J5145345J5729457J6673895K3700672
4075A68040689K4639547j293965k1494839k9318278k8973688j9385013j3764186
4068G8450267q887186p098351m979083m049169k861926k503983j314437j223359
4060D5532773p86697j003578j000777q51317n50403o74016j0255k23531J72023
4051D0604222J17063K09323J41394J61650L7518J26258o2611O7481j05440j98085
4041D1098773j96218j89044k22408j13017r7136J75932J95005Q7164o7055l01833
4031D0370163l26108l76408o17050n69008o31577n99364n04024m59802l75501
4022C5911321l32422m04983m75943m94516n20985p73045o97596q54238r06111
$$ plain form
4013 30451482 29445031 28631083 27899530 27195063 26557793 25922154 25357275 24763095 24292637
4004 24292637 23621407 22909396 22321754 21614138 20995281 20327654 19716117 19187097 18727032
3995 18727032 18311744 17870902 17445895 16938422 16592254 16166400 15841967 15376264 15047281
3986 15047281 14676962 14200308 13895215 13506861 13282768 13008610 12762128 12426842 12147944
3977 12147944 11884447 11627896 11345407 11078707 10854615 10628679 10517459 10357781 10162358
3968 10162358 9906452 9670038 9469855 9368075 9301393 9165800 9186835 9248141 9026543 8746500
3958 8746500 8511721 8435618 8291690 8227056 8088555 8035458 7899910 7884255 7826446 7751848 7689983
3947 7689983 7602218 7431306 7289446 7096083 6890025 6652746 6600424 6489410 6344693 6199713
$$ packed form
4013C0451482j006451q13948p31553p04467o37270o35639n64879n94180m70458
4004B4292637o71230p12011n87642p07616o18857o67627o11537n29020m60065
3995A8727032m15288m40842m25007n07473l46168m25854l24433m65703l28983
3986A5047281l70319m76654l05093l88354k24093k74158k46482l35286k78898
3977A2147944k63497k56551k82489k66700k24092k25936j11220j59678j95423
3968A0162358k55906k36414k00183j01780o6682j35593K1035O1306k21598k80043
3958H746500k34779p6103j43928o4634j38501n3097j35548j5655n7809p4598o1865
3947G689983q7765j70912j41860j93363k06058k37279n2322j11014j44717j44980
$$ plain form
3937 6199713 6112265 6090875 6040690 5940183 5938737 5870133 5687172 5538952 5626445 5512607 5455547
3926 5455547 5402906 5318299 5278915 5184140 5057528 5008052 5036780 4983914 5002891 4833412 4884098
3915 4884098 4809970 4709980 4763543 4706318 4672012 4602232 4569993 4537317 4551491 4491445 4494566 4421999
3903 4421999 4308564 4241883 4180120 4238043 4238928 4154460 4102282 4030687 4076436 4044178 3979040 3855545
3891 3855545 3786485 3780151 3750521 3843159 3876288 3860831 3785760 3710654 3658138 3724469 3776322 3798258
3879 3798258 3855473 3882870 3894849 3891442 3912186 4005833 4096218 4060834 4201718 4291450 4295579 4288727
3867 4288727 4203550 4137879 4081983 4035787 3895670 3786130 3683812 3577734 3460718 3420874
3857 3420874 3324256 3278998 3289168 3368426 3371967 3321781 3275803 3256488 3275535 3217857 3234626 3213053
$$ packed form
3937F199713q7448k1390n0185j00507j446o8604j82961j48220Q7493j13838n7060
3926E455547n2641q4607l9384r4775j26612m9476K8728n2866J8977j69479N0686
3915D884098p4128r9990N3563n7225l4306o9780l2239l2676J4174o0046L121p2567
3903D421999j13435o6681o1763N7923Q85q4468n2178p1595M5749l2258o5138j23495
3891C855545o9060o334k9630R2638L3129j5457p5071p5106n2516O6331N1853K1936
3879C798258N7215K7397J1979l407K0744R3647R0385l5384J40884Q9732M129o852
3867D288727q5177o5671n5896m6196j40117j09540j02318j06078j17016l9844
3857C420874r6618m5258J0170P9258L541n0186m5978j9315J9047n7678J6769k1573
$$ plain form
3845 3213053 3190178 3112517 3192211 3224320 3185114 3219912 3148440 3127468 3093751 3127662 3113677
3834 3113677 3039195 2915515 2867714 2929097 2962254 3055845 2951964 2848969 2871380 2906668 2944801
3823 2944801 2884745 2807997 2788074 2851977 2859318 2928623 2823426 2731589 2743984 2809407 2804687 2750401
3811 2750401 2756118 2763280 2834091 2897855 2791222 2753664 2904629 2841915 2820738 2832859 2827593 2872002
3799 2872002 2827345 2830231 2876174 2906218 3014787 2899666 2810153 2907360 3099160 3151706 3161212
3788 3161212 3206804 3284693 3297837 3318427 3405960 3348107 3205682 3012727 2972404 2906348 2909900
3777 2909900 2952463 2919313 2723591 2730208 2709113 2781800 2813207 2795277 2898716 2900839 2773696
3766 2773696 2748231 2734436 2902463 2872635 2905113 2828785 2861622 2835295 2812470 2775898 2666757
$$ packed form
3845C213053k2875p7661P9694L2109l9206L4798p1472k0972l3717L3911j3985
3834C113677p4482j23680m7801O1383L3157R3591j03881j02995K2411L5288L8133
3823B944801o0056p6748j9923O3903P341O9305j05197r1837J2395O5423m720n4286
3811B750401N717P162P0811O3764j06633l7558J50965o2714k1177J2121n266M4409
3799B872002m4657K886M5943L0044J08569j15121q9513R7207J91800N2546R506
3788C161212M5592P7889J3144K0590Q7533n7853j42425j92955m0323o6056L552
3777B909900M2563l3150j95722O617k1095P2687L1407j7930J03439K123j27143
3766B773696k5465j3795J68027k9828L2478p6328L2837k6327k2825l6572j09141
$$ plain form
3755 2666757 2817957 2915986 2877524 2830972 2768794 2794741 2735403 2684319 2703314 2736738 2732266
3744 2732266 2702217 2679128 2672217 2673393 2692716 2648830 2615649 2629287 2707430 2769738 2686709 2667221
3732 2667221 2647079 2596476 2666885 2787644 2721846 2751917 2700320 2720198 2730710 2781700 2782797
3721 2782797 2771161 2801893 2820713 2761738 2831097 2896590 2816079 2835088 2876357 2873810 2896477 2840854
3709 2840854 2966196 2939417 2959938 2986343 3054474 3084976 3079173 3098898 3055937 3009066 3082101
3698 3082101 3017775 3121528 3128454 3092777 3181957 3174762 3182515 3111381 3081184 3108107 3124616 3233618
3686 3233618 3225545 3180508 3244682 3214435 3225274 3292413 3222339 3268148 3308738 3353970 3197450
3675 3197450 3179947 3248744 3192106 3239376 3318822 3354318 3380121 3394435 3387443 3344283 3349960 3372098
$$ packed form
3755B666757J51200R8029l8462m6552o2178K5947n9338n1084J8995L3424m472
3744B732266l0049k3089o911J176J9323m3886l3181J3638P8143O2308q3029j9488
3732B667221k0142n0603P0409J20759o5798L0071n1597J9878J0512N0990J097
3721B782797j1636L0732J8820n8975O9359O5493q0511J9009M1269k547K2667n5623
3709B840854J25342k6779K0521K6405O8131L0502n803J9725m2961m6871P3035
3698C082101o4326J03753O926l5677Q9180p195P753p1134l0197K6923J6509J09002
3686C233618q073m5037O4174l0247J0839O7139p0074M5809M0590M5232j56520
3675C197450j7503O8797n6638M7270P9446L5496K5803J4314o992m3160N677K2138
$$ plain form
3663 3372098 3332313 3384913 3481584 3533022 3602578 3592755 3481320 3538261 3610835 3608078 3622531 3602278
3651 3602278 3645330 3769047 3770609 3713758 3742145 3868445 3838166 3906812 3934870 3906768 3872737
3640 3872737 3869087 4013275 3889394 3883982 3917846 3894849 3948471 3970757 3982193 3957682 3897190
3629 3897190 3805945 3892965 4016184 3945699 3915191 3888865 3859954 3907295 3863520 4007615 4028715
3618 4028715 4016609 3960106 3970973 3949256 3997091 4134795 4151506 4136204 4166857 4301978 4350133
3607 4350133 4281630 4370265 4317872 4361671 4427518 4525255 4663531 4666425 4672749 4757014 4784928 4829597
3595 4829597 4851822 4934058 4957593 5012802 5037182 5118905 5166307 5186326 5221022 5212608 5227713 5297828
3583 5297828 5399300 5415844 5437616 5501685 5550421 5529686 5631369 5818848 5811722 5791921 5887499
$$ packed form
3663C372098l9785N2600R6671N1438O9556r823j11435N6941P2574k757J4453k0253
3651C602278M3052J23717J562n6851K8387J26300l0279O8646K8058k8102l4031
3640C872737l650J44188j23881n412L3864k2997N3622K2286J1436k4511o0492
3629C897190r1245Q7020J23219p0485l0508k6326k8911M7341m3775J44095K1100
3618D028715j2106n6503J0867k1717M7835J37704J6711j5302L0653J35121M8155
3607D350133o8503Q8635n2393M3799O5847R7737J38276K894O324Q4265K7914M4669
3595D829597K2225Q2236K3535N5209K4380Q1723M7402K0019L4696q414J5105P0115
3583E297828J01472J6544K1772O4069M8736k0735J01683J87479p126j9801R5578
$$ plain form
3572 5887499 5841546 5976317 6056279 6116730 6113903 6167102 6277524 6491211 6493575 6582031 6608929
3561 6608929 6681221 6755757 6765288 6804563 6797685 6925595 6962007 6982150 7064052 7112816 7075369 7225342
3549 7225342 7254497 7310624 7265637 7318872 7333069 7333968 7403450 7381455 7434062 7528453 7465036 7397121
3537 7397121 7393889 7471308 7522644 7557517 7579322 7551741 7542987 7585070 7794714 7876090 7804096 7755300
3525 7755300 7869775 7913837 7939145 7942979 8076094 8190032 8185650 8238420 8337237 8396595 8419053
3514 8419053 8367748 8436672 8461848 8511987 8592939 8748033 8884108 8870914 8987898 9128518 9248727
3503 9248727 9313927 9378666 9517026 9591513 9675496 9817344 9810580 9965834 10028925 10226867 10464433
3492 10464433 10517049 10538547 10650461 10884401 10979346 11112776 11278680 11456105 11614861 11739021
$$ packed form
3572E887499m5953J34771P9962O0451k827N3199J10422K13687K364Q8456K6898
3561F608929P2292P4536R531L9275o878J27910L6412K0143Q1902M8764l7447J49973
3549G225342K9155N6127m4987N3235J4197Q99O9482k1995N2607R4391o3417o7915
3537G397121l232P7419N1336L4873K1805k7581q754M2083K09644Q1376p1994m8796
3525G755300J14475M4062K5308L834J33115J13938m382N2770R8817N9358K2458
3514H419053n1305O8924K5176N0139Q0952J55094J36075j3194J16984J40620J20209
3503I248727O5200O4739J38360P4487Q3983J41848o764J55254O3091J97942K37566
3492A0464433N2616K1498J11914K33940R4945J33430J65904J77425J58756J24160
$$ plain form
3482 11739021 11997920 12144701 12344419 12589398 12737667 12942925 13132455 13324748 13543271
3473 13543271 13784491 13998070 14212913 14452162 14588128 14775220 14974177 15138263 15369335
3464 15369335 15537047 15740022 15957908 16223207 16542785 16719789 16829768 17044036 17332186
3455 17332186 17663273 17940966 18213227 18490384 18875684 19132122 19383715 19746220 20139964
3446 20139964 20578019 21054723 21449088 21807370 22205540 22799977 23412792 24033474 24647631
3437 24647631 25407741 26325291 27194444 28153438 29212388 30268783 31616685 32980038 34549507
3428 34549507 36348559 38214956 40279845 42507364 45002563 47485605 50059378 52690766
3420 52690766 55313970 57669105 59839417 61919582 63554091 64715402 65636979 66251443
$$ packed form
3482A1739021K58899J46781J99718K44979J48269K05258J89530J92293K18523
3473A3543271K41220K13579K14843K39249J35966J87092J98957J64086K31072
3464A5369335J67712K02975K17886K65299L19578J77004J09979K14268K88150
3455A7332186L31087K77693K72261K77157L85300K56438K51593L62505L93744
3446B0139964M38055M76704L94365L58282L98170N94437O12815O20682O14157
3437B4647631P60110R17550Q69153R58994J058950J056395J347902J363353J569469
3428C4549507J799052J866397K064889K227519K495199K483042K573773K631388
3420E2690766K623204K355135K170312K080165J634509J161311R21577O14464
$$ plain form
3412 66251443 66614666 66644934 66602740 66490849 66313972 66130498 65960066 65807996 65545481 65204285
3402 65204285 64490831 63496004 62330726 60852207 59040322 56847905 54496546 52014106
3394 52014106 49450010 46947652 44543612 42290834 40313684 38499563 36799472 35282315
3386 35282315 34081051 32952775 31839501 30893225 30182457 29539244 28964763 28456055 27999880
3377 27999880 27508354 27116347 26952215 26725841 26550247 26339523 26202192 26104600 26126251 26057652
3367 26057652 26066325 25937903 25809337 25747777 25781064 25755477 25628234 25718440 25835970 25819806 25851289
3356 25851289 25893352 25920747 25971902 26050182 26202683 26369651 26496390 26741293 26970280 27125215
3346 27125215 27407596 27614691 27930516 28188234 28477800 28801058 29092911 29460960 29691681
$$ packed form
3412F6251443L63223L0268m2194j11891j76877j83474j70432j52070k62515l41196
3402F5204285p13454r94827j165278j478519j811885k192417k351359k482440
3394E2014106k564096k502358k404040k252778j977150j814121j700091j517157
3386C5282315j201264j128276j113274r46276p10768o43213n74481n08708m56175
3377B7999880m91526l92007j64132k26374j75594k10724j37331r7592K1651o8599
3367B6057652Q673j28422j28566o1560L3287k5587j27243R0206J17530j6164L1483
3356B5851289M2063K7395N1155P8280J52501J66968J26739K44903K28987J54935
3346B7125215K82381K07095L15825K57718K89566L23258K91853L68049K30721
$$ plain form
3337 29691681 29762681 29904914 30145307 30423188 30666559 31050782 31501318 31869570 32132839 32366065
3327 32366065 32721255 33157287 33628289 34096886 34397771 34870231 35425081 36037808 36637927
3318 36637927 37137837 37634826 38188623 38764842 39329297 40048091 40860844 41560971 42457361
3309 42457361 43518556 44525835 45490793 46468232 47417873 48172217 48990009 49844500 50783701
3300 50783701 51904689 53068973 54394154 55917014 57527586 59206426 61076689 63008730
3292 63008730 65158649 67511269 69911358 72469884 75388621 78488489 81740419 85293860
3284 85293860 89112433 93155219 97531501 102217106 107359616 112716967 118324884 124263841
3276 124263841 130246046 136130086 141620448 146628387 150888397 154399557 157147597 159070899
$$ packed form
3337B9691681P1000J42233K40393K77881K43371L84223M50536L68252K63269K33226
3327C2366065L55190M36032M71002M68597L00885M72460N54850O12727O00119
3318C6637927M99910M96989N53797N76219N64455P18794Q12753P00127Q96390
3309D2457361J061195J007279R64958R77439R49641P54344Q17792Q54491R39201
3300E0783701J120988J164284J325181J522860J610572J678840J870263J932041
3292F3008730K149919K352620K400089K558526K918737L099868L251930L553441
3284H5293860L818573M042786M376282M685605N142510N357351N607917N938957
3276A24263841N982205N884040N490362N007939M260010L511160K748040J923302
$$ plain form
3268 159070899 160141541 160526685 160585279 160419064 160336681 160271417 160283353 160474362 160722779 160741646
3258 160741646 160212819 159113337 157208921 154640971 151353454 147440988 143022602 138201445
3250 138201445 133402743 128817852 124592653 120858942 117693638 115120841 113041083 111517349
3242 111517349 110380039 109804814 109674647 109957468 110624046 111640004 112955913 114309424 115598711
3233 115598711 117078069 118471939 119754041 121297133 123084990 124949424 126767885 128654530
3225 128654530 130640356 132474057 134269134 135913035 137533369 139057593 140313372 141309681
3217 141309681 142139468 142479098 142427096 141960523 140980124 139538753 137528018 135283459 132769157
3208 132769157 130035555 127010708 124025423 121175882 118288194 115095589 111546297 107997705
$$ packed form
3268A59070899J070642L85144N8594j66215q2383o5264J1936J91009K48417J8867
3258A60741646n28827j099482j904416k567950l287517l912466m418386m821157
3250A38201445m798702m584891m225199l733711l165304k572797k079758j523734
3242A11517349j137310n75225j30167K82821O66578J015958J315909J353511J289287
3233A15598711J479358J393870J282102J543092J787857J864434J818461J886645
3225A28654530J985826J833701J795077J643901J620334J524224J255779R96309
3217A41309681Q29787L39630n2002m66573r80399j441371k010735k244559k514302
3208A32769157k733602l024847k985285k849541k887688l192605l549292l548592
$$ plain form
3200 107997705 104364370 100926539 97608031 94574662 91924754 89080264 86255568 83468362
3192 83468362 80702601 78052191 75460066 73135158 70832179 68728168 66867790 65306695
3184 65306695 63981206 62624856 61580500 60679653 59941697 59386341 58909365 58404720 57980876
3175 57980876 57530492 57100169 56733426 56145576 55560958 54654049 53536352 52464258 51331724
3166 51331724 50274079 49506931 48619848 47860148 47262488 46700123 46194825 45708391 45446714
3157 45446714 45242694 45117441 45043517 45043184 44950975 44887767 44934607 45055892 45223996 45354180 45486471
3146 45486471 45423670 45461057 45443786 45295101 45017842 44569295 44340810 43952677 43628845 43176238
3136 43176238 42959494 42723087 42722965 42692777 42827962 43049880 43511088 44218615 44870542 45750113
$$ packed form
3200A07997705l633335l437831l318508l033369k649908k844490k824696k787206
3192H3468362k765761k650410k592125k324908k302979k104011j860378j561095
3184F5306695j325489j356350j044356r00847p37956n55356m76976n04645m23844
3175E7980876m50384m30323l66743n87850n84618r06909j117697j072094j132534
3166E1331724j057645p67148q87083p59700n97660n62365n05298m86434k61677
3157D5446714k04020j25253p3924l33r2209o3208M6840J21285J68104J30184J32291
3146D5486471o2801L7387j7271j48685k77259m48547k28485l88133l23832m52607
3136D3176238k16744k36407j22l0188J35185K21918M61208P07527O51927Q79571
$$ plain form
3126 45750113 46767256 47902865 49239254 50747382 52385469 54019076 55635572 57301813
3118 57301813 58776584 59856938 60824505 61663670 62160460 62329150 62149919 61761387 60973392
3109 60973392 59894147 58592430 57216608 55908074 54624604 53463406 52472535 51756860
3101 51756860 51345327 51188938 51323718 51615616 52267742 52987327 53931320 54738643 55774925
3092 55774925 56769165 57521707 57981211 58145764 57947763 57324745 56408177 55082456 53443239
3083 53443239 51643525 49766701 47737628 45629628 43604728 41651924 39772344 38114422
3075 38114422 36480689 35016929 33649651 32515232 31477121 30477419 29513685 28698053 27884443
3066 27884443 27250184 26648035 26024709 25389861 24827211 24357631 23865448 23414267 22978220
$$ packed form
3126D5750113J017143J135609J336389J508128J638087J633607J616496J666241
3118E7301813J474771J080354R67567Q39165M96790J68690j79231l88532p87995
3109F0973392j079245j301717j375822j308534j283470j161198r90871p15675
3101E1756860m11533j56389J34780K91898O52126P19585R43993Q07323J036282
3092E5774925R94240P52542M59504J64553j98001o23018r16568j325721j639217
3083E3443239j799714j876824k029073k108000k024900j952804j879580j657922
3075C8114422j633733j463760j367278j134419j038111r99702r63734q15632q13610
3066B7884443o34259o02149o23326o34848n62650m69580m92183m51181m36047
$$ plain form
3057 22978220 22629651 22248579 21937660 21518242 21348609 21202079 20963612 20827412 20661275
3048 20661275 20485379 20345195 20229651 20295324 20298153 20225163 20304611 20451850 20609061 20792433
3038 20792433 20960386 21166773 21211084 21204783 21373185 21429681 21373251 21284630 21013253 20643179
3028 20643179 20232389 19824480 19323947 18777796 18325220 17802216 17415294 17037119 16631939
3019 16631939 16132641 15668757 15315502 15107746 14836924 14618339 14504287 14269379 13946517
3010 13946517 13744191 13592495 13435583 13365897 13196885 13039992 12905883 12876450 12762858 12598158
3000 12598158 12529610 12417572 12389667 12406252 12229385 12076829 11963575 12034130 11977010 11901902
2990 11901902 11884130 11945632 11993377 11898905 11830162 11816318 11895864 11930700 11946308 11899766 11865615
$$ packed form
3057B2978220l48569l81072l10919m19418j69633j46530k38467j36200j66137
3048B0661275j75896j40184j15544O5673K829p2990P9448J47239J57211J83372
3038B0792433J67953K06387M4311o301J68402N6496n6430q8621k71377l70074
3028B0643179m10790m07909n00533n46151m52576n23004l86922l78175m05180
3019A6631939m99298m63884l53255k07756k70822k18585j14052k34908l22862
3010A3946517k02326j51696j56912o9686j69012j56893j34109k9433j13592j64700
3000A2598158o8548j12038k7905J6585j76867j52556j13254P0555n7120p5108
2990A1901902j7772O1502M7745r4472o8743j3844P9546L4836J5608m6542l4151
$$ plain form
2979 11865615 11817956 11787106 11748158 11709028 11761260 11834990 11838333 11966968 12030704 12071973 12181691
2968 12181691 12238400 12303637 12407000 12485502 12520214 12575756 12648436 12750814 12928795 12851509 12927644
2957 12927644 13185380 13333392 13498502 13711729 13903847 14126855 14445571 14644628 14911972
2948 14911972 15197925 15564253 15841624 16114751 16435273 16859027 17221652 17420096 17695327
2939 17695327 18075918 18483050 18789716 19124351 19617933 20047606 20499833 20966322 21384380
2930 21384380 21791967 22236844 22717808 23249332 23850991 24289190 24824041 25399951 26103502
2921 26103502 26781732 27537198 28332597 29063355 29938221 30824030 31847059 32686399 33538385
2912 33538385 34582927 35405287 36222715 37173373 38066589 38843056 39634134 40382115 41171997
$$ packed form
2979A1865615m7659l0850l8948l9130N2232P3730L343J28635O3736M1269J09718
2968A2181691N6709O5237J03363P8502L4712N5542P2680J02378J77981p7286P6135
2957A2927644K57736J48012J65110K13227J92118K23008L18716J99057K67344
2948A4911972K85953L66328K77371K73127L20522M23754L62625J98444K75231
2939A7695327L80591M07132L06666L34635M93582M29673M52227M66489M18058
2930B1384380M07587M44877M80964N31524O01659M38199N34851N75910P03551
2921B6103502O78230P55466P95399P30758Q74866Q85809J023029Q39340Q51986
2912C3538385J044542Q22360Q17428R50658Q93216P76467P91078P47981P89882
$$ plain form
2903 41171997 42191209 43303815 44348344 45438590 46637365 48062941 49503254 50955008
2895 50955008 52742557 54637277 56554374 58566567 60811478 63147000 65566894 68213682
2887 68213682 70973864 73936093 77179076 80662494 84492325 88703362 93200625 98138890
2879 98138890 103750715 110192755 117281042 125269768 134191385 144140667 155123390 167481014
2871 167481014 181502348 197625618 216095283 237030701 260405226 285347360 310126888
2864 310126888 331644976 345693025 347418143 335153468 311691406 282643315 253227821
2857 253227821 226415391 203687489 184743641 169195662 156361973 145589672 136593451
2850 136593451 129039735 122665445 117057705 112108776 107564105 103560583 99904145 96558104
$$ packed form
2903D1171997J019212J112606J044529J090246J198775J425576J440313J451754
2895E0955008J787549J894720J917097K012193K244911K335522K419894K646788
2887F8213682K760182K962229L242983L483418L829831M211037M497263M938265
2879I8138890N611825O442040P088287P988726Q921617R949282J0982723J2357624
2871A67481014J4021334J6123270J8469665K0935418K3374525K4942134K4779528
2864C10126888K1518088J4048049J725118j2264675k3462062k9048091k9415494
2857B53227821k6812430k2727902j8943848j5547979j2833689j0772301q996221
2850A36593451p553716o374290n607740m948929m544671m003522l656438l346041
$$ plain form
2842 96558104 93609300 90953471 88407653 86131095 84108256 82328824 80675907 79077739
2834 79077739 77664227 76233410 75007158 73764051 72501137 71198493 69770878 68282898
2826 68282898 66434371 64523355 62679575 60815298 59094797 57425380 55889946 54582557
2818 54582557 53333225 52114548 50722406 49092840 47265704 45363773 43428390 41476583
2810 41476583 39577955 37921992 36297952 34842868 33471448 32245097 31037026 29917728
2802 29917728 28794959 27889226 27029408 26124870 25330291 24633104 23970829 23389883 22784108
2793 22784108 22077184 21522821 20930128 20451013 19944806 19566665 19248378 18849406 18431912
2784 18431912 18018067 17628732 17293148 16933034 16604666 16195141 15758595 15474939 15186031
$$ packed form
2842I6558104k948804k655829k545818k276558k022839j779432j652917j598168
2834G9077739j413512j430817j226252j243107j262914j302644j427615j487980
2826F8282898j848527j911016j843780j864277j720501j669417j535434j307389
2818E4582557j249332j218677j392142j629566j827136j901931j935383j951807
2810D1476583j898628j655963j624040j455084j371420j226351j208071j119298
2802B9917728j122769r05733q59818r04538p94579o97187o62275n80946o05775
2793B2784108p06924n54363n92693m79115n06207l78141l18287l98972m17494
2784A8431912m13845l89335l35584l60114l28368m09525m36546k83656k88908
$$ plain form
2775 15186031 14880000 14558266 14196561 13910219 13637464 13421624 13128561 12887674 12646880
2766 12646880 12334054 12062490 11897068 11748881 11615568 11358987 11138294 10932063 10814684
2757 10814684 10652825 10352192 10204946 10096411 9893833 9790036 9626535 9403912 9302743
2748 9302743 9133988 8996014 8959019 8812048 8651259 8500622 8299285 8122373 8067555 7872272
2738 7872272 7787797 7718117 7485511 7299384 7128863 6990888 6935513 6787053 6638731 6590921
2728 6590921 6539641 6469716 6315714 6166626 6054855 6029835 5977565 5750350 5554557 5577923
2718 5577923 5482557 5384270 5325191 5329271 5211559 5130524 5001292 4907295 4852420 4860024 4856496 4568726
2706 4568726 4534992 4608399 4578514 4440059 4349925 4386684 4425849 4380011 4295258 4212552 4097056
$$ packed form
2775A5186031l06031l21734l61705k86342k72755k15840k93063k40887k40794
2766A2646880l12826k71564j65422j48187j33313k56581k20693k06231j17379
2757A0814684j61859l00633j47246j08535k02578j03797j63501k22623j01169
2748I302743j68755j37974l6995j46971j60789j50637k01337j76912n4818j95283
2738G872272q4475o9680k32606j86127j70521j37975n5375j48460j48322m7810
2728F590921n1280o9925j54002j49088j11771k5020n2270k27215j95793K3366
2718E577923r5366r8287n9079M080j17712q1035j29232r3997n4875P604l528k87770
2706D568726l3734P3407k9885j38455r0134L6759L9165m5838q4753q2706j15496
$$ plain form
2695 4097056 4008097 4009259 3958381 3969419 3924114 3817473 3727967 3617509 3671332 3618584 3510729
2684 3510729 3455331 3492822 3504114 3445349 3299952 3177694 3085694 3058005 3012827 3015089 3010427
2673 3010427 2996306 3053837 3041457 2941845 2856754 2867966 2920613 2841355 2770158 2689023 2662423
2662 2662423 2616796 2601590 2618983 2617892 2646466 2486952 2338577 2348590 2444462 2418916 2323830
2651 2323830 2243231 2286413 2215052 2186283 2232880 2171564 2111830 2058876 2109570 2149322 2154191 2097533
2639 2097533 2060637 1990243 1933439 1942678 1838449 1775846 1858728 1921358 1885217 1859282 1861277 1817192
2627 1817192 1822686 1895965 1877013 1795909 1775685 1780804 1775713 1717952 1703839 1594943 1659681 1677112
2615 1677112 1777470 1832330 1755801 1711939 1600023 1610323 1745325 1797547 1767946 1836799 1855559
$$ packed form
2695D097056q8959J162n0878J1038m5305j06641q9506j10458N3823n2748j07855
2684C510729n5398L7491J1292n8765j45397j22258r2000k7689m5178K262m662
2673C010427j4121N7531j2380r9612q5091J1212N2647p9258p1197q1135k6600
2662B662423m5627j5206J7393j091K8574j59514j48375J0013R5872k5546r5086
2651B323830q0599M3182p1361k8769M6597o1316n9734n2954N0694L9752M869n6658
2639B097533l6896p0394n6804R239j04229o2603Q2882O2630l6141k5935J995m4085
2627A817192N494P3279j8952q1104k0224N119n091n7761j4113j08896O4738J7431
2615A677112J00358N4860p6529m3862j11916J0300J35002N2222k9601O8853J8760
$$ plain form
2604 1855559 1753048 1675182 1643595 1620807 1758884 1652289 1562085 1636877 1639285 1701686 1709653
2593 1709653 1705154 1809967 1922111 1930992 1991876 2051545 2023268 2225031 2305711 2425132 2443224
2582 2443224 2408662 2615150 2706896 2652379 2585903 2423803 2282895 2186845 2062485 2001206 1898594
2571 1898594 1742075 1707744 1631746 1537472 1517282 1412864 1420336 1387600 1359843 1421232 1316234
2560 1316234 1319387 1324601 1298050 1236526 1216670 1191868 1182156 1187514 1168275 1114323 1055754 991336
2548 991336 953864 987251 1125575 1023684 972441 964282 991952 1053525 944099 1001900 952650
2537 952650 1036590 1044177 933857 879620 883007 877251 866952 895081 841988 864637 843865 819588
2525 819588 858600 822961 767813 726132 688400 676127 570235 580940 574580 672730 627341 569675
$$ packed form
2604A855559j02511p7866l1587k2788J38077j06595r0204P4792K408O2401P967
2593A709653m499J04813J12144Q881O0884N9669k8277K01763Q0680J19421J8092
2582B443224l4562K06488R1746n4517o6476j62100j40908r6050j24360o1279j02612
2571A898594j56519l4331p5998r4274k0190j04418P472l2736k7757O1389j04998
2560A316234L153N214k6551o1524j9856k4802r712N358j9239n3952n8569o4418
2548I91336l7472L3387J38324j01891n1243q159K7670O1573j09426N7801m9250
2537I52650Q3940P587j10320n4237L387n756j0299K8129n3093K2649k0772k4277
2525H19588L9012l5639n5148m1681l7732j2273j05892J0705o360R8150m5389n7666
$$ plain form
2513 569675 641191 665153 688039 606451 587428 595882 621179 622091 618301 655047 648322 593093 628664
2500 628664 575277 562804 401716 460934 432714 479458 618147 521347 509825 478980 534363
2489 534363 515083 514500 482452 462585 505451 485960 465081 533918 570056 513478 498455 557124
2477 557124 508128 568290 529778 528340 475659 444317 549559 510339 525447 386696 482671
2466 482671 493228 579295 560291 427068 441916 495963 472650 430129 426759 464006 487758 515726
2454 515726 417612 480312 457637 377127 408752 316186 347334 382259 360261 335708 262147 289854
2442 289854 323623 321833 363978 474501 472336 424074 378800 290470 202041 250967 260722 248646
2430 248646 249873 333192 364198 345074 307910 296351 274743 338222 365467 241328 221576 359357
$$ packed form
2513E69675P1516K3962K2886q1588j9023Q454K5297R12l790L6746o725n5229L5571
2500F28664n3387j2473j61088N9218k8220M6744J38689r6800j1522l0845N5383
2489E34363j9280n83l2048j9867M2866j9491k0879O8837L6138n6578j5023N8669
2477E57124m8996O0162l8512j438n2681l1342J05242l9220J5108j38751R5975
2466D82671J0557Q6067j9004j33223J4848N4047k3313m2521l370L7247K3752K7968
2454E15726r8114O2700k2675q0510L1625r2566L1148L4925k1998k4553p3561K7707
2442B89854L3769j790M2145J10523k165m8262m5274q8330q8429M8926R755j2076
2430B48646J227Q3319L1006j9124l7164j1559k1608O3479K7245j24139j9752J37781
$$ plain form
2418 359357 329833 271171 353705 292426 348453 271990 280767 262015 209628 217071 254489 238846
2406 238846 302114 294328 227856 273702 306666 255345 356815 306994 313752 325250 317685 249595
2394 249595 333616 355483 414014 361112 399246 329750 313635 338513 304221 358103 423840 534601
2382 534601 468293 486802 522654 566506 471563 440644 373790 267711 283514 258022 278615
2371 278615 342906 289069 219838 140460 218442 225354 261187 396033 437367 303648 173111
2360 173111 260252 332937 271623 194904 301150 239800 236225 289807 332634 309021 343731 332456
2348 332456 283207 315753 256231 210278 158431 222370 196807 142561 227833 248811 186295 196220
2336 196220 288326 232213 172436 180613 133647 173228 191046 195149 200055 164177 88885 166108
$$ packed form
2418C59357k9524n8662Q2534o1279N6027p6463Q777j8752n2387P443L7418j5643
2406B38846O3268p786o6472M5846L2964n1321J01470m9821O758J1498p565o8090
2394B49595Q4021K1867N8531n2902L8134o9496j6115K4878l4292N3882O5737J10761
2382E34601o6308J8509L5852M3852r4943l0919o6854j06079J5803k5492K0593
2371B78615O4291n3837o9231p9378P7982O912L5833J34846M1334j33719j30537
2360A73111Q7141P2685o1314p6719J06246o1350l575N3582M2827k3613L4710j1275
2348C32456m9249L2546n9522m5953n1847O3939k5563n4246Q5272K0978o2516R925
2336A96220R2106n6113n9777Q177m6966L9581J7818M103M906l5878p5292P7223
$$ plain form
2324 166108 237373 238183 194364 204906 128559 216970 201388 268044 313504 246206 260109 290751
2312 290751 272518 224559 190326 217492 236884 211570 203327 211363 286111 234962 165423 97524
2300 97524 153821 153978 217696 220749 161890 132220 102977 177960 195109 207509 182868 190963 210635
2287 210635 250839 269349 224458 210312 255972 277540 328819 395757 334996 253166 215495 193276
2275 193276 241668 292946 286546 284962 219424 214127 218445 157342 147237 208778 228698 229466 343848
2262 343848 343855 269860 241478 311381 277593 281876 253784 213848 194825 155803 216246 239224 276182
2249 276182 223461 206137 182806 138418 205633 303276 356101 275526 237315 287948 288535 323499
2237 323499 314585 455955 498008 417115 365793 344177 346209 291065 304282 282916 301778 320579
$$ packed form
2324A66108P1265Q10m3819J0542p6347Q8411j5582O6656M5460o7298J3903L0642
2312B90751j8233m7959l4233K7166J9392k5314q243Q036P4748n1149o9539o7899
2300I7524N6297J57O3718L053n8859k9670k9243P4983J7149J2400k4641Q095J9672
2287B10635M0204J8510m4891j4146M5660K1568N1279O6938o0761q1830l7671k2219
2275A93276M8392N1278o400j584o5538n297M318o1103j0105O1541J9920P68J14382
2262C43848Pp3995k8382O9903l3788M283k8092l9936j9023l9022O0443K2978L6958
2249B76182n2721j7324k3331m4388O7215R7643N2825q0575l8211N0633N87L4964
2237C23499q914J41370M2053q0893n1322k1616K032n5144J3217k1366J8862J8801
$$ plain form
2225 320579 288388 273287 332940 347440 261188 264661 351628 407495 335121 307549 322149 381189
2213 381189 389102 345070 314388 342087 404349 438993 488282 614136 619851 481552 458446 400478
2201 400478 486640 526958 541801 537464 644340 669565 685998 711316 741733 801080 822919 932556
2189 932556 856164 808281 840338 935621 858599 948142 1047916 1041323 1134467 1124827 1139332 1182709
2177 1182709 1218920 1211463 1249611 1296840 1279266 1253563 1344838 1388180 1498875 1618265 1638147
2166 1638147 1701028 1664747 1672293 1657874 1834677 1830389 1794478 1865134 1930787 1937163 1986842 2036575
2154 2036575 2156022 2291199 2356859 2370671 2376410 2474976 2577893 2714195 2745990 2861877 2884903
2143 2884903 3135934 3395152 3322876 3585977 3726124 3788715 3922315 4131428 4336388 4601675
$$ packed form
2225C20579l2191j5101N9653J4500q6252L473Q6967N5867p2374k7572J4600N9040
2213C81189P913m4032l0682K7699O2262L4644M9289J25854N715j38299k3106n7968
2201D00478Q6162M0318J4843m337J06876K5225J6433K5318L0417N9347K1839J09637
2189I32556p6392m7883L2057R5283p7022Q9543R9774o593R3144r640J4505M3377
2177A182709L6211p457L8148M7229j7574k5703R1275M3342J10695J19390J9882
2166A638147O2881l6281P546j4419J76803m288l5911P0656O5653O376M9679M9733
2154B036575J19447J35177O5660J3812N739R8566J02917J36302L1795J15887K3026
2143B884903K51031K59218p2276K63101J40147O2591J33600K09113K04960K65287
$$ plain form
2133 4601675 4885366 5080645 5363705 5805912 6282733 6919073 7576792 8018204 8622783 9322515
2123 9322515 10270050 11465973 12912866 14978950 17476354 20564141 24351129 29329649
2115 29329649 34765998 42040373 50095542 49540120 41418929 31687517 24210952 19383973
2107 19383973 15909772 13486730 11552643 10103768 9011433 8139117 7466622 7024528 6670124
2098 6670124 6437925 6167853 5686205 5106685 4709152 4392588 4010407 3612327 3400842 3214079
2088 3214079 3214517 2997337 2917557 2769174 2675857 2544960 2458830 2438799 2262594 2166649 2060664
2077 2060664 1924240 1841049 1713746 1670535 1587798 1601619 1571627 1620615 1458622 1399477 1286684
2066 1286684 1182465 1141481 1176279 1145778 1091647 1062287 1047270 987850 859693 927513 946693
$$ packed form
2133D601675K83691J95279K83060M42207M76821O36340O57719M41412O04579O99732
2123I322515R47535J195923J446893K066084K497404L087787L786988M978520
2115B9329649N436349P274375Q055169n55422q121191r731412p476565m826979
2107A9383973l474201k423042j934087j448875j092335q72316o72495m42094l54404
2098F670124k32199k70072m81648n79520l97533l16564l82181l98080k11485j86763
2088C214079M38k17180p9780j48383r3317j30897q6130k0031j76205r5945j05985
2077B060664j36424q3191j27303m3211q2737J3821k9992M8988j61993n9145j12793
2066A286684j04219m0984L4798l0501n4131k9360j5017n9420j28157O7820J9180
$$ plain form
2055 946693 910104 880056 904049 931174 1032768 973814 837523 797137 769347 705474 713074
2044 713074 710928 663918 613680 720998 618323 549079 601204 575951 593038 640687 574875
2033 574875 527659 598079 679666 622444 653019 639328 602618 609122 616468 543338 517209 537391
2021 537391 502056 527208 548240 462084 343300 427452 391835 337484 411459 321839 360922
2010 360922 313693 257510 326458 428500 494997 491458 464166 455404 372792 315632 332753 383867
1998 383867 464029 339731 286513 323933 350983 293893 238056 237040 157162 135408 172073 268234
1986 268234 168362 286617 303833 323401 277215 266231 269618 197361 194606 200241 190383 192902
1974 192902 222632 209713 223464 152974 216391 153281 193024 185682 207912 237149 244815 210864
$$ packed form
2055I46693l6589l0048K3993K7125J01594n8954j36291m0386k7790o3873P600
2044G13074k146m7010n0238J07318j02675o9244N2125k5253J7087M7649o5812
2033E74875m7216P0420Q1587n7222L0575j3691l6710O504P346p3130k6129K0182
2021E37391l5335K5152K1032q6156j18784Q4152l5617n4351P3975q9620L9083
2010C60922m7229n6183O8948J02042O6497l539k7292q762q2612n7160J7121N1114
1998C83867Q0162j24298n3218L7420K7050n7090n5837j016p9878k1754L6665R6161
1986B68234r9872J18255J7216J9568m6186j0984L387p2257k755N635r858K519
1974A92902K9730j2919J3751p0490O3417o3110L9743p342K2230K9237P666l3951
$$ plain form
1962 210864 160277 81368 91856 82145 39953 94051 130737 171074 193840 247290 176062 152804
1950 152804 214009 188436 233675 157282 107232 148105 178936 84396 57609 84517 32195 6336
1938 6336 147340 143828 160969 190483 154254 214428 161717 144610 158011 58761 -56610 76924
1926 76924 241771 152611 199869 272164 119063 111551 158093 77859 140842 185130 177065 186136
1914 186136 169131 115561 126234 26985 12596 39260 -5082 -2323 52821 71980 109797 113253
1902 113253 87891 59962 77144 111531 144731 245741 248354 195249 47486 102134 118540
1891 118540 37504 93205 59762 -49256 54985 -20676 39830 99256 77064 -25972 -36795
1880 -36795 77015 101203 39671 103614 88288 73240 87069 77455 -55300 -37497 93944
$$ packed form
1962B10864n0587p8909J0488r711m2192N4098L6686M0337K2766N3450p1228k3258
1950A52804O1205k5573M5239p6393n0050M0873L0831r4540k6787K6908n2322k5859
1938F336J41004l512J7141K9514l6229O0174n2711j7107J3401r9250j15371J33534
1926G6924J64847q9160M7258P2295j53101p512M6542q0234O2983M4288q065R071
1914A86136j7005n3570J0673r9249j4389K6664m4342K759N5144J9159L7817L456
1902A13253k5362k7929J7182L4387L3200J01010K613n3105j47763N4648J6406
1891A18540q1036N5701l3443j09018J04241p5661O0506N9426k2192j03036j0823
1880c6795J13810K4188o1532O3943j5326j5048J3829r614j32755J7803J31441
$$ plain form
1869 93944 138041 92814 105009 73006 53310 16321 74283 33652 -18957 27587 91535 112906
1857 112906 -62948 38364 33378 134807 162428 211121 128289 95245 23128 170872 225465
1846 225465 203332 177537 199125 237933 273359 215748 198276 115595 94840 100715 58431 139962
1834 139962 83243 3034 126712 191828 111431 131342 148600 175859 166444 143574 55406 71893
1822 71893 163510 122757 71512 36664 18277 126862 81149 138772 138514 29723 1760 -9498
1810 -9498 -102572 -28837 42073 70740 38521 -43071 -13266 26017 71643 110356 59599 28282
1798 28282 41872 118211 141486 149083 26698 -50209 -40457 -48717 -146404 -29580 79535 63109
1786 63109 76977 20225 29801 63069 9377 -118038 -118768 -11829 70640 29257 -69612 -23925
$$ packed form
1869I3944M4097m5227J2195l2003j9696l6989N7962m0631n2609M6544O3948K1371
1857A12906j75854J01312m986J01429K7621M8693q2832l3044p2117J47744N4593
1846B25465k2133k5795K1588L8808L5426n7611j7472q2681k0755N875m2284Q1531
1834A39962n6719q0209J23678O5116q0397J9911J7258K7259r415k2870q8168J6487
1822G1893R1617m0753n1245l4848j8387J08585m5713N7623k58j08791k7963j1258
1810i498r3074P3735P0910K8667l2219q1592K9805L9283M5626L8713n0757l1317
1798B8282J3590P6339K3275P597j22385p6907R752q260r7687J16824J09115j6426
1786F3109J3868n6752R576L3268n3692j27415p30J06939Q2469m1383r8869M5687
$$ plain form
1774 -23925 39997 -62652 -105648 -141748 -122773 -79480 -71406 4950 50832 -34793 -54568 12217
1762 12217 76373 112434 121004 21619 -50335 -49247 -22752 5782 51885 82933 101922 -28412
1750 -28412 -110039 43493 52917 85495 19402 -42985 -17912 14337 -28486 -54550 -11574 110631
1738 110631 38616 80446 114990 -64506 38378 76189 78530 59556 24538 4720 -65361
1727 -65361 17054 44654 -8593 19294 57092 49083 -24194 27274 22124 -35411 -58001 85377
1715 85377 17134 80019 94817 -1791 13841 57560 3433 -78057 -42145 -14293 -50156 -28952
1703 -28952 19146 21769 31919 58658 50198 -51422 42047 -20717 60463 16063 -75651 -48800
1691 -48800 -14977 28278 8865 46276 2935 -110327 -163338 -75670 -101014 -69801 -24109 61097
$$ packed form
1774b3925O3922j02649m2996l6100J8975M3293Q074P6356M5882q5625j9775O6785
1762A2217O4156L6061Q570r9385p1954J088K6495K8534M6103L1048J8989j30334
1750b8412q1627J53532R424L2578o6093o2387K5073L2249m2823k6064M2976J22205
1738A10631p2015M1830L4544j79496J02884L7811K341j8974l5018j9818p0081
1727f5361Q2415K7600n3247K7887L7798q009p3277N1468n150n7535k2590J43378
1715H5377o8243O2885J4798r6608J5632M3719n4127q1490L5912K7852l5863K1204
1703b8952M8098K623J0150K6739q460j01620R3469o2764Q1180m4400r1714K6851
1691d8800L3823M3255j9413L7411m3341j13262n3011Q7668k5344L1213M5692Q5206
$$ plain form
1679 61097 101961 148044 26227 37744 -16570 -154822 -102946 -152681 -96131 -85953 -105277
1668 -105277 -197620 -96394 -46985 106043 106244 -22631 -101565 -99164 -49066 -28140 745 -62987
1656 -62987 -55294 -53173 26098 6094 -14058 54257 38035 76362 35718 13196 -30833 -156756
1644 -156756 -90286 -108466 -50902 -87006 6150 145582 6756 -22567 -26257 -15503 8378
1633 8378 -49685 -48339 -62072 -25366 -35203 10828 30644 22212 9391 27730 -2622 -33001 46413
1620 46413 -757 -64640 -26181 -14310 44518 5329 -66098 -15194 31698 6668 8788 -21853
1608 -21853 -15864 51002 20722 111205 111951 79421 77714 98834 47480 -31967 -12767 -13287 -17336
1595 -17336 -40482 15692 37366 -35023 -34709 -78812 26988 9700 -23044 -49682 -25736 75908
$$ packed form
1679F1097M0864M6083j21817J1517n4314j38252N1876m9735N6550J0178j9324
1668a05277r2343J01226M9409J53028K01j28875p8934K401N0098K0926K8885o3732
1656f2987P693K121P9271k0004k0152O8315j6222L8327m0644k2522m4029j25923
1644a56756O6470j8180N7564l6104R3156J39432j38826k9323l690J0754K3881
1633H378n8063J346j3733L6706r837M6031J9816q432j2821J8339l0352l0379P9414
1620D6413m7170o3883L8459J1871N8828l9189p1427N0904M6892k5030K120l0641
1608b1853N989O6866l0280R0483P46l2530j707K1120n1354p9447J9200n20m049
1595a7336k3146N6174K1674p2389L14m4103J05800j7288l2744k6638K3946J01644
$$ plain form
1583 75908 -18298 36190 -26087 -86545 -103887 -21283 -13328 -57662 -30316 106482 34594 134250
1571 134250 115040 57433 154430 85353 77856 54136 -1398 -169053 -115536 -45279 -5452 -44443
1559 -44443 -138067 -43803 -51904 -103610 -141562 -148685 -25586 47080 9889 -97630 -31791 -23810
1547 -23810 6418 2314 -13991 -16759 57278 -46124 -40373 13107 123188 58981 -13858 -132389
1535 -132389 -36554 -83689 -92801 -35083 98114 41816 -11915 -127990 -117881 -43532 3427
1524 3427 -35762 -51097 23937 -20181 -149771 -192516 -16061 -20024 -18996 50509 27561 47430
1512 47430 43756 -19273 20520 -111519 -27771 -69009 12247 -12966 85870 -10921 -44095 -69978
1500 -69978 -2182 21638 69318 81374 -22928 122338 28691 -13129 36932 -40153 -119643
$$ packed form
1583G5908r4206N4488o2277o0458j7342Q2604P955m4334K7346J36798p1888R9656
1571A34250j9210n7607R6997o9077p497k3720n5534j67655N3517P0257L9827l8991
1559d4443r3624R4264q101n1706l7952p123J23099P2666l7191j07519O5839P981
1547b3810L0228m104j6305k768P4037j03402N751N3480J10081o4207p2839j18531
1535a32389R5835m7135r112N7718J33197n6298n3731j16075J0109P4349M6959
1524C427l9189j5335P5034m4118j29590m2745J76455l963J028O9505k2948J9869
1512D7430l674o3029L9793j32039Q3748m1238Q1256k5213R8836r6791l3174k5883
1500f9978O7796K3820M7680J2056j04302J45266r3647m1820N0061p7085p9490
$$ plain form
1489 -119643 -58705 -29728 -43848 -14511 45057 36803 -55642 -68318 -143946 -112925 -100878 -81708
1477 -81708 -56915 -12451 -27174 -14586 -64794 -23474 60796 -17234 -34568 102773 128231 113771
1465 113771 28884 -45415 -23813 -28817 -39562 76527 54414 -87727 13593 112182 100008
1454 100008 120374 44640 85483 96318 96915 20310 -17039 -45616 -94914 -133652 -105638 138
1442 138 -14642 37787 131758 33848 2451 -58931 -85706 50620 26064 -46850 -59113 -3099
1430 -3099 12186 -28686 -12622 -12684 -86439 -104695 -108250 -123987 -90927 -29182 -88355 -4570 87263
1417 87263 -27705 -100112 6346 97344 60084 -76004 -22128 -43256 -68446 -25517 9718
1406 9718 -7705 -40776 -182762 -215782 -161036 -103051 -131130 -50647 -74673 -159793 -184804 -150312
$$ packed form
1489a19643O0938K8977j4120K9337N9568q254r2445j2676p5628L1021J2047J9170
1477h1708K4793M4464j4723J2588n0208M1320Q4270p8030j7334J37341K5458j4460
1465A13771q4887p4299K1602n004j0745J16089k2113j42141J01320R8589j2174
1454A00008K0366p5734M0843J0835N97p6605l7349k8577m9298l8738K8014J05776
1442A38j4780N2429R3971r7910l1397o1382k6775J36326k4556p2914j2263N6014
1430c099J5285m0872J6064o2p3755j8256l555j5737L3060O1745n9173Q3785R1833
1417H7263j14968p2407J06458R0998l7260j36088N3876k1128k5190M2929L5235
1406I718j7423l3071j41986l3020N4746N7985k8079Q0483k4026q5120k5011L4492
$$ plain form
1394 -150312 -110896 -138104 -80162 -92361 -158608 -27644 131585 122874 -75948 -114789 49734
1383 49734 52655 18962 68571 -25484 -37594 -23989 -18390 2458 -121639 -48955 -44384 36308
1371 36308 74909 -5185 -25416 -21238 23385 -37421 -70482 -99050 -12056 -22566 -32299 8207
1359 8207 9570 -61574 -71752 22533 -19904 -102104 -76849 -106203 -60745 -1302 2501 1125 -73901
1346 -73901 -62515 -41803 30709 -1632 -53768 19370 -5810 -63659 -85848 -79367 -28686 44634
1334 44634 15784 43237 51744 -22439 50634 104307 60210 -33145 57013 123524 46226 -8714
1322 -8714 220 41621 109637 107357 76709 57134 40142 -14512 -104584 -93262 -92729 -39928 -69603
1309 -69603 -74701 -74523 -14742 -55127 -141931 -139660 -15545 89648 57935 23718 -35551 4029
$$ packed form
1394a50312L9416k7208N7942j2199o6247J30964J59229q711j98822l8841J64523
1383D9734K921l3693M9609r4055j2110J3605N599K0848j24097P2684M571Q0692
1371C6308L8601q0094k0231M178M4623o0806l3061k8568Q6994j0510r733M0506
1359H207J363p1144j0178R4285m2437q2200K5255k9354M5458N9443L803j376p5026
1346g3901J1386K0712P2512l2341n2136P3138k5180n7849k2189O481N0681P3320
1334D4634k8850K7453Q507p4183P3073N3673m4097r3355R0158O6511p7298n4940
1322h714Q934M1401O8016k280l0648j9575j6992n4654r0072J1322N33N2801k9675
1309f9603n098J78N9781m0385q6804K271J24115J05193l1713l4217n9269L9580
$$ plain form
1297 4029 -36073 -161580 -186814 23545 25562 36658 -12064 34698 31210 38825 26009 -20654
1285 -20654 12382 58544 32740 -43795 -26832 -26194 64039 89931 88367 123404 17095 -79815
1273 -79815 42403 77807 2692 -27096 -104201 -126567 -66712 8694 -109597 -37121 -49341
1262 -49341 -19780 72697 -63119 72432 113240 -107541 -184679 -63686 67767 41717 76107
1251 76107 13153 -73998 -53932 -48678 14515 53808 -7758 -6150 -89078 -91883 -71972 32162
1239 32162 167878 62001 7766 110070 47040 -33510 82404 77602 24522 33563 81607
1228 81607 -53864 -80252 -39086 -90262 -35380 1042 -17078 -11865 -58985 -25016 -24104 -33018
1216 -33018 -4980 63429 82955 50701 62749 20534 13474 33319 38719 -6600 -61806 -53087
$$ packed form
1297D029m0102j25507k5234K10359K017J1096m8722M6762l488P615j2816m6663
1285b0654L3036M6162k5804p6535J6963O38R0233K5892j564L5037j06309r6910
1273g9815J22218L5404p5115k9788p7105k2366N9855P5406j18291P2476j2220
1262d9341K9561R2477j35816J35551M0808k20781p7138J20993J31453k6050L4390
1251G6107o2954q7151K0066N254O3193L9293o1566J608q2928k805J9911J04134
1239C2162J35716j05877n4235J02304o3030q0550J15914m802n3080R041M8044
1228H1607j35471k6388M1166n1176N4882L6422j8120N213m7120L3969R12q914
1216c3018K8038O8409J9526l2254J2048m2215p060J9845N400m5319n5206Q719
$$ plain form
1204 -53087 -44940 23841 -68648 -50809 -38450 -2792 -48302 2387 19390 7762 23335 -24060
1192 -24060 10811 59422 -8428 -49147 -22563 -4817 -60660 -72238 -65083 -140807 -146580 -28964
1180 -28964 121561 24106 -15398 -74625 -88699 -70675 -129757 -63705 -16343 33532 10242 -11020
1168 -11020 24131 -72552 -139742 -7436 21014 -15004 -33180 -92958 -178369 -121407 -52480 -116476
1156 -116476 -50764 -54995 -48642 -96152 -81230 -97285 -119170 -115658 -137587 -54881 -25713 35954
1144 35954 93249 66276 -8356 -11675 -36077 -53943 -68415 -44300 -44375 47010 44584 100317 97294
1131 97294 -35997 -7198 -17838 -67891 -75714 -1093 -46658 -3062 72030 -28850 -81782 -42895
1119 -42895 -95685 -81986 -6266 98015 24303 -10262 -5942 -6718 -8560 -41458 41804 141539
$$ packed form
1204e3087Q147O8781r2489J7839J2359L5658m5510N0689J7003j1628J5573m7395
1192b4060L4871M8611o7850m0719K6584J7746n5843j1578P155p5724n773J17616
1180b8964J50525r7455l9504n9227j4074J8024n9082O6052M7362M9875k3290k1262
1168a1020L5151r6683o7190J32306K8450l6018j8176n9778q5411N6962O8927o3996
1156a16476O5712m231O353m7510J4922j6055k1885L512k1929Q2706K9168O1667
1144C5954N7295k6973p4632l319k4402j7866j4472K4115p5R1385k426N5733l023
1131I7294j33291K8799j0640n0053p823P4621m5565M3596P5092j00880n2932L8887
1119d2895n2790J3699P5720J04281p3712l4565M320p76j842l2898Q3262R9735
$$ plain form
1107 141539 151686 64215 -42094 -62778 -64037 -40648 -58302 25166 21064 -33763 -87412 -74932
1095 -74932 -39674 10388 -64393 -31977 -44368 -27672 101112 77700 31196 -25361 15420 59418
1083 59418 54269 83066 84990 10484 -79427 -126806 -10478 -100016 -122508 1875 71163 121064
1071 121064 98808 61905 -7470 -11172 -5539 -60642 -73832 41503 99515 5604 1378 -20652
1059 -20652 40497 -3091 -7002 -7013 -51766 -32755 -53164 -55187 -2388 17158 -21061 -40599 -42139
1046 -42139 -56855 -110305 -69627 -51865 -111530 -6968 39752 153245 34082 -3359 33454
1035 33454 44589 62377 20331 -38345 951 96692 30197 79893 2757 16657 29354 64228
1023 64228 42125 8382 -47027 -187590 -88538 -69878 -45870 -22278 36762 35830 -15914 60637
$$ packed form
1107A41539J0147q7471j06309k0684j259K3389j7654Q3468m102n4827n3649J2480
1095g4932L5258N0062p4781L2416j2391J6696J28784k3412m6504n6557M0781M3998
1083E9418n149K8797J924p4506q9911m7379J16328q9538k2492J24383O9288M9901
1071A21064k2256l6903o9375l702N633n5103j3190J15335N8012r3911m226k2030
1059b0652O1149m3588l911j1m4753J9011k0409k023N2799J9546l8219j9538j540
1046d2139j4716n3450M0678J7762n9665J04562M6720J13493j19163l7441L6813
1035C3454J1135J7788m2046n8676L9296R5741o6495M9696p7136J3900J2697L4874
1023F4228k2103l3743n5409j40563R9052J8660K4008K3592N9040r32n1744P6551
$$ plain form
1011 60637 -35853 -90773 -36990 59584 72082 54438 -4805 -7109 -78422 20042 22188 15936
999 15936 83378 62929 117838 -37683 -79956 -78913 10771 -17595 16226 12669 -4412 80015
987 80015 85451 -9895 -57220 -90558 -76491 -36898 -89067 9052 -16240 63108 105711 445
975 445 -114681 -95863 -58790 -12783 86969 345 -39028 -19238 -83062 17437 -42703 -110840
963 -110840 21441 4316 -59319 -81552 -36683 -66635 -49186 -40835 70979 61105 -81017 32189
951 32189 37591 23364 34327 75186 33615 37256 46982 42092 41531 45718 2551 -45600 -42417 -87573
937 -87573 -119256 -12471 81221 56600 207023 112837 58762 34868 -82492 -146591 -81887
926 -81887 63737 52990 35154 31016 24525 -37491 -108486 -86066 -21904 -107897 -164772 -159149
$$ packed form
1011F0637r6490n4920N3783R6574J2498j7644n9243k304p1313R8464K146o252
999A5936O7442k0449N4909j55521m2273J043Q9684k8366L3821l557j7081Q4427
987H0015N436r5346m7325l3338J4067L9593n2169R8119k5292P9348M2603j05266
975D45j15126J8818L7073M6007R9752q6624l9373J9790o3824J00499o0140o8137
963a10840J32281j7125o3635k2233M4869k9952J7449Q351J11814r874j42122J13206
951C2189N402j4227J0963M0859m1571L641R726m890n61M187m3167m8151L183m5156
937h7573l1683J06785R3692k4621J50423r4186n4075k3894j17360o4099O4704
926h1887J45624j0747j7836m138o491o2016p0995K2420O4162q5993n6875N623
$$ plain form
914 -159149 -67075 -25270 -3499 72968 686 -19675 -48535 -8124 9643 -80308 19484 -67678
902 -67678 -40947 -5818 -54102 -146688 -115116 -123420 -192644 -96593 1689 37553 18263 -16127
890 -16127 -102156 -22054 -62455 -12038 40632 14619 34646 77673 12107 126536 199640 83538
878 83538 21967 6756 52718 40130 28316 5811 32583 52639 16753 8837 20538 80808
866 80808 88044 86497 30829 85053 64279 86909 124614 113782 -67641 -70007 30079 45467
854 45467 -24755 -40313 15522 -21704 16309 44802 45783 -17272 -71468 -104688 -47040 -38895 -138762
841 -138762 6479 -74579 -149060 -142991 -52763 19807 46209 21243 -36635 41592 -56550 -110578
829 -110578 -107095 -50185 -38820 32206 -7324 -52132 16078 127839 65955 76076 84275 11019
$$ packed form
914a59149R2074M1805K1771P6467p2282k0361k8860M0411J7767q9951R9792q7162
902f7678K6731L5129m8284r2586L1572q304o9224R6051R8282L5864j9290l4390
890a6127q6029Q0102m0401N0417N2670k6013K0027M3027o5566J14429P3104j16102
878H3538o1571j5211M5962j2588j1814k2505K6772K0056l5886p916J1701O0270
866H0808P236j547n5668N4224k0774K2630L7705j0832j81423k366J00086J5388
854D5467p0222j5558N5835l7226L8013K8493R81o3055n4196l3220N7648Q145r9867
841a38762J45241q1058p4481O069R0228P2570K6402k4966n7878P8227r8142n4028
829a10578L483N6910J1365P1026l9530m4808O8210J11761o1884J0121Q199p3256
$$ plain form
817 11019 82395 73726 -41857 -10392 -72267 -33862 -60944 10454 20128 38221 -46418 -142086
805 -142086 -166998 -53048 -61458 15054 -30952 -85866 -8163 -98826 -123829 -113719 -47051 44175
793 44175 70490 25561 -522 -41463 -69865 -90610 -62252 41037 75510 -10225 32339 41560
781 41560 63691 -15765 -17746 40542 67016 68728 -56546 -46552 15460 30572 106152 47809
769 47809 80259 56069 -30896 -29687 39015 -11261 -120620 -36622 -101198 -151129 -56168 -7790
757 -7790 81524 129386 103390 72424 55612 -46799 -63036 -50083 -5993 -31103 8454 7003
745 7003 -85499 -105858 4474 -1614 54032 30709 -40181 6452 78822 68460 60461 117277
733 117277 127029 71754 -57041 2580 52812 -46717 4542 -1067 -7030 67732 5605 -87852
$$ packed form
817A1019P1376q669j15583L1465o1875L8405k7082P1398R674J8093q4639r5668
805a42086k4912J13950q410P6512m6006n4914P7703r0663k5003J0110O6668R1226
793D4175K6315m4929k6083m0941k8402k0745K8358J03289L4473q5735M2564R221
781D1560K2131p9456j981N8288K6474J712j25274R994O2012J5112P5580n8343
769D7809L2450k4190q6965J209O8702n0276j09359Q3998o4576m9931R4961M8378
757g790Q9314M7862k5996l0966j6812j02411j6237J2953M4090k5110L9557j451
745G003r2502k0359J10332o088N5646k3323p0890M6633P2370j0362p999N6816
733A17277R752n5275j28795N9621N0232r9529N1259n609n963P4762o2127r3457
$$ plain form
721 -87852 -71625 98878 86807 64013 -22455 -58656 -59630 -29468 22537 91005 -30274 -72180
709 -72180 -49024 -102178 43432 -36891 8870 -14529 46322 49203 -376 44364 51857 34419
697 34419 12760 -14619 -68923 32388 60471 86411 22101 -92808 -12920 40543 -77494
686 -77494 18262 -64461 -59756 -9006 32159 37967 -25630 2529 2631 -53230 -98659 -145809 -171271
673 -171271 -19005 43131 77650 58890 43816 -30906 316 -10290 -66721 -43469 -18612 -66822
661 -66822 -90785 -34766 -75826 -32957 50732 83856 -59218 -27833 128220 108722 10774 -1998
649 -1998 37342 -14082 5075 9283 -38087 -30172 -72938 -40287 -65832 23503 10908 9908 20046
636 20046 99764 78463 64541 -16109 -89035 -23346 -11950 22331 6855 62216 59866 36572
$$ packed form
721h7852J6227J70503j2071k2794q6468l6201r74L0162N2005O8468j21279m1906
709g2180K3156n3154J45610q0323M5761k3399O0851K881m9579M4740P493j7438
697C4419k1659k7379n4304J01311K8083K5940o4310j14909P9888N3463j18037
686g7494R5756q2723M705N0750M1165N808o3597K8159J02n5861m5429m7150k5462
673a71271J52266O2136L4519j8760j5074p4722L1222j0606n6431K3252K4857m8210
661f6822k3963N6019m1060M2869Q3689L3124j43074L1385J56053j9498r7948j2772
649a998L9340n1424J9157M208m7370P915m2766L2651k5545Q9335j2595j000J0138
636B0046P9718k1301j3922q0650p2926O5689J1396L4281j5476N5361k350k3294
$$ plain form
624 36572 -16643 -41491 -32296 -68209 30638 46854 -23835 13130 30888 -17606 13308 19431
612 19431 -61266 -49405 -15241 110204 -4140 24921 2797 7856 8175 11058 65139 -45353
600 -45353 -21007 25488 -46913 11186 68357 89954 91328 166926 72145 -90650 -66393 27987
588 27987 6225 -2267 29337 36619 37329 -55872 24530 16797 -99786 -111812 13235 -27660 -18911
575 -18911 26115 -55571 -84906 -12853 80510 -17105 -6346 83185 82712 56510 -108 71409
563 71409 129536 76250 -20251 -26029 -910 22725 1868 7351 82824 28334 27244 -55009 -94050
550 -94050 -87053 -9423 28367 61363 69651 55365 -4687 42305 103231 71490 133181 75402
538 75402 42524 50114 -37482 67033 94665 -5836 11769 -39028 48752 23975 -38441 41647
$$ packed form
624C6572n3215k4848R195l5913R8847J6216p0689L6965J7758m8494L0914O123
612A9431q0697J1861L4164J25445j14344K9061k2124N059L19K883N4081j10492
600d5353K4346M6495p2401N8099N7171K1597J374P5598r4781j62795K4257R4380
588B7987k1762q492L1604P282P10r3201Q0402p733j16583j2026J25047m0895Q749
575a8911M5026q1686k9335P2053R3363r7615J0759Q9531m73k6202n6618P1517
563G1409N8127n3286r6501n778K5119K3635k0857N483P5473n4490j090q2253l9041
550i4050O997P7630L7790L2996Q288j4286o0052M6992O0926l1741O1691n7779
538G5402l2878P590q7596J04515K7632j00501J7605n0797Q7780k4777o2416Q0088
$$ plain form
526 41647 89527 16605 17247 77160 -5429 -26427 23513 19568 -7455 -29169 63227 81778 -5136
513 -5136 -63957 -117911 -20648 -30513 -40919 44533 7826 -49397 -46693 -3318 21516 164118
501 164118 114428 64606 47048 -4178 -1436 93235 85610 41924 50883 -9627 9112 34502
489 34502 58209 46370 54657 -3171 -118249 -50702 -76458 -26317 -4194 -16328 52954 57183
477 57183 24351 -104541 -110491 -18018 79974 -1780 -19858 -38777 -35333 82090 23617 -84485
465 -84485 -50740 -21226 -11779 37387 100406 117815 29310 32907 20826 16823 45494 96963 113792
452 113792 75960 46620 -2854 -66383 -25452 -60277 5601 59463 114408 64570 55381 34207
440 34207 -61267 17329 50520 -33122 -69433 -28841 7687 -46464 20818 74468 34007 54832
$$ packed form
526D1647M7880p2922O42N9913q2589k0998M9940l945k7023k1714R2396J8551q6914
513e136n8821n3954R7263r865j0406Q5452l6707n7223K704M3375K4834J42602
501A64118m9690m9822j7558n1226K742R4671p625m3686Q959o0510J8739K5390
489C4502K3707j1839Q287n7828j15078O7547k5756N0141K2123j2134O9282M229
477E7183l2832j28892n950R2473R7992q1754j8078j8919L444J17423n8473j08102
465h4485L3745K9514R447M9166O3019J7409q8505L597j2081m003K8671N1469J6829
452A13792l7832k9340m9474o3529M0931l4825O5878N3862N4945m9838r189k1174
440C4207r5474P8596L3191q3642l6311M0592L6528n4151O7282N3650m0461K0825
$$ plain form
428 54832 16172 79041 55155 -16796 -27910 -6618 -32563 -7816 3066 56415 86654 37772
416 37772 35195 53103 101992 79346 20235 -7885 -10283 15257 34339 31609 -73937 -24710
404 -24710 -14689 23608 43692 41558 58964 -51298 -146070 -73417 -46098 -23938 -60334 -58260
392 -58260 22846 59162 46242 -18681 -46002 11635 45509 45051 99472 73696 15284 -33997
380 -33997 58760 114230 57953 80266 152350 200643 119872 42910 24610 -14196 64564 139738
368 139738 85116 35458 3343 66767 8608 -48819 -6464 8813 15088 41728 -13132 -126632
356 -126632 -24103 45965 25545 108390 118733 17739 -17517 47167 28730 -41142 54517
345 54517 85451 -1130 44259 -39314 -92329 -12453 -37288 -114697 31117 -96268 -37351 29235
$$ packed form
428E4832l8660O2869k3886p1951j1114K1292k5945K4747J0882N3349L0239m8882
416C7772k577J7908M8889k2646n9111k8120k398K5540J9082k730j05546M9227
404b4710J0021L8297K0084k134J7406j10262r4772P2653K7319K2160l6396K074
392e8260Q1106L6316j2920o4923k7321N7637L3874m58N4421k5776n8412m9281
380c3997R2757N5470n6277K2313P2084M8293q0771p6962j8300l8806P8760P5174
368A39738n4622m9658l2115O3424n8159n7427M2355J5277O275K6640n4860j13500
356a26632J02529P0068k0420Q2845J0343j00994l5256O4684j8437o9872R5659
345E4517L0934q6581M5389q3573n3015P9876k4835p7409J45814j27385N8917O6586
$$ plain form
333 29235 17544 21663 -7229 21132 11255 20555 -5173 -89008 -53635 34708 -55417 -66157 -56461
320 -56461 29655 134057 210173 114341 12987 18853 96018 19110 52703 -21616 -34620 32930
308 32930 94597 15841 -5167 -85876 18475 107389 -12035 -30308 46109 14391 -5863 86384
296 86384 35378 -27896 57379 70678 53293 51420 62857 34562 -104832 -45522 26874 45414
284 45414 25472 18161 56182 58880 50155 6590 61464 -33638 -132048 -52460 29509 62647 15196
271 15196 -36456 -61482 38558 128401 92039 145254 102075 70171 45153 14721 -19346 -66293
259 -66293 -105215 -97110 -18426 -17791 38286 85413 14665 38619 116120 73467 -7091 229 33598
246 33598 36099 62659 39708 2047 -16054 -33625 30721 80281 -39012 22110 31352 101814
$$ packed form
333B9235j1691M119k8892K8361r877R300k5728q3835L5373Q8343r0125j0740R696
320e6461Q6116J04402P6116r5832j01354N866P7165p6908L3593p4319j3004O7550
308C2930O1667p8756k1008q0709J04351Q8914j19424j8273P6417l1718k0254R2247
296H6384n1006o3274Q5275J3299j7385j873J1437k8295j39394N9310P2396J8540
284D5414j9942p311L8021K698q725m3565N4874r5102r8410P9588Q1969L3138m7451
271A5196n1652k5026J00040Q9843l6362N3215m3179l1904k5018l0432l4067m6947
259f6293l8922Q105P8684O35N6077M7127p0748K3954P7501m2653q0558P320L3369
246C3598K501K6560k2951l7661j8101j7571O4346M9560j19293O1122R242P0462
$$ plain form
234 101814 188398 81254 -14263 -9355 -26096 -38099 82875 153646 175776 112644 71468 81751
222 81751 28260 -15163 12591 57397 96694 79161 -9373 23548 72641 37873 31056 9425
210 9425 -63808 -415 -17077 4868 -14429 -7665 -29126 27107 5472 100859 138961 96156
198 96156 37801 -36158 7691 39045 28806 -623 -31389 -26173 -58639 7808 -7157 7298
186 7298 59133 -19437 10217 5725 -32838 -75514 17848 110751 17371 58389 31652 66499
174 66499 53123 -80430 16672 49443 80739 95299 116508 164324 24076 -50463 15356 50589
162 50589 -316 53592 57366 56694 79921 39255 37938 -21408 14061 25827 20812 25411 5938
149 5938 1115 89086 52135 43086 48945 63532 20238 -13132 -40869 25789 38277 41062 11351
$$ packed form
234A01814Q6584j07144r5517M908j6741j2003J20974P0771K2130o3132m1176J0283
222H1751n3491m3423K7754M4806L9297j7533q8534L2921M9093l4768o817k1631
210I425p3233O3393j6662K1945j9297O764k1461N6233k1635R5387L8102m2805
198I6156n8355p3959M3849L1354j0239k9429l0766N216l2466O6447j4965J4455
186G298N1835p8570K9654m492l8563m2676R3362R2903r3380M1018k6737L4847
174F6499j3376j33553R7102L2771L1296J4560K1209M7816j40248p4539O5819L5233
162E0589n0905N3908L774o72K3227m0666j317n9346L5469J1766n015M599j9473
149E938m823Q7971l6951r049N859J4587m3294l3370k7737O6658J2488K785k9711
$$ plain form
136 11351 7876 20944 92096 87829 106682 121185 26910 -66163 17726 28869 68976 132442
124 132442 39842 -45536 89516 133869 60862 18709 2789 68709 73374 22424 -5056 -23963
112 -23963 35065 113312 44018 74026 69035 102487 155782 151691 93883 111735 54400 -11280
100 -11280 27527 134 8166 39255 50544 64804 22652 -18203 4627 16073 -52895 14188
88 14188 105881 64455 47646 117446 80157 7476 -46220 -8338 8059 -75995 -15529 38117
76 38117 -5934 14860 50356 -8050 12298 83081 149612 58295 3066 -5550 2248 55633 18514
63 18514 14752 43623 35386 10784 17961 21868 12163 -32413 5845 53634 106314 112433 129419
50 129419 16714 31225 46031 19886 36999 38174 28712 52385 37925 -46006 230 113525
$$ packed form
136A1351l475J3068P1152m267J8853J4503r4275r3073Q3889J1143M0107O3466
124A32442r2600q5378J35052M4353p3007m2153j5920O5920M665n0950k7480j8907
112b3963N9028P8247o9294L0008m991L3452N3295m091n7808J7852n7335o5680
100a1280L8807k7393Q032L1089J1289J4260m2152m0855K2830J1446o8968O7083
88A4188R1693m1426j6809O9800l7289p2681n3696L7882J6397q4054O0466N3646
76C8117m4051K0794L5496n8406K0348P0783O6531r1317n5229q616P798N3385l7119
63A8514l762K8871q237k4602P177L907r705m4576L8258M7789N2680O119J6986
50A29419j12705J4511J4806k6145J7113J175r462K3673j4460q3931M6236J13295
$$ plain form
38 113525 -4773 -37958 38710 -6591 48062 63591 54325 89777 85549 31548 28088 6981
26 6981 28775 -26738 12220 123922 129512 37146 65525 81933 70097 60638 121780 147977 79054
13 79054 70733 49159 108322 116075 31043 7027 61184 76576 37473 -21972 -10334 -49862 20804
0 20804
$$ packed form
38A13525j18298l3185P6668m5301N4653J5529r266L5452m228n4001l460k1107
26F981K1794n5513L8958J11702N590r2366K8379J6408j1836r459O1142K6197o8923
13G9054q321k1574N9163P753q5032k4016N4157J5392l9103n9445J1638l9528P0666
0B0804
$$ Imaginary data points
##PAGE= N=2
##DATA TABLE= (X++(I..I)), XYDATA
$$ plain form
16383 -2420588 -2401569 -2320741 -2299195 -2275278 -2277693 -2190800 -2185483 -2220346 -2122750 -2096402 -2058398 -2084488
16371 -2084488 -1965578 -1893683 -1900152 -1884296 -1867278 -1861371 -1740716 -1783082 -1811866 -1732855 -1673960
16360 -1673960 -1603323 -1560143 -1544978 -1508786 -1485038 -1381454 -1371301 -1359605 -1363558 -1355949 -1264872
16349 -1264872 -1296881 -1235218 -1123740 -1098201 -1118260 -1114859 -1163815 -1160869 -1005498 -950993 -944283
16338 -944283 -897830 -877866 -786669 -763668 -792369 -796944 -799569 -694752 -643222 -636156 -666363 -614562
16326 -614562 -521917 -508304 -436303 -434995 -337631 -314415 -433999 -318675 -259236 -249874 -224622
16315 -224622 -218165 -176356 -126523 -97161 -121637 -46660 2091 5070 37222 -5282 52275 85936
16303 85936 125953 197660 139056 137424 138684 237443 240642 172371 255205 370730 426638 511727
$$ packed form
16383b420588J9019Q0828K1546K3917k415Q6893N317l4863R7596K6348L8004k6090
16371b084488J18910P1895o469J5856J7018N907J20655m2366k8784P9011N8895
16360a673960P0637M3180J5165L6192K3748J03584J0153J1696l953P609R1077
16349a264872l2009O1663J11478K5539k0059L401m8956K946J55371N4505O710
16338i44283M6453J9964R1197K3001k8701m575k625J04817N1530P066l0207N1801
16326f14562R2645J3613P2001J308R7364K3216j19584J15324N9439R362K5252
16315b24622O457M1809M9833K9362k4476P4977M8751K979L2152m2504N7557L3661
16303H5936M0017P1707n8604j632J260R8759L199o8271Q2834J15525N5908Q5089
$$ plain form
16291 511727 479548 591499 552757 497846 536633 583317 613157 649809 627758 650468 653405
16280 653405 683941 727342 774684 762627 796537 828777 866325 920955 897710 907759 915942 968152
16268 968152 967688 1022302 1089732 1096388 1103694 1133791 1179327 1143932 1114128 1117593 1176706 1195125
16256 1195125 1182492 1221922 1223098 1287097 1346050 1373005 1379244 1411167 1452061 1536339 1493523 1537006
16244 1537006 1579214 1488489 1538242 1545438 1484295 1553373 1619413 1682063 1714143 1705025 1763930 1822629
16232 1822629 1721897 1709542 1797042 1874832 1869177 1925556 1949610 1936227 1866093 1858987 1830353
16221 1830353 1819477 1846217 1921051 1978308 2077019 2052366 1983406 1976229 2074140 2081290 1967041
16210 1967041 2071177 2092332 2069027 2050076 2080537 2063289 2076709 2126773 2137790 2149924 2111004
$$ packed form
16291E11727l2179J11951l8742n4911L8787M6684K9840L6652k2051K2710K937
16280F53405L0536M3401M7342j2057L3910L2240L7548N4630k3245J0049Q183N2210
16268I68152m64N4614O7430O656P306L0097M5536l5395k9804L465N9113J8419
16256A195125j2633L9430J176O3999N8953K6955O239L1923M0894Q4278m2816M3483
16244A537006M2208r0725M9753P196o1143O9078O6040O2650L2080r118N8905N8699
16232A822629j00732j2355Q7500P7790n655N6379K4054j3383p0134p106k8634
16221A830353j0876K6740P4834N7257R8711k4653o8960p177R7911P150j14249
16210A967041J04136K1155k3305j8951L0461j7248J3420N0064J1017J2134l8920
$$ plain form
16199 2111004 2092187 2165668 2267129 2224294 2289328 2290901 2252103 2301917 2266163 2143363 2176621
16188 2176621 2316056 2326397 2326356 2397931 2394872 2333486 2361627 2458659 2427571 2430193 2401748 2412114
16176 2412114 2425107 2415910 2400379 2311367 2411475 2490416 2458434 2588852 2574984 2529366 2549112
16165 2549112 2531827 2572694 2511914 2463032 2498738 2563329 2468266 2456929 2490532 2615232 2643056
16154 2643056 2569310 2521703 2551972 2585851 2598941 2643541 2693201 2638335 2648621 2633544 2563551
16143 2563551 2591038 2608858 2685332 2764857 2703417 2694244 2685424 2693336 2601088 2735667 2785914 2728986
16131 2728986 2860473 2821758 2776729 2845042 2784575 2714762 2647200 2617005 2699736 2745627 2738007
16120 2738007 2709244 2697362 2806203 2864312 2882042 2808737 2783893 2793272 2758415 2751633 2802704
$$ packed form
16199B111004j8817P3481J01461m2835O5034J573l8798M9814l5754j22800L3258
16188B176621J39435J0341m1P1575l059o1386K8141R7032l1088K622k8445J0366
16176B412114J2993r197j5531q9012J00108P8941l1982J30418j3868m5618J9746
16165B549112j7285M0867o0780m8882L5706O4591r5063j1337L3603J24700K7824
16154B643056p3746m7607L0269L3879J3090M4600M9660n4866J0286j5077o9993
16143B563551K7487J7820P6474P9525o1440r173q820P912r2248J34579N0247n6928
16131B728986J31487l8715m5029O8313o0467o9813o7562l0195Q2731M5891p620
16120B738007k8763j1882J08841N8109J7730p3305k4844R379l4857o782N1071
$$ plain form
16109 2802704 2823461 2815882 2849948 2850209 2819255 2839203 2868508 2941684 2869056 2780549 2791950 2795129
16097 2795129 2830974 2747491 2816216 2792397 2781058 2879850 2791753 2828245 2762832 2809209 2918135
16086 2918135 2887004 2906318 2897289 2942697 2903958 2870613 2807014 2819269 2870863 2865383 2944518 2991353
16074 2991353 2965237 2886024 2965858 3005865 2861229 2808580 2864443 2914204 2879588 2900116 2858166
16063 2858166 2918501 2950346 2864487 2806517 2892151 2909933 2914036 2850948 2798232 2728801 2956907
16052 2956907 3081487 3001240 2954755 2962521 2923579 2929657 2866608 2862960 2874172 2915810 3003509 2990724
16040 2990724 2940792 2885047 2792116 2841647 2911032 2916353 2832694 2813496 2836279 2907199 2909192 2937621
16028 2937621 2927599 2887329 2866687 2989799 2936833 2871199 2907023 2877080 2933053 2852874 2940336
$$ packed form
16109B802704K0757p579L4066K61l0954J9948K9305P3176p2628q8507J1401L179
16097B795129L5845q3483O8725k3819j1339R8792q8097L6492o5413M6377J08926
16086B918135l1131J9314r029M5408l8739l3345o3599J2255N1594n480P9135M6835
16074B991353k6116p9213P9834M0007j44636n2649N5863M9761l4616K0528m1950
16063B858166O0335L1845q5859n7970Q5634J7782M103o3088n2716o9431K28106
16052B956907J24580q0247m6485P766l8942O078o3049l648J1212M1638Q7699j2785
16040B990724m9932n5745r2931M9531O9385N321q3659j9198K2783P0920J993K8429
16028B937621j0022m0270k0642J23112n2966o5634L5824k9943N5973q0179Q7462
$$ plain form
16017 2940336 2864162 2953025 3118774 3072756 2946788 2852528 2778735 2842509 2852324 2966418 2865723
16006 2865723 2867870 2887642 2911487 2889111 3025374 3064621 2907011 2891735 2884200 2881129 2847678
15995 2847678 2866287 2870708 2786770 2852905 2920974 2990499 2908425 2891710 3026325 3015941 3028028
15984 3028028 3098408 3065040 3098344 3073389 3008161 2969967 2907044 2964080 2868490 2854747 2905900
$$ packed form
16017B940336p6174Q8863J65749m6018j25968r4260p3793O3774R815J14094j00695
16006B865723K147J9772K3845k2376J36263L9247j57610j5276p535l071l3451
15995B847678J8609M421q3938O6135O8069O9525q2074j6715J34615j0384J2087
15984C028028P0380l3368L3304k4955o5228l8194o2923N7036r5590j3743N1153
$$ [...]
##END NTUPLES=NMR SPECTRUM
##END=
