##TITLE=1H_TG-2351x
 DMSO
 8 sc, 
 2.06.2022
##JCAMPDX= 6.0         $$ Bruker NMR JCAMP-DX V2.0
##DATA TYPE= NMR SPECTRUM
##DATA CLASS= NTUPLES
##ORIGIN= UXNMR, Bruker Analytische Messtechnik GmbH
##OWNER= root
$$ XWIN-NMR		Version 3.5
$$ Thu Jun  2 14:39:02 2022 Russian Standard Time (UT+4h)  she@DPX200
##.OBSERVE FREQUENCY= 200.13135
##.OBSERVE NUCLEUS= ^1H
##.ACQUISITION MODE= SIMULTANEOUS
##.ACQUISITION SCHEME= undefined
##.AVERAGES= 8
##.DIGITISER RES= 18
##SPECTROMETER/DATA SYSTEM= spect
##.PULSE SEQUENCE= zg30
##.SOLVENT NAME= DMSO
##.SHIFT REFERENCE= (INTERNAL, DMSO, 0, 15.7634)
##AUDIT TRAIL= $$ (NUMBER, WHEN, WHO, WHERE, WHAT)
$$ ##TITLE= Audit trail, XWIN-NMR		Version 3.5
$$ ##JCAMPDX= 5.01
$$ ##ORIGIN= Bruker BioSpin GmbH
$$ ##OWNER= she
$$ F:/spectra/data/she/nmr/H-F/1/pdata/1/auditp.txt
$$ ##AUDIT TRAIL=  $$ (NUMBER, WHEN, WHO, WHERE, WHAT)
(   1,<2022-06-02 14:36:35.28 +0400>,<she>,<DPX200>,
      <created by zg, POWCHK disabled, PULCHK disabled
       configuration hash MD5:
       00 E9 B6 7A A2 85 ED C7 34 08 36 98 17 FE 4E 26
       data hash MD5: 16K
       01 F9 10 30 64 D0 B2 E2 12 3A E1 29 38 F7 18 E4>)
(   2,<2022-06-02 14:36:38.48 +0400>,<she>,<DPX200>,
      <Start of raw data processing
       efp BC_mod = 2 LB = 0.24 FT_mod = 6 PKNL = 1 PHC0 = -18047.46 PHC1 = 21.40074 SI = 16K 
       data hash MD5: 16K
       8C 44 2D 27 36 02 33 6F B9 97 DE BC FE 26 09 25>)
(   3,<2022-06-02 14:36:56.07 +0400>,<she>,<DPX200>,
      <pk PHC0 = -0.1296717 PHC1 = -4.4 
       data hash MD5: 16K
       41 B9 21 1F F7 81 DB EE EE 80 4C 06 A6 7A 36 24>)
(   4,<2022-06-02 14:38:14.29 +0400>,<she>,<DPX200>,
      <abs ABSG = 5 
       data hash MD5: 16K
       58 9C EB 65 3B B0 CC DC 9B 2B DE C6 6B 0B 5C 79>)
$$ ##END=
$$ 
$$ hash MD5
$$ BA 48 A9 86 A5 24 A9 AD AD 82 45 51 57 82 A9 78
##$RELAX= 
##$RELAX= 
##$RELAX= 
##$RELAX= 
##$RELAX= 
##$RELAX= 
$$ Bruker specific parameters
$$ --------------------------
##$DU= <F:/spectra>
##$EXPNO= 1
##$NAME= <H-F>
##$PROCNO= 1
##$TYPE= <nmr>
##$USER= <she>
##$AMP= (0..31)
100 100 100 100 100 100 100 100 100 100 100 100 100 100 100 100 100 100 
100 100 100 100 100 100 100 100 100 100 100 100 100 100 
##$AQSEQ= 0
##$AQ_mod= 1
##$AUNM= <au_zg>
##$AUTOPOS= <>
##$BF1= 200.13
##$BF2= 200.13
##$BF3= 200.13
##$BF4= 200.13
##$BF5= 200.13
##$BF6= 200.13
##$BF7= 200.13
##$BF8= 200.13
##$BYTORDA= 1
##$CFDGTYP= 0
##$CFRGTYP= 5
##$CHEMSTR= <none>
##$CNST= (0..31)
1 1 145 1 1 1 1 1 1 1 1 1 1 1 1 1 1 1 1 1 1 1 1 1 1 1 1 1 1 1 1 1 
##$CPDPRG= <>
##$CPDPRG1= <>
##$CPDPRG2= <>
##$CPDPRG3= <>
##$CPDPRG4= <mlev>
##$CPDPRG5= <mlev>
##$CPDPRG6= <mlev>
##$CPDPRG7= <mlev>
##$CPDPRG8= <mlev>
##$CPDPRGB= <>
##$CPDPRGT= <>
##$D= (0..31)
0 1.2 0 0 0 0 0 0 0 0.06 0 0.03 0 0 0 0 0.0002 0 0 0 0 0 0 0 0 0 0 0 0 
0 0 0 
##$DATE= 1654166194
##$DBL= (0..7)
120 120 120 120 120 120 120 120 
##$DBP= (0..7)
150 150 150 150 150 150 150 150 
##$DBP07= 0
##$DBPNAM0= <>
##$DBPNAM1= <>
##$DBPNAM2= <>
##$DBPNAM3= <>
##$DBPNAM4= <>
$$ [...]
##$SUBNAM2= <"">
##$SUBNAM3= <"">
##$SUBNAM4= <"">
##$SUBNAM5= <"">
##$SUBNAM6= <"">
##$SUBNAM7= <"">
##$SUBNAM8= <"">
##$SUBNAM9= <"">
##$SW= 18.05172834244
##$SWIBOX= (0..15)
0 0 2 0 0 0 0 0 0 0 0 0 0 0 0 0 
##$SW_h= 3612.71676300578
##$TD= 16384
##$TD0= 1
##$TE= 0
##$TE2= 300
##$TE3= 300
##$TEG= 300
##$TL= (0..7)
0 120 120 120 120 120 120 120 
##$TP= (0..7)
150 150 150 150 150 150 150 150 
##$TP07= 0
##$TPNAME0= <>
##$TPNAME1= <>
##$TPNAME2= <>
##$TPNAME3= <>
##$TPNAME4= <>
##$TPNAME5= <>
##$TPNAME6= <>
##$TPNAME7= <>
##$TPOAL= (0..7)
0.5 0.5 0.5 0.5 0.5 0.5 0.5 0.5 
##$TPOFFS= (0..7)
0 0 0 0 0 0 0 0 
##$TUNHIN= 0
##$TUNHOUT= 0
##$TUNXOUT= 0
##$USERA1= <user>
##$USERA2= <user>
##$USERA3= <user>
##$USERA4= <user>
##$USERA5= <user>
##$V9= 5
##$VALIST= <valist>
##$VCLIST= <CCCCCCCCCCCCCCC>
##$VD= 0
##$VDLIST= <DDDDDDDDDDDDDDD>
##$VPLIST= <PPPPPPPPPPPPPPP>
##$VTLIST= <TTTTTTTTTTTTTTT>
##$WBST= 1024
##$WBSW= 4
##$XGAIN= (0..3)
0 0 0 0 
##$XL= 0
##$YL= 0
##$YMAX_a= 334827
##$YMIN_a= -458399
##$ZGOPTNS= <>
##$ZL1= 120
##$ZL2= 120
##$ZL3= 120
##$ZL4= 120
##$ABSF1= 15.74248
##$ABSF2= -2.309369
##$ABSG= 5
##$ABSL= 3
##$ALPHA= 0
##$AQORDER= 0
##$ASSFAC= 0
##$ASSFACI= 0
##$ASSFACX= 0
##$ASSWID= 0
##$AUNMP= <proc_1d>
##$AZFE= 0.1
##$AZFW= 0.1
##$BCFW= 0
##$BC_mod= 2
##$BYTORDP= 0
##$COROFFS= 0
##$CY= -3
##$DATMOD= 1
##$DC= 0
##$DFILT= <>
##$DTYPP= 0
##$F1P= 0
##$F2P= 0
##$FCOR= 1
##$FTSIZE= 16384
##$FT_mod= 6
##$GAMMA= 0
##$GB= 0
##$INTBC= 1
##$INTSCL= 0
##$ISEN= 128
##$LB= 0.24
##$LEV0= 0
##$LPBIN= 0
##$MAXI= 10000
##$MC2= 0
##$MEAN= 0
##$ME_mod= 0
##$MI= 1.114404
##$NCOEF= 0
##$NC_proc= -6
##$NLEV= 6
##$NOISF1= 3.799351
##$NOISF2= 2.8
##$NSP= 0
##$NTH_PI= 0
##$NZP= 0
##$OFFSET= 15.76342
##$PC= 1
##$PHC0= -18047.59
##$PHC1= 17.00074
##$PH_mod= 1
##$PKNL= yes
##$PPARMOD= 0
##$PSCAL= 0
##$PSIGN= 0
##$REVERSE= no
##$SF= 200.130001625986
##$SI= 16384
##$SIGF1= 3
##$SIGF2= 2
##$SINO= 5.538805
##$SIOLD= 16384
##$SREGLST= <1H.CDCl3>
##$SSB= 0
##$STSI= 16384
##$STSR= 0
##$SW_p= 3612.71676300578
##$SYMM= 0
##$S_DEV= 0
##$TDeff= 16384
##$TDoff= 0
##$TI= <>
##$TILT= no
##$TM1= 0
##$TM2= 0
##$TOPLEV= 0
##$USERP1= <user>
##$USERP2= <user>
##$USERP3= <user>
##$USERP4= <user>
##$USERP5= <user>
##$WDW= 1
##$XDIM= 16384
##$YMAX_p= 301586378
##$YMIN_p= -450100
$$ End of Bruker specific parameters
$$ ---------------------------------
##NTUPLES= NMR SPECTRUM
##VAR_NAME=  FREQUENCY,     SPECTRUM/REAL,   SPECTRUM/IMAG
##SYMBOL=    X,             R,               I
##VAR_TYPE=  INDEPENDENT,   DEPENDENT,       DEPENDENT
##VAR_FORM=  AFFN,          ASDF,            ASDF
##VAR_DIM=   16384,         16384,           16384
##UNITS=     HZ,            ARBITRARY UNITS, ARBITRARY UNITS
##FACTOR=    0.220516191357247, 1,           1
##FIRST=     3154.73329124084, 0,            0
##LAST=      -457.983471764938, 0,           0
##MIN=       -457.983471764938, -450100,     0
##MAX=       3154.73329124084, 301586378,    0
$$ Real data points
##PAGE= N=1
##DATA TABLE= (X++(R..R)), XYDATA
$$ [...]
9652I818l5082k7568J02341q018K7168p100J4993L3745l8822K9539Q221l1518
9640G7717P3604o245J908l1702j46223M5542J4257J29512K5985n4492M4412n9269
9628A15006M53p3317K2778n0186J1340m0463J04294N3202k7685q0395l8411R669
9616F285q305p879k7990R8251j8209j19459J8402J12974n4057m4148K6048J7906
9604a81M6072J6399j6742j01566l3150O5566J26173k5123n261J7243j46803N2806
9592d567R8386m591m0204Q2017O5507P198j55811l0925J4135m9122k4481k114
9580d4572N8066j5877K1824J22570K1579q0676M1591l5764o265K5171o204l3121
9568F8322l9115m9610K7916R6530k3359J6896J9302L9184r3737k0099N1556m8804
$$ plain form
9652 9818 -25264 -52832 49509 41491 68659 61559 76552 110297 71475 101014 109235 77717
9640 77717 151321 145076 146984 115282 -30941 14601 28858 158370 184355 129863 174275 115006
9628 115006 115459 42142 64920 14734 26074 -14389 89905 143107 115422 35027 -3384 6285
9616 6285 -2020 -9899 -37889 60362 42153 -77306 -58904 54070 13 -44135 -18087 -181
9604 -181 45891 62290 45548 -56018 -89168 -23602 102571 77448 72187 89430 -57373 -4567
9592 -4567 93819 89228 49024 131041 196548 203746 47935 17010 31145 -17977 -42458 -44572
9580 -44572 13494 -2383 19441 142011 163590 82914 124505 88741 82476 107647 101443 68322
9568 68322 29207 -20403 7513 104043 80684 97580 116882 156066 62329 42230 93786 44982
9556D4982j45018J06588N0489Q6850L321k627P5652n6099o7158L7538n4864l1591
9544D8063M3646m6536P5642n0929o3390K2261L6266M8518k5461o2637k0429N3685
9532E8699k7902m8745n0492m0207M803p199l7053N2593P3430K2729l3860Q3564
9520E0360K9577M3742P2286r2723K9531j15747k7213m3914M0416P9215m7556M9522
9508F7496M2521l6727J4666q5343J09208M6984p7934M4428j2235j5909O7844m2250
9496A22749m3557N4340m198p8480j591k0821k7724N0161J364Q5100l877k6847
9484A06619l15k9682Q5569l7038N0203L5696j35359J965o7310O2101l0939N1848
9472I3358O1290m4197k3934n0236k0680j3201j1796P6536N238J9597O8854O045
$$ plain form
9556 44982 -100036 6552 57041 143891 147212 144585 220237 164138 96980 134518 79654 48063
9544 48063 91709 45173 120815 69886 6496 28757 65023 113541 88080 25443 5014 58699
9532 58699 30797 -17948 -68440 -108647 -103844 -111043 -148096 -95503 -22073 656 -33204 50360
9520 50360 79937 123679 195965 103242 132773 17026 -10187 -54101 -13685 65530 17974 67496
9508 67496 110017 73290 87956 2613 111821 158805 80871 125299 113064 97155 164999 122749
9496 122749 79192 133532 129334 50854 49263 28442 718 50879 52243 137343 133466 106619
9484 106619 106304 76622 162191 125153 175356 211052 75693 77658 10348 72449 41510 93358
9472 93358 154648 110451 86517 36281 15601 2400 -9396 67140 72378 91975 160829 166874
9460A66874j00897k5921J19030j07671K753O4301J126J27985r2632P517Q6679
9449B49144j29421n694n5009k6495J611L9525p6355O83o746P3313K6392j31046
9437d0098P9443R1785L2756J462k0950o5975r6522m91J2272O3003M8465j33117
9425b7967j13571J02629L3213L3663N3850n4988K5428j3773O1545N5182J6640
9414A71851P7794j18401j7245J6302K4586o9314l4195L1362n5439R734K8097j1344
9402E3788k881J05780l2824L5742R833o6730O2230L5321j21224M8698k7480n0915
9390D9338P0864k2093k7013J4682m273M2924M8463l7415m3748l7264M1818J43408
9378B39691K4506j14905q3461N6296M0582o8837l7964K314K0589L5698n7074o1547
$$ plain form
9460 166874 65977 40056 159086 51415 54168 118469 119595 247580 154948 162465 249144
9449 249144 119723 114029 59020 32525 34136 73661 -2694 -2011 -8757 64556 90948 -40098
9437 -40098 39345 131130 163886 165348 144398 78423 -18099 -18590 -6318 56685 105150 -27967
9425 -27967 -141538 -38909 -5696 27967 81817 26829 52257 38484 100029 155211 171851
9414 171851 249645 131244 113999 130301 154887 85573 51378 82740 27301 37035 65132 53788
9402 53788 50907 156687 123863 159605 169438 102708 164938 200259 79035 127733 100253 49338
9390 49338 120202 98109 71096 85778 81505 124429 172892 135477 91729 54465 96283 239691
9378 239691 264197 149292 65831 122127 162709 93872 55908 58222 78811 114509 57435 -4112
9366d112j0810N5546O3003k1253m1634m2496Q7028J58270m6654n2260N9559j8173
9354A86014o763n8716L2770J01003K4296l7310Q9938o2930j40818M2106m6923
9343A22667J07729Q2784m411o320n9965O4787O3972K4890m330j7232M909n6786
9331C22694Q361K0567j2121j3794L8835j1883m1227R086J5699n7162j26787p408
9319A44860J22575m3745n4408Q5238k097r1004M1070J9544J0886P2155J9446O8141
9307C92661j62620k4158L6883L9359Q0696r4394k597L0367k9925J6311L8080J79447
9295E00110R725j21432j2194j28455q7081L0989j599M2040O6379m2149M6178j7683
9283B84828q3239j8863L2321r546L3786K7755m5882K3958p4749k7867K7180k7348
$$ plain form
9366 -4112 -14922 40624 103627 82374 40740 -1756 85272 243542 196888 144628 204187 186014
9354 186014 179251 120535 153305 254308 278604 241294 331232 268302 127484 169590 122667
9343 122667 230396 313180 308769 302449 242484 307271 371243 396133 391803 374571 379480 322694
9331 322694 331055 351622 339501 325707 364542 352659 311432 320518 336217 279055 152268 144860
9319 144860 267435 223690 169282 254520 252423 161419 202489 222033 232919 305074 324520 392661
9307 392661 230041 205883 242766 282125 362821 268427 265830 296197 266272 282583 320663 500110
9295 500110 509835 388403 376209 247754 160673 191662 190063 232103 298482 256333 302511 284828
9283 284828 201589 182726 215047 205501 239287 267042 221160 245118 170369 142502 169682 142334
9271A42334j4327J080k5871n83L3448L6137P297J4642P6646j22435r8976N1802
9259A01194J76653R6516l8666p8553J4013o2663M5478n5813o6293J05677m0483
9248A97060J4983J5078m0537l4419N6866J8628P3814L7459K3832m5148j07475
9237B10141m1121K6820j0335j1399J14256L1085j16474j2639J4444k1061k7303
9226A56414j6979m3456K06603n1789p3478N2572L5136L6321l8361k3013K7808
9215B67778l9251n0351N6936m4363P8685O6062J1975o6219j07987N3861N5239
9204B82365R5261P0047J1138k2728l7311K2306J01138r1440m9780L5336o6324
9193C50008r3671N8332M372K2193M8301m110K3073m5559P587R680o8695M2689
$$ plain form
9271 142334 128007 129087 103216 102633 136081 172218 179515 194157 270803 148368 49392 101194
9259 101194 277847 374363 335697 257144 271157 208494 253972 198159 131866 237543 197060
9248 197060 212043 227121 186584 152165 209031 227659 301473 338932 362764 317616 210141
9237 210141 169020 195840 185505 174106 288362 319447 202973 190334 204778 183717 156414
9226 156414 139435 95979 302582 250793 177315 229887 265023 301344 262983 239970 267778
9215 267778 228527 178176 235112 190749 269434 335496 347471 281252 173265 227126 282365
9204 282365 377626 447673 458811 436083 398772 421078 522216 430776 380996 416332 350008
9193 350008 256337 314669 319041 341234 389535 385425 408498 362939 370526 380206 311511 354200
9181C54200P2270J2699L3027o3318M2628m5653J4473j1858M296l5476j3319N0171
9169D14140R6257j44846K8030N7941m534q1472M2457O8762o9012M651Q013j12800
9157C07587J35015q350k4258O0379M0212M8228M5061k7377l9961J09728j8210
9146F28054m0447j8099J7426J6537J9728p8653l2173L1418K7242M4171M2024j0909
9134F46319n1373O7682P5050j41331p569M7240M213l8184r503o091O9728R0740
9122G46921K2370m1438O1386K9488n8075m2102M0476n711N7800L3921j0623n0251
9110G84162P9470o3604o4019Q3456O2466M1501j9628K654R0695m4483K0975P0978
9098A044623M3604k6343l900N3514k8068q5671k5414K14656l2263k425R1357p77
$$ plain form
9181 354200 426470 439169 472196 408878 451506 405853 420326 408468 412764 377288 363969 414140
9169 414140 510397 365551 393581 451522 446988 365516 407973 476735 407723 412374 420387 307587
9157 307587 442602 434252 409994 470373 510585 558813 603874 576497 536536 646264 628054
9146 628054 587607 569508 586934 603471 623199 544546 512373 543791 571033 615204 657228 646319
9134 646319 594946 662628 737678 596347 588778 636018 640231 602047 592544 586453 656181 746921
9122 746921 769291 727853 789239 818727 760652 718550 759026 753315 811115 845036 834413 784162
9110 784162 863632 800028 736009 819465 881931 923432 903804 906458 997153 952670 973645 1044623
9098 1044623 1088227 1061884 1057984 1111498 1083430 997759 972345 1187001 1154738 1152313 1243670 1242893
9086A242893N4578p4230n8234N5316n1039O4780j3520J08160j374o8960J13312
9075A371682N3164k9815L1772L402M833R3198k799J5295R4893P7086R046K6133
9063A747890k8171l4637k2533O5984Q2622q596M9841M7337J7944O4754M6172Q2062
9051B110669P3130P7044r3959K1292P3768J00544R1986P6099J04746O5884J0958
9040B712161Q8346j0530K6914l7166J9630J68088Q1728M0563O9167L8576R4356
9029C291833J63494M6924J35248o888J15763J19444Q7757N7731J79018L914J72289
9018D366527Q7763L7465J55600P9506J76210J68840J10539J62151K71060J64851
9008E780512J31000J77716J33475K22576J88622K48454L02318J63614K50398K47211
$$ plain form
9086 1242893 1297471 1223241 1165007 1220323 1169284 1234064 1220544 1328704 1327330 1258370 1371682
9075 1371682 1424846 1395031 1426803 1430205 1435038 1528236 1525437 1540732 1635625 1712711 1721757 1747890
9063 1747890 1719719 1685082 1662549 1728533 1811155 1802559 1852400 1899737 1917681 1982435 2028607 2110669
9051 2110669 2183799 2260843 2166884 2188176 2261944 2362488 2454474 2530573 2635319 2701203 2712161
9040 2712161 2800507 2789977 2816891 2779725 2799355 2967443 3049171 3089734 3158901 3197477 3291833
9029 3291833 3455327 3502251 3637499 3630611 3746374 3865818 3953575 4011306 4190324 4194238 4366527
9018 4366527 4454290 4491755 4647355 4726861 4903071 5071911 5182450 5344601 5615661 5780512
9008 5780512 5911512 6089228 6222703 6445279 6633901 6882355 7184673 7348287 7598685 7845896
8998G845896K75238K85685L45572L40026M55847M27711L66552M17929M77618N38574
8988A1776648O39542O99485O60249P25069Q62936J021952J036972J062787J148108
8979A9633748J147340J317611J327193J453618J507478J702232J997107K216392
8971C2302719K342372K044292J701666J106672L11263o30050j158704j631182
8963C6389048j607456j438889j152683j150863j083082r37319r01126q08434q29828
8954B6479368p48807m86521j31207j42278N0679K66411L44241N86535P27734Q57851
8944B7804006R66098J107303J204189J366461J536111J571890J315811J296736
8936C8168605J429288J456600J630803J786038J673693J043688M68463n44017
$$ plain form
8998 7845896 8121134 8406819 8752391 9092417 9548264 9975975 10342527 10760456 11238074 11776648
8988 11776648 12416190 13115675 13775924 14500993 15363929 16385881 17422853 18485640 19633748
8979 19633748 20781088 22098699 23425892 24879510 26386988 28089220 30086327 32302719
8971 32302719 34645091 36689383 38391049 39497721 39808984 39178934 38020230 36389048
8963 36389048 34781592 33342703 32190020 31039157 29956075 29018756 28117630 27309196 26479368
8954 26479368 25730561 25244040 25112833 24970555 25021234 25287645 25631886 26218421 26946155 27804006
8944 27804006 28770104 29877407 31081596 32448057 33984168 35556058 36871869 38168605
8936 38168605 39597893 41054493 42685296 44471334 46145027 47188715 47657178 47113161
8928D7113161j742338k738583l114997l249632l127413k638294k261126j951617
8920B6289161j632984j493995j297935j138623j090326j106687j016918r25359
8912A6586334r12316p75011o77243n07831o09036n75878n25612n00067m81444
8903A1021896n34407m87998l88229l57820m15666m58774m54786l18708m04881
8894G200627k63396l21111l15449l67779j38786j02695k31411j42911j94483j53115
8884D969491j89018k70542j26426m1574j68996j87123n0935j09071j32316j45570
8874C547920m6535m2405o0303l9247r5569j48340j30171o2115j17622n4347J5365
8863B766631q0328k7782J2380j18990j08139j9522O0531n7950K4369j7390j43470
$$ plain form
8928 47113161 45370823 42632240 39517243 36267611 33140198 30501904 28240778 26289161
8920 26289161 24656177 23162182 21864247 20725624 19635298 18528611 17511693 16586334
8912 16586334 15674018 14899007 14221764 13713933 13104897 12529019 12003407 11503340 11021896
8903 11021896 10487489 9999491 9611262 9253442 8837776 8379002 7924216 7605508 7200627
8894 7200627 6937231 6616120 6300671 5932892 5794106 5691411 5460000 5317089 5122606 4969491
8884 4969491 4780473 4509931 4383505 4341931 4172935 3985812 3934877 3825806 3693490 3547920
8874 3547920 3501385 3458980 3398677 3359430 3263861 3115521 2985350 2923235 2805613 2751266 2766631
8863 2766631 2686303 2658521 2670901 2551911 2443772 2424250 2484781 2426831 2451200 2433810 2290340
8852B290340q7519k4122n5879K2794m069n8783p4590M5601n8699k4533K65n0572
8840A920234J1781K1552Q381q5660O02o7248j6694j6428n9050L9439O8609l6872
8828A788646j72128q923j04411l6023K3160K6149O378M880J4702j01305j0568
8817A430557J24500N2844k9220P2076l7537R860k994P1605l8584R604Q0079k9248
8805A713542o9053l740L0434l1367N2651j8916L2331k4624J363N4309l8376j00405
8793A598149m0500N7209O7064M1832N9866j38541K7211J15774R3522M666j14228
8782A772024J30176J04650j00082L2740Q8683K0506M1753J2909j18558O0886L2292
8771B077979j900R3139J1571k4942L884J35292J05398N7507J7602M6249J32456
$$ plain form
8852 2290340 2202821 2178699 2122820 2145614 2141545 2082762 2008172 2053773 1995074 1970541 1970806 1920234
8840 1920234 1932015 1953567 1961948 1876288 1876890 1809642 1792948 1776520 1717470 1756909 1825518 1788646
8828 1788646 1616518 1607595 1503184 1467161 1490321 1516470 1522848 1527728 1542430 1441125 1430557
8817 1430557 1555057 1607901 1578681 1650757 1613220 1623080 1620086 1691691 1653107 1662711 1742790 1713542
8805 1713542 1644489 1640749 1671183 1639816 1692467 1673551 1705882 1681258 1682621 1736930 1698554 1598149
8793 1598149 1557649 1614858 1681922 1723754 1783620 1645079 1672290 1788064 1881586 1886252 1772024
8782 1772024 1902200 2006850 1906768 1939508 2028191 2048697 2090450 2103359 1984801 2045687 2077979
8771 2077979 2076079 2169218 2180789 2155847 2159731 2295023 2400421 2457928 2475530 2521779 2654235
8760B654235k6940n913M6608l832J42364M1922J06432P2648J11808L7109J7378
8749C193819j0784J49884J40059Q1103R9120N133p831R9527Q0200Q7355M0415
8738C958000M4867J43571J70797J31075J18126J79235J18117J36604m288K41913
8728E238017J45202J00626N6311K62106K49008J90704K01004K43618J96990K12789
8718G096375L19318K44775K39576K03726L21468M37380L23919M23197N17317L15642
8708A0442693L75870N74796N54728M94591N18775O86499P59088P59420R58093
8699A6124553R12185Q90172J016936J199161J157886J404182J368861J509438
8691B5583374J720478J654504J756711K016090K170455K256788K281973K273690
$$ plain form
8760 2654235 2627295 2621382 2667990 2664158 2806522 2848444 2954876 3027524 3139332 3176441 3193819
8749 3193819 3183035 3332919 3472978 3554081 3653201 3658334 3650503 3750030 3830230 3917585 3958000
8738 3958000 4002867 4146438 4317235 4448310 4566436 4745671 4863788 5000392 4996104 5238017
8728 5238017 5383219 5483845 5540156 5802262 6051270 6241974 6442978 6686596 6883586 7096375
8718 7096375 7415693 7660468 7900044 8103770 8425238 8862618 9186537 9609734 10127051 10442693
8708 10442693 10818563 11393359 11948087 12442678 12961453 13647952 14407040 15166460 16124553
8699 16124553 17036738 17926910 18943846 20143007 21300893 22705075 24073936 25583374
8691 25583374 27303852 28958356 30715067 32731157 34901612 37158400 39440373 41714063
8683D1714063J814372J282782O31688r9182p00595j429737j714425j787091j881011
8674C7830864j727831j703771j473134j324787j279363j247363j150695r24876
8666B6999044p85226o93773m86111l41930p7835N5799K27473K49444M71706N48023
8656B6166614Q10150R39055R17216J066857J010039J252024J096628J170705J150283
8647C5579571R89401P97255O77141K01686k33591p80373j301388j746054k031352
8638C2152296k272040k245080k061625j918595j675951j457094j349375j233446
8630A7939090j036866j008806r45658r01191p51972p82811n47664n31434n17011
8621A0915677m37024m52924l63861l44300l56009k43005k39494k84072k30420
$$ plain form
8683 41714063 43528435 44811217 45442905 45343723 44643128 43213391 41498966 39711875 37830864
8674 37830864 36103033 34399262 32926128 31601341 30321978 29074615 27923920 26999044
8666 26999044 26213818 25520045 25033934 24692004 24614169 24669968 24897441 25146885 25618591 26166614
8656 26166614 26976764 27915819 28833035 29899892 30909931 32161955 33258583 34429288 35579571
8647 35579571 36568972 37366227 38043368 38245054 38011463 37231090 35929702 34183648 32152296
8638 32152296 29880256 27635176 25573551 23654956 21979005 20521911 19172536 17939090
8630 17939090 16902224 15893418 14947760 14046569 13294597 12511786 11964122 11432688 10915677
8621 10915677 10478653 10025729 9661868 9317568 8961559 8718554 8479060 8194988 7964568
8612G964568j87745k43302j49602j45583k40387j12613l58944k73247k19467j50782
8602E882896l16518j77396j51392k78806k80653j27986j13872j57402j73327j36750
8592C968794j27713j90229j42024o0615j73347j08016m0409j69999j99894j9423
8582B737125n489K6704r7016j49202p305Q7673j64623l15346O0029m9012r1211
8571B032327j11310j212l4457K9759j49717j1829J3306j67890J5671M3012N0413
8560A708073L5019j20623r2119k0444j35624q997R0353k7069j56886J9351L0808
8549A321842o9175n3332M992p1508q3139L0894j03487q5524P296J7759j2016N5577
8537I60179j10558k6943P6361J2189p017n8091k1538L6332o8665l6815l346j15681
$$ plain form
8612 7964568 7776823 7533521 7383919 7238336 6997949 6885336 6526392 6253145 6033678 5882896
8602 5882896 5566378 5388982 5237590 4958784 4678131 4550145 4436273 4278871 4105544 3968794
8592 3968794 3841081 3650852 3508828 3448213 3274866 3166850 3126441 2956442 2756548 2737125
8582 2737125 2731636 2758340 2661324 2512122 2504817 2592490 2427867 2112521 2172550 2123538 2032327
8571 2032327 1921017 1919805 1885348 1915107 1765390 1753561 1766867 1598977 1614648 1657660 1708073
8560 1708073 1743092 1622469 1530350 1509906 1374282 1365285 1455638 1428569 1271683 1291034 1321842
8549 1321842 1252667 1199335 1204327 1132819 1049680 1080574 977087 891563 898859 916618 904602 960179
8537 960179 849621 822678 899039 911228 904211 846120 824582 860914 792249 755434 752088 636407
8525F36407J9363L9810q4395j6996l5383n885R805O0314k8821M244M0503l6289
8513F02677K5136J7811j70384j217P212k0160p2500j3917m4617j2193J4257j0076
8501C22029J5831o77Q3888k3428p4093L612k7271p5624Q1688J1759l6104k2178
8489B59432L3339k0867Q0441k5180O2556N7950k20497r5526M813N9195J5688L8301
8477B49645j9478j32467M0059R1186r7502j24622L4564K8944J48368l5190L1238
8466B14745N815n4004j6523R1684n1552n6822K4069N3960N196P6147r2371r5927
8454A04417J9720n1739M2000j7310R504l0786k5836m4749Q0596P8698k5635p1549
8442F7331m1716J23413K3262j31686O94O9110J0869L4002Q4078m0749j59493J0283
$$ plain form
8525 636407 655770 695580 611185 594189 558806 552921 562726 623040 594219 598463 638966 602677
8513 602677 627813 645624 475240 474023 481235 461075 388575 374658 330041 317848 332105 322029
8501 322029 337860 337183 421071 397643 323550 327162 299891 224267 305955 317714 281610 259432
8489 259432 292771 271904 352345 327165 389721 447671 227174 131648 136461 195656 211344 249645
8477 249645 230167 97700 137759 228945 131443 6821 41385 70329 218697 183507 214745
8466 214745 220560 166556 150033 241717 190165 133343 157412 211372 216568 292715 200344 104417
8454 104417 124137 72398 114398 97088 106592 75806 49970 5221 85817 164515 138880 67331
8442 67331 25615 149028 172290 40604 41298 110408 121277 155279 239357 198608 39115 49398
8430D9398J0458k7175M2336j9500p2738N7618J5997k9325J03400j32929P1682
8419F9222j7309r0874K8205K5725p6094Q4867k828l1064N2492J6993R537o8682
8407A90P395j0846J04724n7111J5481o725q481M5981L005m8424k8181O0623n38
8394G7093m613q1593n0206n4329J02727p343P2246j7022p3124k1381K639J44090
8382H9184j1046k5781j0140O5327L9371q8464o5534P2849o9490q4347Q0277j397
8370i191K4395p2762L357Q8671K2424j951M0317K9127M280q4045l3348l2389r4214
8357a15329N8473O3361l6733m0078j8206k0112l5558M5201L6414P102J17480J8007
8345H0022r1513j28241M3565K6900M5490p2291J6666J15404j4949K1979n7793
$$ plain form
8430 49398 59856 32681 75017 55517 -17221 40397 56394 27069 130469 -2460 69222
8419 69222 51913 -38961 -10756 14969 -61125 23742 20914 -10150 42342 59335 68872 190
8407 190 7585 -3261 101463 44352 59833 53108 44627 90608 93613 45189 17008 77631 77093
8394 77093 72480 -9113 -59319 -113648 -10921 -18264 53982 36960 -36164 -57545 -54906 89184
8382 89184 78138 52357 42217 107544 146915 58451 -7083 65766 -3724 -88071 -7794 -9191
8370 -9191 15204 -57558 -54201 34470 56894 54943 95260 124387 128667 44622 11274 -21115 -115329
8357 -115329 -56856 6505 -30228 -70306 -88512 -108624 -144182 -98981 -62567 -55465 62015 80022
8345 80022 -11491 -139732 -96167 -69267 -23777 -96068 -79402 36002 21053 43032 -14761
8334a4761l9321P5389J05587m4862J6326N2536m9390K8903J3750m1999j4960Q4966
8322A72164m4089N4564k6618n3414j2029q869O7971M3895n4283k628j6130l8342
8310H2192O7711m0012P1412J577j04619j3118J1981k2432p3531J1568j19J27353
8298A19963j5884L169J605n7846J00468M0140k728j02864q3961m0118M7299L0347
8286C9590J5713Q905n4008L1942J39075r2976l3498n273J2796O6731L262j34664
8274b405p0447L9790Q0293M532N396L6732o3106O1000J1940l6859n5386m0648
8262b9168l8281Q343j02214K1613j976R1790o9895M1830J02192r1588P1177k7319
8250b3496k4334m5011q8664P2274P6086p9349j1555J11955K8250j52165J6401
$$ plain form
8334 -14761 -54082 21307 126894 82032 98358 150894 101504 130407 144157 102158 87198 172164
8322 172164 128075 182639 156021 102607 90578 81709 149680 193575 139292 136664 120534 82192
8310 82192 149903 109891 181303 182880 78261 65143 77124 54692 -18839 -7271 -7390 119963
8298 119963 104079 107248 108853 51007 151475 191615 188887 86023 2062 -38056 9243 39590
8286 39590 55303 64208 10200 42142 181217 88241 54743 49470 62266 128997 132259 -2405
8274 -2405 -72852 -33062 47231 51763 57159 93891 30785 91785 103725 66866 11480 -29168
8262 -29168 -67449 -59106 -161320 -139707 -141683 -49893 -119788 -77958 24234 -67354 3823 -23496
8250 -23496 -47830 -92841 -181505 -109231 -33145 -112494 -124049 -12094 16156 -136009 -119608
8239a19608R2044J654m9225q5367p9989O7721J30199j5134J1652l0433j35612
8228b12098J39868J33413l551n6355o6147J3692N9746k1438j0231m628o4825R727
8216h2827l9310j2488P6864J5308o4504J0534M0690J6119j18538n341L2054q426
8204a39865M7763J2379l4422r737M0604J4521l1107j08078J7568J28870o8607
8193a30111j42698L24455l6838q0387l0036K4813Q4367o3595k7455O2865l391
8182a8011M6545k1756m8953M5309L106o0281J1303N4617l6329N9187N4343n7628
8170C1452q1888n2902p6557Q0397J2107O2231l8145l621K096L0704m7748L7555
8158d4319N7620k0270o2375o0069J32174J6478j4662m1959k8012j354j08716M3841
$$ plain form
8239 -119608 -27564 -25910 -75135 -160502 -240491 -172770 -42571 -57705 -46053 -76486 -212098
8228 -212098 -72230 61183 57632 1277 -64870 -51178 8568 -12870 -23101 -27729 -92554 -82827
8216 -82827 -122137 -134625 -57761 -42453 -106957 -96423 -55733 -39614 -158152 -163493 -131439 -139865
8204 -139865 -92102 -79723 -114145 -123882 -83278 -68757 -99864 -207942 -190374 -61504 -130111
8193 -130111 -272809 51646 14808 -65579 -95615 -70802 13565 -50030 -77485 -14620 -18011
8182 -18011 28534 6778 -42175 3134 6240 -54041 -42738 11879 -24450 34737 89080 31452
8170 31452 -50436 -103338 -179895 -99498 -87391 -25160 -63305 -66926 -64830 -34126 -81874 -44319
8158 -44319 13301 -6969 -69344 -129413 2761 19239 4577 -37382 -65394 -66748 -175464 -131623
8146a31623Q7601K9663m0735J2920n3487K495J03948r5642K9308J19386p0284
8135f450o6778j536j07205L8755N7763L2370r7427j0968J19411r9314l4806J28686
8123d7499J2350L4631p1486k309J18008l165q7170o3359N7970J8740k7714k8856
8111h9859P1668K1903j8027m5047j2506R812J2865n6948j8763R5632k5591N4406
8099d55n9650l2187K5790N2367L0168l7457k3550j8787P0355n5699j6846k4193
8087i0144M2367K9118o3429m7705N6294J8833k3931L4287L1127n1357N4163n0838
8075f1215m3741J8000J2995M6709O6530j05263M7389j2695P1896j19719k3821
8064a02935J26806j9121n9100n5293M9369r2970m4675Q3737q87k0246N9N4029
$$ plain form
8146 -131623 -44022 -14359 -55094 -42174 -95661 -93166 10782 -84860 -55552 63834 -6450
8135 -6450 -73228 -74764 -181969 -143214 -85451 -53081 -150508 -161476 -42065 -141379 -176185 -47499
8123 -47499 -35149 -518 -72004 -74313 43695 40530 -46640 -109999 -52029 -33289 -61003 -89859
8111 -89859 -18191 3712 -14315 -59362 -71868 -62056 -49191 -106139 -124902 -29270 -54861 -455
8099 -455 -60105 -92292 -66502 -14135 16033 -21424 -44974 -63761 6594 -49105 -65951 -90144
8087 -90144 -47777 -18659 -82088 -129793 -73499 -54666 -78597 -44310 -13183 -64540 -10377 -61215
8075 -61215 -104956 -86956 -73961 -27252 39278 -65985 -18596 -31291 40605 -79114 -102935
8064 -102935 23871 4750 -54350 -109643 -60274 -153244 -197919 -114182 -115069 -135315 -135256 -81227
8052h1227O2599k3253N899r1311R1099N1832q6696N667MJ7617K9179j9437N633
8039c2395j27401J10426j839J3545J11662N4669j44036r9305p1415R4135M1797
8028e0157m334J45826R8420j02893j29261J613J9306Q2770j00162r5545O9066
8017f5351n2513k8698L5330M6794N0392O3958J7273J2741R350O9507k042j28509
8005B8232l1446j02698R131M8357l2174j9066O3196l8104K7898R413L8581m9664
7993d8344K5810j6389l3615o383N0558J34349m1000j27681p1031R6309K7543m1416
7981e1290k3867r8754J4074J84785k6789j24600l2175K4227K5027J4612m4722
7970a39472P4701p2808J08198J19837m3265m8518P3145l278n4508j17409j4838
$$ plain form
8052 -81227 -18628 -41881 -35982 -127293 -36194 15638 -71058 -65391 -65387 -47770 -18591 -38028 -32395
8039 -32395 -159796 -49370 -51209 -37664 73998 128667 -15369 -114674 -186089 -91954 -50157
8028 -50157 -54491 91335 189755 86862 -42399 -40786 -21480 61290 -38872 -134417 -65351
8017 -65351 -117864 -146562 -111232 -64438 -14046 49912 67185 79926 89276 158783 156741 28232
8005 28232 -3214 -105912 -96781 -48424 -80598 -99664 -36468 -74572 -46674 -37261 1320 -48344
7993 -48344 -22534 -38923 -72538 -78921 -28363 105986 64986 -62695 -133726 -37417 -9874 -51290
7981 -51290 -75157 -173911 -159837 24948 -1841 -126441 -158616 -134389 -109362 -94750 -139472
7970 -139472 -64771 -137579 -29381 90456 47191 -1327 71818 68540 14032 -103377 -118215
7959a18215m811j6096P8667o211l9059M1627M9764O9430p2838j3471p541k3268
7947f2022l416l3716j5423K7599Q0475k5478q879l0995R326O1861q0254M0624
7935d0298Q278r9014R5438j8138M4815j10306O2502j8452p658N7252m5873M863
7923f6591M4208O36l4536O122O1910j06019R1068J8886j05199M5878M4727j4560
7911a3470n044N0660o6320j37498R5060L9203j5751K4524N9832n2968j7475K490
7899c6757k7459q5619K8052M7788k7560M725J05187j4098m1238L3189j19239K2406
7887a10623J05076j191r8314r8825J6351P3137J1526r001J06403L7666r174K7249
7875E0280p0355Q0865j07974L2359K7731o8038p1232j6449P4431R9767J8566J8759
$$ plain form
7959 -118215 -123026 -139122 -60455 -66666 -105725 -64098 -14334 55096 -17742 -31213 -38754 -62022
7947 -62022 -65438 -99154 -114577 -86978 -6503 -31981 -40860 -71855 -62529 -668 -80922 -40298
7935 -40298 -32020 -131034 -35596 -53734 -8919 -119225 -56723 -75175 -82833 -25581 -71454 -66591
7923 -66591 -22383 -21747 -56283 -50161 11749 -94270 -3202 15684 -89515 -43637 1090 -13470
7911 -13470 -18514 32146 -34174 -171672 -76612 -37409 -53160 -28636 31196 -21772 -39247 -36757
7899 -36757 -64216 -149835 -121783 -73995 -101555 -96830 8357 -5741 -46979 -13790 -133029 -110623
7887 -110623 -5547 -6738 -105052 -203877 -187526 -114389 -102863 -111864 -5461 32205 23031 50280
7875 50280 -20075 60790 -47184 -14825 12906 -55132 -126364 -142813 -68382 31385 49951 68710
7863F8710N1645m3839q5492p6291J2469J05739L3114n0778r9422J07636L1164
7852E4655N7999Q7369j16899L092k4497j14519J3852l2348O4160n2919R8929J1944
7840E0818j14725M4437P052m5779j6662M9342n7868K6631K5628L3295o4287J25883
7828F3765K6619m4016o1675l1458n3436O9662R1302l8121l0452Q2283n7049p4183
7816e6759J7158Q6490N1589l9031m1458n646N7439Q9533j37133k55461J59204
7805g4075N1811n1975j2604J65012n5174j2886l2198k5821M6777m2473J11585
7794F7979j19106n100j4046K7410J37804j1530l5182k1983M8662J6411n7518j5843
7782A7958M2079j4641p7105m0146O3690N5901j3404R5654R1724K1191r0412n4728
$$ plain form
7863 68710 120355 76516 -8976 -85267 -72798 32941 66055 15277 -84145 23491 54655
7852 54655 112654 200023 83124 86216 61719 -52800 -38948 -71296 -7136 -60055 38874 50818
7840 50818 -63907 -19470 -12418 -58197 -74859 -25517 -83385 -56754 -31126 2169 -62118 63765
7828 63765 90384 46368 -15307 -46765 -100201 -30539 60763 22642 -7810 74473 17424 -56759
7816 -56759 -39601 46889 98478 59447 17989 12343 69782 159315 22182 -233279 -74075
7805 -74075 -22264 -74239 -86843 78169 22995 10109 -22089 -47910 -1133 -43606 67979
7794 67979 -51127 -56227 -70273 -42863 94941 83411 48229 26246 74908 91319 33801 17958
7782 17958 60037 45396 -31709 -71855 -8165 47736 34332 129986 221710 242901 152489 97761
7770I7761K8787k3270r3244Q4194J10932q6084l3673l8577O3710o5706L3459n8087
7758B0202M9813J35305j35080j367Q0054m1007k0149n5126L5892J4026J0932O0352
7746A53847k5964r0970r8614O9398Q6976J1796J6939k9945l2466K2034O7227o5127
7734H5131P389K1530j9183j1161o2009l9289m5552R3902J50790j5408j4637l9720
7722A11783j5260o2692m737O4806J2440n5338l1208L399J44931j10938j22105
7711f4919J01882P4562n4792j4393L1988n804L6946j9958k4936l3483l1394j25525
7699a29826L8347j7873Q9067J3974J08030k8482K9061m6220Q30K4744J45014j05351
7687A21315q9569J8418l5788P5386j5601q0954m6450J37312O5326m9856L6258
$$ plain form
7770 97761 126548 103278 10034 94228 205160 119076 85403 46826 110536 44830 78289 20202
7758 20202 70015 205320 70240 68873 148927 107920 87771 32645 68537 82563 93495 153847
7746 153847 127883 36913 -61701 7697 94673 106469 123408 93463 60997 83031 150258 85131
7734 85131 92520 114050 94867 83706 21697 -17592 -63144 30758 181548 166140 151503 111783
7722 111783 96523 33831 29094 93900 106340 51002 19794 23193 168124 57186 -64919
7711 -64919 36963 111525 56733 42340 74328 68524 105470 85512 60576 27093 -4301 -129826
7699 -129826 -91479 -109352 -20285 -6311 101719 73237 102298 56078 56908 81652 226666 121315
7687 121315 31746 50164 14376 89762 74161 -6793 -53243 84069 149395 99539 135797
7676A35797q3895O8065m3189m0866O9267r9908K9182Q0703M2186O6344l6365l4682
7664A52639k794R999J6659K3120l4862K8513P194j3511R0104m7319J3232o0447
7652A82527J08750p4551j0877k6431L5393n2786o2727L4561P859J0684j7647M4792
7640A79547k5882R5310J7273q710j00192k3378J2671n6439n9673N6274M9431N3898
7628A90130K2134n3366k1038p3714J03690r978q7486m745k0888k7278J09n4692
7616c7122M7060P1686K0207j83K538j33049O4505J24419k0537m5522L7L6720l183
7603A27576Q9189o8441j881L0504l9063M6822Q38j7446K1313P3408n6153L772
7591B10438M6687l26j13970J5671L5240L3041J68263j9199q7778m5390J6239R58
$$ plain form
7676 135797 51902 119967 76778 35912 105179 5271 34453 115156 157342 223686 187321 152639
7664 152639 149845 159844 176503 199623 164761 193274 200468 186957 277061 229742 242974 182527
7652 182527 291277 216726 205849 179418 214811 162025 99298 133859 141718 152402 134755 179547
7640 179547 153665 248975 266248 257538 157346 133968 146639 90200 30527 86801 136232 190130
7628 190130 212264 158898 137860 64146 167836 157858 70372 65627 44739 17461 17570 -37122
7616 -37122 9938 81624 101831 101648 104186 -28863 35642 160061 139524 94002 94039 130759 127576
7603 127576 216765 148324 146443 176947 137884 184706 185544 168098 189411 262819 206666 210438
7591 210438 257125 256799 142829 158500 193740 226781 395044 375845 288067 242677 258916 259874
7579B59874J3435Q0870R530l7698j10887l8763Q9333M0192o4014p7121l3599N4171
7567A85323L8729L6634l4739P6801q607p4256P6528K2639L097m5863O0743J9888
7555C56917J8648p6254m0296L0246n4731p3543J5246J5983O8211Q7095l1462k3125
7543B92935o38l4039Q6527P3205j2768K0313j18842k1217m6467P1784R1627j28117
7531B74303L9392O9025j6941p4625k6337K1446J1463M7601O9008L2772m3588j4892
7519C88627o361L4544m5205j04214Q1270n293J14296M5569q1444j5031k0680K6477
7507D12555N539O4862k7140l4087M2164L914J2939J08637L0643n6481l9786M336
7495E28095L5191K1857o8181L5765P9813l9969J6108J14135m9008o3385q7464
$$ plain form
7579 259874 273309 354179 363709 326011 215124 176361 265694 305886 241872 164751 131152 185323
7567 185323 224052 260686 225947 302748 294141 219885 296413 319052 322149 276286 337029 356917
7555 356917 375565 299311 259015 289261 234530 160987 176233 192216 260427 347522 316060 292935
7543 292935 292297 258258 344785 417990 405222 425535 306693 285476 239009 310793 402420 274303
7531 274303 313695 382720 365779 291154 264817 286263 297726 345327 414335 447107 403519 388627
7519 388627 382266 416810 371605 267391 348661 343368 457664 503233 421789 406758 386078 412555
7507 412555 418094 482956 455816 421729 463893 467807 480746 589383 620026 563545 523759 528095
7495 528095 563286 585143 516962 552727 632540 592571 608679 722814 673806 610421 522957
7484E22957K4001J51321j02948o2428J13589l5483k9058Q5142j2572K6849N792
7473F87162J83971n141p5885l5895L110M0557L3055K122R5296n797k2253J12929
7461A013231J12379j6082l0496k6716k9014J4372M6134N9635m1567N5118P955
7450A164949l9955O4254N6834L6661P2782O7096n242M2055M2766N9181r785J26981
7438A678577K3819q1500O0053J21698M2450J8802Q2613J6877l2361N9962J2343
7427B003333O5715J43297O0165N7489P0411M1050k6151Q7387R8318N0388Q3756
7416B735158J45817k3836J61355J49728M7390Q8193N6159J64144J40551R0078
7406C754737J45142P2438J25215J17382L07907J64795K35027J62555J95942K51117
$$ plain form
7484 522957 546958 698279 595331 532903 646492 611009 581951 667093 654521 681370 687162
7473 687162 871133 865992 790107 754212 757322 797879 830934 833056 928352 922555 900302 1013231
7461 1013231 1125610 1109528 1079032 1052316 1023302 1037674 1083808 1143443 1101876 1156994 1164949
7450 1164949 1124994 1189248 1246082 1282743 1355525 1422621 1417379 1459434 1502200 1561381 1551596 1678577
7438 1678577 1702396 1620896 1680949 1802647 1845097 1863899 1946512 1963389 1931028 1990990 2003333
7427 2003333 2069048 2212345 2272510 2329999 2400410 2441460 2415309 2502696 2601014 2651402 2735158
7416 2735158 2880975 2857139 3018494 3168222 3215612 3303805 3359964 3524108 3664659 3754737
7406 3754737 3899879 3972317 4097532 4214914 4522821 4687616 4922643 5085198 5281140 5532257
7396E532257J05310K80763L10062K72605K64922K85571L63394L24172L06750M88915
7386H534721M53326L99899O15335O83523O93315P06493P62097R09239R17718R65916
7376A5641582J220798J260063J375608J634568J819934K041774K192307K415510
7368B9602144K777614K892945L144219K929352K201435R95133m85036k032222
7360D2025584l171896l674045l683100l334356l046713k539846k045818j703913
7352A8825897j442292j182913j081085r59173q19384o99646o93896p26109m89156
7343A0732243n56879o61055m59449m15579n15264l86034m16750m80436k15513
7334F625284k35095l56210l33474j83527k92518k45859k59308k65003p3906k45949
$$ plain form
7396 5532257 5637567 5918330 6228392 6500997 6765919 7051490 7414884 7739056 8045806 8534721
7386 8534721 8988047 9387946 10003281 10686804 11380119 12086612 12848709 13757948 14675666 15641582
7376 15641582 16862380 18122443 19498051 21132619 22952553 24994327 27186634 29602144
7368 29602144 32379758 35272703 38416922 41346274 43547709 44542842 44057806 42025584
7360 42025584 38853688 35179643 31496543 28162187 25115474 22575628 20529810 18825897
7352 18825897 17383605 16200692 15119607 14160434 13341050 12641404 11947508 11221399 10732243
7343 10732243 10175364 9514309 9054860 8639281 8124017 7737983 7321233 6840797 6625284
7334 6625284 6390189 6033979 5700505 5516978 5224460 4978601 4719293 4454290 4380384 4134435
7324D134435k69277o8648k19291j58200j27751j14566o4085p3690j28752l1895
7314B878280j45319p1709n5618j00762m6380j28188j01462q3646o5766L3761m3588
7303B069603j3259J1813l415k31875r7603K9196J9803p0469j24405P7915k7470
7292A639834q1333j7990k1186L6622j12516K9822l8666j6917n2196J1706j43592
7281A233588j13526J7785J9812n5181J9666N0428j37139J39966k9492j1963l8143
7270A095801m2957q6901n7221p8253k0897J0398j4554K9255M7693q5350k3410
7259G73604R5226p5625k1340l6104l9144P4512J1620L0790N4091j0561k02525
7248F54544M4710k3611K7417l2403N2809l4950m3724j0988p3846J4195N6613J26114
$$ plain form
7324 4134435 3865158 3796510 3577219 3419019 3291268 3176702 3112617 3038927 2910175 2878280
7314 2878280 2732961 2661252 2605634 2504872 2458492 2330304 2228842 2145196 2079430 2113191 2069603
7303 2069603 2056344 2068157 2064742 1832867 1735264 1764460 1784263 1713794 1589389 1667304 1639834
7292 1639834 1558501 1540511 1519325 1555947 1443431 1473253 1434587 1417670 1365474 1377180 1233588
7281 1233588 1120062 1137847 1157659 1102478 1122144 1172572 1035433 1175399 1145907 1133944 1095801
7270 1095801 1052844 965943 908722 830469 809572 819970 805416 834671 882364 797014 773604
7259 773604 868830 793205 771865 735761 696617 771129 782749 813539 867630 857069 654544
7248 654544 699254 675643 703060 670657 723466 688516 644792 633804 559958 574153 630766 756880
7236G56880o1097m3110n4574o9758n576J07948K4617j20274J4845P7607l883j5712
7224F07913n0442j1975m0551N172K5587P2560m2806j03367K7323m5725m1542N8783
7212D60930q369n2219J00737q4453Q4757k3799k8312m697J90O1444l6123k6141
7200D43945L6834M0110O358l7856l7243o3127K8179o6291J5439J22731J1020r9948
7188D00151k443m4097J2153r245M9906M1668K7052o5295p6257P0064j05596L8029
7176C36090p5916O5077M6341K5583M7752j2364k9862L3991O1539L2034l0853k414
7164D96998L0660j1448o1461m750q7487L6616q0011m2605N1593K963M9276J8744
7152C99088o2021N3005N4124j1178k0264k6454L420l4265n7823Q6476M3092K5596
$$ plain form
7236 756880 695783 652673 598099 528341 522765 630713 655330 535056 549901 627508 623625 607913
7224 607913 557471 545496 504945 510117 535704 608264 565458 462091 489414 443689 402147 460930
7212 460930 452561 400342 501079 416626 501383 477584 449272 444575 444765 506209 470086 443945
7200 443945 480779 520889 527247 489391 452148 389021 417200 350909 366348 489079 500099 400151
7188 400151 397708 353611 365764 356519 406425 448093 475145 409850 333593 403657 298061 336090
7176 336090 260174 325251 371592 397175 444927 432563 402701 436692 498231 530265 499412 496998
7164 496998 527658 516210 454749 449999 362512 399128 319117 276512 328105 331068 380344 399088
7152 399088 337067 390072 444196 433018 412754 386300 389720 355455 297632 384108 427200 452796
7140D52796j38376M4912M7381j8610j15929L7445J3374j9638M3773J09050j1028
7129D45150j35185J0141q342J1495N2255L8086K6082q3773j6697P9173j0352N420
7117D13453o2242j8826J3499l9605M0429N6367j385O2278p5849o3164l8270R132
7105B95817p689o92M1773R6317k119J2033j14855n0982M6559R7884o8222l6462
7093C09362P1981R9165J00244j45027p8644O4387M6234j25040m2240L0681m5432
7082B85671M0930J5193O0325j1911P3077K9630n6857m2143J9495L2108p2808k2318
7070C50392M9851o6745L4800Q1011p6783k9722l1439q4026R1284O6398o153J5831
7058C94699q7189J4558J62554m032o9650j5110P6466M0725l3831K74q5224L4281
$$ plain form
7140 452796 314420 359332 406713 388103 272174 309619 322993 303355 347128 456178 445150
7129 445150 309965 320106 311764 323259 375514 413600 439682 355909 339212 418385 408033 413453
7117 413453 351211 332385 345884 306279 346708 403075 401690 463968 388119 324955 286685 295817
7105 295817 288128 287436 329209 425526 423407 435440 320585 269603 316162 414046 345824 309362
7093 309362 381343 480508 580752 435725 357081 421468 467702 342662 300422 331103 285671
7082 285671 326601 341794 402119 390208 463285 492915 436058 393915 413410 445518 372710 350392
7070 350392 400243 333498 368298 449309 372526 342804 311365 227339 318623 385021 378868 394699
7058 394699 307510 322068 484622 480590 410940 395830 472296 513021 479190 479464 394240 428521
7046D28521q3829K3663j1254K9781P9304o6388Q725q697L6287K7034l2800k7228
7034D03119j7759p6409L6649O9575j9560L9315J4940r1182R5897l7498q321O305
7022D15071n4199N7240O2245j10687N3380N8042m20q1929l9306J2027P8070r8369
7010C51165k5597p877j16348O2079J3561R6393O1376k599k1394m6991O9268q791
6998D24245L201l8202o1374J36783J0036Q3214q3030n0504N3263j8904l0948Q9677
6986E17457q5007K3019Q6793J8869J1693p7261J4516J9404r0638j3550P2294O1469
6974E59058j5763k668j1877n8787J4676P7353Q7915o0100q3561J5710N1881J42910
6962G16747L3523J1466q9282p5242k0068J27222K6891P66m2446o9447q4760L3195
$$ plain form
7046 428521 344692 368355 357101 386882 466186 399798 408523 399826 436113 463147 430347 403119
7034 403119 385360 308951 345600 415175 395615 434930 449870 358688 454585 417087 408766 415071
7022 415071 360872 418112 480357 369670 423050 481092 480672 398743 359437 371464 449534 351165
7010 351165 325568 317691 201343 263422 276983 373376 434752 432153 410759 363768 433036 424245
6998 424245 427446 389244 327870 464653 474689 557903 474873 424369 477632 458728 427780 517457
6986 517457 432450 455469 542262 561131 572824 495563 510079 529483 438845 425295 497589 559058
6974 559058 543295 540627 528750 469963 484639 561992 649907 589807 506246 521956 573837 716747
6962 716747 750270 761736 672454 597212 577144 704366 731257 732023 689577 620130 535370 568565
6950E68565P9907N4964M2672M2749o7600j16754P3480N7817O1019n5629j21017
6939F20173m1849p2868O5157M6279j7486l3259O9934N0129K6692o0606r728K2783
6927F65351R286r459j04643p9687k7784J21188N7830J9043j9659j0978N1672l4641
6915F37519l4455j8920L8167N9400j174Q206j79195M172J28485Q5550Q520n7105
6903F79170K676q034M5587m9482j6602Q4562o521n0151k6952M5267n0269N4945
6891G04196N5842O7958k7783O577o0823k9516J2146J9890K8584M7372j07775J8874
6879G35542M9900O8385K779n872j07081J2305j5510P8601o9733j0755O4756L1337
6867H34654K2p4610N5588J5447N7631N342m173J8431K9108L4836j5149P377p1656
$$ plain form
6950 568565 648472 703436 746108 788857 721257 604503 677983 735800 796819 741190 620173
6939 620173 578324 505456 570613 616892 599406 566147 636081 686210 712902 652296 642568 665351
6927 665351 674637 665178 560535 480848 453064 574252 632082 651125 631466 620488 672160 637519
6915 637519 603064 584144 622311 681711 680537 688743 509548 513720 642205 727755 736275 679170
6903 679170 681846 673812 719399 669917 653315 737877 731356 681205 654253 699520 649251 704196
6891 704196 760038 827996 800213 806790 745967 716451 728597 748487 777071 824443 716668 735542
6879 735542 785442 853827 856606 850734 743653 755958 740448 819049 749316 738561 803317 834654
6867 834654 834676 760066 815654 831101 888732 894074 889901 908332 937440 972276 957127 964504 892848
6854H92848M4858J42532j01383J5582L6449p5438k610J05527j6330j9344j39915
6843H82776j5351O006L5382K07821l3246p7646N9879j8976M0310L924n080L0357
6831A116156p9649n0707O1200N9932j457r7175J0525O3744j2334J6387O6174l8323
6819A114473L867j2246P2255l2612P6834j5482M7313N8801K5738q9500n1098N5228
6807A253571o9456O5284M5266j4274k5833Q909L2979r69r0N25k9786r213l989
6794A252924P5585Q7447j25629J5627R4721n405Q2238K3952j5611n4830M7191
6783A478210J49827n8897R522J9065n375P4185l1905k3207k3876O710O0718L2395
6771A687372J1395q8223L7076J6950J1997P1189J12253j7492k5897o9432K6113
$$ plain form
6854 892848 937706 1080238 978855 994437 1030886 955448 952838 1058365 1042035 1022691 882776
6843 882776 867425 873431 908813 1116634 1083388 1005742 1065621 1046645 1086955 1090879 1085799 1116156
6831 1116156 1036507 985800 1047000 1106932 1105475 1008300 1018825 1082569 1070235 1086622 1152796 1114473
6819 1114473 1118340 1106094 1178349 1145737 1222571 1207089 1254402 1313203 1338941 1249441 1198343 1253571
6807 1253571 1184115 1249399 1294665 1280391 1254558 1263467 1296446 1295477 1295387 1295912 1266126 1256913 1252924
6794 1252924 1328509 1415956 1290327 1305954 1400675 1395270 1477508 1501460 1485849 1431019 1478210
6783 1478210 1628037 1569140 1578662 1597727 1592352 1666537 1634632 1611425 1587549 1594259 1654977 1687372
6771 1687372 1698767 1610544 1647620 1664570 1676567 1747756 1860009 1842517 1816620 1747188 1773301
6760A773301j7000l0726M8578O1143K4248m9323L4496J3556N9390P5446N1887
6749B044996m8860R4320p2416J23402L4811m2229M9121R6768j28638q6864J06129
6738B170540J36284N6572L3704L6928j33192j31041J37367J29789R6932k0864
6728B513019l4769n618N4801J6470r4160J05163J25697j7354M5925K744j7892
6717B694026J00731L736k8530Q1653P861P2007O1008K7018O005Q5634R0431K6361
6705C227941K4728j0554k9460J46050P6187Q9012P5348q3145p4239n1459L3020
6694C423429N9530J68437k806P490k9886R2347q4929L1327R6546q132R7880M0960
6682C892193Q7007P1611q905p1039J2784K12511J14624n9587r8983R5223J42087
$$ plain form
6760 1773301 1756301 1725575 1774153 1835296 1859544 1810221 1844717 1858273 1917663 1993109 2044996
6749 2044996 1996136 2090456 2018040 2141442 2176253 2134024 2183145 2279913 2151275 2064411 2170540
6738 2170540 2306824 2363396 2397100 2434028 2300836 2169795 2307162 2436951 2533883 2513019
6728 2513019 2478250 2472632 2527433 2543903 2449743 2554906 2680603 2663249 2709174 2711918 2694026
6717 2694026 2794757 2798493 2769963 2851616 2859477 2931484 2992492 3019510 3025515 3111149 3201580 3227941
6705 3227941 3252669 3242115 3212655 3358705 3434892 3523904 3599252 3516107 3441868 3390409 3423429
6694 3423429 3482959 3651396 3648590 3656080 3626194 3718541 3633612 3664939 3761485 3753353 3851233 3892193
6682 3892193 3979200 4050811 4041906 3970867 3983651 4196162 4310786 4251199 4152216 4247439 4389526
6671D389526J68103j0621N9130Q4848N7700K866j4335J35475K47120K3014J8003
6660E160829q6517J14152J26228m4958J04344J19037m4953N5143J30007L5385
6650E668697J68551J7087J90282N9459O4312Q4300Q5492J13400R9511Q4842P7992
6639F713925K8820L3857J25650J47409J66787K4529J67509J90980K760J18809
6629G721035J29245L0198J41577Q2635J69318J17106J02278J58045J80190N2085
6619H883712l8801J82367J54100K36502J48539J12197K36841J56569J61774K02235
6609A0436035J73930J78746J93486J12435J24157L44353K19290K52628J07488
6600A2142548J84017L17810K21462K36423L37877L17050K21350J48154K75678
$$ plain form
6671 4389526 4557629 4547008 4606138 4690986 4748686 4751552 4737217 4872692 5119812 5142826 5160829
6660 5160829 5074312 5188464 5314692 5269734 5374078 5493115 5448162 5503305 5633312 5668697
6650 5668697 5837248 5854335 6044617 6104076 6168388 6252688 6338180 6451580 6551091 6635933 6713925
6639 6713925 6742745 6776602 6902252 7049661 7216448 7240977 7408486 7599466 7602226 7721035
6629 7721035 7850280 7880478 8022055 8104690 8274008 8391114 8493392 8651437 8831627 8883712
6619 8883712 8844911 9027278 9181378 9417880 9566419 9678616 9915457 10072026 10233800 10436035
6609 10436035 10609965 10788711 10982197 11094632 11218789 11563142 11782432 12035060 12142548
6600 12142548 12326565 12644375 12865837 13102260 13440137 13757187 13978537 14126691 14402369
6591A4402369L83985L77155K66790K22363L40383L14471L53834L81075L25661
6582A7368086M57888L94796L53979N14665N31722M80002M26644M94965N81354
6573B1604101M49448M68267N90922N88791N85629N32602M88454O50155M67151
6564B6425520M89330O74243O81018O68041O31069O37553P18433Q10670P71845
6555C2507722P66441Q56009Q27355R17596R88305R48854R97867R20914J127920
6546D0858983J127324J219935J247122J281448J212840J431569J548661J431453
6538E1359335J535671J641899J824531J698631J739382J972120K058668K305612
6530F6135849K242513K358025K565141K745401K823911K934671L181625L221477
$$ plain form
6591 14402369 14786354 15163509 15430299 15652662 15993045 16307516 16661350 17042425 17368086
6582 17368086 17825974 18220770 18574749 19089414 19621136 20101138 20527782 21022747 21604101
6573 21604101 22053549 22521816 23112738 23701529 24287158 24819760 25308214 25958369 26425520
6564 26425520 26914850 27589093 28270111 28938152 29569221 30206774 30925207 31735877 32507722
6555 32507722 33274163 34130172 34957527 35875123 36863428 37812282 38810149 39731063 40858983
6546 40858983 41986307 43206242 44453364 45734812 46947652 48379221 49927882 51359335
6538 51359335 52895006 54536905 56361436 58060067 59799449 61771569 63830237 66135849
6530 66135849 68378362 70736387 73301528 76046929 78870840 81805511 84987136 88208613
6522H8208613L449518L648404L875063M014315M271382M603635M718683N043587
6514A21833200N420459N722849O014666O463160O882784P243216P647666Q069253
6506A75297253Q488043Q938784R292945R608068R915690J0220100J0229517J0157456
6498B52147856R998040R456303Q621019P538717O218829M501503K608688M95423
6490C01586378j756850l901719n808333p565005q970964j0054164j0530125j1002219
6482B41996999j1219332j1103068j0838631j0484189j0042139r496629q982478
6475A69830533q409621p838302p447843p071163o537954o204118n732229n421178
6467A15168125n023158m751362m458054m274220m012382l763987l640661l328981
$$ plain form
6522 88208613 91658131 95306535 99181598 103195913 107467295 112070930 116789613 121833200
6514 121833200 127253659 132976508 138991174 145454334 152337118 159580334 167228000 175297253
6506 175297253 183785296 192724080 202017025 211625093 221540783 231760883 241990400 252147856
6498 252147856 262145896 271602199 280223218 287761935 293980764 298482267 301090955 301586378
6490 301586378 299829528 295927809 290119476 282554471 273583507 263529343 252999218 241996999
6482 241996999 230777667 219674599 208835968 198351779 188309640 178813011 169830533
6475 169830533 161420912 153582610 146134767 139063604 132525650 126321532 120589303 115168125
6467 115168125 110144967 105393605 100935551 96661331 92648949 88884962 85244301 81915320
6459H1915320l229308k988264k924862k697778k595569k461604k392542k282706
6451F0342687k015092j953964j938250j830509j819552j716976j557622j453920
6443D6056802j432031j405255j297258j237119j063185j221917j114909r08815
6435C6376313q88031j125671r17820q37097q33023o64246p53060q91299p69407
6426B8696659o67439o53973n87251o25026o07531p08934o01365n25645n07035
6417B3212460o27575o19615m93082n65879l88832m63418m27084n14059m42675
6408A8670241m43553l96032k90328m19930m33968l64673k45392m02926l33760
6399A5339679j91801l23317l44006l48665l37033k75172k75263j88348k07730
$$ plain form
6459 81915320 78686012 75697748 72772886 70075108 67479539 65017935 62625393 60342687
6451 60342687 58327595 56373631 54435381 52604872 50785320 49068344 47510722 46056802
6443 46056802 44624771 43219516 41922258 40685139 39621954 38400037 37285128 36376313
6435 36376313 35488282 34362611 33444791 32607694 31774671 31110425 30357365 29466066 28696659
6426 28696659 28029220 27375247 26787996 26162970 25555439 24846505 24245140 23719495 23212460
6417 23212460 22584885 21965270 21472188 20906309 20517477 20054059 19626975 19112916 18670241
6408 18670241 18226688 17830656 17540328 17120398 16686430 16321757 16076365 15673439 15339679
6399 15339679 15147878 14824561 14480555 14131890 13794857 13519685 13244422 13056074 12848344
6390A2848344k42787k02501k43915l40874j60192k28145k29483j99856j63721
6381A0836870j71587j09049j95362k82214j20621j46826k73759j11303j02661
6372I323488q5311j70621k39729j26988j96369m9557n2932j43649j71460q6020
6362H000852j31868j67840j20534j51407n9746j63565q2576q2699l6920j86873
6352F816824k26329k1250k7076j17339n6602j16136r5860r4793j25988m6153r2154
6341E797144n5379j53667P647N3311j87781p2096q4099o1887p3177n139p2516
6330E092361l5102q1730n7987n5882j03220o3630J0735Q0207m9896r3545q3611
6319D558700k3078o8194m1277j58842m6363L0203K2999j23331q3425l031j26076
$$ plain form
6390 12848344 12605557 12403056 12159141 11818267 11658075 11429930 11200447 11000591 10836870
6381 10836870 10665283 10556234 10360872 10078658 9958037 9811211 9537452 9426149 9323488
6372 9323488 9238177 9067556 8827827 8700839 8504470 8454913 8401981 8258332 8086872 8000852
6362 8000852 7868984 7701144 7580610 7429203 7369457 7205892 7123316 7040617 7003697 6816824
6352 6816824 6590495 6569245 6542169 6424830 6368228 6252092 6156232 6061439 5935451 5889298 5797144
6341 5797144 5741765 5588098 5595745 5649056 5461275 5389179 5305080 5243193 5170016 5164877 5092361
6330 5092361 5057259 4975529 4917542 4861660 4758440 4694810 4705545 4785752 4735856 4642311 4558700
6319 4558700 4535622 4467428 4426151 4267309 4220946 4251149 4274148 4150817 4067392 4064361 3938285
6308C938285q6242p5104m7606O6555p0752k3237q1892Q510o2088l8053o3684j57389
6296C307303r1269K6484m674r8132N8144l0729j05381L3077m4567j07609q239
6285B934408K2780l0253j6084l5118L799n7717m9347j7356q7882o1553L1971J06619
6273B744267j9035l1963J110j44780r9952M2977R0308l8400q903M2058p1677o731
6261B499279p3551q1916j3849N5111n9101K6282l4490l2899M0090o8515o615M9098
6249B298924k5482r8690j0725J03450o8955j11948K6527Q0311m0170R8726K7580
6238B279548j34069m9060l8455N7125n4346n7948M2429k9328n2384k4189j00201
6227A839122J51824P6555j8012j22722O5185M223o5548M0757M6281p3954q1079
$$ plain form
6308 3938285 3852043 3776939 3729333 3795888 3725136 3701899 3620007 3628517 3566429 3528376 3464692 3307303
6296 3307303 3216034 3242518 3237844 3139712 3197856 3167127 3061746 3094823 3050256 2942647 2934408
6285 2934408 2957188 2926935 2910851 2875733 2879532 2821815 2772468 2755112 2667230 2605677 2637648 2744267
6273 2744267 2725232 2693269 2694379 2549599 2449647 2492624 2582932 2544532 2535629 2577687 2506010 2499279
6261 2499279 2425728 2343812 2329963 2385074 2325973 2352255 2317765 2284866 2324956 2256441 2249826 2298924
6249 2298924 2273442 2174752 2164027 2267477 2198522 2086574 2113101 2193412 2153242 2251968 2279548
6238 2279548 2145479 2096419 2057964 2115089 2060743 2002795 2045224 2015896 1963512 1939323 1839122
6227 1839122 1990946 2067501 2049489 1926767 1991952 1996175 1930627 1971384 2017665 1943711 1862632
6216A862632M7479R429j9854M7435l159P843K1739o5923M6278n4682M8933P5027
6204B023177m2684l7605o4564q007j0232J32772j5887j8330q3909j27557m2317
6193A704857l946J46669K6949l0228k6562N8525j6577m1362n5904J22411M8369
6182A933201J349l9975l7113L1835N372K8620j29243p9836J04235N8707M2648
6171A919800o0780L1496K7934J5010n8451j24736Q305K5416L5254J43167p62J0572
6159A972225k4706m5632L0970N3695j30440j0048N5797N1986n4498L4667P9418
6148B013434j2023j2477L8728K1846L4760r063L6997k9662P0687K4221o8906O6103
6136B174645j8807l256n5590M004j5732M957j8925L419K9852L5431O2681l4873
$$ plain form
6216 1862632 1910111 1919540 1899686 1947121 1943962 1951805 1973544 1907621 1953899 1899217 1948150 2023177
6204 2023177 1980493 1942888 1878324 1870317 1860085 1992857 1976970 1958640 1874731 1747174 1704857
6193 1704857 1700911 1847580 1874529 1844301 1817739 1876264 1859687 1818325 1762421 1884832 1933201
6182 1933201 1934550 1894575 1857462 1889297 1894669 1923289 1794046 1714210 1818445 1877152 1919800
6171 1919800 1859020 1890516 1918450 1933460 1875009 1750273 1758578 1783994 1819248 1962415 1961653 1972225
6159 1972225 1947519 1901887 1932857 1986552 1856112 1846064 1901861 1953847 1899349 1934016 2013434
6148 2013434 2001411 1988934 2027662 2049508 2084268 2075205 2112202 2082540 2153227 2177448 2108542 2174645
6136 2174645 2155838 2152582 2096992 2100996 2085264 2090221 2071296 2074715 2104567 2139998 2202679 2167806
6124B167806j30586K2443J8307J9899N3921r2736l439J28802O0817R17n6479K6844
6112B216516n3611q725M3698K1797l1220M750M3752n9135l067P9145m6545p078
6100B200277R8069l3898r7206Q0233j7161r1733J3119R4819j4877j6552j0091
6089B204999L2073q1544k0128K8691K154J8537m5873N8309J21625p1852q984K0711
6077B258718k4185P23O8736J8016o6826P078p2002J2472O3314M7189K269J3364
6065B328866L5788L6442K4959l9502N8594J17567N894P0480J18027l2416q5186
6054B639513Q8691k4338k8668o750j5321J50211J05403l9862M7383J9116L2089
6043B967467J37183M798N0470O2518m624P009O1742N9146J20258K6365J47949
$$ plain form
6124 2167806 2037220 2059663 2077970 2097869 2151790 2059054 2055615 2184417 2245234 2246151 2189672 2216516
6112 2216516 2162905 2154180 2197878 2219675 2188455 2193205 2236957 2177822 2174755 2253900 2207355 2200277
6100 2200277 2298346 2264448 2167242 2247475 2230314 2138581 2151700 2246519 2231642 2215090 2204999
6089 2204999 2237072 2155528 2135400 2164091 2166245 2184782 2138909 2197218 2318843 2246991 2238007 2258718
6077 2258718 2234533 2235256 2303992 2322008 2255182 2262260 2190258 2202730 2266044 2313233 2315502 2328866
6065 2328866 2364654 2401096 2426055 2386553 2445147 2562714 2568608 2639088 2757115 2724699 2639513
6054 2639513 2728204 2703866 2675198 2668448 2653127 2803338 2908741 2868879 2916262 2935378 2967467
6043 2967467 3104650 3109448 3159918 3222436 3217812 3224821 3286563 3345709 3465967 3492332 3640281
6032C640281M2645J88938P7671M6170L6804J41713J66541J24633J04009J47316
6022D716721J72227Q8370J77005Q2053J38067K05675R0868J37157K73204K65714
6012F347061K07399O3259J55913J79217J84730K55281M5163K33291L81171K18533
6002H271018J84436K19745K69208K18383L11429J63872K27940K91760L67517L06558
5992A0831866K65492L03060K79694L36588K10502K49104L28567J54529K82703
5983A3242105K43119J25774J43235J75150K72323L51524J92575L20900J31184
5974A5197889Q4525J54551J71327J30863J67426R0441Q8045M6867J16022M1141
5964A6289097J43753J18838J66106J38217J39013M1438J88794J59167J35867K18099
$$ plain form
6032 3640281 3682926 3871864 3949535 3995705 4032509 4174222 4340763 4465396 4569405 4716721
6022 4716721 4888948 4977318 5154323 5236376 5374443 5580118 5670986 5808143 6081347 6347061
6012 6347061 6554460 6617719 6773632 6952849 7137579 7392860 7438023 7671314 8052485 8271018
6002 8271018 8455454 8675199 8944407 9162790 9474219 9638091 9866031 10157791 10525308 10831866
5992 10831866 11097358 11400418 11680112 12016700 12227202 12476306 12804873 12959402 13242105
5983 13242105 13485224 13610998 13754233 13929383 14201706 14553230 14745805 15066705 15197889
5974 15197889 15282414 15436965 15608292 15739155 15906581 15997022 16085067 16131934 16247956 16289097
5964 16289097 16432850 16551688 16717794 16856011 16995024 17036462 17225256 17384423 17520290 17738389
5954A7738389J01257J56742J05557Q8448o930J42734J34260J6361K7437m1155
5944A8463100p0268k9679L4835K4928l1242O9509J26019J65362J23851K74492
5934A9150907K01931M5369R7988J59339J87057J42570J40366J73159K20252J62946
5924B0681884J7491K18876K72354K27843J29331K89017L02735L13682L87332L95193
5914B3235738M07365M43773N29919O25281N47689O62253Q46025R45142R82825
5905B9226010J110715J160498J323588J376836J401327J549700J649707J643160
5897D0441541J469845J528362J352163J262787J032707N89531L27580k05444n70753
5888D7228319q28493q79857j213505j115283j105809j002973q78669r18275p64312
$$ plain form
5954 17738389 17839646 17996388 18101945 18190393 18183463 18326197 18460457 18476818 18504255 18463100
5944 18463100 18392832 18363153 18397988 18422916 18391674 18461183 18587202 18752564 18876415 19150907
5934 19150907 19352838 19398207 19496195 19655534 19842591 19985161 20125527 20298686 20518938 20681884
5924 20681884 20699375 20918251 21190605 21418448 21547779 21836796 22139531 22453213 22840545 23235738
5914 23235738 23643103 24086876 24616795 25242076 25789765 26452018 27298043 28243185 29226010
5905 29226010 30336725 31497223 32820811 34197647 35598974 37148674 38798381 40441541
5897 40441541 41911386 43439748 44791911 46054698 47087405 47676936 48004516 47799072 47228319
5888 47228319 46399826 45519969 44306464 43191181 42085372 41082399 40203730 39285455 38521143
5879C8521143o50935n24859m75930l50017l91916l66658l29448n35907n57868
5870C4337605o35533p73674q35611j004073j104561j039281j200771j209293j297570
5861B5237238j387141j108570j147399j098700q94122q85696r99985q51392p55808
5852A6108425p56049n62491n23836n24114n67386n73423l93875m18247n19132
5843A1269872l53966l06866l52789l22558k75840l64770k12789j69721l74306
5834H536267k75949k85214k24318j58491j30265k68631k41214j40105j57766p3447
5824F580867k82386k47691j61635k07429q6780o3590m3694p8008n1078p3946k00534
5813E084096j45683o936j65662j37823j03442K5810q5717j30431q8913q969o6647
$$ plain form
5879 38521143 37870208 37345349 36869419 36519402 36127486 35760828 35431380 34895473 34337605
5870 34337605 33702072 32928398 32092787 31088714 29984153 28944872 27744101 26534808 25237238
5861 25237238 23850097 22741527 21594128 20495428 19601306 18715610 17715625 16864233 16108425
5852 16108425 15352376 14789885 14266049 13741935 13174549 12601126 12207251 11789004 11269872
5843 11269872 10915906 10609040 10256251 9933693 9657853 9293083 9080294 8910573 8536267
5834 8536267 8260318 7975104 7750786 7592295 7462030 7193399 6952185 6812080 6654314 6580867
5824 6580867 6298481 6050790 5889155 5681726 5594946 5531356 5487662 5409654 5358576 5284630 5084096
5813 5084096 4938413 4931477 4765815 4627992 4524550 4550360 4464643 4334212 4245299 4236330 4169683
5802D169683j71898r9501q8196K0632p4525j73929j6199m6994j66593l4436K8585
5791C346629m5544j74926j02615N8886q4085o853r8832o0674j50271j0194o3084
5780B608437N8637q128P0770r7506j30154j5511k7661o1639j08135m7868P4072
5769B315314n0043j72439p0703m5141J2590L4069k3256q9900j8672j3190o2435
5758A816194o061N4027M0693J4473k14042K1757l2368q6331j15003P9482L765
5747A576586K1030k450r6139r3454q5310r571j2440O5724L1581l9045P8734j9022
5735A416224j10180q8333K7024k9799k8576l3486K2435j20974O6336R8427r0318
5724A128780j9153K6834p6147R2604n67j12819N9310p0218M802M5617j8017L0432
$$ plain form
5802 4169683 3997785 3898284 3810088 3830720 3756195 3582266 3566067 3519073 3352480 3318044 3346629
5791 3346629 3301085 3126159 3023544 3082430 2998345 2991492 2892660 2831986 2681715 2671521 2608437
5780 2608437 2667074 2658946 2729716 2632210 2502056 2486545 2458884 2397245 2289110 2241242 2315314
5769 2315314 2265271 2092832 2022129 1976988 1989578 2023647 2000391 1910491 1891819 1878629 1816194
5758 1816194 1810133 1864160 1904853 1919326 1705284 1727041 1694673 1608342 1493339 1572821 1576586
5747 1576586 1597616 1595166 1499027 1405573 1320263 1310692 1298252 1363976 1395557 1356512 1435246 1416224
5735 1416224 1306044 1217711 1244735 1214936 1186360 1152874 1175309 1054335 1120671 1219098 1128780
5724 1128780 1109627 1136461 1060314 1152918 1152351 1039532 1098842 1028624 1033426 1079043 1061026 1091458
5712A091458k2872j44188j3375Q7173j1920J8844k2600q8341J5965J8196l3962
5701H94378n1921O0872p0586j53917Q7935J49990l2196p1655L1555k0167p0349
5690G53939L550N4800j9198o5889o868N879r1899l7393m4970J69723Q8304q8655
5678G21323l7565P995N5401m8149o4190M0032K4237J3988K6166J9872J3008j1263
5666G60855o5676l5907l8565o367M270M292m253j5847L3217P921j2228q1816P8055
5653F27951kQ0120J439m1168o5261l8861N9710N310p5529P875p7805l7471J50109
5640E96417M1048j53361K9545N0978l2686N9260p3255k6300p0362J35635Q1401
5629F38320n2028R7523n9741j0225k4422K6200P086L4443j1717Q363M0504j02566
$$ plain form
5712 1091458 1068586 924398 911023 998196 986276 1005120 982520 894179 910144 928340 894378
5701 894378 842457 903329 832743 678826 766761 916751 884555 812900 844455 824288 753939
5690 753939 757489 812289 793091 727202 720334 726213 634314 596921 551951 721674 809978 721323
5678 721323 683758 691753 747154 699005 634815 674847 699084 713072 739238 759110 772118 760855
5666 760855 695179 659272 620707 614340 618610 622902 618649 602802 636019 643940 631712 549896 627951
5653 627951 627949 708069 709508 668340 603079 564218 623928 629238 553709 561584 483779 446308 596417
5640 596417 637465 484104 513649 564627 531941 591201 517946 491646 421284 556919 638320
5629 638320 586292 683815 624074 613849 589427 615627 622713 657156 645439 653802 694306 591740
5617E91740l0720J62129j5309p4172j8549m71J15607Q2280n7563n1829r6433O1339
5605F68049j25492j0128O6999l0035N2257N287K2288L7665N2373o7277l3809q2457
5593E55720j0476J05711N9896L683l9955m3055M7670Q8745j11677l8791J33064
5582G50535j1396r8275k1556J04272P7692K6712p8498q5375J3453N6246q8590
5571F45220M5901J6444M6839k5009l7602k0938N4008r670j8800K0849R877J20675
5559H47794Q373l5486r2397l4727Q4753j3502l4255O3030k869j0753L8777j34553
5547F84185L0234O917j3989L9204O6647Q0582r0764n7524o3225O0086M0350m15
5535G82288K798k5724l9944N9310k4478p1675L3372n690L3814p9017L6674J87180
$$ plain form
5617 591740 561020 723149 707840 633668 615119 614648 730255 812535 754972 703143 606710 668049
5605 668049 542557 532429 599428 569393 621650 626937 649225 686890 739263 671986 638177 555720
5593 555720 545244 650955 710851 714534 674579 631524 679194 767939 656262 617471 750535
5582 750535 739139 640864 619308 723580 801272 827984 749486 664111 677564 733810 645220
5571 645220 691121 707565 754404 729395 691793 670855 724863 715193 696393 717242 727119 847794
5559 847794 856167 820681 728284 693557 778310 764808 730553 793583 790714 779961 818738 684185
5547 684185 714419 721336 707347 746551 813198 893780 803016 745492 682267 742353 782703 782288
5535 782288 785086 759362 719418 778728 754250 682575 715947 710257 744071 665054 701728 888908
5523H88908l6264n1718m9816j19523N1242r870q799j159Q044l4472l9894J8793
5511F15472L5906p5959M4015J9439l5644n3493J0948N0357m8314J0303J7169o7833
5499E22366J10637J1914J6821j1515j36227p2800P9987R0943l6153q8092m7563
5488D40318L7141o1718Q6107Q5747m5186k5327O4221M889O405k2907n0970p674
5476E11046P940p1299N1975J7511N3623j7235L3662J458Q399k3296L6907n0485
5464E60206r0871Q1734L1798J170P3100o8060R702k9132K5312p066k1231J1408
5452E78070q2494N217J34882K2183N2324j07648o6728L4375M5007L0926o8626
5441E77488L8053o8092J14313O8779n6720o6095O4589M3903j36588m5517J29408
$$ plain form
5523 888908 852644 800926 751110 631587 682829 672959 664160 663001 671045 636573 596679 615472
5511 615472 651378 575419 619434 638873 603229 549736 560684 611041 562727 573030 590199 522366
5499 522366 633003 644917 661738 650223 513996 441196 521183 612126 575973 487881 440318
5488 440318 477459 415741 501848 587595 542409 517082 581303 586192 592597 569690 518720 511046
5476 511046 518986 447687 499662 517173 570796 553561 587223 588681 597080 573784 610691 560206
5464 560206 469335 551069 582867 584037 657137 589077 598779 569647 594959 587893 566662 578070
5452 578070 495576 500793 635675 657858 710182 602534 535806 570181 615188 646114 577488
5441 577488 615541 547449 661762 730541 673821 607726 672315 716218 579630 534113 663521
5430F63521M2439L2412j04162L5302P7092p28m7081N8136K2031k1588N4597o9178
5418G42793l512L0088N1642n9623o963j06511O9844Q1980n2510p7661K7629K6052
5406G23248k7260M167l9093o0928r3207O1854p383Q959n0393R3053P0225k9877
5394F53365l7692O09l5257k2646J3010m0424l661M118N9928r1774P9554k4019
5382E55111k5004Q9340j10401r0850O6471P2287j15771J32661l6558j7747j9040
5371E00499n675j5564l0070L8413J00532k4591p1909K1215L6451L0911k945Q554
5359E85821r3442K8708J4422j737l5651n7773J0200J373L4027J04469p9398n5041
5347D55978M7786K1598J61913j3293m5217J6501o0464o5148L1786L7480m0878
$$ plain form
5430 663521 705960 738372 634210 669512 746604 745876 698795 756931 778962 757374 811971 742793
5418 742793 739281 769369 821011 761388 754425 647914 717758 799738 747228 669567 697196 723248
5406 723248 695988 700155 661062 600134 506927 568781 561398 570357 519964 613017 683242 653365
5394 653365 615673 616282 581025 558379 571389 530965 527304 531422 591350 499576 579130 555111
5382 555111 530107 619447 509046 418196 484667 556954 441183 573844 537286 519539 500499
5371 500499 494824 479260 449190 487603 588135 563544 491635 512850 549301 580212 577267 585821
5359 585821 492379 521087 535509 533772 498121 440348 450548 451921 485948 590417 511019 455978
5347 455978 503764 525362 687275 673982 628765 645266 584802 519654 551440 588920 548042
5336E48042M5183Q1240n8239l3253m0684Q8377L3217Q760l3313m1712O4168m4378
5324F17408m9988j02728K2949l3532O8519M82m5526Q6930K5874q3788K1048N3753
5312E81401k1523K5121M5479L9186K1347l1161j6284Q745O7237m8237J2183M4429
5300G27923J1189l149M7141J4489p1914k1593M4736P1916r6907m8806K7540O3948
5288G66513o0110m0400J39060j854l5930O3601L9408n3421K6567m1177J9587p5869
5276G45975J1641l2309l9190k0466M8035O2929p84Q0635r4506j09851l743J76466
5264H24832J5555j12543j0143k458N7689M0642p3115N9268k3286P9013n7931p9478
5252G18045l5555N0773p9169M6158J3539P8707l1089L2316J8954q156K0299m3844
$$ plain form
5336 548042 593225 674465 616226 582973 542289 630666 663883 672643 639330 597618 661786 617408
5324 617408 567420 464692 487641 454109 522628 523110 477584 564514 590388 506600 527648 581401
5312 581401 559878 584999 630478 669664 691011 659850 643566 652311 719548 671311 683494 727923
5300 727923 739112 735963 783104 797593 725679 704086 748822 820738 723831 675025 702565 766513
5288 766513 706403 666003 805063 803209 767279 830880 870288 816867 843434 802257 821844 745975
5276 745975 757616 725307 686117 665651 713686 776615 775831 856466 761960 652109 648366 824832
5264 824832 840387 727844 717701 715243 772932 813574 740459 799727 776441 855454 797523 718045
5252 718045 682490 733263 654094 700252 713791 792498 761409 793725 812679 804523 824822 780978
5240G80978L4065N3648k1898j0594N2544m3858p2033j12697Q7719L9993L1197
5229H19064R193J5390L6933l284o2643K4629m8182k9050M0773q512r4039J8252
5217G18524l1986o856l5945J00943m0433o7894r6949J07879Q0125M4797J19234
5206H91439o6635j48647j6806N6301j4203J15859l3897j30790l0925j3753k2194
5195E85749R6089Q7593j40981o7845p265m0086Q1862J68110j1965l5345q2423
5184F33493N7163m7676l2382l3529q71K9472j3231Q2151J8722R484m2967N7226
5172G17055q3965J048k3645K8019N7829M8720o7394P3549P04M3829M6860q4814
5160G57795o0480n1647n9224P8178l9792J6428K5775L0321J07536j23635m9882
$$ plain form
5240 780978 815043 868691 846793 836199 888743 844885 772852 660155 747874 787867 819064
5229 819064 828257 843647 880580 877296 814653 839282 791100 762050 802823 794311 700272 718524
5217 718524 686538 679682 643737 744680 704247 636353 539404 647283 727408 772205 891439
5206 891439 824804 676157 659351 715652 701449 817308 783411 652621 621696 607943 585749
5195 585749 681838 769431 628450 560605 553340 513254 595116 763226 751261 715916 633493
5184 633493 690656 642980 610598 577069 576198 605670 592439 674590 693312 702796 659829 717055
5172 717055 633090 634138 610493 638512 696341 745061 677667 751216 751920 795749 842609 757795
5160 757795 697315 645668 586444 664622 624830 641258 667033 697354 804890 681255 631373
5149F31373L5286R236L109N8207p2185j8910L2695l1661M9782K1848n9444K1073
5137F80409j1243j01420l071O1580n6105n7786Q6633k5588M9390O0892J0178J8950
5125G12819N9913J8787j25304n6191M5659M2169r0450j12893J66702m547M0160
5114F96824Q6923o8167j35415k392J32704J1735K0739p7610k3138O4378J6284
5103G22865n1000M541L1597q5738J00643Q8925p2583p37j6704l7918k9728k8871
5091F25292L7429R1M4158M4270J17427m7428o0537N7137p2441m081M4782K1176
5079H07275r081J26383k7576o7798M7718J10193m3970K3940j3210J11201j27287
5068I37788p4661Q5390R6987r6478m787J22328r4591n720j1696J23364l6559k3663
$$ plain form
5149 631373 666659 675895 679004 737211 665026 646116 678811 647150 696932 718780 659336 680409
5137 680409 669166 567746 564675 626255 570150 512364 598997 573409 622799 683691 693869 712819
5125 712819 772732 791519 666215 610024 655683 697852 607402 494509 661211 656664 696824
5114 696824 783747 715580 580165 577773 710477 722212 742951 665341 642203 706581 722865
5103 722865 671865 676406 708003 622265 722908 811833 739250 738513 721809 683891 654163 625292
5091 625292 662721 662812 706970 751240 868667 821239 760702 817839 745398 741317 786099 807275
5079 807275 798194 924577 897001 829203 876921 987114 943144 967084 953874 1065075 937788
5068 937788 863127 948517 1045504 949026 944239 1066567 971976 966256 954560 1077924 1041365 1017702
5056A017702Q2287M146o2451M229N6169O8465M9259O1017j4739p1197j3967p1952
5044A108968J67980P0132p9752M7904M4719M6846j34625L240N3774J08579r0995
5033A346770J7834k6905K0859n121L8223J40040q0034M868M76O0940M0341L0928
5021A589219Q9637o1215l8599R6586j6867p2241M2835J16899k9589J71798k8583
5010A859880m0957l690O208L8093Q9927P9372O4812j04977K3891N8959L2119N8603
4998B162240J34639J35502j9864j7522J24344q3878k587J85240J9671P5078N6941
4987B769804J11333R0560j9195J17038K01892N4327P2617J58152Q2880R6663J61584
4976C897655L0627j549J43428J53919R7015K42934K06981Q5334J59351J81063
$$ plain form
5056 1017702 1099989 1104135 1041684 1045913 1102082 1170547 1219806 1280823 1266084 1194887 1180920 1108968
5044 1108968 1276948 1347080 1267328 1315232 1359951 1406797 1272172 1275412 1329186 1437765 1346770
5033 1346770 1364604 1337699 1358558 1353437 1391660 1531700 1451666 1456534 1457010 1517950 1558291 1589219
5021 1589219 1678856 1617641 1579042 1675628 1658761 1586520 1629355 1746254 1716665 1888463 1859880
5010 1859880 1818923 1815233 1821441 1859534 1949461 2028833 2093645 1988668 2012559 2071518 2103637 2162240
4998 2162240 2296879 2432381 2412517 2394995 2519339 2435461 2432874 2618114 2637785 2712863 2769804
4987 2769804 2881137 2971697 2952502 3069540 3271432 3325759 3398376 3556528 3639408 3736071 3897655
4976 3897655 3928282 3926733 4070161 4224080 4321095 4564029 4771010 4856344 5015695 5196758
4966E196758M8042J78397R5856J36105J26404J69859K0968K8115J67318J59696
4956F327518M0423M8956J26314L8510N2502J34946O1070K881k1490m6656K0322
4945F785296J41414P6384j11627j7932J93317J17768Q5408J03659Q115o4496k8386
4934G288920J52850J22952M5205O2290N0573J95013J09399J43318J78712J09405
4924H458637J27699K69562J54308O4881K29292K23504J20713J79817P0147N8086
4914I956646J68858K05094K78851l4739l4155K04489J33796Q9629O6762P653J13191
4903A1156075m1169J07572K6034j56355M1678L5719p6940q7319J9010j30847j43659
4892A0749799p7840j46184j20700p1334j16768n0980o4062j44331l0000n8417
$$ plain form
4966 5196758 5244800 5423197 5519053 5655158 5781562 5951421 5972389 6000504 6167822 6327518
4956 6327518 6367941 6416897 6543211 6581721 6634223 6769169 6830239 6833120 6811630 6764974 6785296
4945 6785296 6926710 7003094 6891467 6873535 7066852 7184620 7270028 7373687 7381802 7317306 7288920
4934 7288920 7441770 7564722 7609927 7672217 7722790 7917803 8027202 8170520 8349232 8458637
4924 8458637 8586336 8855898 9010206 9075087 9304379 9527883 9648596 9828413 9898560 9956646
4914 9956646 10125504 10330598 10609449 10574710 10540555 10745044 10878840 10968469 11035231 11042884 11156075
4903 11156075 11114906 11222478 11248512 11092157 11133835 11169554 11092614 11005295 11024305 10893458 10749799
4892 10749799 10671959 10525775 10405075 10333741 10216973 10165993 10101931 9957600 9927600 9869183
4882I869183j03876l5635n5050j40569j17914l8747P3180Q4313r4319p4311Q3512
4871I449767L9239j6861m8784l3420R051m8581J1509p356j37007j30495K8383
4860I115445K7385o8462j02510q8274j18995j61613M8603j02166k20288r1134
4850H237991j79106k04315k35824j03142o2451k40071k56073j77897l0856k00272
4840F547984j95057j53722k33252j41103j95659j44700p1825j28883k44148q7302
4830D952333m3009j85624j96912j60868J1434j91455j77629n3140m9157l9753
4820C866220K6696j76878o2397j15457j48025J3069l4871N5976p8535p6441j1554
4809C257803r024O2601J4955L3008j9395n8212l6147Q1009l4538J9475J5220k5716
$$ plain form
4882 9869183 9765307 9729672 9674622 9534053 9416139 9377392 9450572 9534885 9440566 9366255 9449767
4871 9449767 9489006 9472145 9423361 9389941 9398992 9350411 9361920 9354564 9217557 9087062 9115445
4860 9115445 9142830 9074368 8971858 8883584 8764589 8602976 8651579 8549413 8329125 8237991
4850 8237991 8058885 7854570 7618746 7515604 7453153 7213082 6957009 6779112 6748256 6547984
4840 6547984 6352927 6199205 5965953 5824850 5629191 5484491 5412666 5283783 5039635 4952333
4830 4952333 4909324 4723700 4526788 4365920 4377354 4185899 4008270 3955130 3905973 3866220
4820 3866220 3892916 3716038 3653641 3538184 3390159 3403228 3368357 3424333 3345798 3269357 3257803
4809 3257803 3248779 3311380 3326335 3359343 3339948 3281736 3245589 3326598 3292060 3311535 3326755 3301039
4797C301039o1197P0993N3303L0381J4323o8505m8297J07895J49523Q0909Q7974
4786C718341R268N0163L2158m1106L2753J66718K6738M0821J03430K10359O6950
4775D416593Q3838K2303J36269J97037J14668J35670K09781J42591q0513M0970
4765E419207J59763J36626R6595R8415N799P5152K32381R1313K8929L7628J99292
4754F581100J46882O6067L1922K18159J06411P3510p875n0467M907M7485R1522
4743G309623P4370Q4696o0346L9071L0532J19593O7773P0698J77995J11302R7805
4732H123112J27882J29109R5652J60885J33448J91104K41281J72139J90951R9055
4722I664618J44994Q7089J53341J40648M6050L700L3984J83420o6169N1408N6764
$$ plain form
4797 3301039 3239842 3310835 3364138 3394519 3408842 3340337 3292040 3399935 3549458 3630367 3718341
4786 3718341 3727609 3777772 3809930 3768824 3801577 3968295 3995033 4035854 4139284 4349643 4416593
4775 4416593 4500431 4522734 4659003 4856040 4970708 5106378 5316159 5458750 5378237 5419207
4765 5419207 5578970 5715596 5812191 5910606 5916405 5991557 6223938 6315251 6344180 6381808 6581100
4754 6581100 6727982 6794049 6825971 7044130 7150541 7224051 7216176 7165709 7170616 7218101 7309623
4743 7309623 7383993 7468689 7408343 7447414 7477946 7597539 7665312 7736010 7914005 8025307 8123112
4732 8123112 8250994 8380103 8475755 8636640 8770088 8961192 9202473 9374612 9565563 9664618
4722 9664618 9809612 9896701 10050042 10190690 10236740 10240440 10274424 10457844 10391675 10443083 10499847
4711A0499847J8508l9888r069K8559r9647o8658j6484j05559m2278j85258m5005
4700I935068q9398j04312j41896p8101j48387j18620J65525M0076j03378j21705
4690I234872M6066m1244m6829M5116l721p5702m4o9486l3063k080l7006O127L5751
4677I058757m8617J10700l1120n5239K3870l0861P5672M2011o3316l7017M5790
4666I090630j10276k02196k179p7416j30179k25989j72629j45961j11147q5202
4656G827456j82390j79737j21225l6514j45489j91441k66902k00829j06891k42463
4646F153575j24829j14640o6171j52828j84523K4072m0606j30439j08687p0300
4636E184624r8688j18938j7081o2081r2168L3280p673p1483O471r7544l6992j4204
$$ plain form
4711 10499847 10518355 10478467 10469398 10497957 10398310 10329652 10313168 10207609 10165331 9980073 9935068
4700 9935068 9845670 9741358 9599462 9521361 9372974 9254354 9419879 9459955 9356577 9234872
4690 9234872 9280938 9239694 9192865 9237981 9234260 9158558 9158514 9089028 9055965 9053885 9016879 9023006 9058757
4677 9058757 9010140 9120840 9089720 9034481 9058351 9027490 9103162 9145173 9081857 9044840 9090630
4666 9090630 8980354 8778158 8775979 8698563 8568384 8342395 8169766 8023805 7912658 7827456
4656 7827456 7645066 7465329 7344104 7307590 7162101 6970660 6703758 6502929 6396038 6153575
4646 6153575 6028746 5914106 5847935 5695107 5510584 5534656 5494050 5363611 5254924 5184624
4636 5184624 5085936 4966998 4949917 4887836 4795668 4828948 4821275 4749792 4756263 4658719 4621727 4607523
4624D607523q3243n3685k47058j68810M1240o9463K4028l9222n5046j87707j65933
4613C602624M1291o8494j64311j27610r1006O6394r2120j10590p5064q3373p0867
4602B826874j07376n9501j18651o3979k9133p7550j28246N2672o1006j4299q8906
4591B130899q8525l7274r208j6465j01913n7445q4054Q8525k7872j29461L491
4580A670698L0809k8519j8653k1415q4894q8230P5403o443m2248p737N8791m3897
4568A493665j23952M5503r6037m1975M3055N0083m3058K2706O976k3633O3339
4557A396672L1387r3218r0485l1047J4900j00837J2941P0074N6656N8949j05022
4546A220970J6162N9165M1695L8595p8992l4085P362l3538j5924m0633J9866P4182
$$ plain form
4624 4607523 4524280 4470595 4223537 4054727 4095967 4026504 4050532 4011310 3956264 3768557 3602624
4613 3602624 3643915 3575421 3411110 3283500 3192494 3258888 3166768 3056178 2981114 2897741 2826874
4602 2826874 2719498 2659997 2541346 2477367 2448234 2370684 2242438 2295110 2234104 2219805 2130899
4591 2130899 2042374 2005100 1995892 1979427 1877514 1820069 1736015 1824540 1796668 1667207 1670698
4580 1670698 1701507 1672988 1654335 1632920 1548026 1459796 1535199 1528756 1486508 1478771 1537562 1493665
4568 1493665 1369713 1415216 1319179 1277204 1320259 1370342 1327284 1349990 1356966 1333333 1396672
4557 1396672 1428059 1334841 1244356 1213309 1228209 1127372 1140313 1210387 1267043 1325992 1220970
4546 1220970 1237132 1296297 1337992 1376587 1297595 1263510 1270872 1237334 1221410 1180777 1200643 1274825
4534A274825l9510L5801k9887N074J8731q2613n2657R6363O0793q4141q9968J0664
4522A123475k1182P8155o1123J04353R5703l4475r3112M9558J34k8011q318p2922
4510A132235M743O8090j5620n6358J47198O6660n7541M572m8960K3501P5767O4385
4498A408672m601p1731p1116Q7411Q6595J03982j5305q6036R9544K6915q618j33873
4486A421839M8121K1435Q8125N3067Q1185j35019R0923J46602j1109j28017N1032
4475A728184J25998q362q760M4053M0249j7673n4601K7903r6129n9566k6145J0151
4463A705302J28521N9938j24051L263j9793M6114o04m7537J07312Q9003K8791
4452A976259p8085l3236N7652P2033n6876J9484K2741j01609N477N1059P9343
$$ plain form
4534 1274825 1235315 1271116 1241229 1246303 1265034 1182421 1129764 1226127 1286920 1202779 1112811 1123475
4522 1123475 1102293 1180448 1119325 1223678 1319381 1284906 1191794 1241352 1241486 1213475 1205157 1132235
4510 1132235 1136978 1205068 1189448 1133090 1280288 1346948 1289407 1293979 1245019 1268520 1344287 1408672
4498 1408672 1404071 1332340 1261224 1348635 1435230 1539212 1523907 1437871 1537415 1564330 1555712 1421839
4486 1421839 1469960 1491395 1579520 1632587 1713772 1578753 1669676 1816278 1805169 1677152 1728184
4475 1728184 1854182 1845820 1837060 1881113 1921362 1903689 1849088 1876991 1780862 1721296 1695151 1705302
4463 1705302 1833823 1893761 1769710 1772973 1753180 1799294 1798690 1751153 1858465 1947468 1976259
4452 1976259 1898174 1864938 1922590 1994623 1937747 1957231 1979972 1878363 1883840 1934899 2014242
4441B014242O5173J09951o6470O465R6908m7083N4744J22944N5734M1685l5P7756
4429B532014k8509j16690R8072J40585J25981q780M4226M7356J48747K5277r6663
4418B911616J13556K41598j12198L3538J83022N6971Q9220J56508K5774R6959
4408C796564R9255J39270K29957Q5324J35106K27013K02947J53116K55984L07150
4398E631686P8261J68986L00359K80560K60679M27438M53165L91894M47393N32822
4388H973243M29309N80899Q09302P52920P60202R08080Q90895P65333P82638P46567
4378A6399388P41606O74833Q72441R97999R63857R03808O32007M46889L40249
4369B2973077L75573L47939N53477M37680L45387O0998l42977n00089o74260o58606
$$ plain form
4441 2014242 2079415 2189366 2122896 2129361 2226269 2179186 2233930 2356874 2412608 2454293 2454258 2532014
4429 2532014 2503505 2386815 2484887 2625472 2751453 2742673 2786899 2834255 2983002 3008279 2911616
4418 2911616 3025172 3266770 3154572 3188110 3371132 3428103 3517323 3673831 3699605 3796564
4408 3796564 3895819 4035089 4265046 4350370 4485476 4712489 4915436 5068552 5324536 5631686
4398 5631686 5709947 5878933 6179292 6459852 6720531 7147969 7601134 7993028 8440421 8973243
4388 8973243 9402552 9983451 10792753 11545673 12305875 13213955 14104850 14870183 15652821 16399388
4378 16399388 17140994 17815827 18688268 19686267 20650124 21553932 22185939 22632828 22973077
4369 22973077 23348650 23696589 24250066 24687746 25033133 25094131 24751154 24251065 23576805 22918199
4359B2918199n01248l47831l74292n26156o93371q79147j003509j012670q60904
4350A6719071o52686p78080o70564q08331q14741q05026p41423n99116p14399
4341A0134705p10143m15429l70138m99536l90201l15304k14376k79821k71172
4332F668585k74716j63504j10101k96383j01959o0813j95047j47809n6629j78523
4322E083101q8256q1557o8919r2786o4536j10663j17648N5956M0957k450q4261
4311D468938j14883q0580J857k0994n8916Q3550q605K2692M8181K4462K5940K7968
4299D419610q9531J4872Q0704M977l9441j16675P8077J32967j8408R2141J51527
4288D710820l364O711L0970N4854l618P6327K6919j6892J10093P0424J08891Q7836
$$ plain form
4359 22918199 22416951 22069120 21694828 21168672 20475301 19596154 18592645 17579975 16719071
4350 16719071 16066385 15288305 14617741 13809410 12994669 12189643 11448220 10849104 10134705
4341 10134705 9424562 9009133 8638995 8139459 7749258 7433954 7219578 6939757 6668585
4332 6668585 6393869 6230365 6120264 5823881 5721922 5661109 5466062 5318253 5261624 5083101
4322 5083101 4994845 4913288 4844369 4751583 4687047 4576384 4458736 4514692 4555649 4553199 4468938
4311 4468938 4354055 4273475 4275332 4254338 4195422 4278972 4270367 4293059 4341240 4365702 4391642 4419610
4299 4419610 4330079 4344951 4425655 4430632 4391191 4274516 4352593 4485560 4467152 4559293 4710820
4288 4710820 4707456 4714167 4745137 4799991 4796373 4872700 4899619 4882727 4992820 5063244 5172135 5259971
4276E259971K5567P1629j7445J59444K63959N2669R2462J15637O4582J48772O9703
4265F306950J45260J98853J1083M8664P2513M0004J29826J06089K7143Q4879J20922
4254G292186K21908J25118J44931K10936J09602J26779J99535K00560K20584K56190
4244I108329K06043K10093O7539K30787L62131K28207K84913L77620K42528K55900
4234A1574090L99704L60275K90103M03609L91009M07290M40759M94984N33734
4225A5295557N94913O51463P21040O00508O79623P93393P82628Q92784R49656
4216B1961565R22791J002006J020632J201799J283969J348623J463617J556639
4208C1761641J716380J924229K060072K281013K605075K773105K987530L349068
$$ plain form
4276 5259971 5285538 5357167 5339722 5499166 5763125 5815794 5908256 6023893 6088475 6237247 6306950
4265 6306950 6452210 6651063 6662146 6710810 6783323 6823327 6953153 7059242 7086385 7171264 7292186
4254 7292186 7514094 7639212 7784143 7995079 8104681 8231460 8430995 8631555 8852139 9108329
4244 9108329 9314372 9524465 9592004 9822791 10184922 10413129 10698042 11075662 11318190 11574090
4234 11574090 11973794 12334069 12624172 13027781 13418790 13826080 14266839 14761823 15295557
4225 15295557 15890470 16541933 17262973 17863481 18543104 19336497 20119125 21011909 21961565
4216 21961565 22884356 23886362 24906994 26108793 27392762 28741385 30205002 31761641
4208 31761641 33478021 35402250 37462322 39743335 42348410 45121515 48109045 51458113
4200E1458113L566922M012665M485106M694763N112937N516900N920317O234906
4192I1002629O045093N622303M766473L290415J543065m48138k404225m054886
4184A05362729n538969o478486o847872o699099o173878n679495n029655m374488
4176E8540787l871427l423300k976531k580643k302685k108580j817449j657620
4168C7802552j450115j440197j182663r72062q24186j058292q74921p27121p13485
4159B8559510o49922n95410o52054n60693o59770o60753n61520o42427m96015
4150B3080946o25664m56701m08610m49143l40296m24992k81730k53372k11298
4141A9629140j34512k41942k10283j93271l16028k94301k10816j38601k27982
$$ plain form
4200 51458113 55025035 59037700 63522806 68217569 73330506 78847406 84767723 91002629
4192 91002629 97047722 102670025 107436498 110726913 112269978 111821840 109417615 105362729
4184 105362729 99823760 93345274 86497402 79798303 73624425 67944930 62915275 58540787
4176 58540787 54669360 51246060 48269529 45688886 43386201 41277621 39460172 37802552
4168 37802552 36352437 34912240 33729577 32757515 31933329 30875037 30000116 29272995 28559510
4159 28559510 27909588 27314178 26662124 26101431 25441661 24780908 24219388 23576961 23080946
4150 23080946 22455282 21998581 21589971 21140828 20800532 20375540 20093810 19840438 19629140
4141 19629140 19494628 19252686 19042403 18849132 18533104 18238803 18027987 17889386 17661404
4132A7661404k14728k44428j65229k6188r1676m6465j31829J9437j10713j22625
4122A6526960M5563J03980N1644O3321J17452L7207J70730J99518J93819J33626
4112A7643820J68734K24857J94990K38804K93400L45372K51451M96325M40590
4103B0298343N00235N08798L76108N71516P59416O50017P26481P41659Q62361
4094B5994934Q12038P91720J029160R57961J076858J341864J239340J324559J572961
4085C6141395J638689J863536K039038K172079K317450K667696K961275L200988
4077E5002146L401922L789429M280873M595326N193930N857416O277643O843953
4069I5242638P209996P705475P767364O877759N245696K537474r05057m231552
$$ plain form
4132 17661404 17446676 17202248 17037019 17010831 16919155 16872690 16740861 16760298 16649585 16526960
4122 16526960 16572523 16676503 16728147 16791468 16908920 16946127 17116857 17316375 17510194 17643820
4112 17643820 17812554 18037411 18232401 18471205 18764605 19109977 19361428 19857753 20298343
4103 20298343 20798578 21307376 21683484 22255000 23014416 23664433 24390914 25132573 25994934
4094 25994934 26806972 27598692 28627852 29585813 30662671 32004535 33243875 34568434 36141395
4085 36141395 37780084 39643620 41682658 43854737 46172187 48839883 51801158 55002146
4077 55002146 58404068 62193497 66474370 71069696 76263626 82121042 88398685 95242638
4069 95242638 102452634 110158109 117925473 124803232 130048928 132586402 131681345 127449793
4061A27449793o858012q114072q345433p886493p284985o594318n660692m993486
4053G1712302m524050l972040l510790l182275k784060k303289k113798j905404
4045D7416596j528000j458267j278067j209338q74315p96875p61760n51667n43010
4036C8415297m81301k47831j66144j82581k32457r9745k2346q8473Q1423L15258
4026C7291100K05231J83331L47011M49029N42376N03996O74672O67572Q62104
4017D1726422Q61713Q08954R34020J070970J062141R67918J229548J264002J276523
4008E1202211J285934J274891J159525J239122J194985J208206J197604J076120
4000F0838598J148131J093130J011047J073671J018504J077203R82159Q05606
$$ plain form
4061 127449793 120591781 112477709 104132276 96245783 88960798 82366480 76705788 71712302
4053 71712302 67188252 63216212 59705422 56523147 53739087 51435798 49322000 47416596
4045 47416596 45888596 44430329 43152262 41942924 41068609 40271734 39509974 38958307 38415297
4036 38415297 37933996 37686165 37520021 37337440 37104983 37005238 36982892 36894419 36975842 37291100
4026 37291100 37496331 37679662 38026673 38475702 39018078 39522074 40196746 40864318 41726422
4017 41726422 42588135 43397089 44331109 45402079 46464220 47432138 48661686 49925688 51202211
4008 51202211 52488145 53763036 54922561 56161683 57356668 58564874 59762478 60838598
4000 60838598 61986729 63079859 64090906 65164577 66183081 67260284 68242443 69048049
3992F9048049R65531R43071Q96705Q88534O81906Q09534P01210Q06211Q45015
3983G6585766R51159J038791R08495J173145J472632K174377K294185K055552
3975H8654102R33182q64013l240927m751271m992064m804884m058301l409235
3967F3466589l011892k715000k402780k248998k143252j993727j877318j760531
3959D5313091j664934j617672j690634j502627j166868j294278j290857j060673
3951C4024548j122472j042053j030001r51095q38656q44528q01109p51967p50625
3942B5892042o64147p49657o89079o85991o33878m03326n02720n38036m30969
3933B0594239m01710m75458m06627k26504l26275l57803l49457k53915j77274
$$ plain form
3992 69048049 70013580 70956651 71853356 72741890 73423796 74233330 74934540 75740751 76585766
3983 76585766 77536925 78575716 79484211 80657356 82129988 84304365 86598550 88654102
3975 88654102 89587284 88723271 85482344 80731073 75739009 70934125 66875824 63466589
3967 63466589 60454697 57739697 55336917 53087919 50944667 48950940 47073622 45313091
3959 45313091 43648157 42030485 40339851 38837224 37670356 36376078 35085221 34024548
3951 34024548 32902076 31860023 30830022 29878927 29040271 28195743 27394634 26642667 25892042
3942 25892042 25227895 24478238 23789159 23103168 22469290 22065964 21563244 21025208 20594239
3933 20594239 20192529 19717071 19310444 19083940 18757665 18399862 18050405 17796490 17619216
3924A7619216k74116j98788k37644l24050j30077q7762j25937j7758p8025j32707
3914A6012352m1179o6621j03146L3286l9660j1504J5956K5512o1348J38121P0874
3903A5972643n9242Q254K3121Q1074o6159N3510P7116o9847N7685O0660P9933
3892A6218748l7061J77101J90803J47003J62691R3938N6730J59026J20036J91439
3882A7480454K19062P4016K42821K67092K53939J45969K54865K87149M05894K16033
3872A9847294K05599K95593L43174L21595L54757L55360L86935L47119L93097
3863B2850523L21878L09143L12763J90763K50573M55510L54842K95895L26027
3854B5667917K83570L81259K90055K61778K64628M51762L42844L25655M12927
$$ plain form
3924 17619216 17345100 17146312 16908668 16584618 16454541 16366779 16240842 16223084 16145059 16012352
3914 16012352 15971173 15904552 15801406 15834692 15795032 15783528 15799484 15824996 15763648 15901769 15972643
3903 15972643 15913401 15921655 15944776 16025850 15959691 16013201 16090317 16020470 16078155 16138815 16218748
3892 16218748 16181687 16358788 16549591 16696594 16859285 16953223 17009953 17168979 17289015 17480454
3882 17480454 17699516 17773532 18016353 18283445 18537384 18683353 18938218 19225367 19631261 19847294
3872 19847294 20052893 20348486 20691660 21013255 21368012 21723372 22110307 22457426 22850523
3863 22850523 23172401 23481544 23794307 23985070 24235643 24691153 25045995 25341890 25667917
3854 25667917 25951487 26332746 26622801 26884579 27149207 27600969 27943813 28269468 28682395
3845B8682395M80906M18911L38396M68512N07936M29940N28941N61550O27111
3836C3044598O44831P08857Q46285Q87809Q25260J056641J127222J125727J214113
3827D1481343J324397J428884J604708J703467J708283J943553J919857K022526
3819E5137018K256251K348872K469208K592282K756573K804568K885378L008581
3811G6258731L038976L160111L127915L115443L013872K985805K880068K688813
3803A00269734K591998K348961K102876J803042J440318J231638R23388N76613
3795A13288568K23557j48911l22981o69971j059179j424400j422943j673654k044064
3786A04746022k137494k366964k472501k738985k725740k793279k875079k895060
$$ plain form
3845 28682395 29163301 29582212 29920608 30389120 30897056 31326996 31855937 32417487 33044598
3836 33044598 33689429 34398286 35244571 36132380 36957640 38014281 39141503 40267230 41481343
3827 41481343 42805740 44234624 45839332 47542799 49251082 51194635 53114492 55137018
3819 55137018 57393269 59742141 62211349 64803631 67560204 70364772 73250150 76258731
3811 76258731 79297707 82457818 85585733 88701176 91715048 94700853 97580921 100269734
3803 100269734 102861732 105210693 107313569 109116611 110556929 111788567 112711955 113288568
3795 113288568 113512125 113363214 113040233 112370262 111311083 109886683 108463740 106790086 104746022
3786 104746022 102608528 100241564 97769063 95030078 92304338 89511059 86635980 83740920
3778H3740920k955343k968253k975966k855205k886016k683331k714799k558008
3770F1143999k454423k426223k301080k090425j944771j954930j768943j747105
3762D4456099j636157j353681j289283j192205j164142j221710j006067q98687
3754C4694167q52586p94645q69901p25286o52994o89795o23326m91949o93363
3745B8300322n26615m70205m52868m81344n37389m55965m23994l40792m84041
3736B4127109l77809l05099l59510n35936l61628l54295l85091m51462m09719
3727B0586560m11223l64082m35361m98537j83631l24865n36336m13260m49677
3718A6969588l25252m30916l55516l65361l07755k12251k62624l53070l52977
$$ plain form
3778 83740920 80785577 77817324 74841358 71986153 69100137 66416806 63702007 61143999
3770 61143999 58689576 56263353 53962273 51871848 49927077 47972147 46203204 44456099
3762 44456099 42819942 41466261 40176978 38984773 37820631 36598921 35592854 34694167
3754 34694167 33841581 33046936 32177035 31451749 30798755 30108960 29485634 28993685 28300322
3745 28300322 27773707 27303502 26850634 26369290 25831901 25375936 24951942 24611150 24127109
3736 24127109 23749300 23444201 23084691 22548755 22187127 21832832 21447741 20996279 20586560
3727 20586560 20175337 19811255 19375894 18877357 18693726 18368861 17832525 17419265 16969588
3718 16969588 16644336 16213420 15857904 15492543 15184788 14972537 14709913 14356843 14003866
3709A4003866j66524j76494k43488k18143k71741j43903k80295k07770q9305j47583
3699A2058620j09618p1415j49268r4046k20950m1502q5163k10381K0886j4487
3689A1082676m8501p4766p8373j12055K4816j16812j08593N5423n3425q6980n8475
3678A0424935j13749O8866O0661L001p6588j19825O0996P2856J41756r830m8860
3667A0464219J03191K2651N592R7437J32702Q9226J36878K8913j3933J87733J32195
3656A1386804O9580J08010J53645K40550Q0510J78143J46491L76468K05277L22481
3646A3267959K60179L00547K34192L00412M16362K76003L56437M09692L77845
3637A6199628M45939M82982L78794M60381N93911M52112N00264N04859M43423
$$ plain form
3709 14003866 13837342 13660848 13417360 13199217 12927476 12783573 12503278 12295508 12206203 12058620
3699 12058620 11949002 11877587 11728319 11634273 11413323 11371821 11286658 11076277 11097163 11082676
3689 11082676 11034175 10959409 10881036 10768981 10793797 10676985 10568392 10623815 10570390 10483410 10424935
3678 10424935 10311186 10380052 10440713 10443714 10367126 10247301 10308297 10381153 10522909 10513079 10464219
3667 10464219 10567410 10590061 10595653 10693090 10825792 10915018 11051896 11080809 11066876 11254609 11386804
3656 11386804 11456384 11564394 11718039 11958589 12039099 12217242 12363733 12740201 12945478 13267959
3646 13267959 13528138 13828685 14062877 14363289 14779651 15055654 15412091 15821783 16199628
3637 16199628 16645567 17128549 17507343 17967724 18561635 19013747 19514011 20018870 20462293
3628B0462293M73643M38918L98588K94790M65261M87778L81146M04343L88322
3619B4195082K42655L26691K71145K41706J67882J94492K56126R2660P3241J38994
3609B6200674J75254J0498L4159J40006R6773K03375J70813K31910J28976J01998
3599B7494436K42556K64065L81318L12405L77531M05192N11248N60687O38258
3590C1187696P25625P92199Q15806Q51607J114140J052133J109332J211253J216016
3581D0075807J332407J400646J401514J505156J519088J603208J628391J585281
3573E2051498J496225J632547J566700J413321J398629J299003J259677J225721
3565F3343321J140429J183667J069315R08210Q42027P20902N45786M80058M71745
$$ plain form
3628 20462293 20935936 21374854 21773442 22068232 22533493 23021271 23402417 23806760 24195082
3619 24195082 24437737 24764428 25035573 25277279 25445161 25639653 25895779 25988439 26061680 26200674
3609 26200674 26375928 26386426 26420585 26560591 26657364 26860739 27031552 27263462 27392438 27494436
3599 27494436 27736992 28001057 28382375 28694780 29072311 29477503 29988751 30549438 31187696
3590 31187696 31913321 32705520 33521326 34372933 35487073 36539206 37648538 38859791 40075807
3581 40075807 41408214 42808860 44210374 45715530 47234618 48837826 50466217 52051498
3573 52051498 53547723 55180270 56746970 58160291 59558920 60857923 62117600 63343321
3565 63343321 64483750 65667417 66736732 67644942 68486969 69207871 69753657 70233715 70705460
3556G0705460K95276L69103J62613L3155K46654O6270M5526L0479J12983L3626
3546G2101145p6640L3525m8788m0222m6340Q8603j5471K7107L2941q5666m3009
$$ plain form
3556 70705460 71000736 71369839 71532452 71565607 71812261 71878531 71924057 71954536 72067519 72101145
3546 72101145 72024505 72058030 72009242 71969020 71922680 72011283 71995812 72022919 72055860 71970194 71927185
$$ [...]
##END NTUPLES=NMR SPECTRUM
##END=
