##TITLE=1H_TG-2351
 CDCl3
 8 sc, 
 9.03.2022
##JCAMPDX= 6.0         $$ Bruker NMR JCAMP-DX V2.0
##DATA TYPE= NMR SPECTRUM
##DATA CLASS= NTUPLES
##ORIGIN= UXNMR, Bruker Analytische Messtechnik GmbH
##OWNER= root
$$ XWIN-NMR		Version 3.5
$$ Wed Mar  9 11:38:44 2022 Russian Standard Time (UT+4h)  she@DPX200
##.OBSERVE FREQUENCY= 200.131346
##.OBSERVE NUCLEUS= ^1H
##.ACQUISITION MODE= SIMULTANEOUS
##.ACQUISITION SCHEME= undefined
##.AVERAGES= 8
##.DIGITISER RES= 18
##SPECTROMETER/DATA SYSTEM= spect
##.PULSE SEQUENCE= zg30
##.SOLVENT NAME= CDCl3
##.SHIFT REFERENCE= (INTERNAL, CDCl3, 0, 15.7105)
##AUDIT TRAIL= $$ (NUMBER, WHEN, WHO, WHERE, WHAT)
$$ ##TITLE= Audit trail, XWIN-NMR		Version 3.5
$$ ##JCAMPDX= 5.01
$$ ##ORIGIN= Bruker BioSpin GmbH
$$ ##OWNER= she
$$ F:/spectra/data/she/nmr/H-F/1/pdata/1/auditp.txt
$$ ##AUDIT TRAIL=  $$ (NUMBER, WHEN, WHO, WHERE, WHAT)
(   1,<2022-03-09 11:35:50.57 +0400>,<she>,<DPX200>,
      <created by zg, POWCHK disabled, PULCHK disabled
       configuration hash MD5:
       00 E9 B6 7A A2 85 ED C7 34 08 36 98 17 FE 4E 26
       data hash MD5: 16K
       03 3C 4E 53 02 27 2F 24 26 AB 5C 0A 10 64 0E ED>)
(   2,<2022-03-09 11:37:34.56 +0400>,<she>,<DPX200>,
      <Start of raw data processing
       efp BC_mod = 2 LB = 0.24 FT_mod = 6 PKNL = 1 PHC0 = -16583 PHC1 = 6.400778 SI = 16K 
       data hash MD5: 16K
       7D 08 88 5B 67 21 2E AD A8 F9 33 A4 BA 67 28 73>)
(   3,<2022-03-09 11:37:51.50 +0400>,<she>,<DPX200>,
      <pk PHC0 = -7.668694 PHC1 = 10.2 
       data hash MD5: 16K
       D6 5D F1 C7 1C 4E 37 68 15 19 18 81 FB 2C E5 78>)
(   4,<2022-03-09 11:37:54.87 +0400>,<she>,<DPX200>,
      <abs ABSG = 5 
       data hash MD5: 16K
       9D BE 25 C4 71 FC E6 9A 17 FB 01 D5 C7 77 78 D7>)
$$ ##END=
$$ 
$$ hash MD5
$$ 60 85 EC E9 06 45 D5 39 00 68 21 15 C3 00 9F 82
##$RELAX= 
##$RELAX= 
##$RELAX= 
##$RELAX= 
##$RELAX= 
##$RELAX= 
$$ Bruker specific parameters
$$ --------------------------
##$DU= <F:/spectra>
##$EXPNO= 1
##$NAME= <H-F>
##$PROCNO= 1
##$TYPE= <nmr>
##$USER= <she>
##$AMP= (0..31)
100 100 100 100 100 100 100 100 100 100 100 100 100 100 100 100 100 100 
100 100 100 100 100 100 100 100 100 100 100 100 100 100 
##$AQSEQ= 0
##$AQ_mod= 1
##$AUNM= <au_zg>
##$AUTOPOS= <>
##$BF1= 200.13
##$BF2= 200.13
##$BF3= 200.13
##$BF4= 200.13
##$BF5= 200.13
##$BF6= 200.13
##$BF7= 200.13
##$BF8= 200.13
##$BYTORDA= 1
##$CFDGTYP= 0
##$CFRGTYP= 5
##$CHEMSTR= <none>
##$CNST= (0..31)
1 1 145 1 1 1 1 1 1 1 1 1 1 1 1 1 1 1 1 1 1 1 1 1 1 1 1 1 1 1 1 1 
##$CPDPRG= <>
##$CPDPRG1= <>
##$CPDPRG2= <>
##$CPDPRG3= <>
##$CPDPRG4= <mlev>
##$CPDPRG5= <mlev>
##$CPDPRG6= <mlev>
##$CPDPRG7= <mlev>
##$CPDPRG8= <mlev>
##$CPDPRGB= <>
##$CPDPRGT= <>
##$D= (0..31)
0 1.2 0 0 0 0 0 0 0 0.06 0 0.03 0 0 0 0 0.0002 0 0 0 0 0 0 0 0 0 0 0 0 
0 0 0 
##$DATE= 1646811350
##$DBL= (0..7)
120 120 120 120 120 120 120 120 
##$DBP= (0..7)
150 150 150 150 150 150 150 150 
##$DBP07= 0
##$DBPNAM0= <>
##$DBPNAM1= <>
##$DBPNAM2= <>
##$DBPNAM3= <>
##$DBPNAM4= <>
##$DBPNAM5= <>
$$ [...]
##$SUBNAM2= <"">
##$SUBNAM3= <"">
##$SUBNAM4= <"">
##$SUBNAM5= <"">
##$SUBNAM6= <"">
##$SUBNAM7= <"">
##$SUBNAM8= <"">
##$SUBNAM9= <"">
##$SW= 18.0517287032376
##$SWIBOX= (0..15)
0 0 2 0 0 0 0 0 0 0 0 0 0 0 0 0 
##$SW_h= 3612.71676300578
##$TD= 16384
##$TD0= 1
##$TE= 0
##$TE2= 300
##$TE3= 300
##$TEG= 300
##$TL= (0..7)
0 120 120 120 120 120 120 120 
##$TP= (0..7)
150 150 150 150 150 150 150 150 
##$TP07= 0
##$TPNAME0= <>
##$TPNAME1= <>
##$TPNAME2= <>
##$TPNAME3= <>
##$TPNAME4= <>
##$TPNAME5= <>
##$TPNAME6= <>
##$TPNAME7= <>
##$TPOAL= (0..7)
0.5 0.5 0.5 0.5 0.5 0.5 0.5 0.5 
##$TPOFFS= (0..7)
0 0 0 0 0 0 0 0 
##$TUNHIN= 0
##$TUNHOUT= 0
##$TUNXOUT= 0
##$USERA1= <user>
##$USERA2= <user>
##$USERA3= <user>
##$USERA4= <user>
##$USERA5= <user>
##$V9= 5
##$VALIST= <valist>
##$VCLIST= <CCCCCCCCCCCCCCC>
##$VD= 0
##$VDLIST= <DDDDDDDDDDDDDDD>
##$VPLIST= <PPPPPPPPPPPPPPP>
##$VTLIST= <TTTTTTTTTTTTTTT>
##$WBST= 1024
##$WBSW= 4
##$XGAIN= (0..3)
0 0 0 0 
##$XL= 0
##$YL= 0
##$YMAX_a= 146095
##$YMIN_a= -249137
##$ZGOPTNS= <>
##$ZL1= 120
##$ZL2= 120
##$ZL3= 120
##$ZL4= 120
##$ABSF1= 15.71935
##$ABSF2= -2.3325
##$ABSG= 5
##$ABSL= 3
##$ALPHA= 0
##$AQORDER= 0
##$ASSFAC= 0
##$ASSFACI= 0
##$ASSFACX= 0
##$ASSWID= 0
##$AUNMP= <proc_1d>
##$AZFE= 0.1
##$AZFW= 0.1
##$BCFW= 0
##$BC_mod= 2
##$BYTORDP= 0
##$COROFFS= 0
##$CY= -3
##$DATMOD= 1
##$DC= 0
##$DFILT= <>
##$DTYPP= 0
##$F1P= 0
##$F2P= 0
##$FCOR= 1
##$FTSIZE= 16384
##$FT_mod= 6
##$GAMMA= 0
##$GB= 0
##$INTBC= 1
##$INTSCL= 0
##$ISEN= 128
##$LB= 0.24
##$LEV0= 0
##$LPBIN= 0
##$MAXI= 10000
##$MC2= 0
##$MEAN= 0
##$ME_mod= 0
##$MI= 1.114404
##$NCOEF= 0
##$NC_proc= -8
##$NLEV= 6
##$NOISF1= 3.799351
##$NOISF2= 2.8
##$NSP= 0
##$NTH_PI= 0
##$NZP= 0
##$OFFSET= 15.71053
##$PC= 1
##$PHC0= -16590.67
##$PHC1= 16.60078
##$PH_mod= 1
##$PKNL= yes
##$PPARMOD= 0
##$PSCAL= 0
##$PSIGN= 0
##$REVERSE= no
##$SF= 200.130008210058
##$SI= 16384
##$SIGF1= 3
##$SIGF2= 2
##$SINO= 5.538805
##$SIOLD= 16384
##$SREGLST= <1H.CDCl3>
##$SSB= 0
##$STSI= 16384
##$STSR= 0
##$SW_p= 3612.71676300578
##$SYMM= 0
##$S_DEV= 0
##$TDeff= 16384
##$TDoff= 0
##$TI= <>
##$TILT= no
##$TM1= 0
##$TM2= 0
##$TOPLEV= 0
##$USERP1= <user>
##$USERP2= <user>
##$USERP3= <user>
##$USERP4= <user>
##$USERP5= <user>
##$WDW= 1
##$XDIM= 16384
##$YMAX_p= 449318339
##$YMIN_p= -1126093
$$ End of Bruker specific parameters
$$ ---------------------------------
##NTUPLES= NMR SPECTRUM
##VAR_NAME=  FREQUENCY,     SPECTRUM/REAL,   SPECTRUM/IMAG
##SYMBOL=    X,             R,               I
##VAR_TYPE=  INDEPENDENT,   DEPENDENT,       DEPENDENT
##VAR_FORM=  AFFN,          ASDF,            ASDF
##VAR_DIM=   16384,         16384,           16384
##UNITS=     HZ,            ARBITRARY UNITS, ARBITRARY UNITS
##FACTOR=    0.220516191357247, 1,           1
##FIRST=     3144.14855413428, 0,            0
##LAST=      -468.568208871498, 0,           0
##MIN=       -468.568208871498, -1126093,    0
##MAX=       3144.14855413428, 449318339,    0
$$ Real data points
##PAGE= N=1
##DATA TABLE= (X++(R..R)), XYDATA
$$ [...]
6977B267078L94662M4745k50903K61383J90096j53964M6006k10022j45719J80328
$$ 2267078 2661740 2706485 2455582 2716965 2907061 2753097 2799103 2589081 2443362 2623690
6967B623690p6161l09312j80406J06059Q824j00435L3665K5368J7036m53025K27242
$$ 2623690 2547529 2238217 2057811 2163870 2172694 2072259 2105924 2131292 2148328 1695303 1922545
6956A922545j77137j45431K39491n4798r7925k24974J09908J46419J7726K05776
$$ 1922545 1745408 1599977 1839468 1784670 1686745 1461771 1571679 1718098 1735824 1941600
6946A941600k95009j767J22580j76507O0101K05859j2804m20266k75687M65442
$$ 1941600 1646591 1644824 1767404 1590897 1650998 1856857 1844053 1423787 1148100 1613542
6936A613542k41357k33600L00832K3824N5075q4859M4942K36159k22409j56299
$$ 1613542 1372185 1138585 1439417 1463241 1518316 1433457 1478399 1714558 1492149 1335850
6926A335850K86906m12404N8890J18912k95127j74865K68204K93167l99113O7492
$$ 1335850 1622756 1210352 1269242 1388154 1093027 918162 1186366 1479533 1080420 1147912
6916A147912j4121j94882K43584j25784L51676J62455j40723l64300q0098p448
$$ 1147912 1133791 938909 1182493 1056709 1408385 1570840 1430117 1065817 985719 978271
6906I78271J90084K6427J70632K12778M1515Q5562m38565m6610m2859m6257o1165
$$ 978271 1168355 1194782 1365414 1578192 1619707 1705269 1266704 1220094 1177235 1130978 1069813
6895A069813O5252k49203R5690K4861J71768J38425L5337L5423J43231j45678
$$ 1069813 1135065 885862 981552 1006413 1178181 1316606 1351943 1387366 1530597 1384919
6885A384919l18984L8167L1719L70781j32508J96382k69665j06009q7896j22033
$$ 1384919 1065935 1104102 1135821 1506602 1374094 1570476 1300811 1194802 1106906 984873
6875I84873K8239P0041M5020j23956M51233O2646l67236l13741m1083K02594J11440
$$ 984873 1013112 1083153 1128173 1004217 1455450 1518096 1150860 837119 796036 998630 1110070
6864A110070q2896L5605j46179j26724L41464N9715j31943L51460m353J45003
$$ 1110070 1027174 1062779 916600 789876 1131340 1191055 1059112 1410572 1406219 1551222
6854A551222k65166l2191m4376N2326K12008j73916k73614L0952M60590O4429
$$ 1551222 1286056 1253865 1209489 1261815 1473823 1299907 1026293 1057245 1517835 1582264
6844A582264l13647m09197R3656K11563p1762K19726K42360k78122m34909J09803
$$ 1582264 1268617 859420 953076 1164639 1092877 1312603 1554963 1276841 841932 951735
6834I51735M72966l54411j63048M21060P3308p3236J00596j25009k04771n62716
$$ 951735 1424701 1070290 907242 1328302 1401610 1328374 1428970 1303961 1099190 536474
6824E36474Q2710L02131J61485J65851j2878k79834K21456P4641j87527O2947
$$ 536474 619184 921315 1082800 1248651 1235773 955939 1177395 1252036 1064509 1127456
6814A127456j21034k06773N54900j8297j4517L7615l64495J66151J30396k30689
$$ 1127456 1006422 799649 1354549 1336252 1321735 1359350 994855 1161006 1291402 1060713
6804A060713K91727k727l35209o033K28794j4912k25491k69580l37404P5064O57220
$$ 1060713 1352440 1349713 1014504 1008471 1237265 1222353 996862 727282 389878 464942 1122162
6793A122162J34804j80305J76995j71500J23088j46290j30566K38516N7078K40979
$$ 1122162 1256966 1076661 1253656 1082156 1205244 1058954 928388 1166904 1223982 1464961
6783A464961L46291J17393j48625p6558p83797Q5213L02461K5598M9325k44052
$$ 1464961 1811252 1928645 1780020 1703462 919665 1004878 1307339 1332937 1382262 1138210
6773A138210M09715j22970J69426l15573q081M82332j25105l19570N32960J33234
$$ 1138210 1547925 1424955 1594381 1278808 1270727 1753059 1627954 1308384 1841344 1974578
6763A974578J13729J02193m85245R4743L95036l10601J17751l18053k04386J38349
$$ 1974578 2088307 2190500 1705255 1799998 2195034 1884433 2002184 1684131 1479745 1618094
6753A618094j71931j08461M8948N3093K83046J44086j11137j24033M119q7055
$$ 1618094 1446163 1337702 1386650 1439743 1722789 1866875 1755738 1631705 1635824 1548769
6743A548769m28493k73272L12772J25841M6217j43427j92378J91374J20703n6386
$$ 1548769 1120276 847004 1159776 1285617 1331834 1188407 996029 1187403 1308106 1251720
6733A251720o0485j62025L76348J7371j98536l750l13952O3349J69046K98788
$$ 1251720 1191235 1029210 1405558 1422929 1224393 1220643 906691 970040 1139086 1437874
6723A437874o67564J99886K38359R0777k16459j06497j67632P0619M74335j20397
$$ 1437874 770310 970196 1208555 1299332 1082873 976376 808744 879363 1353698 1233301
6713A233301J1664l25806N37331L94847j81099m32423j04272k8675J11746j03446
$$ 1233301 1244965 919159 1456490 1851337 1670238 1237815 1133543 1104868 1216614 1113168
6703A113168r9620M36663L55599K29211J99274k70309K68760n9508n21761P6355
$$ 1113168 1013548 1450211 1805810 2035021 2234295 1963986 2232746 2173238 1651477 1727832
6693A727832m23960J18669p9733P120M81616J65849j88860J12680j23278k48162
$$ 1727832 1303872 1422541 1342808 1349928 1831544 1997393 1808533 1921213 1797935 1549773
6683A549773p7832K6602L54561k33529k70448K62672l83757N8539l22104k79202
$$ 1549773 1471941 1498543 1853104 1619575 1349127 1611799 1228042 1286581 964477 685275
6673F85275L63975N73726o2861p34752q6057K91711J49560l57259l43575K9750
$$ 685275 1049250 1622976 1560115 825363 739306 1031017 1180577 823318 479743 509493
6663E09493O27364R4693M45251j28627j81181J77895l06277l13950m18906N34151
$$ 509493 1136857 1231550 1676801 1548174 1366993 1544888 1238611 924661 505755 1039906
6653A039906P6122O9392K3740j59083K632J79599Q7633o5200j68773o12081l314
$$ 1039906 1116028 1185420 1209160 1050077 1052709 1232308 1319941 1254741 1085968 473887 470573
6642D70573N41188j90627j57152P7837J81003J45323J65840k02345k38096O9991
$$ 470573 1011761 821134 663982 741819 922822 1068145 1233985 1031640 793544 863535
6632H63535J97398j90940n8386N11201K02898P4952j95464J50244P0454k92477
$$ 863535 1060933 869993 811607 1322808 1525706 1600658 1405194 1555438 1625892 1333415
6622A333415M6802M46307j51141q0695O695n1810q2606j60033k03411J31951M38092
$$ 1333415 1380217 1826524 1675383 1594688 1601383 1549573 1466967 1306934 1103523 1235474 1673566
6611A673566k0305l85246k21119J10136j01507j73588J18740M33682K18777j06746
$$ 1673566 1653261 1268015 1046896 1157032 1055525 881937 1000677 1434359 1653136 1546390
6601A546390j23455J61145q7900k9373l61350J71071K5245K75785R4859l20274
$$ 1546390 1422935 1584080 1496180 1466807 1105457 1276528 1301773 1577558 1672417 1352143
6591A352143j21156k36806n9572n84678L19165J51098k9009K82271J26910L28997
$$ 1352143 1230987 994181 934609 349931 669096 820194 791185 1073456 1200366 1529363
6581A529363M9753m35336O11262J76271n57173r5301K92404J49458j3172l68944
$$ 1529363 1579116 1143780 1755042 1931313 1374140 1278839 1571243 1720701 1707529 1338585
6571A338585r6657m1363J05171J08149J49355k30156l70709n67572P8734O36337
$$ 1338585 1241928 1200565 1305736 1413885 1563240 1333084 962375 394803 473537 1109874
6561A109874j68906o8467k77651j07533K80856L09954k06359J96377k61752n14895
$$ 1109874 940968 872501 594850 487317 768173 1078127 871768 1068145 806393 291498
6551B91498K60311M91344L8599l91804O7059J93478R6956l95041P177j50514q9568
$$ 291498 551809 1043153 1081752 689948 757007 950485 1047441 652400 659577 509063 419495
6540D19495R2808L83484K1756k13619j7391l817n4224Q8190j20045J60239J85094
$$ 419495 512303 895787 917543 703924 686533 682716 628492 716682 596637 756876 941970
6529I41970k98409K14723k13040n6078M3921L6743m5221J821n21169J71801L25203
$$ 941970 643561 858284 645244 589166 633087 669830 624609 626430 105261 277062 602265
6518F02265K06438j1485k52576L31703M94990o18992m54835M14935L62909j4665
$$ 602265 808703 797218 544642 876345 1371335 752343 297508 712443 1075352 1060687
6508A060687R5535l26762J98329l51205k96595J0647M55712J13486m9487M6302
$$ 1060687 1156222 829460 1027789 676584 379989 390636 846348 959834 910347 956649
6498I56649j36697J58700l50328J55971j6119j05642K16732K48916k78664M61408
$$ 956649 819952 978652 628324 784295 768176 662534 879266 1128182 849518 1310926
6488A310926l01450J57047J24255q7623M0594j10547j88058j82279K90845L10170
$$ 1310926 1009476 1166523 1290778 1203155 1243749 1133202 945144 762865 1053710 1363880
6478A363880N9603m2663j35698j94255l7342j07953J01694K22884M5371K51079
$$ 1363880 1423483 1380820 1245122 1050867 1013525 905572 1007266 1230150 1275521 1526600
6468A526600q3189j61355o9233k32610k10558M30475M9661O2182L1738k05666
$$ 1526600 1443411 1282056 1212823 980213 769655 1200130 1249791 1311973 1343711 1138045
6458A138045j01574J08992M04307p6769l46022k8326L7017J09524N0313j58094
$$ 1138045 1036471 1145463 1549770 1473001 1126979 1098653 1135670 1245194 1295507 1137413
6448A137413k40371J72720K14433k98471N3115L7996k4947j87173M01498k24732
$$ 1137413 897042 1069762 1284195 985724 1038839 1076835 1051888 864715 1266213 1041481
6438A041481k81092J60496J07457R5200l15588P7186L39710m42629P2040J57750
$$ 1041481 760389 920885 1028342 1123542 807954 885140 1224850 782221 854261 1012011
6428A012011L69107Q5284k62429K80213L65598K694K62886N2339k00459M8968
$$ 1012011 1381118 1466402 1203973 1484186 1849784 1852478 2115364 2167703 1967244 2016212
6418B016212J71943K67722J71378M9115l24684l00093k57226k21374O01090j02820
$$ 2016212 2188155 2455877 2627255 2676370 2351686 2051593 1794367 1572993 2174083 2071263
6408B071263l8888l51176J42305L06605l73238O7601m46522L26740L0700O4474
$$ 2071263 2032375 1681199 1823504 2130109 1756871 1824472 1377950 1704690 1735390 1799864
6398A799864M1587l36540K27083K10238K96183l23965n3699m0942K01079J386
$$ 1799864 1841451 1504911 1731994 1942232 2238415 1914450 1860751 1819809 2020888 2022274
6388B022274p6488J36815j68539N19148K4955j7831J20727J87967K03065N93667
$$ 2022274 1945786 2082601 1914062 2433210 2458165 2440334 2561061 2749028 2952093 3545760
6378C545760L5529M76273Q08722P84721K43662n5349l81309l43022j033961m17415
$$ 3545760 3581289 4057562 4866284 5651005 5894667 5839318 5458009 5114987 4081026 3663611
6368C663611k71579k36228K897k61450K08394K12736P7315r80956r2809K60992
$$ 3663611 3392032 3155804 3158701 2897251 3105645 3318381 3395696 2414740 2321931 2582923
6358B582923o3318K73572k69596k79852L97503J09934j73809J38345j77963j46257
$$ 2582923 2519605 2793177 2523581 2243729 2641232 2751166 2577357 2715702 2537739 2391482
6348B391482M03311J05153L2936K16400n4304m2096j02821p5542M04786m15332
$$ 2391482 2794793 2899946 2932882 3149282 3094978 3052882 2950061 2874519 3279305 2863973
6338B863973p5935K39761j39084l45198K75958K2035m87530M60331o6077j5542
$$ 2863973 2788038 3027799 2888715 2543517 2819475 2841510 2353980 2814311 2748234 2732692
6328B732692k1761K76424K82161L6476K9487o9372M50787M89109n25161k50592
$$ 2732692 2710931 2987355 3269516 3305992 3335479 3266107 3716894 4206003 3680842 3430250
6318C430250J88707J71780K0817l27541k54174j55678k9361M79496L91960k4875
$$ 3430250 3618957 3790737 3811554 3484013 3229839 3074161 3044800 3524296 3916256 3891381
6308C891381J39385k6298J63666L33710K68220o8296l22107K97584N22511k91706
$$ 3891381 4030766 4004468 4168134 4501844 4770064 4701768 4379661 4677245 5199756 4908050
6298D908050k42838J23267j1849K64466N20323M87112J89159n3384M12079L41935
$$ 4908050 4665212 4788479 4776630 5041096 5561419 6048531 6237690 6184306 6596385 6938320
6288F938320K34434L3777L66231P62595N95089k3083N14721O65303N61518Q48032
$$ 6938320 7172754 7206531 7572762 8335357 8930446 8907363 9422084 10087387 10648905 11496937
6278A1496937M33794Q60080J698761J380001J718281K493747K677266L337570
$$ 11496937 11930731 12790811 14489572 15869573 17587854 20081601 22758867 26096437
6270B6096437N051540N571520O522309Q119067J0647717J1646690L363117r370485
$$ 26096437 31147977 36719497 43241806 51360873 62008590 73655280 77018397 67647912
6262F7647912j4247353j2926952r208088n684932l996295k692106j947543j481153
$$ 67647912 53400559 40473607 31265519 25580587 21584292 18892186 16944643 15463490
6254A5463490j476148j502476j225683p68224o92933j134490n16922k35243L3605
$$ 15463490 13987342 12484866 11259183 10490959 9798026 8663536 8146614 7911371 7944976
6245G944976o41298k88462m16993o33209j23417m22733j74029l7488K56453k72960
$$ 7944976 7303678 7015216 6598223 5965014 5841597 5418864 5244835 5207347 5463800 5190840
6235E190840j96154j68728m17096l62392J66589n40162K28344M8647l0231Q9134
$$ 5190840 4994686 4825958 4408862 4046470 4213059 3672897 3901241 3949888 3919657 4008791
6225D008791j50262j38332r9504k02876J2071j47626j27700l4154k78101M08337
$$ 4008791 3858529 3720197 3620693 3417817 3429888 3282262 3154562 3120408 2842307 3250644
6215C250644K39482l46275J87201j01105n29863L5888L09502k8505r7481m28358
$$ 3250644 3490126 3143851 3331052 3229947 2700084 2735972 3045474 3016969 2919488 2491130
6205B491130J10427N47317O1956j13129j41043J05957m0803m03152K73367j52325
$$ 2491130 2601557 3148874 3210830 3097701 2956658 3062615 3021812 2618660 2892027 2739702
6195B739702k16463J27485J57857L2391m10408L06207o2690p4891L54179k50641
$$ 2739702 2523239 2650724 2808581 2840972 2430564 2736771 2674081 2599190 2953369 2702728
6185B702728J9191p1628m3340J72738R1736j10516k29924k27478N7362n6542r1538
$$ 2702728 2721919 2650291 2606951 2779689 2871425 2760909 2530985 2303507 2360869 2304327 2212789
6174B212789M23613K29816l29308R7322L20627l08249k34888P2743R4556K40090
$$ 2212789 2636402 2866218 2536910 2634232 2954859 2646610 2411722 2484465 2579021 2819111
6164B819111l1982j70623K9378l46847j80573m9896L91631R922n7896j26467K9866
$$ 2819111 2787129 2616506 2645884 2299037 2118464 2068568 2460199 2470121 2412225 2285758 2315624
6153B315624K24198k39282j56163K8532m89642N63465L85540j6392J2952k49204
$$ 2315624 2539822 2300540 2144377 2172909 1683267 2246732 2632272 2615880 2628832 2379628
6143B379628j9446L32656j37185p3911j31995l27209N25713P40688j87168j72254
$$ 2379628 2360182 2692838 2555653 2481742 2349747 2022538 2548251 3288939 3101771 2929517
6133B929517j52863k16989m7256j08693k11265M80956J98441J915m7000K37737
$$ 2929517 2776654 2559665 2512409 2403716 2192451 2673407 2871848 2873763 2826763 3064500
6123C064500K06150k39914P8189k01238j51122J18240J45977P0430l4579J17976
$$ 3064500 3270650 3030736 3108925 2907687 2756565 2874805 3020782 3091212 3056633 3174609
6113C174609q6456j18360n1057l36354J55306M91857J81174m17609N1368J74940
$$ 3174609 3088153 2969793 2918736 2582382 2737688 3229545 3410719 2993110 3044478 3219418
6103C219418j3486J78942L5358L38336L52154l23699j89511p4071J59778K0078
$$ 3219418 3205932 3384874 3420232 3758568 4110722 3787023 3597512 3523441 3683219 3703297
6093C703297K54973j54063L366q1018K55221l00078N5498K6681k09098N7044O99062
$$ 3703297 3958270 3804207 3807573 3726555 3981776 3681698 3737196 3763877 3554779 3611823 4310885
6082D310885J7273k47627L419L18442N21803o9809J08551J43291J00254L6008
$$ 4310885 4328158 4080531 4083950 4402392 4924195 4854386 4962937 5106228 5206482 5242490
6072E242490j24662J7772O76173K51084O09351J97719o815N50192L50587J44518
$$ 5242490 5117828 5135600 5811773 6062857 6672208 6869927 6863112 7413304 7763891 7908409
6062G908409m8364o05837p24661l50667j84910N8620K37161n9571k53945l53559
$$ 7908409 7860045 7254208 6529547 6178880 5993970 6052590 6289751 6230180 5976235 5622676
6052E622676J65272k56365j10257j54931N57100N6526J03554J305M677K95879
$$ 5622676 5787948 5531583 5421326 5266395 5823495 5880021 5983575 5984880 5989557 6285436
6042F285436N28735N83515L63485K86534M69037Q77308O59112N23025O90056M91652
$$ 6285436 6814171 7397686 7761171 8047705 8516742 9394050 10053162 10576187 11266243 11757895
6032A1757895m64828o80966j404301o83542o55640L1435n8975j34321k65610l77868
$$ 11757895 11293067 10612101 9207800 8524258 7868618 7900053 7841078 7706757 7441147 7063279
6022G063279o3321k03423j13146L41907j03384J21700l8319j40626p3199K97054
$$ 7063279 6999958 6796535 6683389 7025296 6921912 7043612 7005293 6864667 6791468 7088522
6012G088522N4377j08601K53897n4527K37266P11685N48499L79845M66554k12859
$$ 7088522 7142899 7034298 7288195 7233668 7470934 8182619 8731118 9110963 9577517 9364658
6002I364658r2971o03739k45474l56957n01126m01948M95168o605l53219k22294
$$ 9364658 9271687 8667948 8422474 8065517 7564391 7162443 7657611 7651006 7297787 7075493
5992G075493N45702J53042n15987P51384K08967M6093J96867J153p4083j99649
$$ 7075493 7621195 7774237 7258250 8009634 8218601 8264694 8461561 8462714 8388631 8188982
5982H188982k41018j18159j72085M33426K49585j80270K99235j21164k64220j09022
$$ 8188982 7947964 7829805 7657720 8091146 8340731 8160461 8459696 8338532 8074312 7965290
5972G965290K54841R2629O58252K5118l92032O8068k78962p2836J87800N97201
$$ 7965290 8220131 8312760 8971012 8996130 8604098 8672166 8393204 8320368 8508168 9105369
5962I105369j00432j92290p7257j73679O9037M99802N88795L55303k69114k31230
$$ 9105369 9004937 8812647 8735390 8561711 8630748 9130550 9719345 10074648 9805534 9574304
5952I574304L23280K70370l97209L118J06746q7052K16289K60937L4341q8044
$$ 9574304 9897584 10167954 9770745 9773863 9880609 9793557 10009846 10270783 10305124 10217080
5942A0217080m8567N31884M0712m4014M13898L09483j73183M58735J18181l82869
$$ 10217080 10168513 10700397 10741109 10697095 11110993 11420476 11247293 11706028 11824209 11441340
5932A1441340J48466K49968L41510L36404K64403j64929N8272O4874N34259M28755
$$ 11441340 11589806 11839774 12181284 12517688 12782091 12617162 12675434 12740308 13274567 13703322
5922A3703322K14310j40201J01452J1467K68442M94344N99841J76838P06978R48917
$$ 13703322 13917632 13777431 13878883 13890350 14158792 14653136 15252977 15429815 16136793 17085710
5912A7085710N26943N61305M78016K40733L13156l67262k57293J23040L39876
$$ 17085710 17612653 18173958 18651974 18892707 19205863 18838601 18581308 18704348 19044224
5903A9044224M49288K78777M73640M29673k3178L05167P18417J158382J418384
$$ 19044224 19493512 19772289 20245929 20675602 20652424 20957591 21676008 22834390 24252774
5894B4252774J786035J820573K102046K350595L030426L128120K384141K135240
$$ 24252774 26038809 27859382 29961428 32312023 35342449 38470569 40854710 42989950
5886D2989950J709298J944681N38125r81561q10806N1035K46789P98333m03193
$$ 42989950 44699248 46643929 47182054 46200493 45389687 45440722 45687511 46485844 46082651
5877D6082651k745279m522363l861033k934281k096777j605450j205889j149967
$$ 46082651 43337372 38815009 34953976 32019695 29922918 28317468 27111579 25961612
5869B5961612j032551j277132q74218o81783r96224q28463n73497L16640l4299
$$ 25961612 24929061 23651929 22777711 22095928 21099704 20271241 19697744 20014384 19980085
5860A9980085R919j58254k72345K5577J056j75035K44206J92124L24302O30546
$$ 19980085 19990004 19831750 19559405 19584982 19586038 19411003 19655209 19847333 20171635 20802181
5850B0802181J043584P36155R87744J646837O96914r66735j568495j363303j000242
$$ 20802181 21845765 22581920 23569664 25216501 25913415 24946680 23378185 22014882 21014640
5841B1014640q71015j77337N5940l53412p85652j048419R8825o44696n08967k92524
$$ 21014640 20143625 19966288 20022228 19668816 18883164 17834745 17933570 17288874 16779907 16487383
5831A6487383M6324k64827J80973l25575P9291J20531l97274N46222M47822M14687
$$ 16487383 16533707 16268880 16449853 16124278 16203569 16324100 15926826 16473048 16920870 17335557
5821A7335557N80152M23771O18577M14645O74562J116833N84625l11672o18630
$$ 17335557 17915709 18339480 18958057 19372702 20047264 21164097 21748722 21437050 20818420
5812B0818420q02592p44173p46126m09222P7924l26474J45703R5658j57027K48775
$$ 20818420 20015828 19271655 18525529 18116307 18194231 17867757 18013460 18109118 17952091 18200866
5802A8200866m7138L75956M27985K88861Q16181R14829J000231Q31085N53705
$$ 18200866 18153728 18529684 18957669 19246530 20062711 20977540 21977771 22808856 23362561
5793B3362561M58163L80707k32085m72382p18913m6490k85515k40830P4155l64515
$$ 23362561 23820724 24201431 23969346 23496964 22778051 22731561 22446046 22205216 22279371 21914856
5783B1914856J04702M14628M20499N34342P34366K43033P29056R68216O66407
$$ 21914856 22019558 22434186 22854685 23389027 24123393 24366426 25095482 26063698 26730105
5774B6730105M26953j9310p1904n61724j94349l2847k22562p19558j97350m98900
$$ 26730105 27157058 27137748 27065844 26504120 26309771 26276924 26054362 25334804 25137454 24638554
5764B4638554M5605j75604L20329M47399P7882j67820Q41335O09723O72615N71871
$$ 24638554 24684159 24508555 24828884 25276283 25354165 25186345 26027680 26637403 27310018 27881889
5754B7881889P13903J009110J124430J273696J754024J916611J460581J392771
$$ 27881889 28595792 29604902 30729332 32003028 33757052 35673663 37134244 38527015
5746C8527015J474757Q61598m3464p95163k30263j16636n26287l97964q64137
$$ 38527015 40001772 40863370 40819906 40024743 39794480 39677844 39151557 38753593 37889456
5737C7889456k91576n61823j687j41684J71330R01072J177104J119583J755047
$$ 37889456 37597880 37036057 37034370 36892686 37064016 37965088 39142192 40261775 42016822
5728D2016822K155973K299193K701125K223120J392592J029375Q12930K94261
$$ 42016822 44172795 46471988 49173113 51396233 52788825 53818200 54631130 54925391
5720E4925391o74534j956306k496374l099431l439251k739172k995648j982514
$$ 54925391 54250857 52294551 49798177 46698746 43259495 40520323 37524675 35542161
5712C5542161j858364j669902r78098r06982r62890j070266o62186k11070L651
$$ 35542161 33683797 32013895 31035797 30128815 29165925 28095659 27433473 27222403 27226054
5703B7226054l04595j68822j52328m43842j21028r809L82821j80412r3253J94140
$$ 27226054 26921459 26752637 26600309 26156467 26035439 26025630 26408451 26228039 26134786 26328926
5693B6328926L77507M35287J048222P50203P20132P66463J10403O6951M98252
$$ 26328926 26706433 27141720 28189942 28940145 29660277 30426740 30537143 30604094 31102346
5684C1102346J85688J48281n95773o61934n77741j008448j458046m70396l78513
$$ 31102346 31288034 31436315 30840542 30178608 29600867 28592419 27134373 26663977 26285464
5675B6285464r31471l10543l67674K28322k52727m6180K04641j1626M34954l865
$$ 26285464 25353993 25043450 24675776 24904098 24651371 24605191 24809832 24798206 25233160 25229295
5665B5229295J03633K11132j71885J34153M35989J58690k28330j6036l58414l46237
$$ 25229295 25332928 25544060 25372175 25506328 25942317 26101007 25872677 25856641 25498227 25151990
5655B5151990k06493p12309j24168n1405j05049O5923J57640K13562R0364M65670
$$ 25151990 24945497 24233188 24109020 24057615 23952566 24018489 24176129 24389691 24480055 24945725
5645B4945725k15077k8420L1364K06990j41994k86382j22154o6122K68075l90829
$$ 24945725 24730648 24702228 24733592 24940582 24798588 24512206 24390052 24323930 24592005 24201176
5635B4201176k06972l14570m83190k12895l36842p39285o43627L21155p3055M1458
$$ 24201176 23994204 23679634 23196444 22983549 22646707 21907422 21263795 21584950 21511895 21553353
5625B1553353l3253L93217l72365q07889m32450p3027m01372n01147j58599l02496
$$ 21553353 21520100 21913317 21540952 20733063 20300613 20227586 19826214 19325067 19166468 18863972
5615A8863972l35586j35720m18622l92318k62520n88325p23081m50719j9006p3660
$$ 18863972 18528386 18392666 17974044 17581726 17319206 16730881 16007800 15557081 15538075 15464415
5605A5464415o47172N07146m47788l91266J87499l60422m96082l81702K12392
$$ 15464415 14817243 15324389 14876601 14485335 14672834 14312412 13816330 13434628 13647020
5596A3647020k25812j3247l63590m72334J84107J73834m19221k37101j06816k37323
$$ 13647020 13421208 13407961 13044371 12572037 12756144 12929978 12510757 12273656 12166840 11929517
5586A1929517J67981l6683k79507K24767Q5381J32727l49552m19063j98916J1196
$$ 11929517 12097498 12060815 11781308 12006075 12091456 12224183 11874631 11455568 11256652 11267848
5576A1267848K29140J11629j73516l17155p75259j77656j26554J56288J83388
$$ 11267848 11496988 11608617 11435101 11117946 10342687 10165031 10038477 10194765 10378153
5567A0378153j00375q828J4617M73620M89517j47733r5814k62645o19637J335
$$ 10378153 10277778 10268950 10283567 10757187 11246704 11098971 11003157 10740512 10120875 10122210
5557A0122210L93229M7360m84365k43922K09395j424k91320l17418K27548j59228
$$ 10122210 10515439 10562799 10078434 9834512 10043907 10042483 9751163 9433745 9661293 9502065
5547I502065m7381k96235q8380L78615k25186k27676j8150J53706j45146M8668
$$ 9502065 9454684 9158449 9070069 9448684 9223498 8995822 8977672 9131378 8986232 9034900
5537I034900K7079l57559J68119K1252k138K48688R5714J88255j32812k92594
$$ 9034900 9061979 8704420 8872539 8893791 8891653 9140341 9236055 9424310 9291498 8998904
5527H998904l73276k20456J67216Q14465Q6868k55084j99227N0616K29260O5516
$$ 8998904 8625628 8405172 8572388 9386853 9473721 9218637 9019410 9070026 9299286 9364802
5517I364802j53057j84791j04043M09014P3900M1112J62312m85499j91931j32449
$$ 9364802 9211745 9026954 8922911 9331925 9405825 9446937 9609249 9123750 8931819 8799370
5507H799370M39877M6464L90530J54119n02382J563J05080j4415L04112Q6517
$$ 8799370 9239247 9285711 9676241 9830360 9327978 9329541 9434621 9420206 9724318 9810835
5497I810835l1204Q9965o4353J3138O5548m9637p9750l06042k0895M91450j0414
$$ 9810835 9779631 9869596 9805243 9818381 9883929 9834292 9754542 9448500 9427605 9919055 9908641
5486I908641M1350j47405r6524P0457K66243J3732j06057L43270J57477m1921
$$ 9908641 9949991 9802586 9706062 9776519 10042762 10056494 9950437 10293707 10451184 10409263
5476A0409263j30704K39105J72476j01381j01384m549J96392j73017M7091L06464
$$ 10409263 10278559 10517664 10690140 10588759 10487375 10482826 10679218 10506201 10553292 10859756
5466A0859756L90180L37896Q3138l1399L1627J68435J9013J41898K33351M3511
$$ 10859756 11249936 11587832 11670970 11639571 11671198 11839633 11858646 12000544 12233895 12277406
5456A2277406M28892M30023n8694P38401P58171M15498N56807P39511R37057J146531
$$ 12277406 12706298 13136321 13077627 13816028 14574199 14989697 15546504 16286015 17223072 18369603
5446A8369603R29065L27113m23670j01119K23174l01591k96383K9198L9571l3918
$$ 18369603 19298668 19625781 19202111 19100992 19324166 19022575 18726192 18755390 18794961 18761043
5436A8761043R11515N83313j53449j51162K10680J7381L20467O73433O67172j3019
$$ 18761043 19672558 20255871 20102422 19951260 20161940 20179321 20499788 21173221 21840393 21827374
5426B1827374M57451O67478l3342l93215j220767j642051j130163m63042r69849
$$ 21827374 22284825 22952303 22918961 22525746 21304979 19662928 18532765 18069723 17099874
5417A7099874k30091J27332k06168k9847l63117o59317L55841n5063r20574r06481
$$ 17099874 16869783 16997115 16790947 16761100 16397983 15738666 16094507 16039444 15118870 14212389
5407A4212389j150776m82223p60570m32298j62452J33178k00390l55248l57195
$$ 14212389 13061613 12579390 11818820 11386522 11224070 11357248 11156858 10801610 10444415
5398A0444415m89816K81122J7102k11446q2132J07630j24000q6220j57810J63503
$$ 10444415 9954599 10235721 10252823 10041377 9959245 10066875 9942875 9856655 9698845 9862348
5388I862348o5751L1803J87776l13991Q6361K87762L67038l6998l22800o26360
$$ 9862348 9796597 9828400 10016176 9702185 9788546 10076308 10443346 10406348 10083548 9457188
5378I457188n19463n7170k74057J57950j52460L3729r1260o46868P1487j14980
$$ 9457188 8937725 8880555 8606498 8764448 8611988 8645717 8554457 7907589 7979076 7864096
5368G864096q536L16429L28313J65129M1042r6110j15460m2442K0732J12592n1490
$$ 7864096 7855560 8171989 8500302 8665431 8706473 8610363 8494903 8452461 8473193 8585785 8534295
5357H534295J2522J80967l35889r2811k04807j59014J12676M13931l19578l14755
$$ 8534295 8546817 8727784 8391895 8299084 8094277 7935263 8047939 8461870 8142292 7827537
5347G827537K57263p9144q1420j58174k19353J47483K32309O84j81701m29773
$$ 7827537 8084800 8005656 7924236 7766062 7546709 7694192 7926501 7927185 7745484 7315711
5337G315711J92895j50802J0939J43262J08075k20412Q979P7398K06228k01456
$$ 7315711 7508606 7357804 7368743 7512005 7620080 7399668 7408647 7486045 7692273 7490817
5327G490817O10811n741K97710J34437K93960j40477o96254j4525n60548m1973
$$ 7490817 8101628 8095887 8393597 8528034 8821994 8681517 7985263 7970738 7410190 7368217
5317G368217p1097L41857L38739l11087l42178p2741r8457K28156q5166l60870
$$ 7368217 7297120 7638977 7977716 7666629 7324451 7251710 7153253 7381409 7296243 6935373
5307F935373K621j76302l60243L46049L40048k95773k24369J04725J2904l322
$$ 6935373 6937994 6761692 6401449 6747498 7087546 6791773 6567404 6672129 6685033 6681711
5297F681711j67936j46102K26140J05115j7204J7609l20164J07576k7477K86413
$$ 6681711 6513775 6367673 6593813 6698928 6681724 6699333 6379169 6486745 6459268 6745681
5287F745681j78622l86172r5447R9086K78547R848k55061k62422L77888j62701
$$ 6745681 6567059 6180887 6085440 6184526 6463073 6472921 6217860 5955438 6333326 6170625
5277F170625l29088J23247J85490k7635K14500j89867j72704k69362k4022n6783
$$ 6170625 5841537 5964784 6150274 6122639 6337139 6147272 5974568 5705206 5681184 5624401
5267E624401L0722N1553k88873j16599K27677M66492m73642M36943k6637m46298
$$ 5624401 5655123 5706676 5417803 5301204 5528881 5995373 5521731 5958674 5932037 5485739
5257E485739l33593P432J55623J58644k08263P4150L77818l19951j44062l41923
$$ 5485739 5152146 5159578 5315201 5473845 5265582 5339732 5717550 5397599 5253537 4911614
5247D911614L8620K01498r1049n4458K04373J37929l00276J80270R0952k69662
$$ 4911614 4950234 5151732 5060683 5006225 5210598 5348527 5048251 5228521 5319473 5049811
5237E049811r1741J06378r0900K56987m09223m242K13763L85224L88551J40121
$$ 5049811 4958070 5064448 4973548 5230535 4821312 4817070 5030833 5416057 5804608 5944729
5227E944729o3742k81692k11144j98673J11248o0227j65541k50119M1973R1866
$$ 5944729 5880987 5599295 5388151 5189478 5300726 5240499 5074958 4824839 4866812 4958678
5217D958678L65030k33374M6931J10353J02132n7558m58560N08l18433k19171
$$ 4958678 5323708 5090334 5137265 5247618 5349750 5292192 4833632 4834140 4515707 4296536
5207D296536J25806r5241K85816O8037J46666p5550o1126L04498j01712j7848
$$ 4296536 4422342 4327101 4612917 4680954 4827620 4752070 4690944 4995442 4893730 4875882
5197D875882k4963Q0938L99058J92286J3211p2316j73596K4941j83235k54745
$$ 4875882 4850919 4931857 5330915 5523201 5536412 5464096 5290500 5315441 5132206 4877461
5187D877461J0576L27635q4870j02050O8011r7686J05132L90285j36525k3137
$$ 4877461 4888037 5215672 5130802 5028752 5096763 4999077 5104209 5494494 5357969 5334832
5177E334832M75088p04952k36811J18746M69119j48567m1626l5006j07512L474
$$ 5334832 5809920 5104968 4868157 4986903 5456022 5307455 5265829 5230823 5123311 5126785
5167E126785j53305j40749J47873K04591k88150L20692O37433J51355r689p9342
$$ 5126785 4973480 4832731 4980604 5185195 4897045 5217737 5855170 6006525 5996836 5917494
5157E917494p2575L82637K43117l59208K48285L84996L66115K44967J22904k65313
$$ 5917494 5844919 6227556 6470673 6111465 6359750 6744746 7110861 7355828 7478732 7213419
5147G213419p0571l62200l05714m03401j68375k04462K6905p788K7603k38862
$$ 7213419 7142848 6780648 6474934 6071533 5903158 5698696 5725601 5717813 5745416 5506554
5137E506554r1470J30714l99160L92862q3876N1852P22504L39215J43094L83776
$$ 5506554 5415084 5545798 5146638 5539500 5455624 5507476 6229980 6569195 6712289 7096065
5127G096065N0092M89180J31535l7035k04739j39967o80035P9306l24150j7735
$$ 7096065 7146157 7635337 7766872 7729837 7525098 7385131 6705096 6784402 6460252 6442517
5117F442517n21278k34864j72959k20547j35064j95260j50985k18511M10007o9317
$$ 6442517 5921239 5686375 5513416 5292869 5157805 4962545 4811560 4593049 5003056 4933739
5107D933739J20401j5378l34771R7376J28946l83275Q2474K61984M6118O93246
$$ 4933739 5054140 5038762 4703991 4801367 4930313 4547038 4629512 4891496 4937614 5630860
5097E630860K71299l44350K5466l25804q4287J175k29715K59561m50806k02344
$$ 5630860 5902159 5557809 5583275 5257471 5173184 5174359 4944644 5204205 4753399 4551055
5087D551055K80363p33205L02875K63855j93786l03503K08700J97326o47353O48411
$$ 4551055 4831418 4098213 4401088 4664943 4471157 4167654 4376354 4573680 3926327 4574738
5077D574738L14684N2778k18703q7103O4791k97582J2340j95616R137N197k5680
$$ 4574738 4889422 4942200 4723497 4636394 4701185 4403603 4415943 4220327 4229464 4234661 4208981
5066D208981m62203J6126P8712J65014n5481L9306K25373K07763L10720P212N06483
$$ 4208981 3746778 3762904 3841616 4006630 3951149 3990455 4215828 4423591 4734311 4741523 5248006
5055E248006j57166m25782M2206k5263N0228n7170k66587k87717j5984K96612
$$ 5248006 5090840 4665058 4707264 4682001 4732229 4675059 4408472 4120755 4104771 4401383
5045D401383L7493k04267k37695L57853K97113K4194m43624M3276o7348j59745
$$ 4401383 4438876 4234609 3996914 4354767 4651880 4676074 4232450 4275726 4208378 4048633
5035D048633J27109M993L28K09782K2114N8107l1591r8307K42362n5161M10067
$$ 4048633 4175742 4180735 4181063 4390845 4412959 4471066 4439475 4341168 4583530 4528369 4938436
5024D938436j30849j25660l67509o1971o2502j43618J58137M40085l57981k88600
$$ 4938436 4807587 4681927 4314418 4252447 4189945 4046327 4204464 4644549 4286568 3997968
5014C997968l63337L36970M75366j49267J44955j13011K02432L48093k22209K27064
$$ 3997968 3634631 3971601 4446967 4297700 4442655 4329644 4532076 4880169 4657960 4885024
5004D885024k24101j81260k68538k87249L39469N8726M19735J24056k34214k54951
$$ 4885024 4660923 4479663 4211125 3923876 4263345 4322071 4741806 4865862 4631648 4376697
4994D376697L96519k53191m3572O2586m39060J11911M77735J36469J69824K49010
$$ 4376697 4773216 4520025 4476453 4539039 4099979 4211890 4689625 4826094 4995918 5244928
4984E244928l1147l73044p5101J27161l44644j00257N25916j19301j73432K65964
$$ 5244928 5213781 4840737 4765636 4892797 4548153 4447896 4973812 4854511 4681079 4947043
4974D947043K02238K71810n7360r2552k21306k14708K14123K02165m20128j3200
$$ 4947043 5149281 5421091 5363731 5271179 5049873 4835165 5049288 5251453 4831325 4818125
4964D818125L11673P226J03641l6295l85756j58183L54222L45936k76854K9376
$$ 4818125 5129798 5137024 5240665 5204370 4818614 4660431 5014653 5360589 5083735 5113111
4954E113111j19664k42096N67042L02291P6914k2255k6924m04711L86674J34028
$$ 5113111 4993447 4751351 5318393 5620684 5697598 5675343 5648419 5243708 5630382 5764410
4944E764410l08229J07880L84613j37973l39996J46729L29421N30843k47662q4343
$$ 5764410 5456181 5564061 5948674 5810701 5470705 5617434 5946855 6477698 6230036 6145693
4934F145693K43551M24571M08243K17138J12877K3765q5146M166l55383J64837
$$ 6145693 6389244 6813815 7222058 7439196 7552073 7575838 7490692 7494858 7139475 7304312
4924G304312J07363K19235M22538k2238K37543K44501L50889J67278N15796L17673
$$ 7304312 7411675 7630910 8053448 8031210 8268753 8513254 8864143 9031421 9547217 9864890
4914I864890M20084J03205L09443J20196J06910M03073q8065j09652n81773l91603
$$ 9864890 10284974 10388179 10697622 10817818 10924728 11327801 11239736 11130084 10548311 10156708
4904A0156708M37206K12211l22346K00942K88242K35526k46403K06082k57811
$$ 10156708 10593914 10806125 10483779 10684721 10972963 11208489 10962086 11168168 10910357
4895A0910357j94888j84638m15906j91198n93646R329m10770n69535j79082J15420
$$ 10910357 10715469 10530831 10114925 9923727 9330081 9339410 8928640 8359105 8180023 8295443
4885H295443m23690j1413k3431k58012k93130n416K24933k16877m7587Q9358M6777
$$ 8295443 7871753 7860340 7836909 7578897 7285767 7280351 7505284 7288407 7240820 7330178 7376955
4874G376955j56964r1013j2874N7843q6070R9430J3453J11478J52403M1510k29362
$$ 7376955 7219991 7128978 7116104 7173947 7087877 7187307 7200760 7312238 7464641 7506151 7276789
4863G276789Q0338J08885q0816P44575J24271k15421q92M13334M59948M12023
$$ 7276789 7357127 7466012 7385196 8129771 8254042 8038621 8037729 8451063 8911011 9323034
4853I323034L65346L19349L82623K26455P16122K60511J39314Q37898O04184m66377
$$ 9323034 9688380 10007729 10390352 10616807 11332929 11593440 11732754 12570652 13174836 12708459
4843A2708459j6631J10839l66764p91915o09333L96814L42559K24148q5386j85996
$$ 12708459 12691828 12802667 12435903 11643988 11034655 11431469 11774028 11998176 11912790 11726794
4833A1726794P560l70569l82374M04137K16291k21230o16664n40373k61094k70664
$$ 11726794 11734354 11363785 10981411 11385548 11601839 11380609 10763945 10223572 9962478 9691814
4823I691814p15069m98092m56279n41888N23394k00560m98536j26549k2168l52361
$$ 9691814 8976745 8478653 8022374 7480486 8003880 7803320 7304784 7178235 7156067 6803706
4813F803706j30490k01848r7040k7500j7403l67525J11899n0124K23979R4067
$$ 6803706 6673216 6471368 6374328 6346828 6329425 5961900 6073799 6023675 6247654 6341721
4803F341721l11346q7622R3643j77974l89888L32838K19987L5282P4328k88755
$$ 6341721 6030375 5942753 6036396 5858422 5468534 5801372 6021359 6056641 6130969 5842214
4793E842214l08256Q8326l69707K71207j54746L6093N5906k42107O9902J80669
$$ 5842214 5533958 5622284 5252577 5523784 5369038 5405131 5461037 5218930 5288832 5469501
4783E469501J22447k86839j48089O53685j780m6331o8851j8137L31733j4921p2390
$$ 5469501 5591948 5305109 5157020 5810705 5808925 5762594 5693743 5675606 6007339 5992418 5920028
4772E920028j21053k56377L34327k62934L9082L31607L35268M35722n07030o4986
$$ 5920028 5798975 5542598 5876925 5613991 5653073 5984680 6319948 6755670 6248640 6183654
4762F183654K20540n4636j45397j84521P7847K04310j91954l47639K08361K20656
$$ 6183654 6404194 6349558 6204161 6019640 6097487 6301797 6109843 5762204 5970565 6191221
4752F191221K46057K36397l04813L14823J01817p8264L03410K4178k99434R7517
$$ 6191221 6437278 6673675 6368862 6683685 6785502 6707238 7010648 7034826 6735392 6832909
4742F832909k30904m86967R8907K61804m2921L48610R3911p8099j8899R0824j21057
$$ 6832909 6602005 6115038 6213945 6475749 6432828 6781438 6875349 6797250 6778351 6869175 6748118
4731F748118j53314L96620k54327J82526J88335M93064K35482k91254j26154j80876
$$ 6748118 6594804 6991424 6737097 6919623 7107958 7601022 7836504 7545250 7419096 7238220
4721G238220r1278N8304J60788j8811Q7554L39255J74843k58065m3143L49514
$$ 7238220 7146942 7205246 7366034 7347223 7434777 7774032 7948875 7690810 7647667 7997181
4711G997181M62839K75782P775L22334K52523L39180M53597J13102K23920K57563
$$ 7997181 8460020 8735802 8743577 9065911 9318434 9657614 10111211 10224313 10448233 10705796
4701A0705796M48008M02027j88579J87730j4223n10232k6003M35369j22765k96456
$$ 10705796 11153804 11555831 11367252 11554982 11540759 11030527 11004524 11439893 11317128 11020672
4691A1020672K36474P6847K01085n1826R2787K95361k07949l29440O419j09133
$$ 11020672 11257146 11333993 11535078 11483252 11576039 11871400 11663451 11334011 11340430 11231297
4681A1231297o37636m50482j8160K40537k16025k87293J18817j52285j31885L35678
$$ 11231297 10593661 10143179 10125019 10365556 10149531 9862238 9981055 9828770 9696885 10032563
4671A0032563m59068l75286K92812j33566Q7375k0524P2894q68323q9536J57580
$$ 10032563 9573495 9198209 9491021 9357455 9444830 9424306 9497200 8628877 8539341 8696921
4661H696921j72932J50629O02120j49234n5216j64489M69133J38118K08501K53045
$$ 8696921 8523989 8674618 9276738 9127504 9072288 8907799 9376932 9515050 9723551 9976596
4651I976596k00551J71352M09693K91321R6666R88621j5115K04339O29548N80713
$$ 9976596 9776045 9947397 10357090 10648411 10745077 11733698 11718583 11922922 12552470 13133183
4641A3133183K93478M10200O57861k620K92216N18906N85083R7092L29378L1467
$$ 13133183 13426661 13836861 14494722 14492102 14784318 15303224 15888307 15985399 16314777 16346244
4631A6346244p6013K13442J2401k03914J60584l16747P479K08597l07120L16256
$$ 16346244 16270231 16483673 16496074 16292160 16452744 16135997 16143476 16352073 16044953 16361209
4621A6361209m70534l47176n94130l52867l07807n01946l58802k96379o08323
$$ 16361209 15890675 15543499 14949369 14596502 14288695 13786749 13427947 13131568 12523245
4612A2523245j30971L6705n55098k0159K40521l83718j52836J03442l23105n40606
$$ 12523245 12392274 12428979 11873881 11853722 12094243 11710525 11557689 11661131 11338026 10797420
4602A0797420J04290l75646J2436J07045r728k00884K11885l68964O0518M90227
$$ 10797420 10901710 10526064 10538500 10645545 10635817 10434933 10646818 10277854 10338372 10828599
4592A0828599L6846j94747j441k11613k97526l14002M04859q3401k77246K64650
$$ 10828599 10865445 10670698 10669257 10457644 10160118 9846116 10250975 10167574 9890328 10154978
4582A0154978L34614j58488j91397J1229O0220J05182j08719J013K9707M25571
$$ 10154978 10489592 10331104 10139707 10150936 10211156 10316338 10207619 10208632 10238339 10663910
4572A0663910L24654J18630j4097j89338k3769K48677p0426K2478l81634M4141
$$ 10663910 10988564 11107194 11093097 10903759 10879990 11128667 11058241 11080719 10699085 10743226
4562A0743226M12947J55987m0351K09325J26198J80735l2094j50681M50719O4166
$$ 10743226 11156173 11312160 11271809 11481134 11607332 11788067 11755973 11605292 12056011 12120177
4552A2120177j11286M27185k1248K52820K47422J93128J25959j53560l8631P0579
$$ 12120177 12008891 12436076 12414828 12667648 12915070 13108198 13234157 13080597 13041966 13112545
4542A3112545j7630M34358N8600k33854M84183M92821K94593O13414N6523Q09715
$$ 13112545 13094915 13529273 13587873 13354019 13838202 14331023 14625616 15239030 15295553 16105268
4532A6105268Q04858K91057O51541L13859j39828K9719j6108m1535l0875J23940
$$ 16105268 16910126 17201183 17852724 18166583 18026755 18056474 18040366 17998831 17967956 18091896
4522A8091896l53311m39704j81135l56885k77403j82897k53122j23789k94584
$$ 18091896 17738585 17298881 17117746 16760861 16483458 16300561 16047439 15923650 15629066
4513A5629066O633j40692J05558m38902p07977k02572J78850J91687k19793L65546
$$ 15629066 15635699 15495007 15600565 15161663 14453686 14251114 14429964 14621651 14401858 14767404
4503A4767404j76537j17751m8199O10966J64593K37576N51528J60612L70121o5170
$$ 14767404 14590867 14473116 14424917 15035883 15200476 15438052 15989580 16150192 16520313 16455143
4493A6455143J82713R3335O88834M28516j2167K55977L70502J88032L12692j17073
$$ 16455143 16637856 16731191 17420025 17848541 17836374 18092351 18462853 18650885 18963577 18846504
4483A8846504m08522m07260k30901n3581J86748l13957k44321J27526j28287j25868
$$ 18846504 18437982 18030722 17799821 17746240 17932988 17619031 17374710 17502236 17373949 17248081
4473A7248081L74976K18972K28191N46401N2050O45670M21137N31528K87853N5905
$$ 17248081 17623057 17842029 18070220 18616621 18668671 19314341 19735478 20267006 20554859 20610764
4463B0610764k62426N15740J31739Q4252n4377k59615N9065L6499J73859M11380
$$ 20610764 20348338 20864078 20995817 21080069 21025692 20766077 20825142 20861641 21035500 21446880
4453B1446880l26621k83189N10840K91522j98189k02702j12175k97526m45031
$$ 21446880 21120259 20837070 21347910 21639432 21441243 21238541 21126366 20828840 20383809
4444B0383809l16158k06383q0566l28968o15497Q3248j030l43465K76141j01143
$$ 20383809 20067651 19861268 19780702 19451734 18836237 18919485 18918455 18574990 18851131 18749988
4434A8749988j1076L99561M80796K00712r6625L84604N42157O33071L69507p2355
$$ 18749988 18738912 19138473 19619269 19819981 19723356 20107960 20650117 21283188 21652695 21580340
4424B1580340L18270Q45684N01693J07932M27057J28928K82887N47215M52144
$$ 21580340 21898610 22744294 23245987 23353919 23780976 23909904 24192791 24740006 25192150
4415B5192150K66120R53238J229965Q429l04942j58356q20134p25675o64312k46094
$$ 25192150 25458270 26411508 27641473 27649902 27344960 27186604 26366470 25640795 24976483 24730389
4405B4730389j74181m16079q0657l84565l0970l36174J2356q3197M18315j02567
$$ 24730389 24556208 24140129 24059472 23674907 23643937 23307763 23320119 23236922 23655237 23552670
4395B3552670J32657n6963l8659R04365P38209M21643J127961Q28423O56958J444334
$$ 23552670 23685327 23628364 23589705 24494070 25232279 25653922 26781883 27610306 28267264 29711598
4385B9711598N40524q96575j071788q52245p29060m60614m65132m47450q27873
$$ 29711598 30252122 29355547 28283759 27431514 26702454 26241840 25776708 25329258 24501385
4376B4501385j77818j13658n29032O6429M6864o63992l15750N02933J1222O46809
$$ 24501385 24323567 24209909 23680877 23747306 23794170 23130178 22814428 23317361 23328583 23975392
4366B3975392k77292p34928L6552K84323J08564k6447K44643n8667o3562L1515
$$ 23975392 23698100 22963172 22999724 23284047 23392611 23366164 23610807 23552140 23488578 23520093
4356B3520093R3057L16082O44105L79246L93367O53269J008000L76226O94782
$$ 23520093 23613150 23929232 24573337 24952583 25345950 25999219 27007219 27383445 28078227
4347B8078227M61607L4950L20620O15048P057L09618N74149L91617J28561P6014
$$ 28078227 28539834 28574784 28895404 29510452 29517509 29827127 30401276 30792893 30921454 30997468
4337C0997468K68152K25560J53184Q28211J27332R3203J41405N1780j8612J50311
$$ 30997468 31265620 31491180 31644364 32472575 32599907 32693110 32834515 32886295 32867683 33017994
4327C3017994K91100j75398M2446K53181M97592L04106R2066K59744N94805J183170
$$ 33017994 33309094 33133696 33176142 33429323 33926915 34231021 34323087 34582831 35177636 36360806
4317C6360806N43100O70710J495486N79293R90439J112666Q73557N32328L92663
$$ 36360806 36903906 37574616 39070102 39649395 40639834 41752500 42626057 43158385 43551048
4308D3551048L01777L67408P97813P61868R71781J176536J330614J326783J508323
$$ 43551048 43852825 44220233 45018046 45779914 46751695 47928231 49258845 50585628 52093951
4299E2093951K377359J890058K349267K413942K029757K222213K988955J781069
$$ 52093951 54471310 56361368 58710635 61124577 63154334 65376547 68365502 70146571
4291G0146571K317151L315995K959648L594205M484873N017260O050512P497506
$$ 70146571 72463722 75779717 78739365 82333570 86818443 91835703 97886215 105383721
4283A05383721R011449J0629584J1969506J1920578J1135611R700344O774436
$$ 105383721 114395170 125024754 136994260 148914838 160050449 169750793 176525229
4276A76525229L649979P9167k198567k451027j440703K6334K585594L980431N141117
$$ 176525229 180175208 180254375 178055808 175604781 174164078 174190412 176776006 180756437 185897554
4267A85897554M883282L633839J411994q60070k233826l796474m756547n415088
$$ 185897554 190780836 194414675 195826669 194966599 192732773 188936299 184179752 178764664
4259A78764664n658986n584752m826901m352827l673202k442672j233732m7844
$$ 178764664 173105678 167520926 162694025 158341198 154667996 152225324 150991592 150943748
4251A50943748J760872K856566L972598N205256O556122Q919049R794889J0748741
$$ 150943748 152704620 155561186 159533784 164739040 171295162 180214211 190009100 200757841
4243B00757841J0516912R443969P946408O402929L944196J738430j952442m765958
$$ 200757841 211274753 220718722 228665130 235068059 239012255 240750685 238798243 234032285
4235B34032285o761432r251525j1110511j2765881j2958787j3442379j2359016
$$ 234032285 227270853 218019328 206908817 194142936 181184149 167741770 155382754
4228A55382754j0597064q928826p390250n435800m817578l931611l567646k833727
$$ 155382754 144785690 135856864 128466614 123030814 118213236 114281625 110713979 107880252
4220A07880252k443472k158403j974403j442959j130130j060532q85636j127167
$$ 107880252 105436780 103278377 101303974 99861015 98730885 97670353 96784717 95657550
4212I5657550n84105n53130n49952n80652L90276J41854L24288N01560R01905
$$ 95657550 95073445 94520315 93970363 93389711 93779987 93921841 94246129 94747689 95649594
4203I5649594P64122R08310J327708J394063K543076K241258K974576L390297
$$ 95649594 96413716 97322026 98649734 100043797 102586873 104828131 107802707 111193004
4195A11193004L477023M646192N482314N936356O821116Q563443R888710J2712662
$$ 111193004 114670027 119316219 124798533 130734889 137556005 146119448 156008158 168720820
4187A68720820J5974406J9272841K3205350K7338664L3811687M0460142M3682470
$$ 168720820 184695226 203968067 227173417 254512081 288323768 328783910 372466380
4180C72466380L7998002K7186890J1667067j765936j3030736k0116176k2242819
$$ 372466380 410464382 437651272 449318339 447552403 434521667 414405491 392162672
4173C92162672k5355253k8719995l3004206l0187078k2596738j3719737m150285
$$ 392162672 366807419 338087424 305083218 274896140 252299402 238579665 234429380
4166B34429380M198077J0669377J74902k1473891k8100402k4910003j8400005
$$ 234429380 238627457 249296834 249471736 227997845 199897443 174987440 156587435
4159A56587435j3044084r349050o789239n069096l826926k644158p14938L79736
$$ 156587435 143543351 134194301 127405062 122335966 118509040 115864882 115149944 115529680
4151A15529680r49062m681157o216026o227772n231283l780059l010447k671355
$$ 115529680 114580618 109899461 103683435 97455663 92224380 88444321 85433874 82762519
4143H2762519j965884j402871j470294j443656j174362j352356j709624j310632
$$ 82762519 80796635 79393764 77923470 76479814 75305452 73953096 72243472 70932840
4135G0932840j094998j161769j288476r39776q02727j035783j315933j921170
$$ 70932840 69837842 68676073 67387597 66447821 65645094 64609311 63293378 61372208
4127F1372208j669369j705001j502075n28963j399075j446549r30552r97206j131497
$$ 61372208 59702839 57997838 56495763 55966800 54567725 53121176 52190624 51193418 50061921
4118E0061921q02795k89961o69290q93812n18158q55325n34583j26303m89410
$$ 50061921 49259126 48969165 48299875 47406063 46887905 46032580 45497997 45371694 44882284
4109D4882284o91463n39487o48296k07483l69994n70762l21095l11532m9150k06703
$$ 44882284 44190821 43651334 43003038 42795555 42425561 41854799 41533704 41222172 41173022 40966319
4099D0966319l62094m91902k91860k86704m57482j71440L4948j79640l20346k53804
$$ 40966319 40604225 40112323 39820463 39533759 39076277 38904837 38939785 38760145 38439799 38185995
4089C8185995j31542n21889o549J41639m62357q9089M76751j49419J75274L97740
$$ 38185995 38054453 37532564 37526015 37667654 37205297 37116208 37592959 37443540 37618814 38016554
4079C8016554Q7688o4048l30449j46762N17429J90117L62029L37042J60614K71092
$$ 38016554 38104242 38040194 37709745 37562983 38080412 38270529 38632558 38969600 39130214 39401306
4069C9401306K50007J88037j73229l07324p4929o95809m36743L24991n9326j89945
$$ 39401306 39651313 39839350 39666121 39358797 39283868 38588059 38151316 38476307 38416981 38227036
4059C8227036k39631M9260K8539L97883J78653n9288J19773k08317L14229L2844
$$ 38227036 37987405 38036665 38065204 38463087 38641740 38582452 38702225 38493908 38808137 38840981
4049C8840981J33928K58476K80849K25583K48846L03522l1952L16835J0092j65754
$$ 38840981 38974909 39233385 39514234 39739817 39988663 40292185 40260233 40577068 40587160 40421406
4039D0421406p65613j89721R8252K2714K51746K03288K72659J84433L92214M12955
$$ 40421406 39655793 39466072 39564324 39587038 39838784 40042072 40314731 40499164 40891378 41304333
4029D1304333L18646k3010K21330M99585M72016O40484N59647N93160O02774Q6303
$$ 41304333 41622979 41599969 41821299 42320884 42792900 43433384 43993031 44586191 45188965 45275268
4019D5275268L37058K57985J37906M3894R38088P01338L90037N66212L09971Q35532
$$ 45275268 45612326 45870311 46008217 46052111 46990199 47691537 48081574 48647786 48957757 49793289
4009D9793289J172051J244589N93254J034443Q73395N90994Q29259J162459J532366
$$ 49793289 50965340 52209929 52803183 53837626 54711021 55302015 56131274 57293733 58826099
4000E8826099J069099P74862O58890Q18485N12785M83168J288042N65093N21959
$$ 58826099 59895198 60670060 61328950 62147435 62660220 63143388 64431430 64996523 65518482
3991F5518482R85297N43827R24653R09983K72034J156919O72498O59123R32364
$$ 65518482 66503779 67047606 67972259 68882242 69154276 70311195 70983693 71642816 72575180
3982G2575180N17002J468115J002209J113889M01570j93498m55727K882l06043
$$ 72575180 73092182 74560297 75562506 76676395 77077965 76884467 76428740 76431622 76125579
3973G6125579L77785o6900k22069r1847n90141n11180p67268p86300o11010n47106
$$ 76125579 76503364 76436464 76214395 76122548 75532407 75021227 74253959 73467659 72856649 72309543
3963G2309543j169165n45569n74657n40693p48976j261912q89385q12330j222282
$$ 72309543 71140378 70594809 70020152 69479459 68730483 67468571 66579186 65766856 64544574
3954F4544574j273526j125250q37493q48184q77008j192535j201755j112471p47740
$$ 64544574 63271048 62145798 61308305 60460121 59583113 58390578 57188823 56076352 55328612
3945E5328612j197219j229560o29993l05349r86409j297549j252796j302210j055829
$$ 55328612 54131393 52901833 52271840 51966491 50980082 49682533 48429737 47127527 46071698
3936D6071698q24206j554881j308689j235877o97670p93269o43217p04020k84929
$$ 46071698 45247492 43692611 42383922 41148045 40450375 39657106 39013889 38309869 38024940
3927C8024940m13633r4799n91479m61868q45440n17467j66506r43930m68109r0812
$$ 38024940 37611307 37516508 36925029 36463161 35617721 35100254 34933748 33989818 33521709 33430897
3917C3430897O6798n17720k21489j50348j00056o65878j02966n0410J3392O0648
$$ 33430897 33497695 32979975 32758486 32608138 32508082 31842204 31739238 31688828 31702220 31762868
3907C1762868j87978j82348p00011k67567k65906r14867n06364j30132k79675
$$ 31762868 31574890 31392542 30692531 30424964 30159058 29244191 28737827 28607695 28328020
3898B8328020k22938K8645k98857J3684L06385J32797J92252M92768O5694M8335
$$ 28328020 28105082 28133727 27834870 27848554 28154939 28287736 28479988 28972756 29038450 29086785
3888B9086785N25595L9161L3900M34111l93232J97068o178k95466j04502k03656
$$ 29086785 29612380 29651541 29685441 30119552 29726320 29923388 29917210 29621744 29517242 29313586
3878B9313586n2819p8900K28826r716k64900M45789J64444L33827M02022K32585
$$ 29313586 29260767 29181867 29410693 29400977 29136077 29581866 29746310 30080137 30482159 30714744
3868C0714744K64686K64339O17061P13646K21424O59292O68894P44861J074533
$$ 30714744 30979430 31243769 31860830 32574476 32795900 33455192 34124086 34868947 35943480
3859C5943480Q67087J158898R75408O62041N32972L58812k64918o22418m16336
$$ 35943480 36810567 37969465 38944873 39606914 40139886 40498698 40233780 39611362 39195026
3850C9195026n17012q34057K35465N38374l70970l83187n03172j11463K52716
$$ 39195026 38678014 37843957 38079422 38617796 38246826 37863639 37360467 37249004 37501720
3841C7501720l25870q32326r02033j305003j537017j437856j338809j130737r96870
$$ 37501720 37175850 36343524 35441491 34136488 32599471 31161615 29822806 28692069 27695199
3832B7695199p64685q53845o02696j017212o10590k89778m77954p26662j89368
$$ 27695199 26930514 26076669 25473973 24456761 23846171 23556393 23078439 22351777 22162409
3823B2162409K73611n39387l58763j58953j22823k25963m95884J50236K88085
$$ 22162409 22436020 21896633 21537870 21378917 21256094 21030131 20534247 20684483 20972568
3814B0972568m12124n55116L35853m3062p17546J45280J89696L82726O3241J64216
$$ 20972568 20560444 20005328 20341181 20298119 19580573 19725853 19915549 20298275 20361516 20525732
3804B0525732L40046r8781j62443n49897Q3381L81783k11721K24488K35710k75347
$$ 20525732 20865778 20766997 20604554 20054657 20138038 20519821 20308100 20532588 20768298 20492951
3794B0492951l0693M18116O5879j90085O03432L24777K21611K74072l9718J17904
$$ 20492951 20462258 20880374 20946253 20756168 21359600 21684377 21905988 22180060 22140342 22258246
3784B2258246O34509L43258l47441J42704M39360J61739L38935q4948q9775K63002
$$ 22258246 22892755 23236013 22888572 23031276 23470636 23632375 23971310 23886362 23796587 24059589
3774B4059589j20353J80798k26823K84621O3843m23730M72671J75130j62243J32581
$$ 24059589 23939236 24120034 23893211 24177832 24241675 23817945 24290616 24465746 24303503 24436084
3764B4436084K85006L35214P9195j55823J56302q076k5181r58P4123N9882k9475
$$ 24436084 24721090 25056304 25135499 24979676 25135978 25127902 25102721 25101763 25175886 25235768 25206293
3753B5206293L83579J64688M50517K35105k49849N9182k31102n4093L88014J12239
$$ 25206293 25589872 25754560 26205077 26440182 26190333 26249515 26018413 25964320 26352334 26464573
3743B6464573j95432k03271Q25164M79870l96023K81756M25750L09589L53550
$$ 26464573 26269141 26065870 26891034 27370904 26974881 27256637 27682387 27991976 28345526
3734B8345526L71790J76549N37335N19606J88696K67364M84101P42124M75661
$$ 28345526 28717316 28893865 29431200 29950806 30139502 30406866 30890967 31633091 32108752
3725C2108752J215501O52436N19452O40678K16215N11373L84513R93230O98583
$$ 32108752 33324253 33976689 34496141 35136819 35353034 35864407 36248920 37242150 37940733
3716C7940733M00526O71478K81595O24008O66380J043387O56946M11117R21743
$$ 37940733 38341259 39012737 39294332 39918340 40584720 41628107 42285053 42696170 43617913
3707D3617913P98709P36399N98602N82398J008388P07086P54784N29385Q09561
$$ 43617913 44416622 45153021 45751623 46334021 47342409 48049495 48804279 49333664 50143225
3698E0143225J350359L36613J099820J076840J522733J150598J246218J105051
$$ 50143225 51493584 51830197 52930017 54006857 55529590 56680188 57926406 59031457
3690E9031457J043225J109487J324407J439789J206625J500654J950316J789099
$$ 59031457 60074682 61184169 62508576 63948365 65154990 66655644 68605960 70395059
3682G0395059J644398J480972J403870J360528O28722L19800L11205L17196L46117
$$ 70395059 72039457 73520429 74924299 76284827 76913549 77233349 77544554 77861750 78207867
3673G8207867J43812O08901M21285L72784J99265O66900P16841K78468P03854
$$ 78207867 78351679 78960580 79381865 79754649 79953914 80620814 81337655 81616123 82319977
3664H2319977j29247j86892l91583l33790j67318j48544n27660m30771K98746
$$ 82319977 82190730 82003838 81612255 81278465 81111147 80962603 80434943 80004172 80302918
3655H0302918M11463K42472N4243N11780L01577M32498L12622L85142K99078L34055
$$ 80302918 80714381 80956853 81011096 81522876 81824453 82256951 82569573 82954715 83253793 83587848
3645H3587848N61388K69628M63112Q50682P38511O18323L84207N68201Q94442
$$ 83587848 84149236 84418864 84881976 85732658 86471169 87089492 87473699 88041900 88936342
3636H8936342L19467L46013N78684N62539K12628K84970N71227j47877J94874
$$ 88936342 89255809 89601822 90180506 90743045 90955673 91240643 91811870 91663993 91858867
3627I1858867Q34012M90021L88697r8290M38657L04634K9404K51259L62831K26852
$$ 91858867 92692879 93182900 93571597 93473307 93911964 94216598 94246002 94497261 94860092 95086944
3617I5086944O43979L00778L68230P68930O73334Q49605N8707M78572P48902M28690
$$ 95086944 95730923 96031701 96399931 97168861 97842195 98691800 98750507 99229079 99977981 100406671
3607A00406671J104943J335443J168644J001252J583734J000589R25348J682056
$$ 100406671 101511614 102847057 104015701 105016953 106600687 107601276 108526624 110208680
3599A10208680J161024J105370J618620J155900Q92614J167828J178457O11249
$$ 110208680 111369704 112475074 114093694 115249594 116142208 117310036 118488493 119099742
3591A19099742O73050O30137R66869P42607N93612M48135M28555L61286L22030
$$ 119099742 119772792 120402929 121369798 122112405 122706017 123154152 123582707 123943993 124266023
3582A24266023K49651L2356r6691j8444J87470l0662j63217K99571l8298L00270
$$ 124266023 124515674 124548030 124451339 124432895 124620365 124589703 124426486 124726057 124687759 124988029
3572A24988029K78955K94988M80594R1494N336M41979N83991P6187n97980o16551
$$ 124988029 125266984 125561972 126042566 126134060 126139396 126581375 127165366 127241553 126643573 126027022
3562A26027022n42196l16087m00395j235998j353568r89449q00473r86394j213473
$$ 126027022 125484826 125168739 124768344 123532346 122178778 121189329 120388856 119402462 118188989
3553A18188989j569960j002015r07132j594738j281681j224176j940116j813636
$$ 118188989 116619029 115617014 114709882 113115144 111833463 110609287 108669171 106855535
3545A06855535j537126j562819r19341j180445j144059o39572o98698r57583k70444
$$ 106855535 105318409 103755590 102836249 101655804 100511745 99872173 99173475 98215892 97945448
3536I7945448j53231k00529j12267L76996L42036n5225K98763Q88413L22197N7617
$$ 97945448 97792217 97591688 97479421 97856417 98198453 98143228 98441991 99330404 99652601 99710218
3526I9710218R46078N94634K75491K68336M89024J92076J20953K8005j83630J18901
$$ 99710218 100656296 101250930 101526421 101794757 102283781 102475857 102596810 102624815 102441185 102560086
3516A02560086J05819n86519k87692l35951k92178p48123m63153j106867j080902
$$ 102560086 102665905 102079386 101791694 101455743 101163565 100415442 99952289 98845422 97764520
3507I7764520j249480j283558j576160j474377j125542j204770j700349j505649
$$ 97764520 96515040 95231482 93655322 92180945 91055403 89850633 88150284 86644635
3499H6644635j564360k036298j601034j500126j337975j146055j358620r78007
$$ 86644635 85080275 83043977 81442943 79942817 78604842 77458787 76100167 75122160
3491G5122160j286312q54856j203472j131653j125169r29649j047250j65619p00457
$$ 75122160 73835848 72980992 71777520 70645867 69520698 68591049 67543799 67378180 66677723
3482F6677723o42450k80942m21821r26195q95646j65901j90354l43055J3906p15989
$$ 66677723 66035273 65754331 65332510 64406315 63510669 63344768 63154414 62811359 62825265 62109276
3472F2109276L0118r6513n75761J44241k94324l03247n67054M09435K91567k72566
$$ 62109276 62139394 62042881 61467120 61611361 61317037 61013790 60446736 60856171 61147738 60875172
3462F0875172l3125j01526k12928K30348K21396l09781K41270K05869L88573K50409
$$ 60875172 60842047 60740521 60527593 60757941 60979337 60669556 60910826 61116695 61505268 61755677
3452F1755677m181M42341Q68245J668550J178434J404928J89141j287129j948771
$$ 61755677 61751496 62193837 63062082 64730632 65909066 67313994 67503135 66216006 64267235
3443F4267235r11585n95857j162794k036763j654496j425060j540039j222267
$$ 64267235 63355650 62759793 61596999 59560236 57905740 56480680 54940641 53718374
3435E3718374r91545m31287n49506j11073j71727l76131L15977K45652P53948
$$ 53718374 52726829 52295542 51746036 51634963 51463236 51087105 51403082 51648734 52402682
3426E2402682N99409J544033K033473J846581K073279K681860K747555K257191
$$ 52402682 53002091 54546124 56579597 58426178 60499457 63181317 65928872 68186063
3418F8186063J184078J79064Q58809Q27197j987586m090780l856985l069462k394083
$$ 68186063 69370141 69549205 70408014 71235211 69247625 65156845 61299860 58230398 55836315
3409E5836315j196887q01036l35334m98528J04674L36607J320558J338596L66084
$$ 55836315 54639428 53838392 53503058 53004530 53109204 53445811 54766369 56104965 56471049
3400E6471049r19148j185878k247119j246709o88806k33072j21923K24761m9715
$$ 56471049 55551901 54366023 52118904 50872195 50183389 49950317 49828394 50053155 50003440
3391E0003440k0289N31545Q56562N65282N71366J124367J377842J896090J403340
$$ 50003440 49983151 50514696 51371258 51936540 52507906 53632273 55010115 56906205 58309545
3382E8309545R8381j229786j830363j265293m94037k68958L78257K78269J97360
$$ 58309545 58407926 57178140 55347777 54082484 53588447 53319489 53697746 53976015 54173375
3373E4173375J99648j43097o14579p18063o53086l47404l73125k11019n68366
$$ 54173375 54373023 54229926 53615347 52897284 52244198 51896794 51523669 51312650 50744284
3364E0744284J12461K23527m7809k25364N80205Q2024R9618R35651Q67190P09823
$$ 50744284 50856745 51080272 51032463 50807099 51387304 51469328 51568946 52504597 53371787 54081610
3354E4081610O07318L57613R34335J013614O89770L94017Q53681K04268P74235
$$ 54081610 54688928 55046541 55980876 56994490 57684260 58078277 58931958 59136226 59910461
3345E9910461R48638R79895J010696J329465J846215J390191J906390K062072
$$ 59910461 60859099 61838994 62849690 64179155 66025370 67415561 69321951 71384023
3337G1384023K190519J197907k81389o38707j300795n5909K16185P45213N74077
$$ 71384023 73574542 74772449 74491060 73852353 72551558 72495649 72711834 73457047 74031124
3328G4031124J438964J654118J599408J975334K697638J993655O46439j5340n29039
$$ 74031124 75470088 77124206 78723614 80698948 83396586 85390241 86036680 86021340 85492301
3319H5492301J25862j92187L41174J004608J132265R17513O97092J054934J183018
$$ 85492301 85618163 85425976 85767150 86771758 87904023 88821536 89518628 90573562 91756580
3310I1756580Q80106J301194J543542J486624J968890J811364K310726K246045
$$ 91756580 92636686 93937880 95481422 96968046 98936936 100748300 103059026 105305071
3302A05305071K726005L481031L342471L617860L914014M627334N297046N349012
$$ 105305071 108031076 111512107 114854578 118472438 122386452 127013786 132310832 137659844
3294A37659844N943470P061659P053422N649649L175310p9444p72872P33338K975849
$$ 137659844 143603314 150664973 157718395 163368044 166543354 166463910 165691038 166424376 169400225
3285A69400225M370193N882969P112027P633922Q261190Q602781Q921491Q964769
$$ 169400225 173770418 179653387 186765414 194399336 202660526 211263307 220184798 229149567
3277B29149567Q605520P954963O750884O167800N513986N081850M983973M662972
$$ 229149567 237755087 245710050 252460934 258628734 264142720 269224570 274208543 278871515
3269B78871515M775961M787210L367021J479363j925063o565371j1855824j6463400
$$ 278871515 283647476 288434686 291801707 293281070 291356007 284790636 272934812 256471412
3261B56471412j7966295j8333205j6797361j3974265j1856309j0688985q918824
$$ 256471412 238505117 220171912 203374551 189400286 177543977 166854992 157936168
3254A57936168r134545p495882o289990o013713n626777n182052m854646m175243
$$ 157936168 148801623 141305741 135015751 129002038 123375261 118193209 113338563 109163320
3246A09163320l863451l064146k636219k801783k830815k601892k718182k290472
$$ 109163320 105299869 102235723 99599504 96797721 93966906 91365014 88646832 86356360
3238H6356360j981899j768935j942820k037178k024499j471116k019774j713096
$$ 86356360 84374461 82605526 80662706 78625528 76601029 75129913 73110139 71397043
3230G1397043j909703j481172j213023j275625j373639n77630j020624j308867
$$ 71397043 69487340 68006168 66793145 65517520 64143881 63566251 62545627 61236760
3222F1236760j239984j461049j155068r91145j442769j143679q68601j465354
$$ 61236760 59996776 58535727 57380659 56389514 54946745 53803066 52934465 51469111
3214E1469111j372296j140718k92736p71298p09160q01425p25708r06610o43993
$$ 51469111 50096815 48956097 48663361 47892063 47182903 46381478 45655770 44749160 44105167
3205D4105167p71356p25373k12521o09035n95494n63019o63982o57071j91695
$$ 44105167 43333811 42608438 42395917 41786882 41191388 40628369 39964387 39307316 39115621
3196C9115621m90239n72893m34290p04950O0681k84883l68955k63576n21814o88561
$$ 39115621 38625382 38052489 37618199 36913249 36973930 36689047 36320092 36056516 35534702 34846141
3186C4846141o44525r7971J38396n78551n64849q60394k15802m28227l30389n50720
$$ 34846141 34201616 34103645 34242041 33663490 33098641 32238247 32022445 31594218 31263829 30713109
3176C0713109n17515j13499l29892K0331l00543k73636P1387m06741m99868m05424
$$ 30713109 30195594 30082095 29752203 29772534 29471991 29198355 29269742 28863001 28363133 27957709
3166B7957709k36022l04254N4425o55398j02146j75112n02990r4123j7848n8094
$$ 27957709 27721687 27417433 27471858 26816460 26714314 26539202 26036212 25942089 25924241 25866147
3156B5866147j13811j52248m87852p6299n60586j79949K6907l23791q1745r5010
$$ 25866147 25752336 25600088 25112236 25035937 24475351 24295402 24322309 23998518 23916773 23821763
3146B3821763m64654j58877j90406k17853k06348L89304k04772m92851k30515
$$ 23821763 23357109 23198232 23007826 22789973 22583625 22972929 22768157 22275306 22044791
3137B2044791J43792r2645k25958K45180n26958J45868K36690K78774k80657p05688
$$ 22044791 22188583 22095938 21869980 22115160 21588202 21734070 21970760 22249534 21968877 21263189
3127B1263189J09260J00075l85677o77695N1064j02034l13080l32926j41148k03094
$$ 21263189 21372449 21472524 21086847 20409152 20460216 20358182 20045102 19712176 19571028 19367934
3117A9367934M05694j76165k87112L58900j06024J88493j09740K7840n27742J47397
$$ 19367934 19773628 19597463 19310351 19669251 19563227 19751720 19641980 19669820 19142078 19289475
3107A9289475K40156K93970k71427j54407n92119R4279J11165J93053J15353j41431
$$ 19289475 19529631 19823601 19552174 19397767 18805648 18899927 19011092 19204145 19319498 19178067
3097A9178067j57213q0394J22730J71642j82038l42555J0496j94929j47305j68604
$$ 19178067 19020854 18940460 19063190 19234832 19052794 18710239 18720735 18525806 18378501 18209897
3087A8209897L04579j63272J71228j67772p5261k46756l18651J08885K7451k33048
$$ 18209897 18514476 18351204 18522432 18354660 18279399 18032643 17713992 17822877 17850328 17617280
3077A7617280K79461j68811l43162p6703O06854k94038p1778L64624k98544J69299
$$ 17617280 17896741 17727930 17384768 17308065 17914919 17620881 17549103 17913727 17615183 17784482
3067A7784482j7035k08504j92068j45064l46140p7111L96639J09178l91080K57355
$$ 17784482 17767447 17558943 17366875 17221811 16875671 16798560 17195199 17304377 16913297 17170652
3057A7170652M4252k23438R6628J524M34136k252L07917N46693l58227k21990
$$ 17170652 17214904 16991466 17088094 17089618 17523754 17521502 17829419 18376112 18017885 17795895
3047A7795895N22720J76106l9718K37014L22397J60587K17500J50378P9339J35082
$$ 17795895 18318615 18494721 18455003 18692017 19014414 19175001 19392501 19542879 19622218 19757300
3037A9757300M14987L96914J03509K45689R77203L99939M51677N62380m5353l25018
$$ 19757300 20172287 20569201 20672710 20918399 21895602 22295541 22747218 23309598 23264245 22939227
3027B2939227p5695k92739o68774m12133K38262K03933j65643M90802K98517o4069
$$ 22939227 22863532 22570793 21902019 21489886 21728148 21932081 21766438 22257240 22555757 22491688
3017B2491688O3259K45317p5255L4058P5693L79788K95503j78063Q26810K68599
$$ 22491688 22554947 22800264 22725009 22759067 22834760 23214548 23510051 23331988 24158798 24427397
3007B4427397k7O22513O95919Q31619O23604J175621Q85314N37666J302098J418129
$$ 24427397 24427370 25049883 25745802 26577421 27201025 28376646 29261960 29799626 31101724 32519853
2997C2519853J394123M83801p47565p68287r16225n59130n32363k66913j44450
$$ 32519853 33913976 34397777 33650212 32881925 31965700 31406570 30874207 30607294 30462844
2988C0462844j40140J46349L32093J06252m6128K8580Q13206M25309K29012Q06862
$$ 30462844 30322704 30469053 30801146 30907398 30861270 30889850 31703056 32128365 32357377 33164239
2978C3164239N26352J236925N41085Q55347Q16840J004976J024563R44107J627850
$$ 33164239 33690591 34927516 35468601 36323948 37140788 38145764 39170327 40114434 41742284
2969D1742284R39829J773516K097840K106788K196984K170908K495890K328306
$$ 41742284 42682113 44455629 46553469 48660257 50857241 53028149 55524039 57852345
2961E7852345J814571K142753K378184K333418J872867K027693J324807L73053
$$ 57852345 59666916 61809669 64187853 66521271 68394138 70421831 71746638 72119691
2953G2119691K75746J32526q1703J30821O32498M62882L03280K13074P7519L89727
$$ 72119691 72395437 72527963 72446260 72577081 73209579 73672461 73975741 74188815 74266334 74656061
2943G4656061O94774J97717N04902R40036J225292J415465J820137K195114K653120
$$ 74656061 75350835 75548552 76053454 76993490 78218782 79634247 81454384 83649498 86302618
2934H6302618L168803M192292M803018N638423O816349P686274R425626Q500563
$$ 86302618 89471421 93663713 98466731 104105154 110921503 118607777 128033403 136533966
2926A36533966L390862l837284p931006r585529r514008p448990o503344n835771
$$ 136533966 139924828 136087544 128156538 118571009 109057001 101608011 95104667 89268896
2918H9268896l784775l419744k255558j871703j933298j333148p07035m27348
$$ 89268896 85484121 82064377 79808819 77937116 76003818 74670670 73963635 73536287
2910G3536287k22658P383O3887N99957J186783N41780P87437J200206J414521
$$ 73536287 73313629 73321012 73384899 73984856 75171639 75713419 76500856 77701062 79115583
2901G9115583J268172J402195J432897R39728O17150o58877j225856k728073l493464
$$ 79115583 80383755 81785950 83218847 84158575 84775725 84116848 82890992 80162919 76669455
2892G6669455l354245l646324l792140l408295k796930k700856k640268j781317
$$ 76669455 73315210 69668886 65876746 62468451 59671521 56970665 54330397 52549080
2884E2549080j461832j172223j215861q77910p35231k96885q20335o21399j194326
$$ 52549080 51087248 49915025 48699164 47821254 47086023 46789138 45968803 45347404 44153078
2875D4153078j080832n11778p38342j274654j050730j292123j093549j423189
$$ 44153078 43072246 42560468 41822126 40547472 39496742 38204619 37111070 35687881
2867C5687881j320108j304995j487822p78042r54138j020655r64246p34930j51370
$$ 35687881 34367773 33062778 31574956 30796914 29842776 28822121 27857875 27122945 26971575
2858B6971575r48325n40073p43749p06051k01161m52916n59538n29556m51549
$$ 26971575 26023250 25483177 24739428 24033377 23832216 23379300 22819762 22290206 21838657
2849B1838657n26189l42658k35476l82037m38457j42349p50786m73537m78325
$$ 21838657 21312468 20969810 20734334 20352297 19913840 19771491 19020705 18547168 18068843
2840A8068843m37740o31679p5030o44732l60404p4513k83178o9111k57795j65823
$$ 18068843 17631103 16999424 16924394 16279662 15919258 15844745 15561567 15492456 15234661 15068838
2830A5068838l57501o24315l44000j97757q3531p9492k91874l84129k54236n1600
$$ 15068838 14711337 14087022 13743022 13545265 13461734 13382242 13090368 12706239 12452003 12400403
2820A2400403K18523m03796j65878j03777N5344K34368k79564m62431l56231m6532
$$ 12400403 12618926 12215130 12049252 11945475 12000819 12235187 11955623 11493192 11136961 11090429
2810A1090429m79238k09260k8063j73483k09212L9746k54632L4131k76996j42891
$$ 11090429 10611191 10401931 10373868 10200385 9991173 10030919 9776287 9810418 9533422 9390531
2800I390531K89009m02436m56470K04472K19122k93607n1709k66778p9431j77930
$$ 9390531 9679540 9277104 8820634 9025106 9244228 8950621 8898912 8632134 8552703 8374773
2790H374773k30875k04930p8593l20264n6594j90359j26306M5539k32116m2028
$$ 8374773 8143898 7938968 7860375 7540111 7483517 7293158 7166852 7212391 6980275 6938247
2780F938247l3158q789m2003n44101R0801R4905k28213l3424j22204j42946K31867
$$ 6938247 6905089 6896300 6854297 6310196 6400997 6495902 6267689 6234265 6112061 5969115 6200982
2769F200982q7099L40889m31991n3798L54760m36292k84236l78183M54214q3860
$$ 6200982 6113883 6454772 6022781 5968983 6323743 5887451 5603215 5225032 5679246 5595386
2759E595386k50929o3007o2921q9402k38145K95056j37350j65736j68442n6863
$$ 5595386 5344457 5281450 5218529 5129127 4890982 5186038 5048688 4882952 4714510 4657647
2749D657647L84566r5824k37696j24150J90538o2263j4417l15235l02099r8454
$$ 4657647 5042213 4946389 4708693 4584543 4775081 4712818 4698401 4383166 4081067 3982613
2739C982613M59841K23895j04183l15166n1467o7294K15113j73576j89445j18253
$$ 3982613 4442454 4666349 4562166 4247000 4195533 4128239 4343352 4169776 3980331 3862078
2729C862078J78176K7257j77320K04491l71757J28150J12302l00364k21511j18906
$$ 3862078 4040254 4067511 3890191 4094682 3722925 3851075 3963377 3663013 3441502 3322596
2719C322596K25463j05225m9817K72250K87940m43328o70646J70100L47942K39521
$$ 3322596 3548059 3442834 3393017 3665267 3953207 3509879 2839233 3009333 3357275 3596796
2709C596796J47505m33277j93862J45877K13619Q2748k69174m2599k7887J64164
$$ 3596796 3744301 3311024 3117162 3263039 3476658 3559406 3290232 3247633 3219746 3383910
2699C383910N4199j50215j27182j12405M2014J43706k22521Q420K564q953J15917
$$ 3383910 3438109 3287894 3160712 3048307 3090321 3234027 3011506 3019926 3022490 3013537 3129454
2688C129454k05723j84842p9784J78578M93176k06271n5628q4940j26748K52560
$$ 3129454 2923731 2738889 2659105 2837683 3330859 3124588 3068960 2984020 2857272 3109832
2678C109832Q4206k36124k03557j9473K52034m6085M36348k80055n0566K75440
$$ 3109832 3194038 2957914 2754357 2734884 2986918 2940833 3377181 3097126 3046560 3322000
2668C322000o89103P59L3324p5389J83454j35171J79327j62951j80678K87048
$$ 3322000 2632897 2633656 2666980 2591591 2775045 2639874 2819201 2656250 2475572 2762620
2658B762620j18556K45285k81240j0158P4906J2876p4629K65248J73704o494L3926
$$ 2762620 2644064 2889349 2608109 2597951 2672857 2685733 2611104 2876352 3050056 3043562 3077488
2647C077488k71378P6458O0758l16393M56186L28190l15871k24100j73871J94221
$$ 3077488 2806110 2882568 2943326 2626933 3083119 3411309 3095438 2871338 2697467 2891688
2637B891688J26298k41767r5582j95348M6515K48150l07713O8686p429M30k4184
$$ 2891688 3017986 2776219 2680637 2485289 2531804 2779954 2472241 2540927 2533498 2533928 2509744
2626B509744J28731Q8307l22504l35921J52364L54713K19415J6444m16749J9766
$$ 2509744 2638475 2726782 2404278 2068357 2220721 2575434 2794849 2811293 2394544 2414310
2616B414310M314j46198j00012o9746Q4681K29554j76801L60370m48163j94893
$$ 2414310 2418624 2272426 2172414 2102668 2187349 2416903 2240102 2600472 2152309 1957416
2606A957416K04387j042K29257k38938j13211l032L69852k11605j13624o2514
$$ 1957416 2161803 2160761 2390018 2151080 2037869 2034837 2404689 2193084 2079460 2016946
2596B016946l3708K4116L78218K7875o6778l36020M7894J78254j20656P3319j87241
$$ 2016946 1983238 2007354 2385572 2413447 2346669 2010649 2058543 2236797 2116141 2189460 2002219
2585B002219j71069K4357j43773J37511K6563l68343M66740N40295l70436n43111
$$ 2002219 1831150 1855507 1711734 1849245 1875808 1507465 1974205 2514500 2144064 1600953
2575A600953l12166O3143J14524j80036L93838J68271l03541J03120n8312K92448
$$ 1600953 1288787 1351930 1466454 1286418 1680256 1848527 1544986 1648106 1589794 1882242
2565A882242j57830j86098N3646k48087N9914k3965P8913K99781j48014l25617
$$ 1882242 1724412 1538314 1591960 1343873 1403787 1379822 1458735 1758516 1610502 1284885
2555A284885k80081J55672K12624K4714K52517k61901l66839Q2097K64607m21217
$$ 1284885 1004804 1160476 1373100 1397814 1650331 1388430 1021591 1103688 1368295 947078
2545I47078M33356j91296j21067q92L15722K1965J06514K5414l91781K27766J56213
$$ 947078 1380434 1189138 1068071 1067179 1382901 1404866 1511380 1536794 1145013 1372779 1528992
2534A528992m92278j60951L92716K52073k45085J22275K65654m3651M18761m04175
$$ 1528992 1036714 875763 1268479 1520552 1275467 1397742 1663396 1619745 2038506 1634331
2524A634331J27354l36636k59760L56267O2219Q2519L5350m3409l14611n6790
$$ 1634331 1761685 1425049 1165289 1521556 1583775 1666294 1701644 1658235 1343624 1286834
2514A286834m06553l2292J98459j80586k5274K90955J92350n58481J29588j70351
$$ 1286834 880281 847989 1046448 865862 840588 1131543 1323893 765412 895000 724649
2504G24649L76400n1663J32975n8096p0696M7929m10626j11861J10853j6016l37749
$$ 724649 1101049 1049386 1182361 1124265 1053569 1101498 690872 579011 689864 673848 336099
2493C36099m5254N8758o2790K28972K44521n0019M2563p1107j09297r4533J7468
$$ 336099 290845 349603 286813 515785 760306 710287 752850 681743 572446 477913 495381
2482D95381N08067j53257r383l13839K67838j16494l060L39065M57100q8403n08803
$$ 495381 1003448 850191 840808 526969 794807 678313 675253 1014318 1471418 1383015 874212
2471H74212J51691N3159K71863k84977J00704N2451j08245N6059K31193l20203
$$ 874212 1025903 1079062 1350925 1065948 1166652 1219103 1110858 1166917 1398110 1077907
2461A077907l3152J77818m18715k50271L47492k32194m8034l06947M68469r8389
$$ 1077907 1044755 1222573 803858 553587 901079 668885 620851 313904 782373 683984
2451F83984J33173m5501n23690K94326Q984k60818K81224o8504k84795K68110
$$ 683984 817157 771656 247966 542292 551276 290458 571682 503178 218383 486493
2441D86493J01468L20465M94896q4632m61169j77948J27032K3597l57338J31254
$$ 486493 587961 908426 1403322 1318690 857521 679573 806605 830202 472864 604118
2431F04118L9646K41615J2962l71821J79451O8224J35646j06671K02114J07155
$$ 604118 643764 885379 898341 526520 705971 774195 909841 803170 1005284 1112439
2421A112439l37975p0876O319p0771j521l2327L92004j96104k98576J4815O10318
$$ 1112439 774464 703588 709907 639136 637615 605288 997292 801188 502612 517427 1127745
2410A127745j14908l93306Q2603N23486j10942l04086m1950q6319O37965k62315
$$ 1127745 1012837 619531 702134 1225620 1114678 810592 768642 682323 1320288 1057973
2400A057973j59424M9961l01397K30992K36631M49187J51556k83051j85535J71046
$$ 1057973 898549 948510 647113 878105 1114736 1563923 1715479 1432428 1246893 1417939
2390A417939K50903j89603m17681k48720J22603K03850j32432j24789L08352l29336
$$ 1417939 1668842 1479239 1061558 812838 935441 1139291 1006859 882070 1190422 861086
2380H61086J08307j00073j05394J14998q3548j78676J94824K63878r3967j34440
$$ 861086 969393 869320 763926 878924 795376 616700 811524 1075402 981435 846995
2370H46995M6312K51748K44209j44601l73716k26424J98057k80586M05059m49240
$$ 846995 893307 1145055 1389264 1244663 870947 644523 842580 561994 967053 517813
2360E17813J9779J60744j15523J33168J57693K63297m42096M65472j64872j20727
$$ 517813 537592 698336 582813 715981 873674 1136971 694875 1160347 995475 874748
2350H74748K14741J74052l04351J91542K96033r5667J8640l55098k37087k2352
$$ 874748 1089489 1263541 959190 1150732 1446765 1351098 1369738 1014640 777553 755201
2340G55201J87870q8946K08745j14787j57892K4685M1413M4533M60930q2313l86540
$$ 755201 943071 854125 1062870 948083 790191 814876 856289 900822 1361752 1279439 892899
2329H92899j06820j58928M18079R8409l92415J95885l46560K41924l0704l10375
$$ 892899 786079 627151 1045230 1143639 751224 947109 600549 842473 811769 501394
2319E01394K94241j29302K15611K71984j70689k23967j76516k38392R9671K01755
$$ 501394 795635 666333 881944 1153928 983239 759272 582756 344364 444035 645790
2309F45790K43736N25360j57613n51065L02947N90749n67720l29704l3450J85744
$$ 645790 889526 1414886 1257273 706208 1009155 1599904 1032184 702480 669030 854774
2299H54774k7010j95579K50104N97520j11939m57475J80841J748K67489K18888
$$ 854774 827764 632185 882289 1479809 1367870 910395 1091236 1092984 1360473 1579361
2289A579361k53233j69590r9620k01989l13573N91976J8253m2779K16987K07839
$$ 1579361 1326128 1156538 1056918 854929 541356 1133332 1151585 1108806 1325793 1533632
2279A533632k45455k7153J89675J94042Q1254j73551m93523j63052L13903J79166
$$ 1533632 1288177 1261024 1450699 1644741 1725995 1552444 1058921 895869 1209772 1388938
2269A388938L10334k86305J05796j20761N5962m98337P3893K75903L57827l38852
$$ 1388938 1699272 1412967 1518763 1398002 1453964 955627 1029520 1305423 1663250 1324398
2259A324398K61498P160M115K6179n3256l55768k51730K94994Q6616o9362J48673
$$ 1324398 1585896 1593056 1597171 1623350 1570094 1214326 962596 1257590 1344206 1274844 1423517
2248A423517K02735j88913K81034M68353m72134j69122L28513K33821l71178J92542
$$ 1423517 1626252 1437339 1718373 2186726 1714592 1545470 1873983 2107804 1736626 1929168
2238A929168J59384k97n7355k3518k71855N51720M36757o05687r0216O07100k29716
$$ 1929168 2088552 2088255 2030900 2007382 1735527 2287247 2724004 2118317 2028101 2635201 2405485
2227B405485m56187J53001L07368K84227l52596K26197L85359l56755k66038M5425
$$ 2405485 1949298 2102299 2409667 2693894 2341298 2567495 2952854 2596099 2330061 2375486
2217B375486J57047K58247J62348K00517J03681m35527N7106l00321J16588J9472
$$ 2375486 2532533 2790780 2953128 3153645 3257326 2821799 2878905 2578584 2695172 2714644
2207B714644M02745J53787K04816j1408o1943J83724M76051N4609m18959j07775
$$ 2714644 3117389 3271176 3475992 3464584 3402641 3586365 4062416 4117025 3698066 3590291
2197C590291o4259M25379Q0720J76496o1660J45489L26279K68441p6450j88862
$$ 3590291 3526032 3951411 4032131 4208627 4146967 4292456 4618735 4887176 4810726 4621864
2187D621864j22179N4355K69569J97179p3150J77973l89303p548J79119j15127
$$ 4621864 4499685 4554040 4823609 5020788 4947638 5125611 4736308 4728760 4907879 4792752
2177D792752L20589N78461n95212L88754M14461M704K89724K90625J64828Q838
$$ 4792752 5113341 5691802 5096590 5485344 5899805 5904509 6194233 6484858 6649686 6658524
2167F658524J83318N36683L39674M5343K21859q530L16929N21818K49237L11653
$$ 6658524 6841842 7378525 7718199 7763542 7985401 7976871 8293800 8815618 9064855 9376508
2157I376508L9518O59484K09341R40504P05944N61503N06183R75998R31141P77998
$$ 9376508 9416026 10075510 10284851 11225355 11931299 12492802 12998985 13974983 14906124 15684122
2147A5684122R57709J124574J139302J870044J598470K304670K387965K274474
$$ 15684122 16641831 17766405 18905707 20775751 22374221 24678891 27066856 29341330
2139B9341330P76375J396456J642928K861407L904582N628509P637288J0825485
$$ 29341330 30117705 31514161 33157089 36018496 39923078 45551587 53188875 64014360
2131F4014360J2950911J5043954J6513365K2988866L2772464M5774307J3800803
$$ 64014360 76965271 92009225 108522590 131511456 164283920 210058227 223859030
2124B23859030l7193547m5359960l7927514k3244990j5221381r465135p623273
$$ 223859030 186665483 141305523 103378009 80133019 64911638 55446503 47823230
2117D7823230n140000m473325l560714l259038k169449j702104j039268p06695
$$ 47823230 42683230 38209905 34649191 31390153 29220704 27518600 26479332 25772637
2109B5772637k433879k493071j703105k088563j266132j147269j030247q44456
$$ 25772637 23338758 20845687 19142582 17054019 15787887 14640618 13610371 12765915
2101A2765915p60335l70847L52345n68054l28216l98818q81776l53244j9277l8280
$$ 12765915 12005580 11634733 11987078 11419024 11090808 10691990 9810214 9456970 9437693 9399413
2091I399413p29731n56640k38071N4417k27798m31833k25508m16375k95261O182
$$ 9399413 8669682 8113042 7874971 7929388 7701590 7269757 7044249 6627874 6332613 6338795
2081F338795p6596j61109o8783l11787o94808J79670K22938j94043m6607L4209
$$ 6338795 6262199 6101090 6032307 5720520 5025712 5205382 5428320 5234277 5187670 5221879
2071E221879j67360k03493m43347J70331q7151n44714l9443p4621J34338l06354
$$ 5221879 5054519 4851026 4407679 4578010 4490859 3946145 3906702 3832081 3966419 3660065
2061C660065j4846k00140l33764M586K04327K83745k48007q4277J35441j05045
$$ 3660065 3645219 3445079 3111315 3115901 3320228 3603973 3355966 3271689 3407130 3302085
2051C302085k24322K40558n16091o27691M35005J28324k4513K78107k40172j06518
$$ 3302085 3077763 3318321 2802230 2174539 2609544 2737868 2713355 2991462 2751290 2644772
2041B644772N79828j42309k93961k16876j74540o7055J58026j68173k81353k5809
$$ 2644772 3224600 3082291 2788330 2571454 2396914 2329859 2487885 2319712 2038359 2012550
2031B012550J62897k64000k95165L60238k92264k48842L10721K02935k14399K18065
$$ 2012550 2175447 1911447 1616282 1976520 1684256 1435414 1746135 1949070 1734671 1952736
2021A952736j31397J1114o3993j93401O4397n61397j41894J57638K96109j24575
$$ 1952736 1821339 1832453 1768460 1575059 1639456 1078059 936165 1093803 1389912 1265337
2011A265337K83829O2819l87246O9232q9872k5602J01928l98968K15510L09240
$$ 1265337 1549166 1611985 1224739 1293971 1204099 1178497 1280425 881457 1096967 1406207
2001A406207K3438K5505n0131j61974k34269j50315Q5973n5941j31978L50092
$$ 1406207 1429645 1455150 1405019 1243045 1008776 858461 944434 888493 756515 1106607
1991A106607J71273L28292l01967m27461l4484L99539m50359N35778K43647j32342
$$ 1106607 1277880 1606172 1304205 876744 842260 1241799 791440 1327218 1570865 1438523
1981A438523n20936o8251K01765L68635l79492k71639M38063L61431J67684j56004
$$ 1438523 917587 849336 1051101 1419736 1040244 768605 1206668 1568099 1735783 1579779
1971A579779k49547k16134n47138N7455L07941K1679j717O9502L02040j2709m01774
$$ 1579779 1330232 1114098 566960 624415 932356 954035 952318 1021820 1323860 1311151 909377
1960I09377j40660J62365p5665k64044n5329K81212n3332n6283l7908J41690L40995
$$ 909377 768717 931082 855417 591373 536044 817256 763924 707641 669733 811423 1152418
1949A152418j92117m36648k65246L28019L29957L7861M2445k94607J43107J53482
$$ 1152418 960301 523653 258407 586426 916383 954244 996689 702082 845189 998671
1939I98671J37840k01387l23324K48322J98309L290j74517j61707K2589j22538
$$ 998671 1136511 935124 611800 860122 1058431 1061721 887204 725497 748086 625548
1929F25548J35204k43093M72246J85430j31652l30514k86793J42106J8892L9498
$$ 625548 760752 517659 989905 1175335 1043683 713169 426376 568482 587374 626872
1919F26872O9929k00491K52884J93346k85122L02012n9920l1480j182k36160J05826
$$ 626872 696801 496310 749194 942540 657418 959430 899510 868030 866848 630688 736514
1908G36514N4061j08449l95488J17469j69623J63493k2207K01895K09326m29721
$$ 736514 790575 682126 286638 404107 234484 397977 375770 577665 786991 357270
1898C57270L36634K74724m36528p8029j71561J46238K6571n6075K17388j58763
$$ 357270 693904 968628 532100 454071 282510 428748 455319 399244 616632 457869
1888D57869J85787k16711L02683R9945n006j71013o7755R6448m4876L2828p5648
$$ 457869 643656 426945 729628 829573 824567 653554 585799 682247 637371 670199 594551
1877E94551L84240r6534l76060p3797q9952m02359J71141K29509J01414J96072
$$ 594551 978791 882257 506197 432400 342448 -59911 111230 340739 442153 638225
1867F38225j29113K81397r7894J73079M19411L7352m20341L35562r3953J77939
$$ 638225 509112 790509 692615 865694 1285105 1322457 902116 1237678 1143725 1321664
1857A321664J87366l7174n8971n28299Q762J6383J00013k05522r8374j42749J60848
$$ 1321664 1509030 1471856 1412885 884586 893348 909731 1009744 804222 705848 563099 723947
1846G23947R7674j23975J7474j96637m30348J94343r9394J78072J4703K83732
$$ 723947 821621 697646 715120 518483 88135 282478 183084 361156 375859 659591
1836F59591K44515l8439m66317K01883M9461m99893K08660M28430J58930n2078
$$ 659591 904106 865667 399350 601233 650694 150801 359461 787891 946821 894743
1826H94743j16277k23978j2832m25760L18028j71887K44852J62194k70152j07566
$$ 894743 778466 554488 541656 115896 433924 262037 506889 669083 398931 291365
1816B91365n7187K23134n5616j36796k0465K89505l34165Q1560K21670j58911
$$ 291365 234178 457312 401696 264900 244435 533940 199775 281335 503005 344094
1806C44094k45636m4745n1331J05330K61616l06867K22286n2477k21756Q0612
$$ 344094 98458 53713 2382 107712 369328 62461 284747 232270 10514 91126
1796I1126N68918o9334n66708Q2630L6602K94579k11543O2382K48151m86596J48545
$$ 91126 660044 590710 24002 106632 143234 437813 226270 288652 536803 50207 198752
1785A98752J05843j7577n45406K76101P4886o5529M63848l27083K27426k19851
$$ 198752 304595 287018 -258388 17713 92599 27070 490918 163835 391261 171410
1775A71410o9255J07322k79500M56521J13172q9101q9370l14579J36219L33528
$$ 171410 102155 209477 -70023 386498 499670 410569 321199 6620 142839 476367
1765D76367m0481j62978j89523l8740O4025K39803J4904N8173J76281j37521j4686
$$ 476367 435886 272908 83385 44645 108670 348473 363377 421550 597831 460310 445624
1754D45624k8359Q9927J17167m94866m65914N2536k0835n9367Q3568K97342k61206
$$ 445624 417265 507192 624359 129493 -336421 -283885 -304720 -364087 -280519 16823 -244383
1743b44383N87277l9304j79295J08453n3133J68877l7850O4171j86507l09243
$$ -244383 342894 303590 124295 232748 179615 348492 310642 374813 188306 -120937
1733a20937J37156J70369K36657N748K4233J1959K6983n3293j61174J53325q0751
$$ -120937 16219 186588 423245 428993 453226 465185 492168 438875 277701 431026 350275
1722C50275J24269l35952J7718J9863M20194j26882k95195K2965l62133J7750
$$ 350275 474544 138592 156310 176173 596367 469485 174290 197255 -164878 -147128
1712a47128R3779J41080m83483r7837n6730K72626L71855l28868L47587J48378
$$ -147128 -53349 87731 -395752 -493589 -550319 -277693 94162 -234706 112881 261259
1702B61259j44896j74589K45582j32760J8058J86035J05680j7327n4917j10550
$$ 261259 116363 -58226 187356 54596 72654 258689 364369 347042 292125 181575
1692A81575Q2813R9943L8688J51137j42548j69754m3077r4601l4119L21757M8033
$$ 181575 264388 364331 403019 554156 411608 241854 198777 104176 70057 391814 439847
1681D39847m43348k36067K52898k20103L8741L47543N8692K37230n276m86673
$$ 439847 -3501 -239568 13330 -206773 -168032 179511 238203 475433 470157 -16516
1671a6516M15299r7556N6986J95099k36742L8100j31225K5446j48810Q0800M07625
$$ -16516 398783 301227 358213 553312 316570 354670 223445 248891 100081 180881 588506
1660E88506O0998q4252j37258o9869j04662k62816M42020m5295J44485l26850
$$ 588506 649504 565252 427994 358125 253463 -9353 432667 387372 531857 205007
1650B05007R6396k06776m06452L58831K47301k0799k76220j0824J42205k94511
$$ 205007 301403 94627 -311825 47006 294307 273508 -2712 -13536 128669 -165842
1640a65842J33917K95462l42595P6781k95015K11967M8912k06810J15466K72730
$$ -165842 -31925 263537 -79058 -2277 -297292 -85325 -36413 -243223 -127757 144973
1630A44973J40228J77490K03364k06018k01180k14996n1204J11883J72016k92738
$$ 144973 285201 462691 666055 460037 258857 43861 -7343 104540 276556 -16182
1620a6182K95313J71465l34633k66847K12321j7178J22994J22586j61551J21647
$$ -16182 279131 450596 115963 -150884 61437 44259 167253 289839 128288 249935
1610B49935k02214J84791j07952K4288R4503K25986l64940K85560r3965k48622
$$ 249935 47721 232512 124560 148848 243351 469337 104397 389957 295992 47370
1600D7370j00449j96056J88242J87387l22399m19691J10146K74063K52226k9015
$$ 47370 -53079 -249135 -60893 126494 -195905 -615596 -505450 -231387 20839 -8176
1590h176J89825j1311k15407O3998j49426J06596R1653K76378n9944m1009k4069
$$ -8176 181649 170338 -45069 18929 -130497 -23901 67752 344130 284186 243177 219108
1579B19108k13m41781M1325J64244J35779k4838j32132J83818q5998p1036j17488
$$ 219108 218895 -222886 -181561 -17317 118462 93624 -38508 145310 59312 -11724 -129212
1568a29212l2579J58324J54898P9910j81042N845K97508k02385l0596K73026j14450
$$ -129212 -161791 -3467 151431 231341 50299 56144 353652 151267 120671 393697 279247
1557B79247n32162M39444j0962k70417r8314L32656o3333k63392p8895J48074
$$ 279247 -252915 186529 175567 -94850 -193164 139492 76159 -187233 -266128 -118054
1547a18054K14436l1410L56617k75251j83688K46279M1759J12163J7437k8862
$$ -118054 96382 64972 421589 146338 -37350 208929 250688 362851 380288 351426
1537C51426k50337j72394j334J33838M468l09520J86435K35088j17808R0712q0058
$$ 351426 101089 -71305 -72639 61199 65667 -243853 -57418 177670 59862 150574 70516
1526G0516K46101j6313n10575J52362m2868K19179O4048k65056J82515L8263k9320
$$ 70516 316617 300304 -210271 -57909 -100777 118402 182450 -82606 99909 138172 108852
1515A08852M00832J49142l87795K38080l67516L5825k9230k45874j7158L13491
$$ 108852 509684 658826 271031 509111 141595 177420 148190 -97684 -114842 198649
1505A98649M00067k25564j05725J7850k3842L6955k66226o6244k2806j22020N81924
$$ 198649 598716 373152 267427 285277 261435 298390 32164 -34080 -56886 -178906 403018
1494D03018k32412l9553l79384m336L94243m3403l53587j430R2143j49676J11064
$$ 403018 170606 131053 -248331 -252667 141576 98173 -255414 -256844 -164701 -314377 -203313
1483b03313j75691L54435l33716J46101N1801K3916L55409N4706k14318k8660
$$ -203313 -379004 -24569 -358285 -212184 -160383 -136467 218942 273648 59330 30670
1473C0670p8239J9805L5807J21317j24321k90832q9695J97971j49754K81896K55197
$$ 30670 -47569 -27764 8043 129360 5039 -285793 -375488 -177517 -327271 -45375 209822
1462B09822n19423r7673K70694l33129M98309K79340j28904l35910l45688M04531
$$ 209822 -309601 -407274 -136580 -469709 28600 307940 179036 -156874 -502562 -98031
1452i8031M85292l441l67868L3747J2922j20123r5030K78420l2453R9561j28095
$$ -98031 387261 383820 15952 49699 62621 -57502 -152532 125888 93435 192996 64901
1441F4901l6342K23984l04052j71424J12911J07382j86273N24239L06863m72226
$$ 64901 28559 252543 -51509 -222933 -110022 -2640 -188913 335326 642189 169963
1431A69963J14302n97247K37429M84566j92665R2612n49868k55238K59999P4895
$$ 169963 284265 -312982 -75553 409013 216348 308960 -240908 -496146 -236147 -161252
1421a61252r0709j95950N51079J19567M13506K77861k23824o12800J68196k67689
$$ -161252 -251961 -447911 103168 222735 636241 914102 690278 77478 245674 -22015
1411b2015R3508M3860k72306R8303J60336M6176l17393J23601R6219j7199j07401
$$ -22015 71493 115353 -156953 -58650 101686 147862 -169531 -45930 50289 33090 -74311
$$ [...]
##END NTUPLES=NMR SPECTRUM
##END=
