##TITLE=1H_TG-2351-X1Y
 DMSO
 8 sc, 
 11.03.2022
##JCAMPDX= 6.0         $$ Bruker NMR JCAMP-DX V2.0
##DATA TYPE= NMR SPECTRUM
##DATA CLASS= NTUPLES
##ORIGIN= UXNMR, Bruker Analytische Messtechnik GmbH
##OWNER= root
$$ XWIN-NMR		Version 3.5
$$ Fri Mar 11 11:48:19 2022 Russian Standard Time (UT+4h)  she@DPX200
##.OBSERVE FREQUENCY= 200.131346
##.OBSERVE NUCLEUS= ^1H
##.ACQUISITION MODE= SIMULTANEOUS
##.ACQUISITION SCHEME= undefined
##.AVERAGES= 8
##.DIGITISER RES= 18
##SPECTROMETER/DATA SYSTEM= spect
##.PULSE SEQUENCE= zg30
##.SOLVENT NAME= DMSO
##.SHIFT REFERENCE= (INTERNAL, DMSO, 0, 15.7116)
##AUDIT TRAIL= $$ (NUMBER, WHEN, WHO, WHERE, WHAT)
$$ ##TITLE= Audit trail, XWIN-NMR		Version 3.5
$$ ##JCAMPDX= 5.01
$$ ##ORIGIN= Bruker BioSpin GmbH
$$ ##OWNER= she
$$ F:/spectra/data/she/nmr/H-F/1/pdata/1/auditp.txt
$$ ##AUDIT TRAIL=  $$ (NUMBER, WHEN, WHO, WHERE, WHAT)
(   1,<2022-03-11 11:47:14.32 +0400>,<she>,<DPX200>,
      <created by zg, POWCHK disabled, PULCHK disabled
       configuration hash MD5:
       00 E9 B6 7A A2 85 ED C7 34 08 36 98 17 FE 4E 26
       data hash MD5: 16K
       61 F0 38 FB B7 53 36 D5 AA 83 DC 14 E9 3D 07 0E>)
(   2,<2022-03-11 11:47:20.34 +0400>,<she>,<DPX200>,
      <Start of raw data processing
       efp BC_mod = 2 LB = 0.24 FT_mod = 6 PKNL = 1 PHC0 = -16587.08 PHC1 = 13.20078 SI = 16K 
       data hash MD5: 16K
       EF F5 52 24 28 D4 CC DC E0 09 CE 56 EF D6 AB 61>)
(   3,<2022-03-11 11:47:40.56 +0400>,<she>,<DPX200>,
      <pk PHC0 = 0.09140797 PHC1 = -6.999999 
       data hash MD5: 16K
       27 04 04 D8 90 5F 27 BB 27 22 CC 7F A6 A2 54 BA>)
(   4,<2022-03-11 11:47:44.03 +0400>,<she>,<DPX200>,
      <abs ABSG = 5 
       data hash MD5: 16K
       CE DA E8 C1 A5 B2 E2 09 B0 23 E7 1B 61 48 39 24>)
$$ ##END=
$$ 
$$ hash MD5
$$ C1 D7 D2 22 0C 39 40 42 AE 81 0B 1D 6B 59 A3 F4
##$RELAX= 
##$RELAX= 
##$RELAX= 
##$RELAX= 
##$RELAX= 
##$RELAX= 
$$ Bruker specific parameters
$$ --------------------------
##$DU= <F:/spectra>
##$EXPNO= 1
##$NAME= <H-F>
##$PROCNO= 1
##$TYPE= <nmr>
##$USER= <she>
##$AMP= (0..31)
100 100 100 100 100 100 100 100 100 100 100 100 100 100 100 100 100 100 
100 100 100 100 100 100 100 100 100 100 100 100 100 100 
##$AQSEQ= 0
##$AQ_mod= 1
##$AUNM= <au_zg>
##$AUTOPOS= <>
##$BF1= 200.13
##$BF2= 200.13
##$BF3= 200.13
##$BF4= 200.13
##$BF5= 200.13
##$BF6= 200.13
##$BF7= 200.13
##$BF8= 200.13
##$BYTORDA= 1
##$CFDGTYP= 0
##$CFRGTYP= 5
##$CHEMSTR= <none>
##$CNST= (0..31)
1 1 145 1 1 1 1 1 1 1 1 1 1 1 1 1 1 1 1 1 1 1 1 1 1 1 1 1 1 1 1 1 
##$CPDPRG= <>
##$CPDPRG1= <>
##$CPDPRG2= <>
##$CPDPRG3= <>
##$CPDPRG4= <mlev>
##$CPDPRG5= <mlev>
##$CPDPRG6= <mlev>
##$CPDPRG7= <mlev>
##$CPDPRG8= <mlev>
##$CPDPRGB= <>
##$CPDPRGT= <>
##$D= (0..31)
0 1.2 0 0 0 0 0 0 0 0.06 0 0.03 0 0 0 0 0.0002 0 0 0 0 0 0 0 0 0 0 0 0 
0 0 0 
##$DATE= 1646984833
##$DBL= (0..7)
120 120 120 120 120 120 120 120 
##$DBP= (0..7)
150 150 150 150 150 150 150 150 
##$DBP07= 0
##$DBPNAM0= <>
##$DBPNAM1= <>
##$DBPNAM2= <>
##$DBPNAM3= <>
##$DBPNAM4= <>
$$ [...]
##$SUBNAM2= <"">
##$SUBNAM3= <"">
##$SUBNAM4= <"">
##$SUBNAM5= <"">
##$SUBNAM6= <"">
##$SUBNAM7= <"">
##$SUBNAM8= <"">
##$SUBNAM9= <"">
##$SW= 18.0517287032376
##$SWIBOX= (0..15)
0 0 2 0 0 0 0 0 0 0 0 0 0 0 0 0 
##$SW_h= 3612.71676300578
##$TD= 16384
##$TD0= 1
##$TE= 0
##$TE2= 300
##$TE3= 300
##$TEG= 300
##$TL= (0..7)
0 120 120 120 120 120 120 120 
##$TP= (0..7)
150 150 150 150 150 150 150 150 
##$TP07= 0
##$TPNAME0= <>
##$TPNAME1= <>
##$TPNAME2= <>
##$TPNAME3= <>
##$TPNAME4= <>
##$TPNAME5= <>
##$TPNAME6= <>
##$TPNAME7= <>
##$TPOAL= (0..7)
0.5 0.5 0.5 0.5 0.5 0.5 0.5 0.5 
##$TPOFFS= (0..7)
0 0 0 0 0 0 0 0 
##$TUNHIN= 0
##$TUNHOUT= 0
##$TUNXOUT= 0
##$USERA1= <user>
##$USERA2= <user>
##$USERA3= <user>
##$USERA4= <user>
##$USERA5= <user>
##$V9= 5
##$VALIST= <valist>
##$VCLIST= <CCCCCCCCCCCCCCC>
##$VD= 0
##$VDLIST= <DDDDDDDDDDDDDDD>
##$VPLIST= <PPPPPPPPPPPPPPP>
##$VTLIST= <TTTTTTTTTTTTTTT>
##$WBST= 1024
##$WBSW= 4
##$XGAIN= (0..3)
0 0 0 0 
##$XL= 0
##$YL= 0
##$YMAX_a= 254636
##$YMIN_a= -162222
##$ZGOPTNS= <>
##$ZL1= 120
##$ZL2= 120
##$ZL3= 120
##$ZL4= 120
##$ABSF1= 15.71163
##$ABSF2= -2.340219
##$ABSG= 5
##$ABSL= 3
##$ALPHA= 0
##$AQORDER= 0
##$ASSFAC= 0
##$ASSFACI= 0
##$ASSFACX= 0
##$ASSWID= 0
##$AUNMP= <proc_1d>
##$AZFE= 0.1
##$AZFW= 0.1
##$BCFW= 0
##$BC_mod= 2
##$BYTORDP= 0
##$COROFFS= 0
##$CY= -3
##$DATMOD= 1
##$DC= 0
##$DFILT= <>
##$DTYPP= 0
##$F1P= 0
##$F2P= 0
##$FCOR= 1
##$FTSIZE= 16384
##$FT_mod= 6
##$GAMMA= 0
##$GB= 0
##$INTBC= 1
##$INTSCL= 0
##$ISEN= 128
##$LB= 0.24
##$LEV0= 0
##$LPBIN= 0
##$MAXI= 10000
##$MC2= 0
##$MEAN= 0
##$ME_mod= 0
##$MI= 1.114404
##$NCOEF= 0
##$NC_proc= -8
##$NLEV= 6
##$NOISF1= 3.799351
##$NOISF2= 2.8
##$NSP= 0
##$NTH_PI= 0
##$NZP= 0
##$OFFSET= 15.71163
##$PC= 1
##$PHC0= -16586.99
##$PHC1= 6.200781
##$PH_mod= 1
##$PKNL= yes
##$PPARMOD= 0
##$PSCAL= 0
##$PSIGN= 0
##$REVERSE= no
##$SF= 200.130007990404
##$SI= 16384
##$SIGF1= 3
##$SIGF2= 2
##$SINO= 5.538805
##$SIOLD= 16384
##$SREGLST= <1H.CDCl3>
##$SSB= 0
##$STSI= 16384
##$STSR= 0
##$SW_p= 3612.71676300578
##$SYMM= 0
##$S_DEV= 0
##$TDeff= 16384
##$TDoff= 0
##$TI= <>
##$TILT= no
##$TM1= 0
##$TM2= 0
##$TOPLEV= 0
##$USERP1= <user>
##$USERP2= <user>
##$USERP3= <user>
##$USERP4= <user>
##$USERP5= <user>
##$WDW= 1
##$XDIM= 16384
##$YMAX_p= 406003198
##$YMIN_p= -3639680
$$ End of Bruker specific parameters
$$ ---------------------------------
##NTUPLES= NMR SPECTRUM
##VAR_NAME=  FREQUENCY,     SPECTRUM/REAL,   SPECTRUM/IMAG
##SYMBOL=    X,             R,               I
##VAR_TYPE=  INDEPENDENT,   DEPENDENT,       DEPENDENT
##VAR_FORM=  AFFN,          ASDF,            ASDF
##VAR_DIM=   16384,         16384,           16384
##UNITS=     HZ,            ARBITRARY UNITS, ARBITRARY UNITS
##FACTOR=    0.220516191357247, 1,           1
##FIRST=     3144.36861093579, 0,            0
##LAST=      -468.348152069986, 0,           0
##MIN=       -468.348152069986, -3639680,    0
##MAX=       3144.36861093579, 406003198,    0
$$ Real data points
##PAGE= N=1
##DATA TABLE= (X++(R..R)), XYDATA
$$ [...]
15503 -121776 401698 325420 106715 228253 18268 -128243 80754 11175 -202656 -152217
15493 -152217 -315479 207543 323335 39454 -13179 -130145 50090 243326 463007 798277
15483 798277 680553 199391 -228046 130004 -185 -135960 -382982 -654251 -589149 -310245
15473 -310245 -29620 -371705 -186269 -260078 -105373 -27194 56705 -34486 43938 276824
15463 276824 -159275 -172039 -182307 -310575 32206 -128972 -24749 -182687 -270948 -78795
15453 -78795 -311973 -456923 -123680 202376 156138 132770 201190 108916 156867 -382283 -450981
15442 -450981 112882 17499 32542 -500822 -406928 -212143 -17213 119716 -98836 310951
15432 310951 301586 -328214 -575010 -269835 -145250 48738 199529 -198861 -230802 -360159
15422 -360159 -150575 300270 219777 242865 110083 -435309 -370468 -209023 -124597 -19433
15412 -19433 -222414 -78799 124897 57193 83214 -101298 -182333 144932 90898 -38441
15402 -38441 -41548 -352331 -220411 -177548 -510222 11856 162862 -89941 -195798 -492642
15392 -492642 -418981 -656804 -607039 -369510 -562607 -114730 575017 410131 162485 196522
15382 196522 204729 -256498 -265988 -324481 -173951 104544 64421 336597 345927 313105 -52804
15371 -52804 -178628 217938 -68217 -93847 111297 469906 82607 -133082 24696 57177
15361 57177 149841 223606 228738 -137118 -269135 137658 -66114 -480256 -80409 53457
15351 53457 13662 467821 558507 256194 -88065 -160434 53276 134136 158598 -17351 342946
15340 342946 -1973 87049 53504 128837 221843 -294994 -423234 -218992 156021 320488
15330 320488 304217 432704 380700 440117 274575 126117 -100305 -145847 -58165 -183248
15320 -183248 -373720 -534994 -275320 237971 238997 332316 527426 98678 -13303 74720
15310 74720 97951 79761 -43213 131731 136417 138358 505538 651550 -9749 -54442 -178621
15299 -178621 2018 323550 -30655 113726 386193 239738 298591 570037 373212 118146
15289 118146 -85296 35959 102930 -64389 -509171 -244543 -155564 -227258 -365499 -41762
15279 -41762 24510 -75610 256443 318203 -85274 152443 -18330 36784 124990 37699 127885
15268 127885 4204 -206083 -285928 59690 338683 265313 171271 47844 -110227 -160103
15258 -160103 -229585 -133237 215517 -61833 -16035 106258 -509021 -525768 -255212 -35606
15248 -35606 -82180 296743 596983 558345 152489 277757 168250 270987 93348 -106916
15238 -106916 -36499 236844 -23585 -210968 -366053 -307868 -50374 35167 -108926 -130831
15228 -130831 -63952 -217970 -176047 -99288 -45960 -239789 210159 244693 179587 332128 -157036
15217 -157036 -214381 113769 180896 652697 251784 21880 125073 -142598 -225076 -400183
15207 -400183 35710 177355 180263 157682 195393 -122367 -300606 -506547 -148418 -115234
15197 -115234 -274683 299369 161688 -147234 80814 320503 65647 -230911 -570872 -452405
15187 -452405 -100233 -236871 -118724 157108 236157 558576 631146 425827 366147 198524
15177 198524 -416179 -559320 -428003 54489 -67139 108603 186363 -162375 -56303 324871
15167 324871 106758 -14276 -500481 -514828 -48654 231911 115253 -2792 217661 -37785
15157 -37785 -222902 -433150 -410291 -27210 232452 295141 263201 -77336 22834 288025
15147 288025 551561 321680 174726 168275 -219826 -112310 9594 47430 -296488 -498183
15137 -498183 -187309 -18777 -583672 -488654 -306263 -306388 203595 131423 -84917 -64804 -195932
15126 -195932 -226135 72093 43376 275429 570669 389451 -40802 98788 318484 313523
15116 313523 506687 208192 202881 499830 418717 292796 495788 686538 641035 366293
15106 366293 389845 -132618 -464296 -85851 -63714 -278508 -447857 -311380 -519630 -187358
15096 -187358 -204516 -255874 -75641 13555 -68775 178475 13585 313809 272916 248511 -100772
15085 -100772 -407094 136906 117284 442 43291 -329823 -352010 214298 -88534 -495880
15075 -495880 -174263 -231842 -469038 -216595 234507 -76507 -574376 143442 640788 519110
15065 519110 82319 84932 125011 490482 210854 178678 -140932 71748 237133 134429
15055 134429 149586 -552934 -550696 -244663 -285619 -54748 52649 45211 -78283 205052 451345
15044 451345 -17145 -138883 -557939 -378802 55774 33215 -235715 242399 208325 454802
15034 454802 384256 126886 -134346 -88673 44361 302594 141954 -115778 133654 205363
15024 205363 -96972 -93885 -391979 -135150 552180 424588 167483 138823 -58203 -226876
15014 -226876 -219295 -429094 -260508 -262504 -345455 -470657 369417 202491 146856 45931 -382883
15003 -382883 -777821 -357907 108986 385490 -109328 -214501 -140193 96688 118209 7113
14993 7113 367815 390156 244881 584431 433037 318404 474697 230157 -4280 -96583
14983 -96583 48904 219338 539913 381474 528544 464051 448398 338238 265909 212570
14973 212570 199646 83325 -325535 -350208 -497700 -414222 66403 67619 129108 343059 369127
14962 369127 55081 -182341 287089 441656 515330 590890 200265 346760 273653 455447
14952 455447 298571 316023 559463 400695 296698 200037 290645 -43031 -240578 -123335
14942 -123335 -345554 6026 163325 263325 256373 386891 199974 126004 286232 -99279
14932 -99279 -114516 30045 71174 219993 126311 123601 43231 -130926 -146064 -296396 -499321
14921 -499321 95423 113123 67572 98623 -104063 -96625 4000 78000 11293 -261510 -224329
14910 -224329 -305109 -340865 -59737 -36588 253529 -183063 234901 154125 93252 7804 -245168
14899 -245168 -127191 -109985 64976 -346618 -604133 -737114 -711772 -220951 -124605 1160
14889 1160 42615 -249656 9641 -71517 -202164 55507 129915 79339 337699 498310 152774
14878 152774 179877 -260443 -191742 -60670 -161922 -201020 171788 133114 -7470 126284
14868 126284 530566 698052 608758 588147 416182 422175 304160 47518 -138123 -9306
14858 -9306 -20337 32776 -98226 -269288 -60995 -48222 -18963 121950 342236 136012 -241
14847 -241 73945 13177 89732 -72487 -126269 -300858 -80428 -196788 -286190 -140935 -21680
14836 -21680 349977 533716 253588 241110 283269 80217 151879 -19651 -328573 -247521
14826 -247521 -159838 -374307 -222188 4200 -93872 -66225 -246971 -5497 -6138 -330642 -421688
14815 -421688 16534 16651 24984 51804 23059 241392 -3268 -92918 -92561 48773 281692
14804 281692 545394 340119 -73958 -28928 -93583 -107403 -463497 -225998 -391159 -390121
14794 -390121 -109166 60873 326317 -139026 -349149 -156085 127383 354930 571938 120919
14784 120919 59640 -178919 -261419 -617835 -609767 -138138 7328 -40803 183509 -32836
14774 -32836 42942 295665 299806 355012 130530 109238 428663 666338 470598 126632 -98185
14763 -98185 -172203 -364950 -319673 -666657 -281285 -272232 14559 344004 474225 362266
14753 362266 102563 -60487 -335242 109167 64840 11211 16273 -46149 78219 244735
14743 244735 512836 650483 73533 13145 -427413 -553688 -603150 -335631 40508 329991
14733 329991 327800 -30793 -125291 103070 158633 154875 549356 581834 329646 182034 -295454
14722 -295454 -579570 62960 110888 -36045 -70956 314292 394439 100084 62689 54311 -134492
14711 -134492 74750 106415 273397 435211 61286 169977 590911 191988 -276577 -243542
14701 -243542 383704 168610 -60337 2215 -49453 -140939 144565 168272 44116 -420976
14691 -420976 -426425 205538 222870 40698 -386932 -403819 -85930 -68158 -291059 -421559
14681 -421559 -325146 -51906 18913 70909 184573 -30064 330327 732088 415431 325060
14671 325060 -216336 -173608 424837 268353 280318 376866 65256 66034 61314 35058 -116730
14660 -116730 -131033 -100750 291036 -141595 -32798 122982 -128082 230406 23875 -110421
14650 -110421 142495 366154 762898 354054 -412319 -88716 399966 71370 117211 127226
14640 127226 -535546 -414904 -119868 -94130 -132168 -196173 -70140 237561 135404 121565
14630 121565 104593 96580 787614 948965 666045 612882 154471 35201 -43583 76221
14620 76221 -53729 -287820 -556525 46340 199077 221268 204684 346002 689378 506617
14610 506617 436175 368121 371307 44396 304740 213147 41312 -119057 -253925 -263753 -138275
14599 -138275 -188753 161781 69607 338941 249551 21324 75836 305103 23837 56824
14589 56824 -208763 -595115 26493 83857 -141373 -37377 87358 -56849 -280498 -727699
14579 -727699 -69947 190984 62530 54656 49769 65221 38789 272530 193975 576410 399443
14568 399443 295623 291390 95904 -391010 -407019 -187881 -78161 -242560 -427998 -233151
14558 -233151 -167949 -171469 -61249 221788 9435 -115106 99148 45073 -188733 -110754
14548 -110754 61224 -201587 -85132 465103 349788 301161 397248 292481 4877 -39635
14538 -39635 -7490 335708 671331 768695 416585 401114 233644 45404 -87110 14313
14528 14313 241174 517804 598388 681799 305187 70743 110323 -178110 -222317 143128
14518 143128 490596 45742 -13812 20456 -261126 255041 137135 -690 59001 -157939
14508 -157939 -737677 -197152 38354 152266 55532 105993 9062 -327225 -295480 43443
14498 43443 -88298 40378 29901 -204249 17237 -109163 -172382 1125 7524 -41547 -141684
14487 -141684 -257636 -75929 -100188 -49466 -265384 265289 150655 -68638 -233156 -97902
14477 -97902 -463666 -386889 -42452 -96406 -109533 -291192 -107116 -45546 -47665 158469 54649
14466 54649 -7797 -273138 48510 133065 285803 136693 29933 149401 389724 72974
14456 72974 182960 -13158 -138187 238740 -30362 -107267 232556 157731 239085 245344 180102
14445 180102 157319 266166 99930 -138714 -23614 -394499 122006 126170 -39872 -365073
14435 -365073 -218841 268381 253727 -85198 -177273 -280546 60986 297135 284668 264093
14425 264093 25798 6843 160274 208510 319312 19779 61622 339213 221092 -123238
14415 -123238 170749 147326 32157 6669 -102816 -57428 108906 -9086 238913 349518
14405 349518 346157 348148 601881 1086837 640547 164265 244736 636352 289502 440519
14395 440519 -161940 -124212 -28930 -172199 -196079 146473 -77057 -154963 48793 -150803
14385 -150803 48545 609741 492750 106487 -189791 44482 255479 109966 483759 529838
14375 529838 -48934 -283087 46080 293314 -47920 133076 41488 -176477 138720 258880
14365 258880 166680 279443 271206 106599 231377 -15809 27226 234218 -162515 71364
14355 71364 213216 147280 336775 -41774 -46950 26315 340666 39730 46469 14415 -76862
14344 -76862 194904 936656 612527 660455 783975 428350 6508 62512 253274 118648
14334 118648 23910 122287 171789 124588 -55728 -190083 -189244 -297069 31020 322121 -35169
14323 -35169 72851 -168171 -192652 231217 441678 459669 112352 65263 53847 -147564
14313 -147564 -168731 148711 -317976 -342742 -437000 -389399 -120936 32001 130471 36188 -85619
14302 -85619 -224399 -265897 -470677 -282403 25890 25966 -35877 33078 381193 139546 -263328
14291 -263328 53716 292033 44410 134474 -42350 -255237 -516383 -685815 -60373 -349393
14281 -349393 -580638 -495065 -347830 -473181 -60182 243017 -281871 -85940 303012 52430
14271 52430 -110611 -56910 -65327 -112027 -239479 183527 436150 272702 -34569 -37844 509921
14260 509921 301999 12328 -195212 30684 268645 393091 -120971 -19832 73305 90287
14250 90287 217042 202250 257330 213651 -33928 -63403 263239 283366 301508 -113676 -51573
14239 -51573 -43984 407127 613691 490488 5381 14477 -75233 -80700 -97946 52410 -379920
14228 -379920 -154035 80970 -357081 -53907 128297 201569 -184572 -150458 108333 -36390
14218 -36390 233177 63512 128734 421745 258573 -318127 -151968 201994 369787 -102507
14208 -102507 -409412 -269182 -189123 -331225 48422 245519 205807 -20388 -251600 -100451
14198 -100451 -382845 -348891 43465 -448681 -492371 -302489 -206064 246382 114411 23955
14188 23955 138745 102368 -213235 -30655 314205 385453 43747 -77068 387726 122628
14178 122628 -196817 -59898 -245440 -219551 -215560 -50372 -281081 -250519 120397 -76368
14168 -76368 -298131 89986 225378 238054 94600 -5807 648 -3725 -63234 136215 7597
14157 7597 -114262 42858 95116 -3937 428548 770501 447040 509650 508033 14168 199648
14146 199648 -49759 -360377 -65177 538586 -180746 -263123 91145 -304969 -229217 -165293
14136 -165293 112792 145285 22552 43958 239116 142515 164650 -44906 -118606 34534
14126 34534 37257 -257737 -367594 -144196 61403 108793 58697 -107767 210376 535703
14116 535703 366644 130168 111873 365185 35100 -114683 -414713 -192958 41572 -50719
14106 -50719 -433054 -202457 132953 375341 19907 -153275 -210771 -425652 141595 7605
14096 7605 -180142 -633424 -321252 31325 -216526 -111089 234890 -254298 -706586 -382212
14086 -382212 -19983 210056 9854 8978 -58389 -158012 -132031 176850 -51952 -394509 -612914
14075 -612914 -360793 -286492 -202108 157788 -269411 -82861 -79100 80192 232245 251717
14065 251717 295324 593610 318114 210837 66156 68478 79645 28564 137307 -156876
14055 -156876 -37023 155052 651173 365488 -6791 -97075 -333660 86050 -130793 -323349
14045 -323349 -22351 326584 171015 232986 358527 436542 599132 535746 264584 389686
14035 389686 305743 37569 -18082 -27668 -143678 -108219 6019 97186 -21546 -30861 159386
14024 159386 121024 125836 -194483 37710 -71591 15886 367130 343822 46902 222430
14014 222430 50000 323172 193185 174163 -115943 -186050 -321141 -325608 43339 177587
14004 177587 514583 99752 71296 -228200 -158757 -41938 351798 117388 121186 243437
13994 243437 309639 604292 213746 -5991 -102070 -130817 -392689 -46196 349561 57778
13984 57778 -231497 87784 -8738 13386 108853 136867 83944 -21023 450447 401903 314736
13973 314736 10040 -234991 -59163 262411 405602 421106 -42431 -195295 203578 143247
13963 143247 303963 540311 426072 354094 330800 176757 71640 499206 170334 76012
13953 76012 346989 26515 -48012 137815 -234415 133643 290880 290677 405468 461442 263779
13942 263779 187284 -89628 36889 470078 605988 630052 411417 190815 -83540 729
13932 729 -493934 -138209 20219 82963 61521 294420 327289 4526 -173903 103694 310436
13921 310436 -99586 -480486 -419693 -295563 -523246 -394191 -232366 -268067 -84694 73176
13911 73176 -380562 -403339 -221847 -131294 22476 -34827 -80176 -302745 -475910 -368862
13901 -368862 -419412 -632650 -325408 68306 104143 480565 268220 486812 732477 543599
13891 543599 149954 -32387 261917 379356 257267 105484 318370 188181 -125859 -28250
13881 -28250 387414 97658 119209 -13875 -69809 -6013 -270841 -310803 199314 423773
13871 423773 125234 39541 93089 -51140 -530661 -562687 -72352 107585 252172 241620
13861 241620 -7454 14283 364223 232176 405168 19637 370376 360045 228188 98977
13851 98977 -172475 -483008 -532110 -426469 -321074 -166706 -369281 -452085 -234543 -110291
13841 -110291 -262430 -171903 33857 -21185 122925 -83001 -141206 32136 -139846 -370214
13831 -370214 -589059 -397193 -469747 -151150 -144880 -190076 -269675 -264944 -396975 -464228 -20662
13820 -20662 -124729 -52723 152194 -350389 -320170 -537484 -440114 -241259 -321740 -132738
13810 -132738 156555 43003 219071 84695 -5700 145381 4034 -260335 346991 325633
13800 325633 267176 495470 726197 254210 -359916 -136165 -150911 -155393 147978 147075 278837
13789 278837 -9283 -17946 -15657 -105695 -348976 -313498 69672 113652 77117 6922 -169683
13778 -169683 -643948 -46736 217148 -91597 -462325 -66374 57137 -86801 -351178 -113413
13768 -113413 140863 -101045 434676 356835 64394 -6484 -265288 -260297 161170 11818
13758 11818 -64028 49004 -50464 24526 207158 -76699 37851 65755 77141 -78804 97991
13747 97991 -162408 -70883 4989 196896 43292 -214805 -155466 -312285 219851 554064
13737 554064 285392 -270742 -294739 -68356 521241 290653 -378644 -233404 203327 -45377
13727 -45377 -137810 99698 602599 184037 -134556 -242537 -172508 -473008 -266109 -149058
13717 -149058 -187245 140369 42642 -36158 66893 25367 114049 181104 199065 -212734 -66669
13706 -66669 -133613 -236055 -227282 136276 89796 -15326 -109834 -4939 65789 -472679 -404771
13695 -404771 -446501 -146640 373899 427726 141941 467345 412430 274405 79718 -106158
13685 -106158 20389 -79614 -194785 -172299 79966 368849 427920 589704 516018 312992
13675 312992 488224 579092 435986 13462 36716 140855 184130 442415 259270 360682
13665 360682 77788 -71990 -148646 -251293 169865 85268 -110859 -572036 -258590 -26713
13655 -26713 -25462 209105 54030 27540 -168875 -14410 10894 -163449 316933 210242
13645 210242 253418 239390 472865 443853 48005 406580 590425 649367 257587 -411935
13635 -411935 -367431 -168978 -268804 -94682 5269 -226108 -193098 29737 70513 131524 -157304
13624 -157304 -8613 -163107 -12742 -248960 -84882 222752 258734 380293 154948 171818
13614 171818 369893 383494 68375 -170588 -337149 -138084 215519 201649 222255 260518
13604 260518 -137293 -165801 -93058 442808 762611 298665 -52683 14372 -204216 -656164
13594 -656164 -240604 60300 -89855 -160210 -33433 -111519 -99077 -242136 -183441 -56272
13584 -56272 148776 375071 322166 -121610 -304173 -343351 -331874 -181682 173580 343891
13574 343891 -129131 -205197 286981 126262 34356 40090 -140094 -302103 -349467 99390
13564 99390 464249 718363 715151 416865 269936 281717 -85444 -61608 -252454 -709882
13554 -709882 -232681 152347 57240 -527957 -151232 -142938 -269092 77710 97948 217128
13544 217128 44828 -30672 -224229 -14406 271457 374408 285618 88631 29439 318923
13534 318923 52280 -325526 -159334 -122848 -97706 -153537 -244908 241412 339263 -28650
13524 -28650 277955 228244 17116 132527 9100 194333 159206 2390 241746 1206
13514 1206 -273651 -141871 -83852 132946 -85317 -33569 -23191 22930 59792 197038 -45689
13503 -45689 -15710 132406 -29678 -71256 -148005 -245788 -244989 -340729 -255387 -125710 37526
13492 37526 83662 -657188 -679555 -52090 8 74052 -165410 -63053 219491 -71913
13482 -71913 166676 348167 254530 -63559 -139436 20361 133071 -70338 202719 184861
13472 184861 224293 145545 24549 -76162 -94387 -209497 -213532 -377951 -434784 170159 56798
13461 56798 -363746 -592610 -252057 -21629 6940 -27926 -40688 -202338 66780 286571
13451 286571 206561 179658 -174355 -107539 45676 -137961 134033 208597 78854 -202374
13441 -202374 -75198 172043 134796 198234 -143119 -128987 124028 -301307 -218810 -123100
13431 -123100 -243233 -14133 -194611 -487557 130570 18010 -337867 -301437 29156 131811
13421 131811 386912 514638 221553 239589 -35387 -34855 -169188 -454412 -566257 -383534
13411 -383534 -227556 50224 356340 211209 210959 197740 85729 189518 -134771 -140657 1037
13400 1037 -745280 -678796 -338444 -235895 -93971 -493347 -523448 -509529 -36904 55008 -127686
13389 -127686 -156834 -202681 -84344 4751 -301779 -8420 -12991 -292067 72187 235261
13379 235261 374558 108639 93545 -166946 -331905 -100170 179242 217381 -81268 -432173
13369 -432173 -79215 152163 -64159 61400 272801 -59118 -468000 -562346 -364588 299245
13359 299245 286052 -138727 -413788 -122558 -13106 131980 122261 -102705 -406241 -422075
13349 -422075 -580127 -280657 -378101 -136235 -294747 -231640 -99521 288821 -106448 123404
13339 123404 497458 254236 224899 18219 -80801 226133 90214 -163922 -142931 7058
13329 7058 171937 235277 288777 421743 361253 -259399 -280108 -175256 280462 -77635 -9273
13318 -9273 -302702 -114436 323796 70437 -44754 406489 541268 37695 -158321 -117719
13308 -117719 -2358 -115781 -275654 -164044 -175797 119393 -221278 -412667 -1687 247347
13298 247347 115331 26132 -163667 -179715 -494212 -319356 387215 410030 219317 18468
13288 18468 126136 24177 166461 26164 -140792 68990 131848 70602 -113100 445516
13278 445516 328985 66849 45675 299173 -199877 -296601 -201135 -587408 -560993 128585
13268 128585 281509 133368 -30657 94981 124261 -4152 -322992 -315691 -327489 -96380
13258 -96380 -15048 -114295 7646 -163673 -87079 -457239 -228120 -208539 -178948 -53070 3852
13247 3852 17360 -86789 274722 171520 -301142 -330418 -272647 -162500 -289129 -26153
13237 -26153 119228 -229817 -343875 -241940 -252688 -50978 -132197 -70165 10286 81851 228597
13226 228597 -49845 71782 -2826 -26061 308133 -42938 -81344 82668 187980 -112517
13216 -112517 -54838 -182762 -465394 -278309 -273775 -225712 69925 91557 60022 55174 -238836
13205 -238836 -489769 -341058 152050 -9962 -338485 -445841 -360409 -74464 -432392 -569029
13195 -569029 -246189 83324 -50292 134244 108916 78194 284369 235405 -153151 -617380
13185 -617380 -480378 -302029 -255595 -170397 -208374 -268882 196867 -60154 -153154 -252810 -392003
13174 -392003 76298 -75214 -289102 -111156 -168948 -210868 -254281 -137571 93958 -194106
13164 -194106 -41676 136929 -18787 -22600 253136 83952 300290 216702 -279591 -225212
13154 -225212 -84613 99742 -115200 -184806 -442415 -675296 -183244 -377139 -364892 25723
13144 25723 -115592 -468480 -362387 -433555 -384567 -337767 -153305 -223019 -202782 -9321 -422609
13133 -422609 -489290 -61279 98429 -52575 -212939 -442018 -480017 -587011 -470495 -521433
13123 -521433 -446575 -147384 -135133 -40030 -28201 -445124 -426357 -171354 -26579 14497 25435
13112 25435 244374 120540 -122069 126808 47865 -166445 -169153 326831 -191377 -326042
13102 -326042 -206340 -62155 362089 302209 353021 299499 -103066 -72421 99610 174242
13092 174242 120563 36041 -411422 -357077 -152743 -209638 -231811 -351425 -605621 -452106
13082 -452106 -177171 -327675 70808 174876 184861 -21773 -284980 -281722 -205944 89041
13072 89041 -241444 -268318 42358 -114068 62093 -211569 -15361 -116498 -181622 36644
13062 36644 -356594 -349077 -122170 123266 142191 81848 117762 -162132 -122664 -273180 -302689
13051 -302689 -128940 242110 312254 422984 268591 -55765 -100231 -49047 20260 -271842
13041 -271842 -254082 -295491 198875 324295 174900 239180 -61960 -381622 -157116 -639645
13031 -639645 -509807 -398482 -543278 -450545 -509200 -204072 -247125 -376103 -29690 31891
13021 31891 168666 385867 141836 68293 -41961 -140169 -193309 -12378 57306 -411772
13011 -411772 -359764 20244 389965 663547 35554 -549791 -380018 -356985 -346801 110941
13001 110941 269590 -174861 -520177 -307200 -324111 -137479 -40186 -386127 -437183 -627845
12991 -627845 -541139 -503986 -534922 -164226 -287075 -77350 -113757 -62646 -251147 -206115 -42047
12980 -42047 -317990 -266568 -350686 -307204 87325 43142 -198397 -23213 -13433 72686 217459
12969 217459 166355 285149 448297 352136 101162 -124603 329541 284866 235200 -23888
12959 -23888 -60145 -103937 -435109 -122815 419153 359644 -60815 70752 -93596 65145
12949 65145 320439 183555 -176348 266001 317098 356703 -11291 111337 -262344 -259311
12939 -259311 205295 413485 361126 -99200 -112631 -172272 -486147 -129372 123343 -119147
12929 -119147 90186 -4690 10866 -67672 2714 552531 401244 -135411 -282538 -244308
12919 -244308 -255165 -214896 -139579 -171228 -346016 -179353 36633 -204030 -347793 351681
12909 351681 505307 -53535 -206190 -576144 -646106 -234965 -348062 -230385 -63536 -427210
12899 -427210 -334262 -818132 -215380 46156 -346608 -443749 -119390 280612 412747 359956
12889 359956 107894 202212 63661 -75434 135632 -121823 -79825 -64413 120156 91041
12879 91041 321660 135278 -173782 -15001 -402379 -607653 -303354 9950 159760 793
12869 793 -10605 211602 339055 -42400 -354360 -449118 67810 -102504 -219670 -439673
12859 -439673 94061 78673 -275155 -112519 -128592 -17710 -173635 -292562 -388731 -458576
12849 -458576 -332213 -190060 -156421 -27401 -368865 -109721 -85291 50223 378301 89497
12839 89497 -207876 -357816 31763 272627 -171619 351253 354663 182058 355839 -104912
12829 -104912 -318854 -129092 -227931 -169166 -254942 -211758 -385532 -153313 -229244 -478949
12819 -478949 -255068 -273598 -548693 -455691 -231987 -87746 -93075 -59340 -15970 -131852 -214012
12808 -214012 70584 -268248 -93774 228660 203122 -67207 -379771 -197894 -193709 -117957
12798 -117957 214291 230326 199893 175666 236146 59879 94301 -48769 -301344 19004
12788 19004 -35434 178161 -32545 -306581 191183 454242 18050 -600107 -587320 -156416
12778 -156416 -4143 -97156 -587725 -658188 -305517 -468456 -641093 -483792 -30440 -20307
12768 -20307 19700 -256616 -230515 -228648 -367095 -215 -13820 -107442 -216140 -85123 -10205
12757 -10205 -357184 -528998 -708867 -442490 221562 234197 279180 -47881 66282 -8163
12747 -8163 -290669 -48593 -141829 -231143 53921 -351918 -300944 -126837 111464 -359140
12737 -359140 -377747 113147 11785 -48090 277057 139759 28675 251912 -6438 -167105
12727 -167105 -343628 -192236 -150749 -440526 -507188 -249795 -48128 331089 -110120 -409722
12717 -409722 -163420 107882 -259498 -500314 -492618 -477596 -45795 79194 406649 210811
12707 210811 -31909 319136 196856 21745 -40268 76046 -19284 147109 279522 392025
12697 392025 553495 150543 170465 160065 394734 361198 51351 -388824 2994 202683
12687 202683 -82553 -77821 -22273 -414846 -223338 160081 360320 509743 439574 278042
12677 278042 300763 342949 215330 -20066 -365237 -586391 -638545 -528433 -619944 -305477
12667 -305477 214608 77097 -156237 265155 264848 -47605 -343814 -271499 142262 -130589
12657 -130589 106760 222074 -21625 202910 -116769 -278126 -61388 -148553 -370025 256953
12647 256953 -42569 -86890 -463471 -474803 -87108 -168800 -284542 -19603 21761 -54522
12637 -54522 -62410 -286957 -215883 70458 -26410 -173692 -182798 180224 309881 458841 404004
12626 404004 161726 15113 -216933 -208629 -262568 -321666 71185 346469 345719 -250182 -99583
12615 -99583 238013 240168 143827 -43013 288201 314641 634522 552823 124008 -22195 143714
12604 143714 473077 242965 302277 310900 -465045 -289940 -192724 214116 -258625 -113461
12594 -113461 -110218 -175856 -253769 163227 -122670 -252748 -81141 -294852 -12915 202846
12584 202846 -7182 -241393 127317 72264 -35400 -268551 -294535 -358543 -326633 -113027
12574 -113027 -230316 212870 6070 225750 173071 90824 170339 32665 -245786 -127964
12564 -127964 104053 -216106 -395718 -316727 -294032 -513811 -462115 -426341 -116711 67728
12554 67728 236691 24375 -152050 -213385 -118035 -116356 -46744 79855 -42058 -374745 -222926
12543 -222926 90997 478338 56582 -84323 -228086 -450178 6369 351756 171267 -7859
12533 -7859 -144560 -56671 -405699 -119537 46598 -212169 -91182 198236 243790 50433
12523 50433 -485139 -713939 -677005 -344734 -496337 -506581 -289309 -85736 46884 172495
12513 172495 -11611 -137959 65525 -37934 -241667 -43507 181389 -141580 -427731 -466090
12503 -466090 16492 -2732 -153894 -156702 -164770 -268684 -199981 4504 275415 174649 23401
12492 23401 -84383 -98730 -102069 -156300 -37538 90990 9137 -239661 -460426 -237998 -296573
12481 -296573 -312320 -236966 -88737 56909 -103210 -161731 -155907 -19636 -187824 -217649 395342
12470 395342 85390 -107116 205437 275119 551638 368376 -106455 -259048 257990 492215
12460 492215 201259 96 35658 -93849 -362334 -338601 -214170 -202810 -337519 -224958
12450 -224958 -321021 -200396 -97019 422616 297740 117971 -176485 -61331 74200 -120667
12440 -120667 48607 -223270 -150813 67872 -1156 -155955 -388919 -271427 -165998 -246897
12430 -246897 -104473 84218 37830 35122 -464753 -287040 -45588 242576 535871 263407
12420 263407 207411 403949 152703 -267034 -265092 -1028730 -519345 -370724 83928 347802
12410 347802 8945 64178 81149 -244669 -565334 -25953 323178 383561 -34613 -312246
12400 -312246 -203025 -24940 -233561 -302610 75577 -326287 -335639 208971 -148917 -78175
12390 -78175 -46334 -377554 -290707 -227895 -33674 -77822 131921 183959 73094 -238921 -289425
12379 -289425 -37757 -122845 -180287 -431280 -172013 -192989 -251937 -432364 -257651 -112418
12369 -112418 4672 -207394 -281476 144413 368020 121223 -142409 356119 143532 122125
12359 122125 230830 -185022 -68422 64884 -90976 -188569 -328962 -445702 -288475 -206427
12349 -206427 -152358 50442 -350264 11969 -91831 297878 390886 182837 52626 -350596
12339 -350596 -23041 -60508 -50269 260685 175761 105058 170414 416655 277284 206773 212114
12328 212114 402232 -31352 273790 455468 76664 -170189 -108624 -195150 -47458 -153041
12318 -153041 -440743 -156731 -173975 262655 11529 -48539 25289 -92144 -35183 114767
12308 114767 73055 183367 67045 -265040 -456832 -394076 -350250 54416 88376 103822
12298 103822 312489 320566 -178154 6144 -54237 -50216 -34868 -472122 -96422 28308 -266463
12287 -266463 -450789 -129510 120736 275277 181985 325450 399115 496251 23400 567972
12277 567972 556977 -178750 -294492 -121077 22756 -132479 -79776 -171953 78185 27740
12267 27740 158218 49652 -7773 -75818 149647 40796 175833 76924 125808 -118017
12257 -118017 -211164 -334272 -539676 -845961 -578365 -569934 -441377 92559 109505 137139
12247 137139 7366 -104141 -383017 -225367 -94433 -202021 -520140 -117183 56541 -128675
12237 -128675 -22783 -289757 -85158 -123383 -211516 -3256 229889 217491 -136929 -47246
12227 -47246 44885 65156 149201 -75384 -78319 159405 -151673 -86963 -110569 -213503 -305912
12216 -305912 -220465 -343863 -651130 -581854 -208551 -237073 -128043 -445847 -204314 -32813
12206 -32813 -152511 -13752 134622 545609 271896 -86517 -153933 -354464 -703571 -289395
12196 -289395 -183933 -27267 -114255 -52899 203628 127323 24635 64027 57018 129083 -278863
12185 -278863 -131981 135419 130917 165825 -207384 -277284 176321 98756 -250768 540904
12175 540904 101083 61716 242938 -35594 -441547 -442954 -290057 -404628 -152315 236876
12165 236876 -4063 -52314 -147876 -202029 -104548 210526 -112116 -437845 -224991 -51314
12155 -51314 -131442 11388 -30297 -848277 -686326 -424754 -302093 -75192 112586 -206604
12145 -206604 36565 180674 55923 13774 95860 -277973 -115297 -58839 325318 16735
12135 16735 114068 285891 -284480 390372 62492 92232 235976 115973 -279644 -198685
12125 -198685 -195135 -553608 -467891 -173907 102969 2026 2495 -206547 -417505 -378363 -432649
12114 -432649 -400849 -413485 -105390 -101712 -301084 -389002 -322831 124824 220373 164280 343449
12103 343449 -38192 -367631 -445207 -55389 -227523 -317248 -308581 -281349 -129032 -67823 119022
12092 119022 210976 288914 -119658 -294854 -219932 214721 81655 -142187 -153944 -323624
12082 -323624 -311539 -300295 -415285 -793742 -491942 -108282 -123586 36885 -131539 -46496
12072 -46496 266765 113747 71481 176260 393039 583104 272445 43723 84887 309946
12062 309946 265306 180729 -376141 -400003 197251 -72263 -502516 -406915 -719117 -667698
12052 -667698 -486736 12852 237559 131797 95771 -10761 111629 365007 219718 83374
12042 83374 310257 383016 500640 338317 -11856 -118470 -77465 -244711 -65765 109249
12032 109249 80696 188289 276878 515117 25599 36359 596344 541353 278952 11419
12022 11419 120514 445022 155107 156053 -100872 -272610 -253837 -33671 193022 160549 58346
12011 58346 -25773 -382862 -162854 -23014 -81996 -80510 -793488 -394311 -460545 72025 118340
12000 118340 421559 544226 361502 -135638 -310827 55686 -139984 143219 208856 391585
11990 391585 -53338 -23643 -32826 -12691 289342 256012 568426 268787 43389 351362
11980 351362 158648 -32455 -118892 183664 260377 -91043 -317384 126835 114563 -394025
11970 -394025 -349706 -394063 -364076 -431956 -373029 -293675 -132178 -6062 140316 1779 -223880
11959 -223880 -164164 -95630 354833 262058 -160424 -181079 -6285 24480 -6171 94825 56561
11948 56561 -43364 -233930 40740 86894 -433215 -178823 83403 98292 255200 90535
11938 90535 273756 104622 311292 227917 -153367 1619 -69577 -138836 -18088 134737
11928 134737 445693 474877 272823 -265818 395206 382984 93768 -202975 -411668 -409640
11918 -409640 -87152 377415 182302 -123145 79090 350249 288091 185034 -5648 -26274
11908 -26274 115383 172147 321417 603122 641082 841340 629217 124189 -94823 -346757
11898 -346757 -22808 284242 300223 215800 -232717 213942 186122 -105227 -384500 -131333
11888 -131333 137314 173113 5863 189528 50694 -58556 261607 66463 -156693 -5657
11878 -5657 206463 -6174 -230899 -381176 -424776 -457629 -552152 -213950 -62300 203777
11868 203777 24891 294106 176655 -42783 325079 519249 391420 648783 166452 -322818
11858 -322818 -366525 -239847 401621 406522 367126 225968 63363 -44687 235620 -22343
11848 -22343 -23351 365602 154958 -85023 -156687 150153 325771 55697 176905 318619
11838 318619 -123853 -493449 -186553 -15574 -172808 171865 162432 -247894 -31070 158739
11828 158739 -24886 -359049 -139658 89499 -173828 -40791 -206413 -160064 -192469 -1477
11818 -1477 251741 177679 235473 223145 65591 140837 143364 -95798 60941 29183 103903
11807 103903 -30301 294348 249841 -84719 168885 -232105 -66441 192806 244228 -9587
11797 -9587 -64695 -54451 -235208 -44136 31192 198379 89875 125001 247541 356968 39294
11786 39294 135148 283305 406412 157816 38843 194929 -294693 -171251 45860 33086
11776 33086 -133992 -239463 -276297 -345292 -2022 678219 335705 -177982 255407 -123604
11766 -123604 -75375 -184099 -319057 -39855 347188 433659 141198 -294966 -180696 175605
11756 175605 235416 275280 289276 285125 92554 241481 151927 319267 349986 -10922 169276
11745 169276 -33894 -254359 285307 161245 138490 79401 -269024 -340 -37371 25809
11735 25809 129702 -93350 -142046 -269796 -162911 -124084 -53986 -250944 -20391 250308
11725 250308 147686 414750 397129 48905 -336883 107667 79522 288790 483033 41229
11715 41229 86431 84080 71108 -109610 -295023 -345534 -298203 -81150 -285374 -457741 -169997
11704 -169997 -69975 63900 93950 -296834 -151590 120327 241911 -78930 286502 78376
11694 78376 -411875 -281050 179639 362064 202413 -26634 249455 388548 -147685 -7013
11684 -7013 -244668 -357876 -39207 164279 155333 95873 221013 508342 539469 532899 301371
11673 301371 -23209 -129251 -346152 -834813 -503499 -265790 -305176 -180281 149172 306451
11663 306451 -111025 -279154 -137935 -56858 52244 189032 -60173 -306768 -158165 -55059
11653 -55059 181127 24698 -430726 -318459 -161604 -80732 54332 -101462 275231 -25794
11643 -25794 -280133 -110610 60724 -1746 400451 340039 50492 -335591 -53096 154787
11633 154787 -37455 -333448 -110420 401414 -40721 -322923 -471913 -202451 -1688 -279837
11623 -279837 -94828 162033 62691 -305097 -277912 -379992 -273185 77111 161202 167649
11613 167649 18341 60821 187891 -53791 167 214219 49343 166071 -26246 12599
11603 12599 246694 277756 199804 426543 192111 415958 -14607 38025 179009 268042
11593 268042 169038 174338 376511 23642 261 -199282 -442709 -172546 213107 124320
11583 124320 147404 46605 -160599 -21338 81651 268267 -376764 -201983 -214612 -268785
11573 -268785 -180900 -34949 131858 127533 -81489 -331970 89425 380020 254826 187457
11563 187457 79020 -226185 160180 212776 106071 11331 -396840 -20173 422398 234919
11553 234919 449027 304708 -92291 232016 242417 -352857 -393705 -12234 134257 151477
11543 151477 33796 206973 633148 612714 541433 305561 60123 470643 628210 522805
11533 522805 72725 243368 360682 -324601 -259384 -189138 432910 625654 511223 708856
11523 708856 350177 -102453 72059 -54368 -369107 -228449 -125286 109763 269638 323644
11513 323644 -52623 -89963 -147812 -277268 -184251 121198 262963 -97091 54390 -186862
11503 -186862 -102865 -257412 -135555 146273 622547 378141 -19783 -369104 -451079 -633934
11493 -633934 -193512 291897 160818 484015 313434 207700 -144250 -349401 -57958 -7641
11483 -7641 306192 227876 138992 383700 422225 332349 -233675 -6492 15527 325294 675827
11472 675827 262075 388772 353606 38217 50203 141010 343072 -3358 165347 367191
11462 367191 -167086 -51135 -184511 -118639 257474 294567 151925 344881 708260 804441
11452 804441 661418 323647 182179 233591 561136 296423 -90518 148731 -171720 157393
11442 157393 261117 440134 170745 101526 291035 85354 172702 177675 456623 311657
11432 311657 530746 249897 364455 79851 226469 156630 163044 156046 28726 -124121
11422 -124121 332146 535269 723662 316620 190109 378019 229026 398054 191893 240487
11412 240487 357900 394105 501484 582536 439897 382328 203792 578727 527125 254515
11402 254515 -53252 74680 443265 433071 37339 302181 511582 549488 491487 72610
11392 72610 -404277 -324520 192249 251214 342014 420155 430318 429820 801615 517384 599297
11381 599297 308734 -188133 -226506 -274865 -169537 -74542 -5061 461920 606407 282054
11371 282054 449605 301105 107549 200958 596035 807135 661389 723465 794538 614454
11361 614454 671928 562876 592614 343547 186668 96173 24667 111605 -138936 -35369
11351 -35369 323686 471011 547851 383320 230529 191880 377154 565091 514161 190979
11341 190979 164313 17080 438885 454852 400238 75281 156120 89716 257354 398446
11331 398446 75974 -101501 193377 559150 321862 660130 708617 637714 491506 548586
11321 548586 540351 111213 433988 439753 358027 -21782 104823 176967 -139127 383785 349510
11310 349510 600210 119239 -81636 43506 326781 298672 371200 404017 291831 374560
11300 374560 641873 504491 195401 731825 516820 350276 690362 432488 162997 434531
11290 434531 534307 241227 304392 493105 583448 446399 194479 517327 742358 700659
11280 700659 502928 544770 770005 812574 357914 165289 -14271 -69405 597449 417826
11270 417826 212261 299930 483613 705783 377599 306414 429161 432389 621561 177425
11260 177425 194965 242300 779361 732420 532129 616867 4699 309003 652027 442579
11250 442579 707024 450058 185053 571784 367385 332699 573687 725567 531538 455286
11240 455286 898465 843499 805522 897068 785503 963389 954293 751032 550780 660823
11230 660823 744387 651968 584413 502627 659641 746940 729327 871025 723155 242162 522094
11219 522094 586096 621772 947921 1050721 941081 836414 702875 682353 683038 581833 753693
11208 753693 628109 755186 672592 535711 854711 550180 495540 730770 851283 895022
11198 895022 1067865 743774 663272 891731 876131 680201 459231 796278 1004179 768804
11188 768804 785277 856450 767868 978189 886739 394283 541843 743463 697408 900688
11178 900688 942397 951146 931429 889471 574002 473878 810984 1084149 1026002 507264 523290
11167 523290 962914 997217 1213678 1046623 768829 840450 1122352 666414 569973 935727
11157 935727 697840 847071 1262610 873431 726568 666383 753326 556209 625821 563278
11147 563278 203290 387135 643459 739608 1178001 965060 904992 762560 743951 873230
11137 873230 823541 915928 986404 782588 1058235 1202699 1026921 903997 1097621 1077218
11127 1077218 774307 863319 728389 738529 670869 885841 642096 824075 1249933 1011209
11117 1011209 912883 910086 517121 749901 1175369 910395 745485 764409 824301 624368
11107 624368 1016984 965448 848902 974836 1031842 1021224 906781 846141 710383 860182
11097 860182 989635 1024172 1200337 785175 1059905 1117520 850998 1214880 1009907 846418
11087 846418 761296 914129 985464 850953 582569 961245 1053166 1121948 1306231 1116146
11077 1116146 878995 970856 1015701 965598 574082 525805 915232 741272 868312 1365934
11067 1365934 692520 665231 831661 795000 867106 955450 1072524 817343 630545 747239
11057 747239 1025915 1201876 654191 1008984 1087438 1206052 1154764 1166595 1140530 1263932
11047 1263932 1087724 900988 869501 1127516 951429 979490 919319 1025819 1119820 1194710
11037 1194710 1455032 1111545 868268 844935 787421 1066233 1069051 730970 786084 802132
11027 802132 693824 493252 670765 545990 866155 1158377 998753 1284671 1313223 911539
11017 911539 974532 1196377 1310080 1199885 1184231 1074516 1129971 1299515 1144097 1102122
11007 1102122 1116179 1002431 1238237 1306604 1422335 1173392 771059 930702 1053931 1002419
10997 1002419 863168 1061966 1388810 989743 912607 772299 1253024 1177113 1171088 1301903
10987 1301903 917858 999152 1451864 1536467 1568491 1015251 1333311 1296839 1406555 1798302
10977 1798302 1751483 1417436 1992913 1620412 1439011 1441982 1449777 1342401 1044986 1711117
10967 1711117 1480886 1035015 1315985 1656813 1497764 1158491 1213823 1378090 1300704 1393407
10957 1393407 1381319 1189317 1200500 1541454 1552792 1346173 1654379 1560498 1554743 1307658
10947 1307658 952479 1398997 1187219 1174612 1258065 1281857 1413856 1380609 1558225 1688192
10937 1688192 1534864 1346467 1672325 1600723 1385056 1273326 998957 1347435 1848622 1957383
10927 1957383 1876128 2009042 1711019 1848817 1521987 1558787 1902633 1729037 1550940 1541067
10917 1541067 1626672 1608621 1701110 1436124 1331356 1280701 1311018 1638963 1709730 1948064
10907 1948064 2184436 2098606 1821619 1758526 1544341 1444736 1165706 1210169 1636399 1795370
10897 1795370 1468234 1603582 1754694 1573671 1627949 1716432 1917485 1853900 1505408 2017367
10887 2017367 2043253 2048188 1930338 2059777 1931682 1826284 1821909 1788755 1793190 1688733 1693844
10876 1693844 1776406 1914199 1813282 1913098 2182549 2282603 2130756 1848628 2227072 2260026
10866 2260026 2034996 2297234 2502775 2285486 1977486 1723057 1785917 2437788 2409780 1851561
10856 1851561 1903298 1864691 1958573 2237301 2340339 2348641 2003741 2043716 2144560 2349342
10846 2349342 2363340 2670333 2693474 2226119 2479030 2446393 2284854 2349693 2174098 2473763
10836 2473763 2400240 2222136 2185228 2174503 2129484 2051184 2166918 2303542 2199856 2518959
10826 2518959 2803848 2453146 2298521 2513373 2667532 2625314 2850282 2766156 2463525 2481147
10816 2481147 3011001 3098772 2923797 2952608 2879196 3124846 2876664 2526774 2447887 2545564
10806 2545564 2471687 2699824 3073180 3127272 2684034 2373406 2336291 2867978 2927676 2895126
10796 2895126 3115741 3370613 3232112 3069932 3022377 2712601 2590533 2540582 2877400 2993805
10786 2993805 2847296 2726431 2732377 3031243 3056233 3445410 3442147 3093624 3002777 2671398
10776 2671398 2764391 3399792 3787087 3417954 3187645 3186729 3062359 3268745 3649393 2996134
10766 2996134 3041427 3343220 3309239 3586750 3636579 3265535 3175124 3316787 3283667 3468976
10756 3468976 3484217 3343648 3397904 3688423 3634461 3684976 3597615 3506969 3853924 3713689
10746 3713689 3871315 3834893 3731458 3607472 3586480 4067193 3895044 4080724 4071628 3954146
10736 3954146 4061168 4322372 3853239 3447916 3378973 3887602 4174799 4098441 3864429 4251817
10726 4251817 4236874 4356399 4445218 4672162 4092503 3827051 4140962 3904306 4193188 4136688
10716 4136688 4131890 4096772 4395205 4760731 4563658 4468049 4867857 4598055 5053811 4934966
10706 4934966 4995224 5097150 5180885 5253278 4914786 4778948 4764031 4861033 5042782 4974638
10696 4974638 4667487 4511239 4490333 4673354 4880100 4928561 5121861 5233065 5590157 5003751
10686 5003751 4704565 4596978 4486936 4863290 4923778 4920932 5098472 5365612 5445243 5221597
10676 5221597 5104891 5144824 4887763 5280569 5512098 5551041 5272926 5066016 5567489 5677933
10666 5677933 5337800 5481634 5712196 5896923 6055612 5873283 5523283 5580096 5706399 5829206
10656 5829206 5821360 5653845 5928449 5941090 6348150 6198847 5911726 5812200 6112207 6421082
10646 6421082 6555579 6436474 6273103 6184748 6113030 6035880 6386617 6664710 6828576 6605587
10636 6605587 6447809 6521061 6602223 6385215 6684520 6771082 6642640 6570314 6405124 6730177
10626 6730177 6505031 6695084 6764444 6536808 6610511 6813374 7030966 6932305 6858524 6784858
10616 6784858 6508469 6889789 6977481 6749418 7155353 7544730 7468773 7610095 7600355 7697089
10606 7697089 7961226 7734557 7556881 7567382 7606555 7918594 7891696 8043987 8043562 7721396
10596 7721396 7759857 7903825 8037798 8266644 8074086 8085920 7933805 8351954 8683434 8398279
10586 8398279 8232566 8092378 8338288 8544145 8451959 8393588 8933225 9070736 9098262 8745277
10576 8745277 9085851 9238115 8991999 8874205 9093964 9097878 8676727 9127679 9177204 9501291
10566 9501291 9418461 9554130 10048503 10152789 10087795 10092163 9923907 9755637 9554724 9890730
10556 9890730 10124457 9989171 9864863 9662572 10323310 10661958 10536708 10922361 10596277
10547 10596277 10921184 10964711 10867522 11000112 11187829 11025961 11214119 11537377 11207846 11436984
10537 11436984 11585922 11535182 11673642 11770528 11807594 11868442 11912180 11898632 11928557 11985262 12059894
10526 12059894 12053005 12395506 12393957 12501005 12688202 12778134 12817468 12884354 12813081 13471423 13711459
10515 13711459 13567699 13940923 14109504 13980647 14110321 13660805 13881338 13739781 13758218
10506 13758218 14125466 14153895 14704928 14851872 14620221 14787242 15152666 14979705 15521282
10497 15521282 15590163 16091179 16129991 16483397 16532250 16359551 16133108 16259008 16587577 16770542
10487 16770542 17147586 17023988 17010098 17360276 17219020 17235266 17265137 17774963 17783712 17890854
10477 17890854 17894085 18223163 18605951 18958888 19303580 19254803 19215207 19550384 19735099 19714832
10467 19714832 19758081 20003775 20347316 20170396 20307794 20727079 20626916 20753781 20818455 20933771
10457 20933771 21499219 21773705 21641559 21530215 21744526 22098174 21964230 22706554 22672450
10448 22672450 22420809 23216019 23042793 23050701 23426601 23703808 24040310 24393617 24368554 24784325
10438 24784325 25249109 25203338 25422211 25481148 25617191 25658994 26388073 26655380 27090884 27290415
10428 27290415 27254042 27558387 28165315 28372497 28114620 28320893 28859081 29502977 29646329
10419 29646329 30110315 30370876 30305005 30314913 30716488 31267869 31309586 31749119 32064468 31849828
10409 31849828 32107358 32763216 33758886 34021767 34537301 34755665 34891651 34865277 35281203
10400 35281203 35701832 36312079 36464535 36777109 37289180 37397844 37427960 38076347 38404884
10391 38404884 38889805 39748084 39578336 40124723 40747999 40668226 41487712 42732127 42953976
10382 42953976 42811005 43321899 44479328 45141044 45508452 45635633 46003171 46449372 46994804
10373 46994804 47714786 47872452 48494916 48816887 49424657 50207621 50751949 51301747 52065872
10364 52065872 52371644 53155603 53872929 54538615 55265424 55851629 56293577 57236097 58201344
10355 58201344 58749030 59222040 60248051 61299428 62125608 62660673 63382394 64190814 64831704
10346 64831704 65749073 66784810 67984345 68901924 69811571 70714033 71349351 72083682 73567494
10337 73567494 74458523 75389248 76622200 77709858 78907648 80397183 81267421 82426101
10329 82426101 83419548 84628914 85837654 87099909 88399911 89363884 90907617 92534499
10321 92534499 93867051 94941944 96770779 98552506 99971066 101719238 103180379 104702744
10313 104702744 106434674 107992068 109783341 111204372 112832713 114655384 116681578 118518819
10305 118518819 120252093 121793013 123845022 125852935 127589528 130101976 132148112 134099700
10297 134099700 135983448 137995954 139994956 142130400 144460363 146821749 149096773 151557451
10289 151557451 153632705 156025116 158579801 160835174 163141638 166289825 169221874 172019812
10281 172019812 174717154 177549732 180494661 183535826 186950369 190293575 193332622 196239251
10273 196239251 199529312 202581362 206305515 209750930 213145825 216947010 220467606 224250560
10265 224250560 227912092 231351116 235082548 238940695 242799759 247309924 251145386 254974962
10257 254974962 259214946 263264662 267035322 271066753 275037593 279132169 283138263 287289654
10249 287289654 291692941 295625768 299765655 304022487 308528207 312894277 316883601 321026535
10241 321026535 325508392 329509603 333487911 337976322 342231483 346030643 349759535 353462907
10233 353462907 357384016 361278462 364808221 368507907 371970988 375415172 378465328 381262133
10225 381262133 384090072 386999819 389793044 392364558 394197955 396490854 398432328 400029182
10217 400029182 401855145 403273915 404465810 404795153 405171741 405634044 406003198 405782132 405097200
10208 405097200 404297410 403444989 402292806 400776677 399550732 397638162 395288513 393303772
10200 393303772 391024984 388538334 385675531 382274578 378863125 375476710 371786600 368088814
10192 368088814 364399617 360719021 356456280 352607952 348650166 344714024 340317155 335869888
10184 335869888 331288951 326881168 322554134 317785971 313408795 309227560 304892344 300405805
10176 300405805 295802183 291126677 286570955 282346911 277854813 273133565 268960138 264535025
10168 264535025 260000865 255936356 251639554 247783953 243733512 239619020 235441874 231505859
10160 231505859 228019218 224299056 220541618 216846828 213018802 209637204 206163119 202543822
10152 202543822 199211445 195687875 192112580 188891079 185859527 182595015 179717691 176521879
10144 176521879 173438355 170866984 167858729 164947861 162497521 160059255 157317558 155165595
10136 155165595 152567538 149700711 147540492 145173240 142877106 140635783 138481579 136056926
10128 136056926 134023218 132074408 129722617 127626548 125963859 124164320 122680618 120246797
10120 120246797 118091966 116621383 115390778 113381185 111778410 110078150 108195234 106653235
10112 106653235 105164001 104096402 102370063 100814874 98959677 97607877 96601275 95365542
10104 95365542 93591613 92579206 91575853 89928898 88648734 87593950 86293062 85165172
10096 85165172 84201359 83225169 81941371 80570839 79590327 78403920 77161195 76286432 75345370
10087 75345370 74337473 73353230 72482851 71677424 70783074 69804711 68607851 67919796 67282917
10078 67282917 66542427 65559928 64763214 64045349 63281423 62823601 62025276 61287954 60516480
10069 60516480 59647448 58735234 58131312 57421287 56896585 56154687 55664725 54690431 53996671
10060 53996671 53694395 53388479 52395802 51935479 51905380 51184267 50995306 50048527 49524790
10051 49524790 49044833 48789287 48204163 47611559 47074134 46552018 45987233 45741569 45410165
10042 45410165 44969908 43776711 43772611 43658488 43242126 42872185 42182628 41963690 41571095
10033 41571095 41265911 40777812 40247617 39860787 39459641 39284628 39124530 39204371 38868738
10024 38868738 38525062 38227794 37656221 37645030 37438720 37088006 36750391 36829862 36295082 35664547
10014 35664547 35774484 35593286 35062524 35134608 34885973 34702741 34403206 34545911 34383632
10005 34383632 34202246 33675076 33487400 33147033 32892195 33050766 32643159 32679440 32557748
9996 32557748 32462161 32442852 32337281 32401643 32365352 31785855 31471616 31578042 31677218 31775126
9986 31775126 31919899 31588493 31573392 31820996 32107729 31946691 31797098 32019431 32180065 31932771
9976 31932771 31651814 31958630 32388975 32646152 32420107 32306932 32016611 31752356 31872904
9967 31872904 31922174 31574624 31532824 31802295 32149664 31900994 31951955 32365073 32051029 31686496
9957 31686496 31450117 31183328 30905372 31147507 30906118 31188242 31245544 31175251 30829879 30565183
9947 30565183 30073637 30108692 30466570 30186111 30213571 30171062 30221379 30080327 30408672 29939999
9937 29939999 29926513 30284094 30411468 30281401 29937941 30249710 30318587 30410673 30622101 30612399
9927 30612399 30675792 30458323 30006778 30367502 30670065 30968095 30865479 30397773 30660239 30740768
9917 30740768 30510118 30902231 30511607 29765617 29676288 29569504 29454271 29099692 29267806 28968115
9907 28968115 28787665 28458124 28202354 28249622 27948104 27639878 27126108 26750218 26382888 26409152
9897 26409152 26103412 25919626 25727805 25523663 24929176 24778696 24570033 24509778 24176674 23876880
9887 23876880 23729595 23553914 23731244 23103290 23197548 23165798 22909330 22357814 22394859 22482155
9877 22482155 22347154 22271800 22456930 22017747 21785758 21864804 21857629 21045094 20700248 21041949
9867 21041949 21303382 20681147 20269653 20274888 19913117 19883492 19757238 19427059 19648023 19287849
9857 19287849 19250743 18992431 18463603 18325921 18143485 18095984 17679127 17473510 17135450 16907613
9847 16907613 16901518 16340723 15818038 15754564 15694880 15902514 15473719 15089388 15158325 14899308
9837 14899308 14687325 14388836 14047263 13818201 13683507 13738574 13687421 13530182 13339750 13096874
9827 13096874 12909122 12524785 12643974 12754622 12518200 12573731 11958315 11781645 11930975 12034189
9817 12034189 11878890 11869216 11672824 11575491 11005630 10927931 11075059 10805370 10677846 10637968
9807 10637968 10424764 10706185 10513319 10237919 10083386 9840311 9548128 10252136 10024236
9798 10024236 9731873 9746605 9906712 10222331 10164270 9873551 9833015 9915002 10010466 10146846
9788 10146846 9998840 9375318 9183575 9185441 8812985 8807634 8799183 8937770 8579046 8685785
9778 8685785 8753482 8474835 8356697 8609981 8730629 8359640 7862951 7906402 8092164 8291125
9768 8291125 7983047 7821215 7693371 7711529 7841340 7736673 7767170 7834773 7274587 6973175
9758 6973175 6859055 7138190 7502010 7401056 7275802 7076081 6856836 6961638 6700738 6399365
9748 6399365 6479146 6674862 6830514 6649987 6798396 6747567 7080673 7062150 7056464 6692607
9738 6692607 6654612 6548561 6436817 6452449 6772556 6649216 6138395 5730736 6026073 6577942
9728 6577942 6340750 6279392 5806948 6150867 6276545 6337439 6378461 6152368 6219757 5923488
9718 5923488 5702667 5961063 5810787 5603032 5958656 6065075 5987237 5703178 6093248 5975090
9708 5975090 5929114 5990455 5617840 5814950 5594777 5683942 5767915 5361223 5293211 5392229 5347314
9697 5347314 5493730 5256217 5337966 5381463 5649733 5331623 5390768 5427109 5463368 5568404
9687 5568404 5348237 4970017 4827101 4866328 4915679 4817728 5027536 5184805 5111674 5032991
9677 5032991 5278564 5532504 5642745 4867850 4702630 4642556 4578072 4768169 4874848 4908618
9667 4908618 5207279 5150816 4867367 4861575 4988743 5011437 4687914 5146644 5237254 4763437
9657 4763437 4584358 4574048 4670155 4640075 4760533 4777183 4727841 4377899 4302788 4447885 4610860
9646 4610860 4737351 4619543 4720152 4272801 4356793 4339193 4182891 4382153 4522116 4756037
9636 4756037 4123922 3982916 4435235 4419606 4184992 4390515 4638212 4596175 4486869 4326648
9626 4326648 4615575 4093186 4148900 4238965 4319243 4280223 4179702 4369796 4623458 4236853
9616 4236853 3982901 4082008 4486349 4662186 4525658 4185373 4084367 4206215 4118592 3943312
9606 3943312 4271527 4343866 4396441 4232538 4102891 3986049 4179598 4008540 3878930 3831385
9596 3831385 4243432 4092309 3943553 3958394 3621668 3556380 3499150 3694021 3602431 3830850
9586 3830850 3943872 3716613 3936421 3865135 3687684 3526888 3412757 3316135 3450470 3737945
9576 3737945 3701306 3420310 3278721 3277949 3635811 3505214 3492397 3314283 3203026 3230163 3174432
9565 3174432 3320186 3520443 3562247 2925750 3174641 3414868 3076827 2966744 2947770 3016727
9555 3016727 3018933 3108903 3148280 3091137 3421589 3120509 3136270 2756428 2442851 2890864 2755338
9544 2755338 2952395 2957539 3058579 3301306 3063779 2868379 3071935 2789862 2650622 2801610
9534 2801610 2859619 3238810 2963967 2939192 2988560 2743750 2470058 2773637 2428697 2392622
9524 2392622 2357047 2487276 2885630 3128888 3011876 2837137 2616709 2628233 2516661 2576658
9514 2576658 2200533 2218204 2611777 2656827 2463507 2413049 2733661 2795771 2526810 2712111
9504 2712111 2686690 2276906 2110480 2261559 2157638 2157803 2684203 2724411 2549138 2416583
9494 2416583 2423032 2261531 2347678 2574931 2903365 2949718 3045808 2759532 2774152 3012337 2694918
9483 2694918 2658460 2622735 2802268 2865692 2369215 2330755 2375287 2378390 2557995 2339811 2233823
9472 2233823 2355580 2716787 2391104 2619432 2364046 2298177 2701946 2564620 2419788 2223073
9462 2223073 1965685 2141328 2603059 2628744 2295228 2351731 2124012 1921009 1954831 2305027
9452 2305027 2369400 2345803 2300741 2370449 2005219 1861112 2082929 2144208 2310135 2318232 2204081
9441 2204081 2153764 2225446 2393403 2261946 2133506 2272399 2290603 1989857 1949012 2461443
9431 2461443 2548977 2621536 2423631 2662232 2034475 2046016 1858505 1989921 2157446 2202295
9421 2202295 2243865 2122727 1366688 1557632 1787869 2081223 2097244 1926434 2014395 1948844
9411 1948844 2331098 2000516 1806797 2261210 2221430 1841276 1689715 1917269 1787305 2014057
9401 2014057 2002828 2028843 2128872 2187659 2150789 2149756 1982817 1875910 2188908 2218364 2277499
9390 2277499 1918276 2013948 2357540 2550980 2353026 2114053 2184873 2286664 2015129 1893178
9380 1893178 2036097 1764611 1596772 1468874 1727194 1605552 1412542 2062832 2250123 2189091
9370 2189091 2107039 1984716 2084695 2035780 1820105 1915665 1847809 1683677 1764822 1708229 1723934
9359 1723934 1754417 2045220 2130684 2100585 2400014 2332019 2001412 1965540 1833182 1721254
9349 1721254 1845395 1818845 1942059 1727461 1939340 1590473 1297406 1843881 1996967 2144070
9339 2144070 2143954 1806956 1716069 1754439 2162083 1923730 1678629 1857716 1967705 2091166
9329 2091166 2077888 1737217 1903006 1614321 1488708 1603188 1703299 1916259 1842780 1925787
9319 1925787 1638387 1586702 1927118 2003059 1865824 2046783 2007611 2021092 1710141 1666866
9309 1666866 1947428 2020028 1714798 1755279 2452994 2108274 1764419 2380904 2445464 1983518
9299 1983518 2053045 2040540 2002270 1745363 1630148 1770783 1625305 1423732 1573163 1772465
9289 1772465 1886621 1542809 1734834 2177084 1954664 1735064 1525428 1557275 1479961 1361116
9279 1361116 1763568 1972919 1764683 1754028 1620410 1394185 1646094 1696999 1653540 1514136
9269 1514136 1496474 1684651 1609125 1433176 952975 1098428 1606931 1469146 1412856 1843175
9259 1843175 1726972 1609797 1579800 1473690 1283975 1258797 1610622 1502051 1541806 1412345
9249 1412345 1487133 1752863 1466274 1470388 1560755 1663359 1355539 1502146 1861862 2213322
9239 2213322 1986150 1510274 1404047 1568418 1596120 1470347 1651286 1576397 1703456 1574139
9229 1574139 1927094 1322480 975016 1318696 1258432 1330631 1739912 2038507 1855868 1626384
9219 1626384 1779666 1966213 1621734 1450796 1508365 1898892 1897950 1712208 1564608 1372002
9209 1372002 1497224 2005251 2034726 1880795 2092105 1574402 1775007 2032714 2076822 1815418
9199 1815418 1648442 1913279 1863854 1969791 2178985 1951522 2057776 1875385 1592892 2000790
9189 2000790 1892451 1983595 1991802 2021422 1950728 1807912 2081552 2073852 1628874 1680144 1572694
9178 1572694 1957108 2208890 1845267 1849112 2050155 1804396 1847177 1706990 1545825 1795473
9168 1795473 2124656 1818484 1748811 1968870 1967120 2333046 2265727 2097562 2043597 2192705
9158 2192705 2330938 2536245 2170482 2300144 2382146 2399976 2209375 2157823 2383739 2390232
9148 2390232 2317224 2189871 2532623 2245745 2174248 1816892 2113080 2251381 2150804 2098873
9138 2098873 2072319 2377056 2255191 2332069 2410015 2296947 2390584 2283163 2280408 2448873 2772371
9127 2772371 2995796 2753778 2600702 2415649 2150622 2358150 2746482 2714957 2600524 2728440
9117 2728440 2769382 2964982 3154051 3172420 2788248 2893453 3020534 3026572 2736540 2466727
9107 2466727 2655685 2922377 2868577 3006569 3544165 3414717 3207392 2969910 2888924 3257804
9097 3257804 3576970 3211783 3137230 3394634 3587443 3303321 3100874 3353594 3304907 3390127
9087 3390127 3202932 3339640 3220256 3331323 3546303 3537399 3555814 3538579 3695675 3564309
9077 3564309 3980794 4151931 4115695 4314231 4205377 4309307 4278412 4162349 4004236 4278560
9067 4278560 4404874 4277810 4618970 4788356 4397945 4335786 4464502 4289519 5069073 5170356
9057 5170356 5482957 5385658 5301522 5687920 5739048 5335754 5711442 5999898 5955506 6093685
9047 6093685 6084770 5851870 5852511 5731304 5838552 6071591 5943395 5911714 6124596 6443398 6706107
9036 6706107 6755889 7235133 7423256 7814526 8070351 8132710 8092933 8129842 8080612 8341548
9026 8341548 8857639 9033412 8948139 9251072 9404982 9462796 9768215 10299624 10448778 10489881
9016 10489881 11201920 12070302 12189332 12485949 13059911 13687328 13954435 14321984 14498749
9007 14498749 14705233 15729745 16247516 16707269 17279180 17684447 18510432 19492611 20126350
8998 20126350 21668071 22800778 23783667 24854101 26288131 27940898 29758691 31174510
8990 31174510 32877551 34603145 37311463 40231695 42784021 45407458 49149410 53367799
8982 53367799 58208095 63426802 67354679 70693307 72634704 72040173 70524925 67941468
8974 67941468 64699605 62155796 59808877 57640226 56213898 54851278 53414429 51631207
8966 51631207 50453889 49765219 49000717 48969884 48523222 48448274 48941373 49315558 49594412 50047260
8956 50047260 51239564 52584268 54133355 55799226 57781430 59943362 62362176 64557828
8948 64557828 67493399 70405154 73317520 76510147 80566808 84633219 87764670 90239861
8940 90239861 90600276 88808740 84627973 78684537 72754970 67012921 62155690 57761785
8932 57761785 54580186 51977775 49699608 47807297 45634620 44317481 43146878 41401320
8924 41401320 39560301 37769662 36271099 34413354 32284155 31045743 29769642 28178082
8916 28178082 26784118 25996473 24669217 23555882 22669296 21749783 21052050 20434208 19800784
8907 19800784 18653353 17617518 17076947 16489808 16090201 15673267 15082306 14728433 14115825
8898 14115825 13277306 12928888 12654834 12269810 12335023 11784443 11506351 11605257 11115317 10909300
8888 10909300 10441381 10185871 9883020 9484842 9167792 9065203 8973564 8803975 8532391 8094104
8878 8094104 7995686 7733625 7458058 7602238 7532596 7649330 7308478 7114333 6742543 6967973
8868 6967973 6918861 6873061 7090588 6881329 6668143 6435550 6317013 6505580 6229876 5918191
8858 5918191 5891927 5968038 6160955 5932466 5725973 5642615 5588520 5553321 5250090 5814942
8848 5814942 6033005 5793413 5565754 5593610 5363759 5614218 5713902 5192904 4854193 4990743
8838 4990743 5206664 5006572 5416825 5314696 5242561 5120688 5043492 4793174 4613677 5187268
8828 5187268 5423327 5291625 5239066 5277358 5313238 5085071 5265809 5065494 4766040 4716692
8818 4716692 4662099 4451137 4324085 4811904 5026700 4740882 4712962 4620724 4708330 4980542
8808 4980542 4996864 4977661 4960912 5099906 5564809 5154958 4966404 5028695 4917375 5093948
8798 5093948 5128715 5153307 5298972 5098839 5307580 5254878 5351302 5475942 6093442 6126507
8788 6126507 5960270 5544275 5549661 5633156 5500793 5455460 5548244 5762887 5750970 5734414 5615648
8777 5615648 6173555 5948020 6528041 6790022 6916199 7255091 7215042 7112261 7117712 7370945
8767 7370945 7499985 7144992 7656707 7906142 7670449 7567639 8055519 7966128 7882530 8250769
8757 8250769 8083008 8102963 8222267 8146361 8152325 8844874 9348577 9259605 9319364 9661540 9707589
8746 9707589 9552709 9582013 10091095 10497760 10718661 10550913 10630194 11061748 11551244 11611950
8736 11611950 11776344 12265426 12568037 12908426 13472716 13728590 13791804 14020863 14558395 15272810
8726 15272810 15643030 16164787 16735051 17478449 18496422 18884442 19317171 20005810 20888497
8717 20888497 21814295 22554530 23552491 24500794 25857341 27013731 27824564 29524582 31478032
8708 31478032 33145631 35498538 37588795 39574627 42072200 44955036 48074992 51222687
8700 51222687 54574583 58756460 63398690 68493301 73475450 77218240 80510506 81933794
8692 81933794 82481455 80905236 78642153 75966766 72506510 68977363 66220863 63066896
8684 63066896 60702696 58465553 56496395 54441254 52451064 51101215 49346639 48133465
8676 48133465 47001996 46111830 46155149 46323685 46384358 47248443 48242102 49485125 50855110
8667 50855110 52916732 54742242 56721842 58957467 61393730 63612174 66569990 69130464
8659 69130464 71384689 74013624 75915115 76642823 76805264 75301603 73171837 70122573
8651 70122573 66098760 61205350 57082330 53217883 49308428 45858679 43121500 41238684
8643 41238684 38859735 36785838 35142307 33108816 31683645 30652201 29331412 27995134
8635 27995134 26684109 25902513 25395066 24659109 24095735 23527915 22761886 22646909 22361730
8626 22361730 22399998 22185513 21577394 21663587 21395810 21638565 21207206 19997734 19615779 19217004
8616 19217004 18424716 17618101 16907866 16170015 15348055 14522038 13724465 13487595 13597075
8607 13597075 12304475 11715442 11807057 11632622 11299644 10953996 10577910 10084516 9715620
8598 9715620 9418375 8697821 8186678 8195638 8476407 8464051 8060192 7517576 7180990 7244466
8588 7244466 7250575 7101165 6894194 6752142 6652015 6552178 6605603 6422009 6442644 6304168
8578 6304168 6108465 4901535 4230118 5250420 5230380 5235917 5262232 4951273 4663896 4919426
8568 4919426 4681748 4496042 4254660 4457511 4610388 5101663 4734744 4246934 3853796 3942020
8558 3942020 4118563 4153074 4074704 3798329 4090098 3722263 3553545 3527303 3441965 3406171
8548 3406171 3320477 2980042 3365648 3276526 3027618 2722365 2650880 2487895 2799097 2874580
8538 2874580 2741982 2777034 3038979 3078895 2655238 2331804 2359617 2534270 2710326 2768918
8528 2768918 2356343 1998458 2432922 2223003 2631523 2673802 2160399 2532272 2512426 1958414
8518 1958414 2239718 2563209 2256916 2029092 1774597 2002768 1866739 1915614 2006341 2209066
8508 2209066 2161476 1923045 2407507 2050177 1864009 1928178 1984879 1806895 1500503 1647000
8498 1647000 1363322 1583612 1715551 1605923 1465680 1107429 1433023 1512238 1516822 1328215
8488 1328215 1179608 1326273 1227839 1340767 1618692 1677839 1373229 1084757 968926 1163906
8478 1163906 1050309 1065116 1227629 1246300 1279327 1242332 1094626 1087151 1114899 1018032 818023
8467 818023 452175 287995 693992 899922 1325399 1149055 718122 805704 821480 894695
8457 894695 922438 905357 813393 798498 701440 674127 932538 1172648 943984 798105 852046
8446 852046 509693 814272 551966 412122 619984 602260 836401 1015028 984844 927131
8436 927131 733846 514273 695844 614788 528749 572649 810433 1087652 1118440 1224575
8426 1224575 810656 519380 691696 871076 1010550 952965 632917 508476 393649 896303
8416 896303 809310 599769 705848 998550 806755 605449 729236 259277 379518 622364
8406 622364 656004 914275 655765 422958 272486 229312 479501 731281 632254 216822
8396 216822 361039 745134 869356 959364 928436 739318 578237 403395 374150 117011
8386 117011 369541 409639 274191 329705 559668 428741 474154 672873 450254 466321
8376 466321 827906 621631 496719 707661 334105 80074 410859 684040 780024 642562
8366 642562 720959 963587 909902 583719 407184 109012 122248 215337 230883 396312 645410
8355 645410 299088 647373 695477 435131 562663 506218 774473 997829 1121475 1071668
8345 1071668 798035 1360457 1018999 696201 879263 749885 583215 866204 924996 531020
8335 531020 424344 2336 196822 570641 746566 460698 409533 868575 1272535 984263
8325 984263 779383 813370 775750 543415 241370 348212 376758 618233 548997 915011
8315 915011 1019959 560263 342828 435144 767730 565142 611571 513949 806313 653188
8305 653188 741178 814815 937599 518677 684207 820433 784506 515593 562518 657637 573849
8294 573849 657675 995620 670969 432244 910369 515333 615148 701642 755855 513746
8284 513746 668027 337996 103052 451262 642441 613557 62646 -201883 -191016 406594
8274 406594 808696 590692 250861 272939 495191 191909 30879 -220211 121074 360737
8264 360737 218642 202427 29036 20544 -54776 29793 293520 235476 241385 367310 625145
8253 625145 787171 530139 507739 347844 237857 332935 446830 242813 15580 170437
8243 170437 205791 595407 753355 659202 155084 -39736 111898 29536 30159 -206246 -408480
8232 -408480 -340110 -166169 -475849 -436351 103900 37698 -8049 -24982 119456 -12540 -59310
8221 -59310 393573 233575 -43176 -77587 -123307 37087 329356 272836 62696 -173621
8211 -173621 -61111 82310 199180 233857 -255793 -92807 9247 -61130 -405812 -412061
8201 -412061 -543563 -444458 -759362 -657726 -495347 -324212 -1009806 -1332348 -3530959 -3639680
8191 -3639680 18699 242569 790722 1052106 845163 562633 471885 580185 557822 93210
8181 93210 -48624 -440928 -188818 238125 489535 184744 354919 436932 600724 290484
8171 290484 -211474 -376326 270757 -75965 -415924 16409 -233294 -357449 -553527 -295361
8161 -295361 -264438 -16673 -292854 -223171 91864 405975 85200 -153836 -108332 296513
8151 296513 246340 6078 238737 238788 523978 486402 -37274 141702 213126 189339 231883
8140 231883 483932 741156 352207 -221263 -46649 -42899 -38297 206093 385090 574912
8130 574912 639607 438229 369555 117364 280868 256186 246848 108803 -240026 -25245 432713
8119 432713 259398 64728 97732 301859 257570 -118150 -206502 -314874 -476463 -136709
8109 -136709 -31376 -226260 -271180 -389979 -346352 -27873 -124506 -508433 -393888 -219629
8099 -219629 197523 85680 -58097 33519 -351190 -270808 157339 527660 440938 81531
8089 81531 43672 -296820 -290134 -165425 -306331 -66510 120564 -121691 -82445 -279155 214586
8078 214586 284839 432197 46904 -241501 -206486 -93764 -95834 94618 -230800 -473905
8068 -473905 -443808 -160329 -67861 9876 -171372 -159678 -146933 -155229 -181526 -358854 135322
8057 135322 52966 -169796 158248 371527 204325 68756 -162004 217338 289190 15774
8047 15774 -57221 32904 -378661 -267390 -41656 62915 118634 366069 217468 -64478
8037 -64478 -15266 109172 -49252 -29127 -353432 -189798 -608862 -751599 -280745 -319407
8027 -319407 -26186 -31043 159646 138496 -306928 68665 -177152 -335275 184320 -285044
8017 -285044 -147210 -320099 -355512 -618305 -499733 -263524 -499156 -291054 -269982 210394
8007 210394 91060 -374543 -193008 201840 61890 32897 380809 330304 486874 386945
7997 386945 -745 98506 93920 47453 -190873 -457090 -196583 -95514 211350 196216 -20506
7986 -20506 340155 168662 -383299 -439919 -814739 -696852 -380350 -696361 -614057 -45163
7976 -45163 20890 17788 -77744 8452 -34618 -305779 -558689 -347169 20586 11762 48890
7965 48890 48766 247477 173558 -19520 -415038 15252 498400 291083 75624 -365265 -486489
7954 -486489 -146727 -170567 9955 35250 -12677 -162917 -226844 -202490 -191773 -358876 -317990
7943 -317990 -76004 -77353 -156706 -111398 -370383 -152619 138315 8426 -176739 -654553
7933 -654553 -791390 -238706 95435 899 -37383 -48261 -199175 -365911 -213205 -282303
7923 -282303 -580530 -340274 -347718 -510094 -332761 -117860 199335 131427 -35211 -258688
7913 -258688 -193582 -221119 -146906 1130 -56189 42984 -314312 -458584 -93469 1661 -113815
7902 -113815 -142517 -156643 -23888 -330256 -506596 -237408 116077 134715 -102226 187835
7892 187835 113367 -173010 -236120 139107 185725 507414 36052 -274888 -247698 -91402
7882 -91402 -84128 -227819 72910 -280936 -474723 -146887 149871 -473052 -443793 -455140 -473541
7871 -473541 -532011 -488556 -191644 -225061 -293502 -266213 51146 110775 -113431 119394 56712
7860 56712 -84942 -294366 -11052 242129 -166686 -106324 -325232 -242988 -142367 -30331
7850 -30331 -90893 19170 105727 -221085 -643330 -570141 -456879 -58917 -446194 -304962
7840 -304962 -320500 -381312 -248108 -396690 -601495 -383421 -115239 -359966 -502505 -246055
7830 -246055 -62469 -204347 -145792 -273132 -239145 -249478 -332663 443 -193542 -464596
7820 -464596 -584861 -515957 -653129 -552822 -170332 -76960 -445616 -39770 86851 -274205
7810 -274205 -529327 -393959 -430216 -472067 845479 166317 -199459 -473124 -432962 125489
7800 125489 -444139 -413016 -115520 -52755 252253 40025 -314714 -644154 -204711 18075
7790 18075 -194538 100881 37658 -462647 -58046 -67370 181057 99061 95341 646 27498
7779 27498 239872 102373 23408 86674 240211 490024 299079 -139516 -170041 -63688
7769 -63688 190703 375015 -281927 -819725 -290970 -117810 57591 -57220 -331660 -171353
7759 -171353 -131003 -163344 -87119 -73785 -238870 -183870 -8744 226615 38305 -1996 -55825
7748 -55825 -185223 450590 419170 37789 69743 29543 204235 246307 -381405 -161607 125214
7737 125214 -12513 194709 357413 290992 310838 294156 102587 221124 -36928 -43614 -12305
7726 -12305 -74453 131752 217091 418088 1294 125486 56389 242650 1116 -115598
7716 -115598 32579 -74502 -40277 30439 -238405 257603 655090 63841 -36379 207710
7706 207710 272794 -116990 33167 -41123 64083 -123910 -371259 12316 -8867 -546789
7696 -546789 -467958 21522 -70396 -412088 -316967 -458110 -303273 -146044 -41536 -192966
7686 -192966 62918 -32884 -201875 143518 354778 -142440 -55700 -13849 149716 550031
7676 550031 506893 473568 227632 475297 583585 90495 79242 268331 -69725 11402
7666 11402 90610 699871 -42423 142595 601163 136268 -49688 237125 316271 81461
7656 81461 -201127 -334116 -569970 -499801 -399994 11123 64110 273420 80518 -200750
7646 -200750 302597 64940 1606 -10503 73950 19204 288434 160011 198766 15318 149670
7635 149670 262627 -82428 83777 -122837 289218 27768 261593 404025 594708 540414
7625 540414 163026 278069 183304 -258 -192872 -362668 -492877 229041 566785 517790
7615 517790 254957 143352 335506 82908 -175481 -7940 288860 662026 331815 -17650
7605 -17650 -184513 -157143 24629 3025 -31411 -180946 -464790 -175615 -66684 49177
7595 49177 200146 50036 -268157 -432242 -176519 -246509 -464621 -150144 49205 -64969
7585 -64969 202317 125521 71601 272906 679706 530824 314592 -128179 -74960 501161
7575 501161 220220 175961 -40249 -116831 -131295 109440 294741 244940 80112 70000 283895
7564 283895 51555 -228357 -240526 29305 -194409 -6609 261616 -11653 -58333 215990
7554 215990 560042 387106 224919 283610 -16744 86867 152293 461771 -201764 148392
7544 148392 355171 229485 520216 169316 880000 768427 423590 694364 754612 498632
7534 498632 96694 309839 669704 611443 491189 463685 836382 391303 567126 595900
7524 595900 887231 215362 710302 871250 743964 318372 146718 621867 702453 723583
7514 723583 749913 1188153 1005844 1111045 1338759 1445738 1260288 1331935 1481310 1318270
7504 1318270 1314934 1165752 842536 649714 632453 488942 743610 541993 342399 1028660
7494 1028660 1309725 747879 995759 1159537 1033390 1147381 863544 877085 968130 1233868
7484 1233868 1363059 998426 1130391 1195152 1332384 1488305 1049356 779489 765578 960861
7474 960861 919860 746306 1056205 1235379 860147 749988 816661 1050451 734374 883872
7464 883872 1013087 1364780 1446462 1823481 1592995 1479310 1461561 1581660 1124555 1360204
7454 1360204 1894991 2175219 2145230 2154304 2271923 2529679 2459343 2040219 2061357 2365218
7444 2365218 2419124 2894553 3097900 2890156 2912616 2558423 2339213 2673359 2712353 2666425
7434 2666425 3035816 3060074 2798788 3164925 3443607 3922638 3952054 3756784 3855561 3918080
7424 3918080 4017144 4282251 4167948 4254197 4563325 4491354 4535474 4535983 5004221 4925284 5018481
7413 5018481 5304703 5671404 5881393 6098778 5752334 6322681 6481514 7178237 7398703 7601064
7403 7601064 7466978 7750201 8307262 8538311 8963475 9459213 10202054 10738110 10767546 11163197
7393 11163197 11783720 12191239 12814671 13391526 13997183 14643520 16084949 17180769 18290569
7384 18290569 19330054 20663167 22057080 23723975 25582038 28122489 30402116 32710853
7376 32710853 35703618 39788369 44198163 49159466 54913709 61062262 67748980 74498958
7368 74498958 79777062 81616775 79502902 74813015 68195585 61380290 54339497 48298872
7360 48298872 43664347 39472019 36315776 33747987 31914739 30221056 28868137 27501537
7352 27501537 26307175 25237976 23796331 21973589 20820675 19603395 18426023 16595868
7344 16595868 15566213 15013124 14399531 13572122 12396270 11814825 11305948 10686579 9928897
7335 9928897 9686254 9148091 8980810 8997110 8470816 7576037 7203644 7033799 6648005 6602791
7325 6602791 6597634 6490554 6371768 6291261 5507437 5476487 5203231 4627159 4279244 4556967
7315 4556967 4720301 4261568 3950741 3893924 3826591 4149072 3942152 3489817 3090548 3185574
7305 3185574 3263498 3208396 3025374 2646130 2453332 2626444 2713806 2896736 2577314 2277973
7295 2277973 2527776 2392855 2132351 2453352 2817422 3025131 2828293 2559549 2631395 2531587
7285 2531587 2400863 2157565 2163431 1893260 1637045 1496540 1530157 1792471 2189042 1849677
7275 1849677 1502701 1520415 1728981 1683019 1574721 1473843 1420522 1485893 1387062 1122502
7265 1122502 1273659 1133878 1242465 1591367 1490050 1317870 1310514 1498444 1259885 1068296
7255 1068296 871975 984996 1108378 1109823 1365333 1085278 982533 972974 470587 334473
7245 334473 562168 482792 79260 217270 424681 638783 349494 273086 514255 355529
7235 355529 635835 491754 561002 403150 496428 359326 538862 344100 353045 387569 673666
7224 673666 926389 1054953 1142868 989335 943277 920096 856005 390262 447161 238936 357391
7213 357391 861832 437512 160862 256894 336614 581141 723905 376544 389133 264225
7203 264225 473725 660157 615487 320133 197782 201689 424812 587358 835573 922670
7193 922670 480888 603176 785128 791331 888033 566234 235972 695524 715882 273743
7183 273743 143578 -41211 220772 228134 130497 -49363 328419 444503 378165 410164 137776
7172 137776 430812 619650 491080 110122 -31709 7518 -98312 -104474 176925 217401
7162 217401 495022 777681 453753 341372 483060 72620 260439 310872 314150 198707
7152 198707 174428 -55468 135961 288962 216106 316861 146287 -14079 98972 -23009
7142 -23009 588396 810920 615730 582459 550846 246510 622693 287632 22342 -53701
7132 -53701 -77612 21416 287215 428429 515161 754826 490640 614142 885191 433597
7122 433597 185549 267711 -56768 -351903 -17247 -93235 -52320 232685 263940 -249682
7112 -249682 -169199 -34241 -179250 -228723 -144263 89310 -168813 -25426 -229123 -111834
7102 -111834 -254881 -384452 -288001 -90158 3794 -59920 279982 331618 158463 -25317
7092 -25317 -71746 -132165 -16735 -108900 58709 112845 -366436 -355748 -64128 349404 143615
7081 143615 -14263 179825 354739 -8367 -88857 -141569 -349387 85916 95337 266740
7071 266740 169482 75616 110168 -188658 227177 209496 -98204 -212443 -295307 -378441 -185618
7060 -185618 1170 362759 274304 105276 73815 -238368 -490759 -72726 56402 188171
7050 188171 87261 -212420 -244806 231555 315291 61295 -90238 24201 -92292 197248
7040 197248 84703 461910 537251 374469 173094 124977 6287 208184 66421 -200480
7030 -200480 205178 200733 207118 37250 -242471 -126926 -23135 35945 381739 131311 -392591
7019 -392591 -558744 -507732 -526660 -326100 -175185 -223930 -41807 252913 576561 327169
7009 327169 385629 -129545 -626353 -147564 -344605 -378747 -221117 -189930 -269543 92805
6999 92805 -252115 121342 278947 127195 12501 471541 465854 187039 -30602 294886
6989 294886 491939 262339 210909 285319 349111 571772 360948 418184 496831 647535 328349
6978 328349 -166858 -345124 3484 264929 -49310 -359872 -535324 -272630 22798 136730
6968 136730 106965 218385 417016 423537 -458113 -276563 -198911 55155 183982 446715
6958 446715 302751 271342 580970 476317 293323 253225 484219 67174 83220 191847
6948 191847 198947 269070 121724 91167 84038 153602 82293 -70896 121462 221522 69796
6937 69796 49433 74682 46863 -4776 -330025 -314570 -177741 -613065 -554551 -569482 -485071
6926 -485071 -531229 -495752 -265326 -8193 463530 461360 330382 83501 105312 -125252 -362945
6915 -362945 -188465 -324432 -599697 -717264 -391531 358056 -60850 -281690 -166877 362999
6905 362999 -230554 -433752 -180337 -280514 -8274 -229904 -345116 -34000 156841 109471
6895 109471 157161 174871 297589 327745 597351 269856 162628 271473 58066 -154833
6885 -154833 169587 -70228 -335471 -239080 317537 -143592 -178388 -145460 -167057 -7701
6875 -7701 -409937 -142739 -104774 -231238 -406181 -257933 -90634 -235102 -189221 -390868
6865 -390868 -148627 124756 -213169 -292290 -200075 -9155 136074 31730 66737 5262
6855 5262 -338616 -201905 159818 119901 158648 139393 225554 132112 -55089 -67856 -46109
6844 -46109 -116045 82621 98884 78525 207858 -134448 -83732 -179710 38072 -294095 122126
6833 122126 486205 571894 -59843 -509759 -279415 -462833 140855 213272 279207 -17260
6823 -17260 -227173 -23736 385087 175078 -209019 197471 31992 -144598 -230196 -25593
6813 -25593 4107 -179206 -94806 176519 -173480 -416107 -308330 -107281 -52129 -448087
6803 -448087 -585192 -349212 20178 97966 -135279 -560908 -359771 -545073 -485598 -55596
6793 -55596 -417887 60287 383586 152584 40456 -182970 -311275 -174610 -170585 -369662
6783 -369662 7006 -150979 -433765 -245869 -416776 -679087 -431712 -31234 -269760 -452639
6773 -452639 -469926 -394708 -287159 6346 -296090 -454445 -388227 -88530 -96990 -54520 170484
6762 170484 71081 -269810 -322820 -372931 -228408 -161519 -116901 -185482 -260269 -261534 -370089
6751 -370089 -155266 -525612 -609711 -510135 -343229 10942 81626 -125206 219433 108730
6741 108730 -246729 -322686 -234739 -361050 -376442 -299574 -174261 -529885 -419629 -221028
6731 -221028 42426 -91038 -545311 -263744 -233267 -66067 -95728 -343444 -540817 -725008
6721 -725008 -278727 -289982 165160 99600 -81784 -3264 -153454 -249647 49277 98092 155455
6710 155455 241079 98179 -155606 -189025 -234730 -161658 124121 198297 -19374 100286 342071
6699 342071 439824 574024 267294 229306 194237 424320 269116 138472 -281089 -357649
6689 -357649 -282791 219238 274852 24757 484675 224164 -8704 -76809 27861 -439466
6679 -439466 -147576 -263452 -25985 247958 240699 52240 -272060 134844 97098 136657
6669 136657 -117215 -106038 -118793 -111326 271344 592396 559131 219015 -83633 -227859 -218141
6658 -218141 -162159 -106687 -94825 -92916 -131843 -1537 -219402 -451386 -429865 -270278 322748
6647 322748 75734 316999 -11374 201638 -47493 172624 427087 186674 177931 176601
6637 176601 275583 246281 46841 614478 359667 130630 -208356 -170138 -93102 -46840 333858
6626 333858 86020 75969 -178044 -500977 -425464 -317973 -226451 -361407 -396405 -391035 -487414
6615 -487414 -129720 -110404 -276177 -465245 -392459 -65172 345599 27630 212785 -62150
6605 -62150 -14107 121792 277438 400025 212466 309281 412843 143190 75976 431829
6595 431829 336585 -19422 103371 15818 -82839 36060 295720 299744 203047 -197288 -195250
6584 -195250 47396 -84186 -150920 -443426 -62419 -35558 185854 374072 115831 -150948
6574 -150948 -140540 -266441 -528253 -274406 -212332 -43627 84517 -152830 93168 8819
6564 8819 -66977 -106650 -79480 -176219 -329925 -217129 -262372 -70997 260901 60282 -235804
6553 -235804 -605832 -171577 -291050 57804 539594 639485 382148 -54433 74109 234221
6543 234221 320133 -465502 -258889 -514673 -422470 -515108 -503715 -347322 -155948 14755
6533 14755 -13869 -330761 51107 155710 -137935 70554 296183 140589 -77767 46792
6523 46792 140527 179194 -83789 -90046 -57397 -223239 -2305 348626 467278 147698 -151075
6512 -151075 247431 137593 -481147 -403211 -371590 -439559 -191258 -78236 44458 156619
6502 156619 11237 212433 322436 184436 -6393 104941 -153026 108394 174849 -75803
6492 -75803 -477520 -449000 -6949 1063 320889 540711 451883 286701 183116 153098 230953
6481 230953 367164 139457 -42861 -429209 -343830 -403166 -357795 -237574 -42862 195871
6471 195871 299668 118860 150730 189795 50949 -89364 39596 343842 323942 613432
6461 613432 449773 303970 209586 -346611 -479082 -304740 -135569 111417 -41198 216977
6451 216977 432634 305247 -83078 62071 -322565 -204056 111998 477667 195412 37653
6441 37653 123982 363468 420500 592117 594282 544803 365799 332765 154706 -99467 -161464
6430 -161464 224141 421191 580733 395816 577175 743262 445644 504083 134327 199180
6420 199180 553125 -18059 -75729 424908 514251 322322 417528 352249 327098 46433 226654
6409 226654 220799 206158 179083 23036 -91788 158043 -68713 -56881 56672 -196869 -228560
6398 -228560 -48102 85191 240245 387511 236726 493887 371607 374683 511211 359982
6388 359982 201385 241321 173815 598940 556948 1052961 808251 668153 427864 586045
6378 586045 694174 665391 828563 480855 455190 387835 427390 947053 795303 348324
6368 348324 447547 305486 235966 363246 47069 163587 -88366 141077 340141 207269
6358 207269 434457 29237 146218 268478 123033 490333 478864 519292 465271 566910
6348 566910 789788 510265 265420 81571 262759 563247 644863 629038 715302 705847 204121
6337 204121 685926 733354 484902 593165 996808 448142 174812 104889 135291 454987
6327 454987 601082 956813 606089 180470 216620 479505 270012 341672 854086 916443
6317 916443 834927 292994 314248 748642 931275 724019 322122 538097 122822 262573
6307 262573 207811 153821 509982 765007 423130 457667 964363 698652 674399 836181
6297 836181 1071491 1741909 981828 271643 550363 768088 942605 1173895 1425901 1720512
6287 1720512 1549238 1187427 705880 862385 1088545 755671 918989 767554 694977 1017021
6277 1017021 1240540 870222 978254 905087 482443 521784 654491 765035 1035574 965785
6267 965785 879387 1074710 941584 1049526 969935 1052593 666350 1093878 1610674 1112963
6257 1112963 1153887 1170676 1128218 925793 1299320 1320685 1277944 1465242 1315159 1198187
6247 1198187 1321250 1520793 1616045 1524974 1491874 1193413 1182367 1275792 1200247 1235192 1381075
6236 1381075 1243849 1383971 1513010 1344364 1147235 1221484 1102976 1220888 1613487 1543715
6226 1543715 1249195 1646813 1973245 1607838 1483420 1293323 1077161 1101515 1546058 1600103
6216 1600103 1903190 1958034 1927766 2004457 2184544 1984604 1864380 1989086 2540311 2107421
6206 2107421 1811399 1979604 1785750 2244440 2315169 1950267 2129657 2602478 2366093 1649032
6196 1649032 1491744 1836491 2238540 2397420 2733018 2901720 2882336 2404676 2642682 2996035
6186 2996035 3185117 3033823 2738003 2679174 2935489 2902666 3066855 3688595 3252566 2933306
6176 2933306 3098933 3171696 3279525 3456942 3621312 3490176 3742734 3554599 3322867 3472871
6166 3472871 3311815 3401152 3868585 3851347 3986353 4075428 3837873 3916815 3974793 4207970
6156 4207970 4251420 4165172 4300698 4141297 4306328 4274502 4465716 4449014 4035513 4253925
6146 4253925 4238144 4237111 4270771 4800805 5087097 4873805 4905698 4865704 4680114 4567294 4743617
6135 4743617 5038145 5204909 5433211 5417557 5588193 5642182 5586443 5686983 5530054 5361284
6125 5361284 5557834 5219621 5747332 5588752 5494501 5703301 6008314 5713849 5945720 6157777
6115 6157777 5692630 5914885 6159924 6129790 6231178 5976399 6305580 6325183 6546982 6472547
6105 6472547 6001730 6076968 6433344 6457929 6344739 6459605 6375702 6564092 6403720 6639625
6095 6639625 6662050 6242051 6174069 6440229 6628302 6824728 6407989 6512640 6401953 6339263
6085 6339263 6332331 6427836 6394843 6306055 6274630 6537618 6972998 6423750 6267457 6380102 6402956
6074 6402956 6001448 5999109 6435144 6672928 6592684 6178799 6090198 6254335 6177171 6876389
6064 6876389 6976130 6981535 6949272 6450352 6258057 6260550 6435923 6441958 6483727 6413215 6451443
6053 6451443 6360672 6464823 6308348 6587659 6956235 6699840 6640177 6262126 6371648 6725459
6043 6725459 6211341 5937601 6251863 5830118 6032785 6367129 6375596 6561091 6336818 6655973
6033 6655973 6865833 7098652 6693257 6797799 6612068 6369105 6198986 6588934 6817990 6938496
6023 6938496 6908633 7198970 7230282 7192919 7720582 7826243 7841817 7556809 7622119 7969385
6013 7969385 8102166 8348403 8103726 8388320 9229749 8914422 9245365 9571664 9439912 9965057
6003 9965057 10366912 10054820 10376585 10868910 10970592 11241413 11537900 12057054 12168903 12063747
5993 12063747 12623416 12954577 13190727 13377272 13654647 13945091 14489935 15062463 15361026
5984 15361026 15887927 16636008 17032633 17061708 17373676 18061349 18601714 19230641 19726561 20608445
5974 20608445 21121022 21518208 22089924 22662106 23298316 23903239 24139502 24453127 25179263
5965 25179263 25319011 25813229 25916805 26352163 26721087 27367903 28156722 28353589 28458092
5956 28458092 28588278 29296517 29690892 29551343 30233685 30797696 31221349 31684547 31969877
5947 31969877 32359812 32815511 33015179 33386632 34056858 34625211 34960496 34843175 35117350
5938 35117350 35595939 35978316 36591357 36797598 37346421 37409462 37720617 38532793 39310139 40010733
5928 40010733 40458246 41485446 42074032 42410453 42937438 43762761 44454183 45536519 46059143
5919 46059143 47264755 48927827 50396482 51919667 53300937 55093491 56842804 58963497
5911 58963497 60699602 63037202 65109598 67736242 70694648 73281445 76583272 79650725
5903 79650725 83083868 86462491 89391586 91845809 94573700 96470246 96907032 96567103
5895 96567103 95372150 93617142 91098344 88085540 84756056 82045422 79003375 76446974
5887 76446974 74014870 71876229 70552753 68232438 66687903 65337461 63688145 62344172
5879 62344172 61123680 60381367 58863037 57397871 55621668 54104067 52564968 50552113
5871 50552113 49132924 47285029 45249681 43337460 41911814 40372780 38209198 36956097
5863 36956097 35724266 34328469 33116495 31827095 30534142 29754543 29109269 27620871
5855 27620871 27158012 26585934 25912587 25035768 24372104 23393320 22554046 21491386 21296638
5846 21296638 20969030 20297779 20032465 19733790 18941751 18586626 18062015 17661545 17346312
5837 17346312 16855971 16581277 16206220 15588809 15189843 14718986 14077123 14139870 13961838 13795158
5827 13795158 13343517 13249410 12902799 12542892 12319413 12414164 12143508 11706556 11667773 11616994
5817 11616994 11279201 11167981 11103108 11068906 10755398 10474483 10215983 9786966 9522718 9470871
5807 9470871 9609683 9273105 9009647 9060556 8882797 9104305 9000633 7984487 8240176 8334206
5797 8334206 7589811 7491107 7508912 7739768 7725369 7568042 7581070 7495007 7404074 7003722 6712319
5786 6712319 6514395 6850185 6598627 6591802 6452495 6795057 6952055 6752248 6058174 5691734
5776 5691734 6040744 6057652 5503077 5354167 5319798 5180320 5661371 5577018 5830430 5793117
5766 5793117 5658106 5715941 5344233 4878805 4874178 4458324 4103002 4789271 4731071 4700797
5756 4700797 4972084 4672358 4625269 4647853 4720828 4596006 4724266 4111908 4185441 4280473
5746 4280473 4570656 4010024 3706545 3772703 4046073 3894024 4061704 3916192 3962363 4014482
5736 4014482 4040198 3772685 3547260 3674213 3321184 3105981 3332755 3000367 2662056 2988341
5726 2988341 3128641 3364463 3316889 3382030 3339737 3244412 3224262 3326242 3254984 2964044 2782303
5715 2782303 2879259 3031159 2854261 2914210 2891029 2870029 2790469 2696827 2606397 3207574 3603288
5704 3603288 3365588 2787931 2878658 3274549 3086698 2727289 2983315 3047630 3128056 2977598
5694 2977598 3024341 3093188 3159052 3430471 2725256 2366404 2466242 2930186 2769990 3102729
5684 3102729 2922364 2969747 3346278 2913473 2804135 3193662 3720469 3454705 2942393 3056611
5674 3056611 3037570 2580795 2203637 2113442 2677535 3168535 2842718 2951971 2778143 2717894
5664 2717894 2348794 2446779 2816858 2833029 2770291 2924393 2374945 2656967 2332893 2536855
5654 2536855 2929687 2932129 2708390 3133858 3060874 3389388 3783703 3499770 3002301 2798862
5644 2798862 3113550 3546073 3530456 3390737 3106191 2981320 2875661 2778117 2945063 2929184
5634 2929184 2891985 3033402 3352965 3137626 3091270 2952250 3023733 3070916 2787364 3092250
5624 3092250 3274360 3055696 3040417 3055549 3234330 3291600 3693443 3642960 3611447 3699444 3804021
5613 3804021 3739606 3494177 3300131 3501979 3639580 3614948 3553051 3537187 3107786 3145651
5603 3145651 3427553 3380847 3288986 3441040 3398744 3398692 3500179 3460658 3490574 3474330 3252613
5592 3252613 2949817 2775088 3227365 3555197 3713593 3426057 3204536 3324603 3643065 3893523
5582 3893523 3373684 2757794 2761587 3567156 3484142 3049640 3489671 3634713 3705676 3589349
5572 3589349 3315161 3536093 3065290 3351200 3781169 3263848 3068704 3210995 3754802 3759025
5562 3759025 3620702 3787538 3623557 3597477 3637202 3743485 3638682 3353037 3446453 3777930
5552 3777930 3282898 2571000 2954938 3103831 2959529 3061537 2937396 2914781 3040964 3128581
5542 3128581 3206195 2907312 3015008 3492424 3495825 3038634 2940894 2932120 3201951 3273892 3542379
5531 3542379 3289735 2859749 2806716 3035124 2913121 2660479 2832123 3294283 3343428 3179008
5521 3179008 3108627 2730340 2786929 2973967 2668341 2563753 2423386 2932763 2874770 3163771
5511 3163771 2907228 3004176 3441473 3236297 2878352 2999821 3244759 3004269 2819739 2829287
5501 2829287 3051795 2956118 3255628 3240082 3155220 2732029 2811086 2939000 3011195 2970150 2878269
5490 2878269 2653377 2684676 2949408 2775462 2883054 2890625 3377656 3277151 2804163 3079302
5480 3079302 3031351 3282229 3403896 3139273 3357850 3273883 3114034 2810852 2815078 2602770
5470 2602770 2718760 2770702 2464736 2700808 2906516 3010717 2976652 2841958 2940839 2699001
5460 2699001 2506583 2892448 2824980 2967568 2880540 2711254 2683602 3013802 2896549 2867280
5450 2867280 3139457 3342018 3050851 3436919 3392868 3406796 2954779 2782572 3252156 3690844
5440 3690844 3504230 3460011 3694147 3684496 3178192 3022335 3060816 3422806 3078784 3488427
5430 3488427 3694209 3855527 3861800 3629530 3673272 3816349 4039596 3951024 3991664 3702023
5420 3702023 3604616 3604189 3212879 3250101 3385884 3371255 3314482 2866944 2479217 2647638 3083853
5409 3083853 2980096 3397474 3648334 3380859 3275414 3415943 3443708 3328855 3431640 3391694
5399 3391694 3153343 3387059 3038768 2777708 2594167 2856278 3041758 2675063 2459713 2759194
5389 2759194 3067424 2978926 2959561 2806578 2587791 2818349 2587776 2831780 2937340 2913548
5379 2913548 3177224 2869100 2988219 3100501 2692142 2649972 2620620 2993036 2831541 2779761
5369 2779761 3264278 3014025 2659004 2905587 2859651 3025987 2764495 2700887 3107202 3029558
5359 3029558 3070217 3315223 3182431 3163677 3405909 3186903 3213419 3082059 3090669 3108682 2869678
5348 2869678 3381459 3868207 3809340 3337502 2906398 2804424 2754575 2829253 3023983 3141277
5338 3141277 3023955 3209376 3347306 3107657 3390230 3443084 3216064 2928262 2876950 2961677
5328 2961677 3287522 3592590 3270463 3055868 2937110 3312348 3363971 2946236 3476983 3622338
5318 3622338 3209362 2929867 3175591 3184796 3501357 3433244 3247015 3427436 3693727 3648087
5308 3648087 3600041 3803532 3883626 3786049 4095722 3772122 3898191 4189526 4063272 4285498
5298 4285498 4296623 4028417 3612290 3685752 3695508 4047834 3979597 3961650 4028810 4187694 4308164
5287 4308164 4360741 4005293 4267846 4250420 4566287 4586056 4431295 4441359 4490544 4472587 4134888
5276 4134888 4512696 4792329 4227689 3853601 4264284 4319596 4344839 4384418 4171642 4211871
5266 4211871 4284757 4204679 3725311 3594563 3876567 3955185 4281607 4464555 4343833 3902792
5256 3902792 4166740 4362159 4433336 4540321 4186253 4080558 4002401 3912602 4041196 3894493
5246 3894493 4298614 4643078 4668074 4232715 4466379 4896241 4389090 4496493 4532706 4567025
5236 4567025 4597605 4609082 4277784 4373484 4593473 4604262 4511465 4119063 3981527 4094968
5226 4094968 4258987 4214609 3911271 4198275 3807218 4091878 4632341 4235216 4026528 4214409
5216 4214409 4541164 4064890 3605052 3602851 3594322 3816297 3573340 3674843 3944344 4116420
5206 4116420 3435307 3182564 3202462 3228924 3151634 3159744 3438618 3475165 3619245 3353212 3145074
5195 3145074 3195516 3497360 3185490 3066902 3248540 3387733 3004013 2977642 3372497 3176686
5185 3176686 2713492 2942107 3251842 3297556 3280951 3247030 3382403 3120569 2917438 2705642
5175 2705642 2819960 3141640 3072434 3007557 3213733 3177714 2754000 2925978 2941598 2932852 3379428
5164 3379428 3483690 3551050 3542659 3608216 3321478 3077796 3212561 2980126 3171939 2987632
5154 2987632 3263362 3447501 3345938 3845357 3975767 3652794 3626599 3746510 3276080 2993316
5144 2993316 3326652 3749319 3383808 3602980 3779905 3829590 3821143 3868962 3605653 3461862
5134 3461862 3515563 3753077 3620051 3478765 3637291 3625182 3572305 3263392 3377890 3413961
5124 3413961 3593985 3712787 3799339 3106860 2901961 3208827 3567348 3502384 3562528 3427958
5114 3427958 3883485 4020166 3951063 3971452 3461098 3188970 3062764 3511041 3693945 3529695
5104 3529695 3470152 3337012 3311900 3386893 3527398 3569061 3884547 3676274 3492935 3767870
5094 3767870 3841591 3534981 3242678 3415520 3834174 3967562 3832452 3602539 3894238 3648293
5084 3648293 3626795 3733251 4290491 4310054 3760756 3644377 3800160 3764152 4140824 4316637
5074 4316637 3581330 3901834 4115569 4127509 4179052 4121138 4013028 4186060 4318264 4587165
5064 4587165 4322180 4378947 4178034 4427925 4616145 4454070 4409682 4509397 4781449 4644685
5054 4644685 4415343 4796782 5166658 4954435 4700032 4925980 4958808 4863162 4671862 4722601
5044 4722601 4776245 5114769 5297103 5111597 5085792 4703156 4939332 4596057 5059337 5037942
5034 5037942 4925249 5197872 5204053 5098083 5077041 5310927 5698507 5648170 5414029 5473468
5024 5473468 5453216 5830446 6101561 5702087 5581522 5725611 5549588 5849350 6217295 6536047
5014 6536047 6425559 6376325 6584599 6955485 6882489 7182003 7273121 7506680 7617804 7871863
5004 7871863 7998046 8037563 8311593 8564770 8425559 8347036 8861014 9120600 9087950 9363466
$$ [...]
##END NTUPLES=NMR SPECTRUM
##END=
