##TITLE=1H_TG-2351-X1
 DMSO
 8 sc, 
 11.03.2022
##JCAMPDX= 6.0         $$ Bruker NMR JCAMP-DX V2.0
##DATA TYPE= NMR SPECTRUM
##DATA CLASS= NTUPLES
##ORIGIN= UXNMR, Bruker Analytische Messtechnik GmbH
##OWNER= root
$$ XWIN-NMR		Version 3.5
$$ Fri Mar 11 11:27:10 2022 Russian Standard Time (UT+4h)  she@DPX200
##.OBSERVE FREQUENCY= 200.131346
##.OBSERVE NUCLEUS= ^1H
##.ACQUISITION MODE= SIMULTANEOUS
##.ACQUISITION SCHEME= undefined
##.AVERAGES= 8
##.DIGITISER RES= 18
##SPECTROMETER/DATA SYSTEM= spect
##.PULSE SEQUENCE= zg30
##.SOLVENT NAME= DMSO
##.SHIFT REFERENCE= (INTERNAL, DMSO, 0, 15.6995)
##AUDIT TRAIL= $$ (NUMBER, WHEN, WHO, WHERE, WHAT)
$$ ##TITLE= Audit trail, XWIN-NMR		Version 3.5
$$ ##JCAMPDX= 5.01
$$ ##ORIGIN= Bruker BioSpin GmbH
$$ ##OWNER= she
$$ F:/spectra/data/she/nmr/H-F/1/pdata/1/auditp.txt
$$ ##AUDIT TRAIL=  $$ (NUMBER, WHEN, WHO, WHERE, WHAT)
(   1,<2022-03-11 11:26:10.09 +0400>,<she>,<DPX200>,
      <created by zg, POWCHK disabled, PULCHK disabled
       configuration hash MD5:
       00 E9 B6 7A A2 85 ED C7 34 08 36 98 17 FE 4E 26
       data hash MD5: 16K
       EF D9 16 38 25 2A D9 0C 8C 58 A8 29 54 36 9F 14>)
(   2,<2022-03-11 11:26:12.71 +0400>,<she>,<DPX200>,
      <Start of raw data processing
       efp BC_mod = 2 LB = 0.24 FT_mod = 6 PKNL = 1 PHC0 = -16585.49 PHC1 = 8.40078 SI = 16K 
       data hash MD5: 16K
       B7 89 A9 B5 33 CC 2E FA D9 1B C7 15 1C 1E BF C6>)
(   3,<2022-03-11 11:26:29.85 +0400>,<she>,<DPX200>,
      <pk PHC0 = -5.425253 PHC1 = 4.4 
       data hash MD5: 16K
       A0 F1 BC 24 D8 B7 98 4C D0 B7 CA D7 27 93 E8 D7>)
(   4,<2022-03-11 11:26:34.54 +0400>,<she>,<DPX200>,
      <abs ABSG = 5 
       data hash MD5: 16K
       77 79 F1 B9 DB A1 17 F8 13 5B 11 28 17 BE 86 9C>)
$$ ##END=
$$ 
$$ hash MD5
$$ AE EC B1 5F CF 9C E9 62 FD 5C 0A 1F B7 A9 ED AF
##$RELAX= 
##$RELAX= 
##$RELAX= 
##$RELAX= 
##$RELAX= 
##$RELAX= 
$$ Bruker specific parameters
$$ --------------------------
##$DU= <F:/spectra>
##$EXPNO= 1
##$NAME= <H-F>
##$PROCNO= 1
##$TYPE= <nmr>
##$USER= <she>
##$AMP= (0..31)
100 100 100 100 100 100 100 100 100 100 100 100 100 100 100 100 100 100 
100 100 100 100 100 100 100 100 100 100 100 100 100 100 
##$AQSEQ= 0
##$AQ_mod= 1
##$AUNM= <au_zg>
##$AUTOPOS= <>
##$BF1= 200.13
##$BF2= 200.13
##$BF3= 200.13
##$BF4= 200.13
##$BF5= 200.13
##$BF6= 200.13
##$BF7= 200.13
##$BF8= 200.13
##$BYTORDA= 1
##$CFDGTYP= 0
##$CFRGTYP= 5
##$CHEMSTR= <none>
##$CNST= (0..31)
1 1 145 1 1 1 1 1 1 1 1 1 1 1 1 1 1 1 1 1 1 1 1 1 1 1 1 1 1 1 1 1 
##$CPDPRG= <>
##$CPDPRG1= <>
##$CPDPRG2= <>
##$CPDPRG3= <>
##$CPDPRG4= <mlev>
##$CPDPRG5= <mlev>
##$CPDPRG6= <mlev>
##$CPDPRG7= <mlev>
##$CPDPRG8= <mlev>
##$CPDPRGB= <>
##$CPDPRGT= <>
##$D= (0..31)
0 1.2 0 0 0 0 0 0 0 0.06 0 0.03 0 0 0 0 0.0002 0 0 0 0 0 0 0 0 0 0 0 0 
0 0 0 
##$DATE= 1646983569
##$DBL= (0..7)
120 120 120 120 120 120 120 120 
##$DBP= (0..7)
150 150 150 150 150 150 150 150 
##$DBP07= 0
##$DBPNAM0= <>
##$DBPNAM1= <>
##$DBPNAM2= <>
##$DBPNAM3= <>
##$DBPNAM4= <>
$$ [...]
##$SUBNAM2= <"">
##$SUBNAM3= <"">
##$SUBNAM4= <"">
##$SUBNAM5= <"">
##$SUBNAM6= <"">
##$SUBNAM7= <"">
##$SUBNAM8= <"">
##$SUBNAM9= <"">
##$SW= 18.0517287032376
##$SWIBOX= (0..15)
0 0 2 0 0 0 0 0 0 0 0 0 0 0 0 0 
##$SW_h= 3612.71676300578
##$TD= 16384
##$TD0= 1
##$TE= 0
##$TE2= 300
##$TE3= 300
##$TEG= 300
##$TL= (0..7)
0 120 120 120 120 120 120 120 
##$TP= (0..7)
150 150 150 150 150 150 150 150 
##$TP07= 0
##$TPNAME0= <>
##$TPNAME1= <>
##$TPNAME2= <>
##$TPNAME3= <>
##$TPNAME4= <>
##$TPNAME5= <>
##$TPNAME6= <>
##$TPNAME7= <>
##$TPOAL= (0..7)
0.5 0.5 0.5 0.5 0.5 0.5 0.5 0.5 
##$TPOFFS= (0..7)
0 0 0 0 0 0 0 0 
##$TUNHIN= 0
##$TUNHOUT= 0
##$TUNXOUT= 0
##$USERA1= <user>
##$USERA2= <user>
##$USERA3= <user>
##$USERA4= <user>
##$USERA5= <user>
##$V9= 5
##$VALIST= <valist>
##$VCLIST= <CCCCCCCCCCCCCCC>
##$VD= 0
##$VDLIST= <DDDDDDDDDDDDDDD>
##$VPLIST= <PPPPPPPPPPPPPPP>
##$VTLIST= <TTTTTTTTTTTTTTT>
##$WBST= 1024
##$WBSW= 4
##$XGAIN= (0..3)
0 0 0 0 
##$XL= 0
##$YL= 0
##$YMAX_a= 160197
##$YMIN_a= -253421
##$ZGOPTNS= <>
##$ZL1= 120
##$ZL2= 120
##$ZL3= 120
##$ZL4= 120
##$ABSF1= 15.69952
##$ABSF2= -2.352329
##$ABSG= 5
##$ABSL= 3
##$ALPHA= 0
##$AQORDER= 0
##$ASSFAC= 0
##$ASSFACI= 0
##$ASSFACX= 0
##$ASSWID= 0
##$AUNMP= <proc_1d>
##$AZFE= 0.1
##$AZFW= 0.1
##$BCFW= 0
##$BC_mod= 2
##$BYTORDP= 0
##$COROFFS= 0
##$CY= -3
##$DATMOD= 1
##$DC= 0
##$DFILT= <>
##$DTYPP= 0
##$F1P= 0
##$F2P= 0
##$FCOR= 1
##$FTSIZE= 16384
##$FT_mod= 6
##$GAMMA= 0
##$GB= 0
##$INTBC= 1
##$INTSCL= 0
##$ISEN= 128
##$LB= 0.24
##$LEV0= 0
##$LPBIN= 0
##$MAXI= 10000
##$MC2= 0
##$MEAN= 0
##$ME_mod= 0
##$MI= 1.114404
##$NCOEF= 0
##$NC_proc= -8
##$NLEV= 6
##$NOISF1= 3.799351
##$NOISF2= 2.8
##$NSP= 0
##$NTH_PI= 0
##$NZP= 0
##$OFFSET= 15.69952
##$PC= 1
##$PHC0= -16590.92
##$PHC1= 12.80078
##$PH_mod= 1
##$PKNL= yes
##$PPARMOD= 0
##$PSCAL= 0
##$PSIGN= 0
##$REVERSE= no
##$SF= 200.130010414241
##$SI= 16384
##$SIGF1= 3
##$SIGF2= 2
##$SINO= 5.538805
##$SIOLD= 16384
##$SREGLST= <1H.CDCl3>
##$SSB= 0
##$STSI= 16384
##$STSR= 0
##$SW_p= 3612.71676300578
##$SYMM= 0
##$S_DEV= 0
##$TDeff= 16384
##$TDoff= 0
##$TI= <>
##$TILT= no
##$TM1= 0
##$TM2= 0
##$TOPLEV= 0
##$USERP1= <user>
##$USERP2= <user>
##$USERP3= <user>
##$USERP4= <user>
##$USERP5= <user>
##$WDW= 1
##$XDIM= 16384
##$YMAX_p= 415379317
##$YMIN_p= -1794904
$$ End of Bruker specific parameters
$$ ---------------------------------
##NTUPLES= NMR SPECTRUM
##VAR_NAME=  FREQUENCY,     SPECTRUM/REAL,   SPECTRUM/IMAG
##SYMBOL=    X,             R,               I
##VAR_TYPE=  INDEPENDENT,   DEPENDENT,       DEPENDENT
##VAR_FORM=  AFFN,          ASDF,            ASDF
##VAR_DIM=   16384,         16384,           16384
##UNITS=     HZ,            ARBITRARY UNITS, ARBITRARY UNITS
##FACTOR=    0.220516191357247, 1,           1
##FIRST=     3141.94512332982, 0,            0
##LAST=      -470.771639675956, 0,           0
##MIN=       -470.771639675956, -1794904,    0
##MAX=       3141.94512332982, 415379317,    0
$$ Real data points
##PAGE= N=1
##DATA TABLE= (X++(R..R)), XYDATA
$$ [...]
$$ plain form
9035 7756210 7603349 7486318 7905866 8274016 8512141 8319513 9036663 9005843 9299434 9494358
9025 9494358 9673682 9950673 10173532 10563193 11000446 11635231 12012805 12037148 12046431 12737426
9015 12737426 13377186 13711561 14276568 14542229 15058275 15285196 16400239 17102785 17686761
9006 17686761 18097357 19018716 19951750 21110041 22319922 24522299 25838820 27112007 28469631
8997 28469631 30615582 32545320 34394854 35837387 37998866 40893360 44152135 47453632
8989 47453632 51372129 56425065 61944663 66690140 70997870 73730875 74195130 72756857
8981 72756857 69879220 66334902 62685854 59753951 57484515 55475964 53695531 51963478
8973 51963478 50509214 48947762 48079312 47523960 47088256 46720531 46587409 46489983 47485065
$$ packed form
9035G756210j52861j17031M19548L68150K38125j92628P17150l0820K93591J94924
9025I494358J79324K76991K22859L89661M37253O34785L77574K4343R283O90995
9015A2737426O39760L34375N65007K65661N16046K26921J115043P02546N83976
9006A7686761M10596R21359R33034J158291J209881K202377J316521J273187J357624
8997B8469631K145951J929738J849534J442533K161479K894494L258775L301497
8989D7453632L918497N052936N519598M745477M307730K733005M64255j438273
8981G2756857k877637l544318l649048k931903k269436k008551j780433j732053
8973E1963478j454264j561452q68450n55352m35704l67725j33122r7426R95082
$$ plain form
8964 47485065 48524734 48928928 50212844 51648215 53346487 54689894 56863274 58817005
8956 58817005 61126253 63687048 66102685 68650647 71625263 74851313 78629988 82642718
8948 82642718 86955092 90866819 92967733 91755230 87601757 81244564 74268981 67391025
8940 67391025 61640999 56602720 53278950 50389666 47850469 45659403 43822418 42064770
8932 42064770 40547485 38857273 37133664 35577599 34288919 33114666 31795354 30614220
8924 30614220 29009299 27888523 26914547 25831838 24650597 23133003 22303959 21566989 20508498
8915 20508498 19310876 18159249 17525901 16758148 16282549 15402767 14918575 14570934 13471334
8906 13471334 13032092 12417391 12287281 12067185 11762547 11717797 10823126 10386137 9890555 9490768
$$ packed form
8964D7485065J039669M04194J283916J435371J698272J343407K173380J953731
8956E8817005K309248K560795K415637K547962K974616L226050L778675M012730
8948H2642718M312374L911727K100914j212503m153473o357193o975583o877956
8940F7391025n750026n038279l323770k889284k539197k191066j836985j757648
8932D2064770j517285j690212j723609j556065j288680j174253j319312j181134
8924C0614220j604921j120776r73976j082709j181241j517594q29044p36970j058491
8915B0508498j197622j151627o33348p67753m75599q79782m84192l47641j099600
8906A3471334m39242o14701j30110k20096l04638m4750q94671m36989m95582l99787
$$ plain form
8896 9490768 9120006 8889834 8762037 8424134 8028166 7926519 7921728 7810509 7749573 7072879
8886 7072879 7337401 7401269 6919632 6390880 6358272 6288270 6426601 6232544 6137668 6369662
8876 6369662 6447433 6158348 5681012 5629813 5637987 5261504 5258113 5347755 5204397 4965424 5362238
8865 5362238 5243968 5056774 4913629 4656609 4872667 5043485 4894837 4878837 4879662 4610967
8855 4610967 4555071 4365780 4486799 4349816 4386633 4295945 4105676 4348858 4532355 4481830
8845 4481830 4224890 4034334 3927169 3826107 3816769 3631440 3888545 3834992 3954657 4270956
8835 4270956 4100481 3689730 4102748 4154909 3750555 4044304 4012462 4307216 4136328 3843314
8825 3843314 4243344 4006180 4017839 4146889 4029431 3969647 3375202 3564490 3739994 3826516
$$ packed form
8896I490768l70762k30172j27797l37903l95968j01647m791j11219o0936o76694
8886G072879K64522O3868m81637n28752l2608p0002J38331j94057r4876K31994
8876F369662P7771k89085m77336n1199Q174l76483l391Q9642j43358k38973L96814
8865E362238j18270j87194j43145k57020K16058J70818j48648j6000Q25k68695
8855D610967n5896j89291J21019j36983L6817r0688j90269K43182J83497n0525
8845D481830k56940j90556j07165j01062r338j85329K57105n3553J19665L16299
8835D270956j70475m10751M13018N2161m04354K93749l1842K94754j70888k93014
8825C843314M00030k37164J1659J29050j17458n9784n94445J89288J75504Q6522
$$ plain form
8815 3826516 3717242 4015595 3940856 3805754 3944141 3406960 3374384 3562270 3943766 3858362
8805 3858362 3706511 4110611 4491102 4334922 4210817 4431725 4719867 4310297 4673905 4848093
8795 4848093 4952666 4780451 4962814 5018760 4621005 4717717 4824058 4949471 5240333 5266795
8785 5266795 5377111 5576989 6081212 5923991 5814415 5766111 5651868 5971630 6221210 5412711
8775 5412711 5525352 6036740 6456167 6190928 6491954 6545027 6615261 6542534 6216446 6798651
8765 6798651 7319324 7484116 7591227 7678834 7972395 7871843 7635118 8219687 8155719 7974491
8755 7974491 8480546 8537790 8834270 8999364 9300825 9388776 9122971 9659615 9883881 9899130
8745 9899130 10203154 10542975 10280037 10261961 11010033 11238377 11620903 11810326 11891976 12265113
$$ packed form
8815C826516j09274K98353p4739j35102J38387n37181l2576J87886L81496q5404
8805C858362j51851M04100L80491j56180j24105K20908K88142m09570L63608J74188
8795D848093J04573j72215J82363N5946l97755R6712J06341J25413K90862K6462
8785E266795J10316J99878N04223j57221j09576m8304j14243L19762K49580q08499
8775E412711J12641N11388M19427k65239L01026N3073P0234p2727l26088N82205
8765F798651N20673J64792J07111Q7607K93561j00552k36725N84569o3968j81228
8755G974491N06055N7244K96480J65094L01461Q7951k65805N36644K24266J5249
8745I899130L04024L39821k62938j8076P48072K28344L82526J89423Q1650L73137
$$ plain form
8735 12265113 12327665 12870129 13358255 13889583 14368925 14829955 14962819 15588192 16003160 16826966
8725 16826966 17318177 17709259 18634553 19871165 20421340 20966462 21665287 22616673 23169537
8716 23169537 24492951 25899027 27057375 28363119 30248104 32296170 34376277 36674090
8708 36674090 39058136 41234757 43738479 46715431 50361441 53854984 58282351 63118066
8700 63118066 67980255 72830060 77506059 81264505 83520523 84313916 83600773 81779386
8692 81779386 78157556 73885885 69998105 66582894 63546923 60996254 58341255 56338163
8684 56338163 54177028 51637134 49909336 48559845 47088771 46568651 46015038 45554376 45500987
8675 45500987 44893558 45628934 46404586 47339019 48803549 50842937 53033959 55012395 57294890
$$ packed form
8735A2265113O2552N42464M88126N31328M79342M61030J32864O25373M14968Q23806
8725A6826966M91211L91082R25294J236612N50175N45122O98825R51386N52864
8716B3169537J323414J406076J158348J305744J884985K048066K080107K297813
8708C6674090K384046K176621K503722K976952L646010L493543M427367M835715
8700F3118066M862189M849805M675999L758446K256018P93393p13143j821387
8692H1779386l621830m271671l887780l415211l035971k550669k654999k003092
8684E6338163k161135k539894j727798j349491j471074n20120n53613m60662n3389
8675D5500987o07429P35376P75652R34433J464530K039388K191022J978436K282495
$$ plain form
8666 57294890 60211386 62336765 64999729 68360804 71240916 74149019 76147824 77555746
8658 77555746 78320053 77530385 75215431 71495913 67627904 62644655 57505467 53180745
8650 53180745 48932799 45405107 42413411 40058265 37700362 35634587 33813877 31875699
8642 31875699 30373434 29355442 27507182 26178098 24818247 23631465 23120457 22990801
8634 22990801 22450162 21566481 21030890 20867153 20673288 20739717 20787875 20728854 20624725 20071172
8624 20071172 19588911 19644536 19519093 19358989 18542998 17776502 17171082 16270327 15424178 15122009
8614 15122009 14234710 13235095 12329949 11951334 11649159 11094525 10443236 10216503 9921717
8605 9921717 9488315 9073035 8901691 8625120 8526153 8143793 7475841 7328919 7262490 7267643
$$ packed form
8666E7294890K916496K125379K662964L361075K880112K908103J998805J407922
8658G7555746P64307p89668k314954l719518l868009m983249n139188m324722
8650E3180745m247946l527692k991696k355146k357903k065775j820710j938178
8642C1875699j502265j017992j848260j329084j359851j186782n11008j29656
8634B2990801n40639q83681n35591j63737j93865O6429M8158n9021j04129n53553
8624B0071172m82261N5625j25443j60104q15991p66496o05420r00755q46149l02169
8614A5122009q87299r99615r05146l78615l02175n54634o51289k26733k94786
8605I921717m33402m15280j71344k76571r8967l82360o67952j46922o6429N153
$$ plain form
8595 7267643 6901717 6515711 6674374 6390700 6185348 6356183 6116090 6038296 5542132 5261879
8585 5261879 5440170 5586648 5246763 4973878 4571319 4494237 4958956 4946251 4940142 5617848
8575 5617848 5071050 3981858 3399876 2916310 3144560 3409462 3604143 3923318 4084432
8566 4084432 3935605 3250507 3327980 3795575 3347143 2779185 2361085 2207346 2627340 2879324
8556 2879324 2864724 2877818 2524994 2687439 2684335 2813888 2529519 2443042 2332176 2149667
8546 2149667 2159156 2239751 2420946 2768924 2448695 2154037 2166606 1791025 1852577 1513716
8536 1513716 1524304 1590215 1595432 1981620 1875790 1573071 1175135 1053389 1478018 1500861
8526 1500861 1420435 1097626 1164953 1016515 1216412 1036351 800199 827812 727305 1127834
$$ packed form
8595G267643l65926l86006J58663k83674k05352J70835k40093p7794m96164k80253
8585E261879J78291J46478l39885k72885m02559p7082M64719j2705o109O77706
8575E617848n46798j089192n81982m83566K28250K64902J94681L19175J61114
8566D084432j48827o85098P7473M67595m48432n67958m18100j53739M19994K51984
8556B879324j4600J3094l52824J62445l104J29553k84369q6477j10866j82509
8546B149667R489Q0595J81195L47978l20229k94658J2569l75581O1552l38861
8536A513716J0588O5911N217L86188j05830l02719l97936j21746M24629K2843
8526A500861q0426l22809O7327j48438J99897j80061k36152K7613j00507M00529
$$ plain form
8516 1127834 1128970 1018838 1441553 1199529 1006800 641608 980774 956434 1028083 790762
8506 790762 407374 637445 596791 748012 1016060 1321207 1090806 1344179 1113080 761931
8496 761931 528397 337493 461153 494040 228002 477622 898999 893213 545302 277970
8486 277970 228845 581724 477291 469361 530229 407496 628332 625364 726655 536508 889479
8475 889479 505255 185626 417278 537544 423058 426117 272947 16302 120710 36966
8465 36966 653212 546088 139406 533336 274900 404161 442981 274370 287177 387851
8455 387851 698379 415427 174385 291185 442124 666909 233615 126866 217527 274107
8445 274107 125199 89047 290267 -342501 -163921 475878 342776 145176 242815 86665
$$ packed form
8516A127834J136j10132M22715k42024j92729l65192L39166k4340P1649k37321
8506G90762l83388K30071m0654J51221K68048L05147k30401K53373k31099l51149
8496G61931k33534j90904J23660L2887k66038K49620M21377n786l47911k67332
8486B77970m9125L52879j04433p930O0868j22733K20836k968J01291j90147L52971
8475H89479l84224l19629K31652J20266j14486L059j53170k56645J04408q3744
8465C6966O16246j07124m06682L93930k58436J29261L8820j68611J2807J00674
8455C87851L10528k82952k41042J16800J50939K24785m33294j06749R0661N6580
8445B74107j48908l6152K01220o32768J78580O39799j33102j97600R7639j56150
$$ plain form
8435 86665 -186690 150519 477049 398164 331903 205209 215064 311212 424943 243780 77819
8424 77819 82055 29548 -142969 -184644 152751 49015 203416 187033 255023 607383 637877
8413 637877 700137 312629 97749 -128499 -202684 -88543 -3807 81982 -121011 92269
8403 92269 479754 174062 49945 286414 57316 216910 334903 110926 140128 5900
8393 5900 38829 -213853 -301267 -140070 64970 -319892 -433805 -209439 36378 168300
8383 168300 -122485 -398973 -607583 -343104 -20025 -1327 236190 216 -11365 118532
8373 118532 -257652 -196872 -11842 184455 -171460 -344595 -142096 -150634 -172260 -150154 -124713
8362 -124713 16849 20387 -102743 19320 -169511 122386 325618 296300 119099 -351493
$$ packed form
8435H6665k73355L37209L26530p8885o6261j26694R855R6148J13731j81163j65961
8424G7819M236n2507j72517m1675L37395j03736J54401j6383O7990L52360L0494
8413F37877O2260l87508k14880k26248p4185J14141Q4736Q5789k02993K13280
8403I2269L87485l05692j24117K36469k29098J59594J17993k23977K9202j34228
8393E900L2929k52682q7414J61197K05040l84862j13913K24366K45817J31922
8383A68300k90785k76488k08610K64479L23079J8698K37517k35974j1581J29897
8373A18532l76184O0780J85030J96297l55915j73135K02499q538k1626K2106K5441
8362a24713J41562L538j23130J22063j88831K91897K03232k9318j77201m70592
$$ plain form
8352 -351493 -294732 -146589 -12655 30524 196329 129212 82345 228612 252869 10754 -219708
8341 -219708 185302 174079 114966 19997 -89973 54329 366694 153568 282474 658878
8331 658878 498091 421661 575099 635725 622657 313735 240064 -8516 -97796 -61579 -191281
8320 -191281 -111684 31429 -188348 -210983 86093 46700 88936 -82920 136948 383765
8310 383765 217843 402788 -192147 -330800 21313 408735 240587 140787 210748 118656
8300 118656 246727 316706 244936 76424 -212968 -316297 -142812 -99851 263051 -177621
8290 -177621 -237632 -92171 115190 -71571 -332395 -171772 -493068 -477460 -254868 -234919
8280 -234919 -13796 -399705 -589470 -167238 139246 -166752 324047 -314511 -303109 -328325
$$ packed form
8352c51493N6761J48143J33934M3179J65805o7117m6867J46267K4257k42115k30462
8341b19708M05010j1223n9113r4969j09970J44302L12365k13126J28906L76404
8331F58878j60787p6430J53438O0626j3068l08922p3671k48580q9280L6217j29702
8320a91281P9597J43113k19777k2635K97076l9393M2236j71856K19868K46817
8310C83765j65922J84945n94935j38653L52113L87422j68148r9800O9961r2092
8300A18656J28071O9979p1770j68512k89392j03329J73485M2961L62902m40672
8290a77621o0011J45461K07361j86761k60824J60623l21296J5608K22592J9949
8280b34919K21123l85909j89765M22232L06484l05998M90799o38558J1402k5216
$$ plain form
8270 -328325 -81596 44881 136667 -72823 152227 -43830 -231746 94509 73509 212915
8260 212915 -277268 -380962 -11746 -265697 -385726 -163715 -666037 -458845 -609556 -451090
8250 -451090 -712526 -664342 -728123 -545725 -244269 -35188 -29774 -70457 20173 -13826 78272
8239 78272 -35121 -159674 133604 -96691 -242688 -403787 -525904 -234583 -524760 -421056
8229 -421056 -94091 -171905 -13785 -470886 -446081 -201687 -214849 -342128 -392764 -470586 -589185
8218 -589185 -53728 61619 -268120 -239496 -349956 -350377 -363045 -576103 -311717 -828614 -931376
8207 -931376 -645723 -377479 -390726 -144932 -548034 -595867 -336790 -253872 -410327 -556999
8197 -556999 -540708 -203491 -657532 -840929 -1794904 -970622 957513 -111514 -486334 -864142
$$ packed form
8270c28325K46729J26477R1786k09490K25050j96057j87916L26255k1000J39406
8260B12915m90183j03694L69216k53951j20029K22011n02322K07192j50711J58466
8250d51090k61436M8184o3781J82398L01456K09081N414m0683R0630l3999R2098
8239G8272j13393j24553K93278k30295j45997j61099j22117K91321k90177J03704
8229d21056L26965p7814J58120m57101K4805K44394j3162j27279n0636p7822j18599
8218e89185N35457J15347l29739K8624j10460m21j2668k13058K64386n16897j02762
8207i31376K85653K68244j3247K45794m03102m7833K59077Q2918j56455j46672
8197e56999J6291L37217m54041j83397r53975Q24282J928135j069027l74820l77808
$$ plain form
8187 -864142 -643942 -247359 -243366 -244822 63975 -227531 -255170 -627564 -812597 -617932 -722854
8176 -722854 -371151 -383956 -148248 3798 -354225 -65011 -462452 -623119 -598931 -359726
8166 -359726 -209035 -43517 154327 -364792 -156865 -317257 -159965 212754 -46563 -453442
8156 -453442 -671757 -358407 -242508 -202210 -346431 52852 -64934 -385897 -469937 -428154
8146 -428154 -338813 -351195 -385626 -457265 122906 -17275 295020 267696 -32769 -336153 -187573
8135 -187573 -506878 -564496 -316986 -105830 -444417 -411227 -490711 -463066 -338366 -353010 -66083
8124 -66083 13637 -185288 -272485 -273664 -390267 -179107 -307899 -152652 -9230 -7623 -244650
8113 -244650 -153104 -325764 -121944 -286021 -59020 -23516 -232951 -332722 -473486 -901683
$$ packed form
8187h64142K20200L96583L993j456L08797k91506k7639l72394j85033J94665j04922
8176g22854L51703j2805K35708J52046l58023K89214l97441j60667K4188K39205
8166c59726J50691J65518J97844n19119K07927j60392J57292L72719k59317m06879
8156d53442k18315L13350J15899M0298j44221L99283j17786l20963q4040M1783
8146d28154Q9341j2382l4431p1639N80171j40181L12295k7324l00465l03384J48580
8135a87573l19305n7618K47510K11156l38587L3190p9484K7645J24700j4644K86927
8124f6083P9720j98925q7197j179j16603K11160j28792J55247J43422J607k37027
8113b44650R1546j72660K03820j64077K27001L5504k09435r9771j40764m28197
$$ plain form
8103 -901683 -662728 -253385 41004 -44835 -464836 -208448 250270 -157560 -289016 -181571
8093 -181571 -217131 -614961 -614000 -294840 -214107 42479 -179041 -588603 -407644 -661502 -1017362
8082 -1017362 -765722 -251716 -467005 -303621 -275436 -253907 -441075 -517726 -532358 -605046
8072 -605046 -517172 -779035 -213009 -224135 -183052 -353767 -329602 -348547 -473725 -526483 -322299
8061 -322299 -355124 -422947 -689321 -405187 -87619 -366381 -589134 -16968 -48059 -297432
8051 -297432 -117819 160085 184592 275829 21127 7143 -268860 -446079 -387170 -451869 -105407
8040 -105407 100211 82435 -279573 -220783 -235348 -610032 -573293 -404154 -532730 -113223
8030 -113223 53895 -170254 60103 242470 -220063 -373444 -511560 -657418 -172293 -538
$$ packed form
8103i01683K38955M09343K94389q5839m20001K56388M58718m07830j31456J07445
8093a81571l5560l97830R61L19160Q0733K56586k21520m09562J80959k53858l55860
8082a017362K51640N14006k15289J63384K8185K1529j87168p6651j4632p2688
8072f05046Q7874k61863N66026j1126M1083j70715K4165j8945j25178n2758K04184
8061c22299l2825o7823k66374K84134L17568k78762k22753N72166l1091k49373
8051b97432J79613K77904K4507R1237k54702j3984k76003j77219N8909o4699L46462
8040a05407K05618j7776l62008N8790j4565l74684L6739J69139j28576M19507
8030a13223J67118k24149K30357J82367m62533j53381j38116j45858M85125J71755
$$ plain form
8020 -538 107266 -95300 -78081 -311993 -694155 -565850 -288274 190443 -145110 -412935
8010 -412935 -93366 -238866 -310062 -417544 -217975 -132300 -152909 -270120 -333918 -607969
8000 -607969 -782041 -513898 -322947 104588 37334 -231845 -581085 -517987 -220643 7086
7990 7086 -49446 -211817 -319923 -219600 -457967 -658346 -183218 27041 -64941 -10672 -164253
7979 -164253 -518428 -640711 -672173 -819728 -561469 -427599 -778411 -449857 -425682 -777340
7969 -777340 -745361 -543127 -530007 -257553 14550 177710 -56582 -210670 -38891 -366291
7959 -366291 -430127 -276191 -98426 -106270 -199105 -331300 -248854 -75112 -237798 -291618 -500686
7948 -500686 -359777 -790434 -909306 -572026 -544381 -300829 -321864 -867658 -804759 -571685
$$ packed form
8020e38J07804k02566J7219k33912l82162J28305K77576M78717l35553k67825
8010d12935L19569j45500p1196j07482J99569Q5675k0609j17211o3798k74051
8000f07969j74072K68143J90951M27535o7254k69179l49240O3098K97344K27729
7990G086n6532j62371j08106J00323k38367k00379M75128K10259r1982N4269j53581
7979a64253l54175j22283l1462j47555K58259J33870l50812L28554K4175l51658
7969g77340L1979K02234J3120K72454K72103J63160k34292j54088J71779l27400
7959c66291o3836J53936J77765p844r2835j32195Q2446J73742j62686n3820k09068
7948e00686J40909m30657j18872L37280K7645K43552k1035n45794O2899K33074
$$ plain form
7938 -571685 -248590 -255998 -488265 -662439 -649497 -21822 -309794 -390791 -198657 -135650 -235626
7927 -235626 -566169 -365773 -473845 -634503 -260299 -232675 -228639 -669201 -757184 -657297 -308806
7916 -308806 -331555 -436730 -869819 -868962 -911655 -401322 -214834 -354591 -382445 -496646 -548124
7905 -548124 -416318 -713087 -457712 -668523 -872306 -266976 114655 147526 50818 280083
7895 280083 -381291 -371289 -310874 -602500 -450216 245641 -213263 -718433 -557182 -385167
7885 -385167 -159650 -726981 -555754 -255787 -25391 164183 -420789 -299107 -475870 -636156
7875 -636156 -885568 -592508 -369823 -266166 -154126 -54585 257169 33332 -178762 -397837
7865 -397837 -545218 -421260 -724141 -540755 -158095 -294318 -208195 110003 217766 -364210
$$ packed form
7938e71685L23095p408k32267j74174J2942O27675k87972q0997J92134O3007r9976
7927b35626l30543K00396j08072j60658L74204K7624M036m40562q7983R9887L48491
7916c08806k2749j05175m33089Q57m2693N10333J86488j39757k7854j14201n1478
7905e48124J31806k96769K55375k10811k03783O05330L81631L2871r6708K29265
7895B80083o61374J0002O0415k91626J52284O95857m58904n05170J61251J72015
7885c85167K25517n67331J71227K99967K30396J89574n84972J21682j76763j60286
7875f36156k49412K93060K22685J03657J12040R9541L11754k23837k12094k19075
7865c97837j47381J23958l02881J83386L82660j36223Q6123L18198J07763n81976
$$ plain form
7855 -364210 -93209 378009 207231 -251792 -678219 -426878 -492666 -653405 -299389 7125
7845 7125 154765 -56033 281055 -134058 -271087 -688282 -511853 -376361 -58070 -100548
7835 -100548 -388715 -333030 -323673 65799 -255029 -630463 -577818 -347007 -220709 -208835 -393074
7824 -393074 -222187 -366192 -448790 -273111 151438 -15163 -42687 -105878 250011 75492
7814 75492 384894 -2951 -110918 -229798 225862 -703392 -1370275 -364693 -313764 72270
7804 72270 68125 -20797 -226668 -410776 -20890 -108912 -148531 -282482 -303500 -307470 16745
7793 16745 167167 -117709 -144354 110831 120478 -200423 -624900 -533643 285029 419835 354894
7782 354894 242583 243434 124480 344517 10605 -424117 -421751 -284072 -810032 -150497 -63949
$$ packed form
7855c64210K71001M71218j70778m59023m26427K51341o5788j60739L54016L06514
7845G125J47640k10798L37088m15113j37029m17195J76429J35492L18291m2478
7835a00548k88167N5685R357L89472l20828l75434N2645K30811J26298J1874j84239
7824c93074J70887j44005q2598J75679M24549j66601k7524o3191L55889j74519
7814G5492L09402l87845j07967j18880M55660r29254o66883J005582N0929L86034
7804G2270m145q8922k05871j84108L89886q8022l9619j33951k1018l970L24215
7793A6745J50422k84876k6645K55185R647l20901m24477R1257Q18672J34806o4941
7782C54894j12311Q51j18954K20037l33912m34722K366J37679n25960O59535Q6548
$$ plain form
7771 -63949 -433586 18581 227825 356212 407367 359138 -65826 147840 134303 -162800
7761 -162800 -296665 -430550 -601223 -362229 31766 313796 -19451 -68618 74411 -316454
7751 -316454 -366284 -108956 289480 657518 505839 259885 21625 -91516 101932 -343170
7741 -343170 -183607 -1129 65045 65944 -19355 -188101 -183236 -34389 136741 -218420 -328809
7730 -328809 -328810 -201309 -80094 -147560 -193730 -171631 -390675 -522688 -139613 -80611 52829
7719 52829 228151 -145576 -424809 -54649 9842 -20750 -44684 -581627 -380709 153034
7709 153034 296455 -142187 175780 145989 -242603 -81404 -17270 453291 150129 -122386
7699 -122386 -105317 -36857 -112814 -177939 -332253 -369370 4482 -44109 -114962 -268520 -869987
$$ packed form
7771f3949l69637M52167K09244J28387N1155m8229m24964K13666j3537k97103
7761a62800j33865j33885j70673K38994L93995K82030l33247m9167J43029l90865
7751c16454m9830K57328L98436L68038j51679k45954k38260j13141J93448m45102
7741c43170J59563J82478O6174Q99q5299j68746M865J48847J71130l55161j10389
7730c28809jJ27501J21215o7466m6170K2099k19044j32013L83075N9002J33440
7719E2829J75322l73727k79233L70160O4491l0592k3934n36943K00918N33743
7709A53034J43421m38642L17967k9791l88592J61199O4134M70561l03162k72515
7699a22386J7069O8460p5957o5125j54314l7117L73852m8591p0853j53558o01467
$$ plain form
7688 -869987 -283080 20791 -168550 47516 -74443 50774 -16435 -425363 -517218 -364745
7678 -364745 -157933 115837 -101633 -350317 228199 317443 276991 35071 -141034 208430
7668 208430 187202 -232557 -304413 -96471 18632 -30343 -185705 -264767 -108437 -205074 33085
7657 33085 343706 242985 73449 10722 254010 164432 -16333 -136147 31425 216866
7647 216866 195466 -412172 -475814 72082 279488 271203 83777 -176772 -173330 -23139 -275457
7636 -275457 -631657 -409287 -140387 -213402 -73131 -57936 -463790 -123878 -99947 -314237
7626 -314237 -484329 -196147 195969 58119 176614 355073 503684 167137 73234 -127520
7616 -127520 66853 301874 284113 203536 -191713 -248083 -216645 -267830 -300369 -182052 -89522
$$ packed form
7688h69987N86907L03871j89341K16066j21959J25217o7209m08928r1855J52473
7678c64745K06812K73770k17470k48684N78516Q9244m0452k41920j76105L49464
7668B08430k1228m19759p1856K07942J15103m8975j55362p9062J56330r6637K38159
7657C3085L10621j00721j69536o2727K43288q9578j80765j19814J67572J85441
7647B16866k1400o07638o3642N47896K07406q285j87426k60549L442J50191k52318
7636b75457l56200K22370K68900p3015J40271J5195m05854L39912K3931k14290
7626c14237j70092K88182L92116j37850J18495J78459J48611l36547r3903k00754
7616a27520J94373K35021j7761q0577l95249n6370L1438n1185l2539J18317R2530
$$ plain form
7605 -89522 87340 354281 162357 438248 153282 -216199 -82393 72453 91084 -29749
7595 -29749 -49799 61517 223023 30333 -342948 -509216 -178577 76087 -68586 435034
7585 435034 377690 -35667 2208 261589 162218 37184 381707 142313 -393659 -374437
7575 -374437 225804 159221 202324 49030 94448 155475 243321 492401 308676 270215 -32935
7564 -32935 -107014 84669 140373 229501 -185966 -249029 82234 57203 193411 578878 165559
7553 165559 -189116 -52861 -135591 159080 293394 368121 443257 177993 619392 525959
7543 525959 675398 409237 456780 835158 244495 39977 334630 394580 494323 812858
7533 812858 398135 232999 378648 201402 104766 213345 118270 352704 473097 159505
$$ packed form
7605h9522J76862K66941j91924K75891k84966l69481J33806J54846J8631j20833
7595b9749k0050J11316J61506j92690l73281j66268L30639K54664j44673N03620
7585D35034n7344m13357L7875K59381r9371j25034L44523k39394n35972J9222
7575c74437O00241o6583M3103j53294M5418O1027Q7846K49080j83725l8461l03150
7564c2935p4079J91683N5704Q9128m15467o3063L31263k5031J36208L85467m13319
7553A65559l54675J36255q2730K94671J34314P4727P5136k65264M41399r3433
7543E25959J49439k66161M7543L78378n90663k04518K94653N9950R9743L18535
7533H12858m14723j65136J45649j77246r6636J08579r5075K34434J20393l13592
$$ plain form
7523 159505 87942 372566 613974 611586 486909 505811 664490 730349 820148 676123 630257
7512 630257 616953 376175 281446 310251 399638 513429 420104 147485 349035 414860 570787
7501 570787 514980 689507 876700 785717 281395 607879 542273 575758 868710 409460
7491 409460 715145 982373 1049874 1141899 1183645 1123537 686471 468747 671756 1071001
7481 1071001 1289928 1012802 859894 992199 979890 1089078 890049 883701 1289726 1389377
7471 1389377 1077807 802827 842442 1160439 1230141 1511530 1476669 1239694 1278490 1266337
7461 1266337 920240 866155 1128019 1359407 1302371 1014336 1552071 1270254 1185474 1233699
7451 1233699 1599838 1376880 1278321 1663101 1584826 1519934 2033305 2607718 2588482 2226185
$$ packed form
7523A59505p1563K84624K41408k388j24677J8902J58679O5859Q9799j44025m5866
7512F30257j3304k40778r4729K8805Q9387J13791r3325k72619K01550O5825J55927
7501E70787n5807J74527J87193r0983n04322L26484o5606L3485K92952m59250
7491D09460L05685K67228O7501R2025M1746o0108m37066k17724K03009L99245
7481A071001K18927k77126j52908J32305j2309J09188j99029o348M06025R9651
7471A389377l11570k74980L9615L17997O9702K81389l4861k36975L8796j2153
7461A266337l46097n4085K61864K31388n7036k88035N37735k81817q4780M8225
7451A233699L66139k22958r8559L84780p8275o4892N13371N74413j9236l62297
$$ plain form
7441 2226185 2355963 2110161 2261080 2344250 1754905 2033614 2344888 2479746 2453106 2491334
7431 2491334 2956220 3378188 3383693 3139578 3368095 3183266 3004220 2975377 2964481 3146271
7421 3146271 3324488 3330448 3556300 3054036 3164434 3445442 3379384 3994973 4218222 4305082
7411 4305082 3938871 3929481 4293198 4466882 4073859 4188785 4850251 4977539 5140703 5649802
7401 5649802 5643603 5494492 5852260 5730446 5734639 6338266 6435275 6748099 7087827 7559742
7391 7559742 7388165 7910445 8415518 8484999 8667638 9293046 9761256 9872604 10327571 10967190
7381 10967190 11580526 11603101 12186150 12997497 13527867 14490833 15350429 16067600 16963515 18736590
7371 18736590 20364197 21686204 23486773 25235368 26955260 29236872 31190817 33869460
$$ packed form
7441B226185J29778k45802J50919Q3170n89345K78709L11274J34858k6640L8228
7431B491334M64886M21968N505k44115K28517j84829j79046k8843j0896J81790
7421C146271J78217N960K25852n02264J10398K81008o6058O15589K23249Q6860
7411D305082l66211r390L63717J73684l93023J14926O61466J27288J63164N09099
7401E649802o199j49111L57768j21814M193O03627R7009L12824L39728M71915
7391G559742j71577N22280N05073O9481J82639O25408M68210J11348M54967O39619
7381A0967190O13336K2575N83049Q11347N30370R62966Q59596P17171Q95915J773075
7371A8736590J627607J322007J800569J748595J719892K281612J953945K678643
$$ plain form
7363 33869460 37299381 41290740 45676497 50492670 56537544 62699442 69446363 75991782
7355 75991782 81766609 84315108 83033746 77924975 70606154 62308321 54798425 48176736
7347 48176736 42920966 38612387 35153554 32779686 31147278 29538060 27717469 26279989
7339 26279989 25204987 24345147 23015564 21267278 19418495 18096087 17249742 16250224 15078768
7330 15078768 14002750 12996655 12177639 11484496 11365422 10563590 9988548 9350793 8903496
7321 8903496 8823317 8455090 8285184 7982011 7797516 7876964 7498374 6953683 6692811 6492343
7311 6492343 6082213 5713175 5313403 5230571 4851410 4616446 4612498 4290569 4201715 4792105
7301 4792105 4303463 3786508 3811045 3812454 4095208 3730228 3533070 3127296 3132804 3376946
$$ packed form
7363C3869460L429921L991359M385757M816173O044874O161898O746921O545419
7355G5991782N774827K548499j281362n108771p318821q297833p509896o621689
7347D8176736n255770m308579l458833k373868j632408j609218j820591j437480
7339B6279989j075002q59840j329583j748286j848783j322408q46345r99518j171456
7330A5078768j076018j006095q19016o93143j19074q01832n75042o37755m47297
7321H903496q0179l68227j69906l03173j84495P9448l78590n44691k60872k00468
7311F492343m10130l69038l99772q2832l79161k34964l948l21929q8854N90390
7301D792105m88642n16955K4537J409K82754l64980j97158m05774N508K44142
$$ plain form
7291 3376946 3054189 2962235 3041153 2975241 2923803 2675397 2922275 2779796 2629118 2738258
7281 2738258 2856969 2583430 2550975 2682764 2717632 2588742 2316906 2356553 2242039 1921784
7271 1921784 1852132 2148906 2294559 2056714 2123799 2071230 2063914 1928093 1886647 2372344 2190244
7260 2190244 1917311 1872960 1706197 1449763 1442668 1295884 1331965 1438255 944979 972577
7250 972577 1485948 1142252 1151893 1131465 1422268 1307157 1456325 1689368 1521583 1239488
7240 1239488 1092380 940047 951658 997402 1243917 1336150 898402 1274443 1410642 1473174
7230 1473174 1281000 850322 587573 781540 977468 968472 1057015 556520 434154 552986
7220 552986 892880 1087942 819425 1240563 1097691 1195679 1536444 968405 974284 646832
$$ packed form
7291C376946l22757r1954P8918o5912n1438k48406K46878j42479j50678J09140
7281B738258J18711k73539l2455J31789L4868j28890k71836L9647j14514l20255
7271A921784o9652K96774J45653k37845O7085n2569p316j35821m1446M85697j82100
7260B190244k72933m4351j66763k56434p095j46784L6081J06290m93276K7598
7250I72577N13371l43696R641k0428K90803j15111J49168K33043j67785k82095
7240A239488j47108j52333J1611M5744K46515R2233m37748L76041J36199O2532
7230A473174j92174m30678k62749J93967J95928q996Q8543n00495j22366J18832
7220E52986L39894J95062k68517M21138j42872R7988L40765n68039N879l27452
$$ plain form
7210 646832 981976 1083355 749853 750690 524972 392416 188712 413561 911696 1041653
7200 1041653 858127 929657 842314 710765 509640 321205 402498 5642 -346810 -40863
7190 -40863 572265 446192 387067 511262 892261 1002965 762875 829393 425514 415136
7180 415136 786189 813275 544154 591135 89125 114407 407921 759768 371589 487969
7170 487969 604989 840673 636850 472031 463404 545421 518263 471090 235435 212345 410237
7159 410237 500713 223708 -15153 486778 709037 597613 808907 1030290 749929 545048
7149 545048 573822 820367 529165 324958 309846 400264 591163 833470 892069 509951
7139 509951 369051 495847 610581 827099 972949 828445 645874 613999 855063 814647
$$ packed form
7210F46832L35144J01379l33502Q37k25718j32556k03704K24849M98135J29957
7200A041653j83526P1530q7343j31549k01125j88435Q1293l96856l52452L05947
7190d0863O13128j26073n9125J24195L80999J10704k40090O6518m03879j0378
7180D15136L71053K7086k69121M6981n02010K5282K93514L51847l88179J16380
7170D87969J17020K35684k03823j64819q627Q2017k7158m7173k35655k3090J97892
7159D10237R0476k77005k38861N01931K22259j11424K11294K21383k80361k04881
7149E45048K8774K46545k91202k04207j5112R0418J90899K42307N8599l82118
7139E09951j40900J26796J14734K16518J45850j44504j82571l1875K41064m0416
$$ plain form
7129 814647 759507 566384 507235 436663 633457 636706 457936 445219 415456 699542 531548
7118 531548 588820 298755 90157 256098 849675 584447 332828 156232 128054 -63012
7108 -63012 -134960 -101541 171500 -27786 67018 247228 152350 325873 563804 904794 747700
7097 747700 823716 527170 582649 629991 935113 462881 287188 679609 201728 209494 437204
7086 437204 478507 233387 142601 107715 325682 769986 307521 -56182 80206 154378
7076 154378 272432 91609 529108 105754 -131062 153284 347656 350015 569311 593364
7066 593364 271684 599695 896236 1023956 901573 436394 94732 590102 666438 341101
7056 341101 421268 476244 188972 318656 356149 26077 483896 693796 743435 546388
$$ packed form
7129H14647n5140j93123n9149p0572J96794L249j78770j2717k9763K84086j67994
7118E31548N7272k90065k08598J65941N93577k65228k51619j76596k8178j91066
7108f3012p1948L3419K73041j99286R4804J80210r4878J73523K37931L40990j57094
7097G47700P6016k96546N5479M7342L05122m72232j75693L92421m77881P766K27710
7086D37204M1303k45120r0786l4886K17967M44304m62465l63703J36388P4172
7076A54378J18054j80823M37499m23354k36816K84346J94372K359K19296K4053
7066E93364l21680L28011K96541J27720j22383m65179l41662M95370P6336l25337
7056C41101Q0167N4976k87272J29684L7493l30072M57819K09900M9639j97047
$$ plain form
7046 546388 147173 165790 720783 703362 639954 485884 441290 521607 212689 203729 152042
7035 152042 175764 271809 101104 -44616 265616 37003 -63863 435826 739297 455380
7025 455380 173247 240991 737379 664018 220625 488643 634301 566714 348782 178156
7015 178156 541733 571914 464915 836301 673743 403583 307132 560240 895379 696460
7005 696460 357834 131851 81082 311892 376667 467616 653720 446878 573582 753434
6995 753434 410606 531305 658679 539784 298507 345167 593693 314612 609253 1041249
6985 1041249 774485 307618 -4382 87449 770896 499306 312298 318743 271841 271393 121994
6974 121994 167322 339286 627804 684558 362723 492599 568298 746130 755023 998491 771092
$$ packed form
7046E46388l99215J8617N54993j7421o3408j54070m4594Q0317l08918q960n1687
7035A52042K3722R6045j70705j45720L10232k28613j00866M99689L03471k83917
7025D55380k82133O7744M96388p3361m43393K68018J45658o7587k17932j70626
7015A78156L63577L0181j06999L71386j62558k70160r6451K53108L35139j98919
7005F96460l38626k25983n0769K30810O4775R0949J86104k06842J26704J79852
6995G53434l42828J20699J27374j18895k41277M6660K48526k79081K94641M31996
6985A041249k66764m66867l12000R1831O83447k71590j87008O445m6902m48j49399
6974A21994M5328J71964K88518N6754l21835J29876P5699J77832Q893K43468k27399
$$ plain form
6963 771092 556346 227360 254094 663499 784677 846385 1021146 1078041 1061966 1173363
6953 1173363 881701 1042290 898257 731414 672115 849829 837871 972274 839420 681851
6943 681851 647914 452658 457073 457666 770857 757066 689642 409370 181928 -56612 619695
6932 619695 976218 977673 671738 618624 910997 800877 771619 710038 701038 1056288 529350
6921 529350 501806 669609 108516 164836 38735 288685 333383 604520 517647 634817
6911 634817 803676 728160 560986 369124 458410 439268 552228 403623 412895 451160 111755
6900 111755 20336 298854 134770 355184 643851 117272 304304 9404 312502 628989
6890 628989 836290 532214 501347 236997 314850 395865 213632 433380 421408 462388 381688
$$ packed form
6963G71092k14746l28986K6734M09405J21178O1708J74761N6895j6075J11397
6953A173363k91662J60589j44033j66843n9299J77714j1958J34403j32854j57569
6943F81851l3937j95256M415N93L13191j3791o7424k80272k27442k38540O76307
6932F19695L56523J455l05935n3114K92373j10120k9258o1581r000L55250n26938
6921E29350k7544J67803n61093N6320j26101K49950M4698K71137q6873J17170
6911F34817J68859p5516j67174j91862Q9286j9142J12960j48605R272L8265l39405
6900A11755r1419K78518j64084K20414K88667n26579J87032k94900L03098L16487
6890F28989K07301l04076l0867k64350P7853Q1015j82233K19748j1972M0980q0700
$$ plain form
6879 381688 832512 875294 764545 712186 700826 993991 923455 675799 514775 330126
6869 330126 541419 651755 667282 438399 852422 961197 1131651 852375 956530 1029546
6859 1029546 821139 1234305 1514159 875342 472198 900618 694696 758396 784570 775999
6849 775999 575973 617834 875930 1221817 894723 823122 1086228 1012480 917815 1087405
6839 1087405 952222 726740 1042520 891170 666574 902565 860740 826654 943002 1259610
6829 1259610 809930 853781 1245121 1357371 1180682 975229 967445 813010 791769 886579
6819 886579 595588 904881 1078480 953495 1186645 1183509 1092188 902807 1175326 917329
6809 917329 673220 1054682 1107419 1112776 1209881 906260 1203606 1234885 1202168 1458500 1113466
$$ packed form
6879C81688M50824M2782j10749n2359j1360K93165p0536k47656j61024j84649
6869C30126K11293J10336J5527k28883M14023J08775J70454k79276J04155P3016
6859A029546k08407M13166K79854o38817m03144M28420k05922O3700K6174q571
6849G75999k00026M1861K58096L45887l27094p1601K63106p3748r4665J69590
6839A087405j35183k25482L15780j51350k24596K35991m1825l4086J16348L16608
6829A259610m49680M3851L91340J12250j76689k05453p784j54435k1241R4810
6819H86579k90991L09293J73599j24985K33150l136r1321j89381K72519k57997
6809I17329k44109L81462N2737N357R7105l03621K97346L1279l2717K56332l45034
$$ plain form
6798 1113466 680694 744234 1066805 1159300 1398047 1605021 1288360 1052414 1090973 1313992
6788 1313992 1272782 1027164 1071075 1148048 1232500 1201689 1221827 1312625 1250810 837292 785981
6777 785981 1538466 1331877 993718 891185 1153524 1377508 1347413 992609 736319 858409
6767 858409 614987 766618 836710 870561 882049 898349 811976 1024374 1028714 944576 1471737
6756 1471737 1182786 926938 1016223 1090476 1026178 715366 613283 822910 783095 835792
6746 835792 1107891 1213002 1382271 1342132 964808 947251 1164992 1413483 1641254 1492276
6736 1492276 1578924 1601385 958357 908151 1396983 1374485 1452041 1294563 1257320 1509722 1557944
6725 1557944 1639978 1303225 1290105 1153633 1173210 1329080 1717312 1993059 1756488 1836005
$$ packed form
6798A113466m32772O3540L22571R2495K38747K06974l16661k35946L8559K23019
6788A313992m1210k45618M3911P6973Q4452l0811K0138R0798o1815m13518n1311
6777G85981P52485k06589l38159j02533K62339K23984l0095l54804k56290J22090
6767H58409k43422J51631P0092L3851J1488J6300q6373K12398M340q4138N27161
6756A471737k88951k55848Q9285P4253o4298l10812j02083K09627l9815N2697
6746H35792K72099J05111J69269m0139l77324j7557K17741K48491K27771j48978
6736A492276Q6648K2461o43028n0206M88832k2498P7556j57478l7243K52402M8222
6725A557944Q2034l36753j3120j36472J9577J55870L88232K75747k36571P9517
$$ plain form
6715 1836005 1887341 1953718 2246600 1681229 1266128 1328810 1307672 1025807 1338679 1476740
6705 1476740 1443592 1439151 1605157 1229353 1093944 1247742 1367468 1591004 1597320 1430975
6695 1430975 1245881 1335943 1639410 1990540 1881649 1854737 1856647 1904249 2191891 1800349
6685 1800349 1549274 1669403 1586662 1812119 2121465 2103832 1978220 1693575 1886360 2108516
6675 2108516 1848183 1878590 2137926 1997451 1516309 1486474 1456648 1828714 1946635 1941864
6665 1941864 1785367 1966783 1977325 2042975 2350764 2525192 2220935 2236992 1916233 1993786
6655 1993786 1906750 1550727 1669896 2020984 2293572 2097782 1936160 2322663 2239049 2066446
6645 2066446 1716967 1966891 2092413 2520129 2417027 1922407 1997861 2514695 2235592 2176906
$$ packed form
6715A836005N1336O6377K92882n65371m15101O2682k1138k81865L12872J38061
6705A476740l3148m441J66006l75804j35409J53798J19726K23536O316j66345
6695A430975j85094R0062L03467L51130j08891k6912J910M7602K87642l91542
6685A800349k51075J20129q2741K25457L09346j7633j25612k84645J92785K22156
6675B108516k60333L0407K59336j40475m81142k9835k9826L72066J17921m771
6665A941864j56497J81416J0542O5650L07789J74428l04257J6057l20759P7553
6655A993786q7036l56023J19169L51088K72588j95790j61622L86503q3614j72603
6645B066446l49479K49924J25522M27716j03102m94620P5454N16834k79103n8686
$$ plain form
6635 2176906 2462904 2105874 2598014 2530950 2213276 2287649 2332367 2296586 2343879 2724888
6625 2724888 2654763 2882351 2806496 2392618 2421454 2854275 2726381 2640753 2623003 2636813 2959883
6614 2959883 3201105 3284320 2630065 2917997 2935121 2439511 2607084 3245339 2993632 2770225
6604 2770225 2888271 3088424 2940610 3138062 3080270 2997350 3406847 3722578 3579558 3864427
6594 3864427 3525589 3202580 3316881 3374834 3354323 3248233 3407265 3490788 3283280 3045528
6584 3045528 3070809 3254401 3475191 3357147 3309805 3696737 3601154 3467362 3756106 3758231
6574 3758231 3544704 3226327 3516536 3846996 3719118 4126550 4088274 4017373 4082990 3554327
6564 3554327 3609530 3490031 3537742 3936507 3723062 3937065 3900391 3531954 3653606 3823735
$$ packed form
6635B176906K85998l57030M92140o7064l17674P4373M4718l5781M7293L81009
6625B724888p0125K27588p5855m13878K8836M32821j27894q5628j7750J3810L23070
6614B959883K41222Q3215o54255K87932J7124m95610J67573O38255k51707k23407
6604B770225J18046K00153j47814J97452n7792q2920M09497L15731j43020K84869
6594C864427l38838l23009J14301N7953k0511j06090J59032Q3523k07508k37752
6584C045528K5281J83592K20790j18044m7342L86932r5583j33792K88744K125
6574C758231k13527l18377K90209L30460j27878M07432l8276p0901O5617n28663
6564C554327N5203j19499M7711L98765k13445K14003l6674l68437J21652J70129
$$ plain form
6554 3823735 4186879 4407346 3744624 3277785 3538116 3977793 4048363 4307386 4596266 4031108
6544 4031108 4068423 4587509 4844843 4908447 4781670 4430903 4653316 4435243 4431990 4205260
6534 4205260 4631022 4549176 4368001 4821562 4439849 4784823 4566342 4384880 4739182 4834820
6524 4834820 5230073 5360223 4904493 4784231 4642460 4914052 5194378 5311092 5350729 5078138
6514 5078138 5188902 4989183 5247885 5401559 5096784 5688019 5879713 6187590 6099701 6229179
6504 6229179 6105845 6235280 6014593 5405436 5579114 5913475 6289878 6349158 6393424 6019220
6494 6019220 5706745 5594936 5893894 5939648 6133070 6307668 6058593 6274583 6594377 6727951
6484 6727951 6742932 7012883 6724306 6769267 6817474 6648696 7129571 7119495 6801287 6854132
$$ packed form
6554C823735L63144K20467o62722m66839K60331M39677P0570K59023K88880n65158
6544D031108L7315N19086K57334O3604j26777l50767K22413k18073l253k26730
6534D205260M25762q1846j81175M53561l81713L44974k18481j81462L54302R5638
6524D834820L95253J30150m55730j20262j41771K71592K80326J16714L9637k72591
6514E078138J10764j99719K58702J53674l04775N91235J91694L07877q7889J29478
6504F229179j23334J29435k20687o09157J73678L34361L76403N9280M4266l74204
6494F019220l12475j11809K98958M5754J93422J74598k49075K15990L19794J33574
6484F727951J4981K69951k88577M4961M8207j68778M80875j0076l18208N2845
$$ plain form
6474 6854132 7301644 6919873 6772561 6876126 7401691 7335100 7060963 7284726 7355486 7615647
6464 7615647 7705379 7787873 7960169 7659266 7456246 7984034 8326837 8516820 8531818 8373845
6454 8373845 8249518 8172741 8083030 8228230 8294473 8322316 8091213 8314566 8221633 8443741
6444 8443741 8565223 8959267 9314703 9380982 9494148 9722445 9724985 9577437 9370614 9701458
6434 9701458 9669845 9358512 9450330 9769113 10239602 10272850 9966298 10131726 10660133 10362950
6424 10362950 9920133 10064244 10250639 10367523 10828316 11047905 10932265 10961307 11150761 11167149
6414 11167149 11337369 11318990 11787859 11770308 11776163 11369443 11511612 11672781 12384520 12413588
6404 12413588 12345275 12491082 12660368 12569360 12860488 13286127 13288825 13097362 13100112 13758048
$$ packed form
6474F854132M47512l81771j47312J03565N25565o6591k74137K23763P0760K60161
6464G615647Q9732Q2494J72296l00903k03020N27788L42803J89983J4998j57973
6454H373845j24327p6777q9711J45200O6243K7843k31103K23353r2933K22108
6444H443741J21482L94044L55436O6279J13166K28297K540j47548k06823L30844
6434I701458l1613l11333R1818L18783M70489L3248l06552J65428N28407k97183
6424A0362950m42817J44111J86395J16884M60793K19589j15640K9042J89454J6388
6414A1167149J70220j8379M68869j7551N855m06720J42169J61169P11739K9068
6404A2413588o8313J45807J69286r1008K91128M25639K698j91463K750O57936
$$ plain form
6394 13758048 14283946 14167512 13919182 13916857 14141098 14490130 14543652 14657012 15076305 15372815
6384 15372815 15227246 15164743 15732162 15726629 15600146 15724075 15791207 15787291 15993858 16681128
6374 16681128 16562846 16801461 17246400 17148024 17192863 17682591 17820225 17886520 17845536 18043468
6364 18043468 18466919 18631541 18435788 18885260 18997383 18997238 19370303 19862952 20088860 19983348
6354 19983348 20018456 20150490 20771212 21180457 21351021 21469537 21768700 21918084 22206302 22560684
6344 22560684 22723393 23304257 23383524 23363625 23813160 24235362 24498605 25161784 25296588 25576306
6334 25576306 25343665 25828545 26376490 26739334 27011174 27274890 27820198 28206211 28465597
6325 28465597 28655477 29035308 29402095 30150888 30678961 30949736 31210833 31376073 31579920
$$ packed form
6394A3758048N25898j16434k48330k325K24241L49032N3522J13360M19293K96510
6384A5372815j45569o2503N67419n533j26483J23929O7132l916K06567O87270
6374A6681128j18282K38615M44939r8376M4839M89728J37634O6295m0984J97932
6364A8043468M23451J64622j95753M49472J12123j45L73065M92649K25908j05512
6354A9983348L5108J32034O20722M09245J70564J18516K99163J49384K88218L54382
6344B2560684J62709N80864P9267j9899M49535M22202K63243O63179J34804K79718
6334B5576306k32641M84880N47945L62844K71840K63716N45308L86013K59386
6325B8465597J89880L79831L66787P48793N28073K70775K61097J65240K03847
$$ plain form
6316 31579920 32110551 32692239 33109148 33548569 34200008 34825899 35162740 35286462 35688810
6307 35688810 36075247 36959599 37474745 38277057 38864209 39195804 40275192 40842873 41291007
6298 41291007 41973885 42361598 43131434 44153430 44775028 45378156 46054147 47098751 48236611
6289 48236611 48556231 49457382 50304449 51213537 52124384 53229475 54303446 55261430 56356547
6280 56356547 56983032 58101160 58996154 59840381 61168127 62738497 63763443 64893811 66212374
6271 66212374 67290773 68668371 70154278 71764301 73050178 74451030 76140429 77760423
6263 77760423 79070490 80759505 82664386 84336103 85969258 87795447 89901823 91476283
6255 91476283 93443995 95414683 97579315 99638505 102092490 104516894 106356226 109132684
$$ packed form
6316C1579920N30631N81688M16909M39421O51439O25891L36841J23722M02348
6307C5688810L86437Q84352N15146Q02312N87152L31595J079388N67681M48134
6298D1291007O82878L87713P69836J021996O21598O03128O75991J044604J137860
6289D8236611L19620R01151Q47067R09088R10847J105091J073971R57984J095117
6280E6356547O26485J118128Q94994Q44227J327746J570370J024946J130368J318563
6271F6212374J078399J377598J485907J610023J285877J400852J689399J619994
6263G7760423J310067J689015J904881J671717J633155J826189K106376J574460
6255I1476283J967712J970688K164632K059190K453985K424404J839332K776458
$$ plain form
6247 109132684 112012338 114413305 117202113 119778193 122225080 125383541 128371033 130786914
6239 130786914 134011710 137659984 141020822 144209874 147737506 151349561 154918293 158087929
6231 158087929 162154760 166404004 170498645 175151522 179750521 184351277 189008486 193571857
6223 193571857 198512901 203592807 208532020 214108318 220168021 226436985 232593566 238591926
6215 238591926 244503147 250659081 257557377 264705530 271619907 278962023 286276530 293604146
6207 293604146 300727098 308043856 315605526 323414054 331215849 338236809 345560763 353233203
6199 353233203 360078898 366431535 372979221 379268805 385261671 390806666 395788671 400613525
6191 400613525 404747594 407836174 410717579 412505143 414318137 415379317 415218496 414778103
$$ packed form
6247A09132684K879654K400967K788808K576080K446887L158461K987492K415881
6239A30786914L224796L648274L360838L189052L527632L612055L568732L169636
6231A58087929M066831M249244M094641M652877M598999M600756M657209M563371
6223A93571857M941044N079906M939213N576298O059703O268964O156581N998360
6215B38591926N911221O155934O898296P148153O914377P342116P314507P327616
6207B93604146P122952P316758P561670P808528P801795P020960P323954P672440
6199C53233203O845695O352637O547686O289584N992866N544995M982005M824854
6191D00613525M134069L088580K881405J787564J812994J061180j60821m40393
$$ plain form
6183 414778103 413542388 412222175 409824170 407000077 403685848 399821465 395375549 390677668
6175 390677668 385646642 379548073 373868291 367664958 360678018 353623555 346281982 338878146
6167 338878146 331604101 325008275 317410863 309527598 301980660 294795038 287295604 280376250
6159 280376250 273346973 266621704 259438390 252528978 245818533 239334532 233312849 227066490
6151 227066490 221150363 215474749 209701359 204289635 199040818 193807698 188609606 183634556
6143 183634556 179149471 174551580 170154664 165961186 162065643 158323098 154480593 149896989
6135 149896989 146464384 143468928 139996473 136541939 133651582 130463201 127629695 124657922
6127 124657922 122111189 118949151 116000150 113897501 111631439 109153508 106564652 104323492
$$ packed form
6183D14778103j235715j320213k398005k824093l314229l864383m445916m697881
6175C90677668n031026o098569n679782o203333o986940p054463p341573p403836
6167C38878146p274045o595826p597412p883265p546938p185622p499434o919354
6159B80376250p029277o725269p183314o909412o710445o484001o021683o246359
6151B27066490n916127n675614n773390n411724n248817n233120n198092m975050
6143A83634556m485085m597891m396916m193478l895543l742545l842505m583604
6135A49896989l432605k995456l472455l454534k890357l188381k833506k971773
6127A24657922k546733l162038k949001k102649k266062k477931k588856k241160
$$ plain form
6119 104323492 102058502 100129042 98455627 96351883 94263808 92351921 90306797 88660565
6111 88660565 86918565 85030275 83142239 81717738 79869949 78307204 77023311 75865756
6103 75865756 74313416 72689578 71606318 70645632 69147049 67383199 66091605 65177973
6095 65177973 63945835 63110579 61792119 60798328 59665463 58464042 57877733 57038820 55997985
6086 55997985 55126633 54188612 52814692 51890564 51074988 50481605 49656995 48914764 48309840
6077 48309840 47335992 46988055 46877181 46076511 45291943 45138267 44948116 43715116 42442872
6068 42442872 42155124 41871131 41156052 40601753 40211217 39702932 39495578 38966166 38292936
6059 38292936 37791085 37227337 36634440 36379905 36127289 35745333 35457979 34853365 34625653
$$ packed form
6119A04323492k264990j929460j673415k103744k088075j911887k045124j646232
6111H8660565j742000j888290j888036j424501j847789j562745j283893j157555
6103G5865756j552340j623838j083260r60686j498583j763850j291594r13632
6095F5177973j232138q35256j318460r93791j132865j201421n86309q38913j040835
6086E5997985q71352r38021j373920r24128q15576n93383q24610p42231o04924
6077D8309840r73848l47937j10874q00670p84568j53676j90151j233000j272244
6068D2442872k87748k83993p15079n54299l90536n08285k07354n29412o73230
6059C8292936n01851n63748n92897k54535k52616l81956k87354o04614k27712
$$ plain form
6050 34625653 34568977 34009479 33444999 33459427 32704450 32613015 32241331 32301974 31882051 31463698
6040 31463698 31590851 31141171 30657673 30757072 30561971 30426013 29646106 29827298 30198103 30071753
6030 30071753 30150119 30126183 30293048 30252327 30194347 29819747 29781484 29705241 29483554 29833886
6020 29833886 29964612 29924668 30030838 30127844 30215763 30442316 30519920 30718868 30784032 30830222
6010 30830222 30941195 31086076 31515678 31587277 31515223 31660021 32298478 32729571 32804670 32763849
6000 32763849 33212222 33681113 34197845 34461507 34700911 34844149 35260907 35833597 35880151 36017332
5990 36017332 35795902 35799698 36038485 36463518 36993288 37152830 36819978 37277122 37583093 37794056
5980 37794056 37992638 37934316 38110866 38123029 38109913 38176589 38280013 38335817 38865702 38670110
$$ packed form
6050C4625653n6676n59498n64480J4428p54977r1435l71684O0643m19923m18353
6040C1463698J27153m49680m83498R9399j95101j35958p79907J81192L70805j26350
6030C0071753P8366k3936J66865m0721n7980l74600l8263p6243k21687L50332
6020B9833886J30726l9944J06170R7006Q7919K26553P7604J98948O5164M6190
6010C0830222J10973J44881M29602P1599p2054J44798O38457M31093P5099m0821
6000C2763849M48373M68891N16732K63662K39404J43238M16758N72690M6554J37181
5990C6017332k21430L796K38787M25033N29770J59542l32852M57144L05971K10963
5980C7794056J98582n8322J76550J2163j3116O6676J03424N5804N29885j95592
$$ plain form
5970 38670110 38323855 38391450 39004393 39019389 39248837 39640957 40222667 39792684 39672284 39520817
5960 39520817 39580354 39627251 40107458 40285662 40197702 39736408 39862384 39986040 39654321 39456171
5950 39456171 39363010 39427264 39044522 39200066 39793969 39902448 39693506 39871232 40099836 40642767
5940 40642767 40454461 40594631 40816021 40695268 40429520 40376051 40495162 40461548 40591681 40769259
5930 40769259 40625336 40919440 40648168 40863925 41242074 41504326 41819692 42373632 42934309
5921 42934309 42934565 42950017 43180111 43769858 44734878 45461363 46020007 47071643 48296886 49609783
5911 49609783 51451797 53012201 54410055 56588804 59174715 61554304 64299974 67441300
5903 67441300 70348734 73779114 77210178 79959733 82862202 85978536 88262199 89355673
$$ packed form
5970C8670110l46255O7595O12943J4996K29448L92120N81710m29983j20400j51467
5960C9520817N9537M6897M80207J78204q7960m61294J25976J23656l31719j98150
5950C9456171r3161O4254l82742J55544N93903J08479k08942J77726K28604N42931
5940D0642767j88306J40170K21390j20753k65748n3469J19111l3614J30133J77578
5930D0769259j43923K94104k71272K15757L78149K62252L15366N53940N60677
5921D2934309K56J5452K30094N89747R65020P26485N58644J051636J225243J312897
5911D9609783J842014J560404J397854K178749K585911K379589K745670L141326
5903F7441300K907434L430380L431064K749555K902469L116334K283663J093474
$$ plain form
5895 89355673 89309284 89430653 88133781 86488282 84576176 82377459 79674732 77541061 75506042
5886 75506042 73426064 72126210 71320309 70031907 69678892 69417469 68824997 68471158 68310146
5877 68310146 68162154 67941386 67038046 65984080 64882632 63262384 61188404 58831607 57078794
5868 57078794 55027760 52252977 50076102 47958920 45468019 43605025 41928669 40194888
5860 40194888 38279782 36766363 35242836 34111608 32731789 31678913 30507206 30033001
5852 30033001 29181757 28700787 27710602 27122075 26692702 26067847 25474413 24850044 24067513
5843 24067513 23218804 22583520 22673144 22499908 21667989 20527557 20288013 20063228 19430219
5834 19430219 18976263 19069495 18803096 17910453 17902320 18124141 17572555 16819208 16511079 16644247
$$ packed form
5895H9355673m6389J21369j296872j645499j912106k198717k702727k133671k035019
5886G5506042k079978j299854q05901j288402l53015k61423n92472l53839j61012
5877F8310146j47992k20768r03340j053966j101448j620248k073980k356797j752813
5868E7078794k051034k774783k176875k117182k490901j862994j676356j733781
5860D0194888j915106j513419j523527j131228j379819j052876j171707m74205
5852C0033001q51244m80970r90185n88527m29373o24855n93434o24369p82531
5843B4067513q48709o35284Q9624j73236q31919j140432k39544k24785o33009
5834A9430219m53956R3232k66399q92643q133K21821n51586p53347l08129J33168
$$ plain form
5824 16644247 16443313 16228637 15597595 15188180 14861773 14630680 14406421 14179047 14036920
5815 14036920 14056273 13954102 13917005 13554776 13205339 13151789 12764734 13034245 12825184 12856669
5805 12856669 12710998 12258544 11818493 11869768 11556873 11377750 11576632 11325527 11345601 11110085
5795 11110085 10716989 10454828 10411231 10185520 9956139 10025364 9937431 9751349 9436619 9528224
5785 9528224 9654653 9659787 9171859 8704582 8996002 8893183 9042972 9207778 8745718 8723796
5775 8723796 8568073 8277598 7632711 7914737 7964660 8050474 8213839 7863712 7557656 7376941
5765 7376941 7401773 7342133 7358652 7603886 7223392 6694152 6899736 6605755 6673795 6940354
5755 6940354 6966699 6944931 6746957 6700289 6455141 6766634 6842761 6856631 6858041 6469763 6668736
$$ packed form
5824A6644247k00934k14676o31042m09415l26407k31093k24259k27374j42127
5815A4036920J9353j02171l7097l62229l49437n3550l87055K69511k09061L1485
5805A2856669j45671m52454m40051N1275l12895j79123J98882k51105K0074k35516
5795A1110085l93096k62161m3597k25711k29381O9225q7933j86082l14730R1605
5785I528224J26429N134m87928m67277K91420j02819J49789J64806m62060k1922
5775H723796j55723k90475o44887K82026M9923Q5814J63365l50127l06056j80715
5765G376941K4832n9640J6519K45234l80494n29240K05584k93981O8040K66559
5755F940354K6345k1768j97974m6668k45148L11493P6127J3870J410l88278J98973
$$ plain form
5744 6668736 6474087 5925421 6144021 5899793 5925205 6223009 5911956 5642691 5554484 5339414
5734 5339414 5518582 5376227 4927118 4949953 5375159 5375127 5002136 4719356 5306342 5041480
5724 5041480 4829396 5106705 5332359 5297845 5023089 4959846 5460921 5201449 5035018 5107885
5714 5107885 5004371 4841641 4854188 5208031 4891957 4967305 5139010 5002118 4855277 4773751
5704 4773751 5299948 4984711 4583201 4576510 4418088 4267395 3688105 3975879 4249454 4564336
5694 4564336 4670753 4561906 4441528 4739546 4961457 4561579 4462689 4512380 4077652 4346622
5684 4346622 4236996 4381947 3991503 4216141 4389659 4264583 4247443 4515926 4646416 4234157
5674 4234157 4166853 3841032 4138101 4430436 3923982 3930380 4079963 4237909 4100497 4167652
$$ packed form
5744F668736j94649n48666K18600k44228K5412K97804l11053k69265q8207k15070
5734E339414J79168j42355m49109K2835M25206l2l72991k82780N86986k64862
5724E041480k12084K77309K25654l4514k74756o3243N01075k59472j66431P2867
5714E107885j03514j62730J2547L53843l16074P5348J71705j36892j46841q1526
5704D773751N26197l15237m01510o691j58422j50693n79290K87774K73575L14882
5694D564336J06417j08847j20378K98018K21911l99878r8890M9691m34728K68970
5684D346622j09626J44951l90444K24638J73518j25076j7140K68483J30490m12259
5674D234157o7304l25821K97069K92335n06454O398J49583J57946j37412O7155
$$ plain form
5664 4167652 4192543 3859945 3948123 4351839 4082865 4032773 4336755 4260615 4086539 4046992
5654 4046992 3815919 3711424 4113206 3874595 3558508 3727395 3652202 3788078 4129067 3827419
5644 3827419 3897049 3782645 4216075 3889906 4021005 4071598 4023486 4379577 4259357 4284412
5634 4284412 4284400 4280484 4276705 4329918 4052132 3809491 3917641 3668902 3830266 3911115 3862962
5623 3862962 3954176 4192664 4290712 3916417 4083977 4329300 4222221 4183169 4432921 4079610
5613 4079610 4206856 4268135 4333067 4243170 4165184 3946643 4211994 4597076 3992227 4098664
5603 4098664 4116351 3925457 4164226 4232857 3879517 3721838 3694867 3548965 3690764 3623404
5593 3623404 3601890 4019173 3957871 3997539 4255913 3982479 3900923 3716186 3896953 3778891
$$ packed form
5664D167652K4891l32598Q8178M03716k68974n0092L03982p6140j74076l9547
5654D046992k31073j04495M01782k38611l16087J68887p5193J35876L40989l01648
5644C827419O9630j14404M33430l26169J31099N0593m8112L56091j20220K5055
5634D284412j2l916l779N3213k77786k42641J08150k48739J61364Q0849m8153
5623C862962R1214K38488R8048l74295J67560K45323j07079l9052K49752l53311
5613D079610J27246O1279O4932q9897p7986k18541K65351L85082o04849J06437
5603D098664J7687j90894K38769O8631l53340j57679k6971j45902J41799o7360
5593C623404k1514M17283o1302L9668K58374k73434q1556j84737J80767j18062
$$ plain form
5583 3778891 3479881 3247857 3416517 4137810 3880902 3910797 4149141 4261130 4153502 3692187
5573 3692187 3711391 3790425 3679549 3682325 3600758 3424976 3730081 3911708 3811739 4003358 4336669
5562 4336669 4391933 4382438 4049393 4334452 4580586 4167986 4089018 4067553 4076174 4267276 4320251
5551 4320251 4466477 4234379 3996394 4054578 4165252 4048619 3817723 3890973 3871442 3805744
5541 3805744 3499776 3752491 4411805 4079003 3897182 4002304 4023316 3852896 3821576 3717094
5531 3717094 3589447 3602957 3503777 3565165 3627242 4113682 3897612 3750457 3736155 3431053
5521 3431053 3508445 3587931 3244398 3197805 3506994 3686421 3672316 3888645 4112123 4075972
5511 4075972 3706526 3694419 3939127 4057221 3843093 3496179 3357817 3451181 3640797 3395203
$$ packed form
5583C778891k99010k32024J68660P21293k56908K9895K38344J11989j07628m61315
5573C692187J9204P9034j10876K776q1567j75782L05105J81627r9969J91619L33311
5562D336669N5264r495l33045K85059K46134m12600p8968k1465Q621J91102N2975
5551D320251J46226k32098k37985N8184J10674j16633k30896P3250j9531o5698
5541C805744l05968K52715O59314l32802j81821J05122K1012j70420l1320j04482
5531C717094j27647J3510r9180O1388O2077M86440k16070j47155j4302l05102
5521C431053P7392P9486l43533m6593L09189J79427j4105K16329K23478l6151
5511D075972l69446j2107K44708J18094k14128l46914j38362R3364J89616k45594
$$ plain form
5501 3395203 3237636 3673713 3632114 3709679 3446168 2964504 3003663 3325094 3546438 3495742
5491 3495742 3512545 3653826 3876767 3828395 3292954 3305198 3471084 3665642 3618130 3634341
5481 3634341 3634825 3532337 3746557 3686995 3600950 3549119 3488417 3639527 3347156 3225332 3518503
5470 3518503 3706347 3728704 3840119 3242621 3202694 3451060 3115942 3358328 3190108 3309682
5460 3309682 3303708 3180997 3615345 3566312 3558086 3887998 3696045 3740452 3984995 3922524 3847659
5449 3847659 3898264 4021009 3611020 3599971 3938216 3858982 3960908 4232810 4259052 3853187
5439 3853187 4102468 4089357 4099034 4076689 4137515 4217888 4214252 3708568 3420942 3977287 3971693
5428 3971693 4013284 3875612 3712151 4341459 3912559 3911923 3925549 3200593 3131987 3539705 3403728
$$ packed form
5501C395203j57567M36077m1599P7565k63511m81664L9159L21431K21344n0696
5491C495742J6803J41281K22941m8372n35441J2244J65886J94558m7512J6211
5481C634341M84j02488K14220n9562q6045n1831o0702J51110k92371j21824K93171
5470C518503J87844K2357J11415n97498l9927K48366l35118K42386j68220J19574
5460C309682n974j22711M34348m9033q226L29912j91953M4407K44543o2471p4865
5449C847659N0605J22745m09989j1049L38245p9234J01926K71902K6242m05865
5439C853187K49281j3111R677k2345O0826Q0373l636n05684k87626N56345n594
5428C971693M1591j37672j63461O29308m28900o36J3626p24956o8606M07718j35977
$$ plain form
5417 3403728 3171923 3341926 3193968 3250181 3422934 3345681 3148288 3283652 3375882 3551904
5407 3551904 3764534 3647628 3494008 3454457 3042891 2855379 3213841 3154021 3113951 3037857
5397 3037857 3266960 3696626 4074851 3613811 3744458 3484497 3295200 3519630 3079603 3085188
5387 3085188 3573332 3826331 2835061 3083415 3221302 3411650 3275755 2981695 3314211 3287460
5377 3287460 3286270 2807442 2457051 3227470 3121510 3121509 3123454 3287219 3616536 3223610 3171543
5366 3171543 2969264 2591337 2830424 3039142 3448478 3603860 3583252 3546017 3505682 3615350
5356 3615350 3301399 3500112 3404041 3493201 3574060 3499596 3083283 3351047 3424069 3371318 3269131
5345 3269131 3417041 2875317 3347066 3885443 3531585 3142676 2760878 2978813 3401736 3441464
$$ packed form
5417C403728k31805J70003j47958N6213J72753p7253j97393J35364R2230J76022
5407C551904K12630j16906j53620l9551m11566j87512L58462n9820m0070p6094
5397C037857K29103M29666L78225m61040J30647k59961j89297K24430m40027N585
5387C085188M88144K52999r91270K48354J37887J90348j35895k94060L32516k6751
5377C287460j190m78828l50391P70419j05960jJ945J63765L29317l92926n2067
5366C171543k02279l77927K39087K08718M09336J55382k0608l7235m0335J09668
5356C615350l13951J98713r6071Q9160Q0859p4464m16313K67764P3022n2751j02187
5345C269131J47910n41724M71749N38377l53858l88909l81798K17935M22923L9728
$$ plain form
5335 3441464 3637359 3874159 3416743 3228640 3146355 3541349 3768906 3607074 3449757 3343927
5325 3343927 3239005 3436965 3094773 3090274 3483259 3706978 3579130 3801715 3604271 3729792
5315 3729792 3751870 3865596 3853952 3742385 3784851 3711522 3753459 3740579 3806949 3783774 3941854
5304 3941854 3955405 3666066 3518862 3807513 3894459 4196459 4368037 4345133 4433574 4561666
5294 4561666 4274489 3960247 4143050 4119307 4150829 4495142 4441961 3811531 3697955 4002249
5284 4002249 3795579 4039318 4238585 4568896 4466872 4463515 4522099 4153001 3986841 4288828
5274 4288828 4369477 3933655 3566137 3692531 3871051 3912626 3826707 3867263 3952618 4069425
5264 4069425 4035916 4081172 4144325 4024023 4366886 4274878 4051707 3768559 4055845 4060106 3887627
$$ packed form
5335C441464J95895K36800m57416j88103q2285L94994K27557j61832j57317j05830
5325C343927j04922J97960l42192m499L92985K23719j27848K22585j97444J25521
5315C729792K2078J13726j1644j11567M2466p3329M1937j2880O6370k3175J58080
5304C941854J3551k89339j47204K88651Q6946L02000J71578k2904Q8441J28092
5294D561666k87177l14242J82803k3743L1522L44313n3181o30430j13576L04294
5284D002249k06670K43739J99267L30311j02024l357N8584l69098j66160L01987
5274D288828Q0649m35822l67518J26394J78520M1575q5919M0556Q5355J16807
5264D069425l3509M5256O3153j20302L42863r2008k23171k83148K87286M261j72479
$$ plain form
5253 3887627 3808756 3886079 3983800 4208296 4222158 4245106 4483685 4242450 4634648 4459868
5243 4459868 4046164 4059025 3297082 3787597 3953069 3808547 4006529 3873982 4114952 3617481
5233 3617481 3265041 3360915 3213475 3569077 3610784 3651402 3665476 3134679 2965360 3054846
5223 3054846 3348060 3741507 3539445 3190615 2933956 2996005 3493187 3735865 3931702 3615986
5213 3615986 3261017 2914118 2729298 3261548 3036225 3049318 3047922 3375831 3375709 2898694 3135781
5202 3135781 2745806 3012840 3251114 3018506 3015529 3431083 3477102 3358239 3414542 2805341
5192 2805341 2707110 3122170 3405485 2892816 2985776 3589482 3187761 2936386 2920378 3158986
5182 3158986 3369385 2937779 2686512 2829291 2942278 2837052 2768546 2927982 3360043 3041546
$$ packed form
5253C887627p8871P7323R7721K24496J3862K2948K38579k41235L92198j74780
5243D459868m13704J2861p61943M90515J65472j44522J97982j32547K40970m97471
5233C617481l52440R5874j47440L55602M1707M0618J4074n30797j69319Q9486
5223C054846K93214L93447k02062l48830k56659O2049M97182K42678J95837l15716
5213C615986l54969l46899j84820N32250k25323J3093j396L27909j22m77015K37087
5202C135781l89975K67034K38274k32608k977M15554M6019j18863N6303o09201
5192B805341r8231M15060K83315n12669R2960O03706m01721k51375j6008K38608
5182C158986K10399m31606k51267J42779J12987j05226o8506J59436M32061l18497
$$ plain form
5172 3041546 3057739 3158236 3132736 3400101 3376104 3015824 3135710 3167438 3399181 3134031
5162 3134031 3079023 3198601 3290400 3300527 3017003 3099446 3514561 3475963 3175512 3026833
5152 3026833 2962813 3713017 3327880 3309862 3230670 3271068 3077867 2771628 3160193 3447800
5142 3447800 3050161 3556915 3243449 2938570 2940009 2881649 3280577 3220999 3315770 3616808
5132 3616808 3430365 3415973 3263782 3265713 3210675 3195188 3053365 3216691 3036781 2890686
5122 2890686 3171379 2959954 3132897 3355080 2827063 3167480 3308745 3046182 3103907 3104719
5112 3104719 3482006 3472554 3245623 3289144 3234215 3016503 3289248 2738125 3002204 3625665
5102 3625665 3574438 3405253 3043086 3029472 2836689 2913977 3006411 3268526 3456496 3429754
$$ packed form
5172C041546J6193J00497k5500K67365k3997l60280J19886L1728K31743k65150
5162C134031n5008J19578R1799J0127k83524Q2443M15115l8598l00451j48679
5152C026833o4020P50204l85137j8018p9192M0398j93201l06239L88565K87607
5142C447800l97639N06754l13466l04879J439n8360L98928n9578R4771L01038
5132C616808j86443j4392j52191J931n5038j5487j41823J63326j79910j46095
5122B890686K80693k11425J72943K22183n28017L40417J41265k62563N7725Q12
5112C104719L77287r452k26931M3521n4929k17712K72745n51123K64079O23461
5102C625665n1227j69185l62167j3614j92783P7288R2434K62115J87970k6742
$$ plain form
5092 3429754 3563676 3667411 3774279 4090686 3787758 3425244 3241853 3502334 3611270 3491510
5082 3491510 3841968 3504132 3551217 3781344 3840528 3620252 3686287 3705783 3666145 3761287 3761412
5071 3761412 3596517 3783776 3694123 3700519 4069746 4343721 4334468 4155750 4160805 3875432 3982137
5060 3982137 4193993 4201929 3852083 3813749 4161355 4266156 4311140 4131563 4094339 3804384
5050 3804384 4247984 4086827 4601565 4347963 4201986 4158992 4494166 4646439 4546837 4461068
5040 4461068 4408109 4615215 4638985 4769729 4472456 4622201 4568653 4556298 4700552 4913442
5030 4913442 5290164 5024178 4827545 5092260 5306895 5567094 5141630 5713877 5789859 5598078
5020 5598078 5662530 5249787 5529892 5948271 6123098 6058629 5875055 5941140 6033515 6210308
$$ packed form
5092C429754J33922J03735J06868L16407l02928l62514j83391K60481J08936j19760
5082C491510L50458l37836M7085K30127N9184k20276O6035J9496l9638R5142J25
5071C761412j64895J87259q9653O396L69227K73975r253j78718N055k85373J06705
5060C982137K11856P936l49846l8334L47606J04801M4984j79577l7224k89955
5050C804384M43600j61157N14738k53602j45977m2994L35174J52273r9602q5769
5040D461068n2959K07106K3770J30744k97273J49745n3548j2355J44254K12890
5030D913442L76722k65986j96633K64715K14635K60199m25464N72247P5982j91781
5020E598078O4452m12743K80105M18379J74827o4469j83574O6085R2375J76793
$$ plain form
5010 6210308 6558690 6767584 6523182 6589298 6798188 6939042 6894780 7247099 7257683 7234846
5000 7234846 7298469 7597341 7623879 7872206 8270829 8105292 8185252 8619124 9366776 9351568
4990 9351568 9292152 9639619 9665068 9369059 9459038 9914021 10580444 10711284 10525003 10703644
4980 10703644 10837371 10892456 11098500 11634360 11994415 12073413 12011237 11777658 12198791 12259677
4970 12259677 12405421 12327030 12025342 11970439 12035646 11706002 11797831 12193379 12201170 12511712
4960 12511712 12990752 12826596 12881743 12981967 12720758 12763851 12506853 12660933 13146563 13685735
4950 13685735 13780503 13544443 13842947 14556431 14949168 14963795 15028798 15316356 15582553 15719800
4940 15719800 15783557 16113566 16208823 16528425 16939855 17339832 18078600 18012674 17844814 18108878
$$ packed form
5010F210308L48382K08894k44402O6116K08890J40854m4262L52319J0584k2837
5000G234846O3623K98872K6538K48327L98623j65537P9960M33872P47652j5208
4990I351568n9416L47467K5449k96009Q9979M54983O66423J30840j86281J78641
4980A0703644J33727N5085K06044N35860L60055P8998o2176k33579M21133O0886
4970A2259677J45744p8391l01688n4903O5207l29644R1829L95548P791L10542
4960A2511712M79040j64156N5147J00224k61209M3093k56998J54080M85630N39172
4950A3685735R4768k36060K98504P13484L92737J4627O5003K87558K66197J37247
4940A5719800O3757L30009R5257L19602M11430L99977P38768o5926j67860K64064
$$ plain form
4930 18108878 18203918 18431313 18377543 18374794 18765071 18630620 18569256 18788493 18325227 18217452
4920 18217452 18300074 18451893 18321408 18196047 17686201 17346636 16986848 16935870 17287337 16942079
4910 16942079 16770956 16431063 16176549 16143729 16056028 15803348 15666054 15313556 15483179 15570905
4900 15570905 15475580 15466069 15515467 15547527 15460003 15635349 15698881 15853440 15502706 15487946 15101407
4889 15101407 15574912 15611420 15934501 15893151 15486691 15827525 15469655 15436946 15411371 15111316
4879 15111316 15109676 15116336 15010437 14984335 14503702 14349042 14568026 14226711 13583879 13116469
4869 13116469 12883728 12305799 12246400 12304444 11991665 11575827 11256778 11275896 10925300 10601392
4859 10601392 10036639 9457353 9369400 9517869 9156184 8683755 8321727 8438246 8827689 8262917
$$ packed form
4930A8108878R5040K27395n3770k749L90277j34451o1364K19237m63266j07775
4920A8217452Q2622J51819j30485j25361n09846l39565l59788n0978L51467l45258
4910A6942079j71123l39893k54514l2820q7701k52680j37294l52498J69623Q7726
4900A5570905r5325r511M9398L2060q7524J75346O3532J54559l50734j4760l86539
4889A5101407M73505L6508L23081m1350m06460L40834l57870l2709k5575l00055
4879A5111316j640O660j05899k6102m80633j54660K18984l41315o42832m67410
4869A3116469k32741n77929n9399N8044l12779m15838l19049J9118l50596l23908
4859A0601392n64753n79286q7953J48469l61685m72429l62028J16519L89443n64772
$$ plain form
4849 8262917 8284584 7649622 7519860 7811443 7812361 7086741 6787543 6730206 6494672 7243335
4839 7243335 7025845 6893507 6713090 6798295 6894156 6851925 6424783 6527905 6360312 6155648
4829 6155648 6402168 6396991 6234798 6359357 6192242 6107336 5880389 5832955 6086450 6353462
4819 6353462 6342338 6141922 5898789 6222455 6400220 6637615 6254384 6025659 6215943 6605449
4809 6605449 6306630 6376779 6596694 6498645 6274808 6777882 7150276 6836050 6885735 7407935
4799 7407935 7244827 7064823 7383238 7520105 7971121 7719060 7538036 7907926 8220063 8411739
4789 8411739 8415332 8565807 9360262 9321440 9140908 9396378 9490443 9677661 10107038 10283390
4779 10283390 10382966 10134896 10694891 11002950 10840169 10880892 11386785 11404364 11540661 11711519
$$ packed form
4849H262917K1667o34962j29762K91583R18p25620k99198n7337k35534P48663
4839G243335k17490j32338j80417Q5205R5861m2231m27142J03122j67593k04664
4829F155648K46520n177j62193J24559j67115q4906k26947m7434K53495K67012
4819F353462j1124k00416k43133L23666J77765K37395l83231k28725J90284L89506
4809F605449k98819P0149K19915r8049k23837N03074L72394l14226M9685N22200
4799G407935j63108j80004L18415J36867M51016k52061j81024L69890L12137J91676
4789H411739L593J50475P94455l8822j80532K55470R4065J87218M29377J76352
4779A0283390R9576k48070N59995L08059j62781M0723N05893J7579J36297J70858
$$ plain form
4769 11711519 11956480 11737289 11729989 11785411 11866796 12050843 12034020 12412603 12015909 11942206
4759 11942206 12352539 12240813 12005708 11917100 12309494 12437188 12721521 12884435 13387680 13717095
4749 13717095 13802975 13980123 14602176 14595180 14091619 14443579 14662099 15057252 14981920 15587668
4739 15587668 16192865 16278604 16310268 16670020 16808985 16922744 17102229 17262901 17374530 17239173
4729 17239173 17171758 17236011 17343085 17543480 17586265 17326707 16527188 16936598 16826259 16814988
4719 16814988 16654129 15951504 15923626 15902542 16168204 15674235 15612426 15561855 15495235 15579566
4709 15579566 15557344 15441841 15498699 15663013 15294409 14770141 14536780 14832407 15165203 15372281
4699 15372281 15924284 15656298 15760073 15853212 15369924 15516931 15958018 15991115 16359088 16140009
$$ packed form
4769A1711519K44961k19191p300N5422Q1385J84047j6823L78583l96694p3703
4759A1942206M10333j11726k35105q8608L92394J27694K84333J62914N03245L29415
4749A3717095Q5880J77148O22053o996n03561L51960K18520L95153p5332O05748
4739A5587668O05197Q5739L1664L59752J38965J13759J79485J60672J11629j35357
4729A7239173o7415O4253J07074K00395M2785k59558p99519M09410j10339j1271
4719A6814988j60859p02625k7878k1084K65662m93969o1809n0571o6620Q4331
4709A5579566k2222j15503N6858J64314l68604n24268k33361K95627L32796K07078
4699A5372281N52003k67986J03775R3139m83288J47007M41087L3097L67973k19079
$$ plain form
4689 16140009 16142873 15832393 15456418 15641901 15740758 15999552 15796612 15378073 15311027 14840128
4679 14840128 14757678 14910870 14738621 14157627 13668554 13424131 13601451 13418835 12726783 12791397
4669 12791397 12183797 11840324 11779535 11519032 11018106 10506216 10088815 10032347 10067972 10126678
4659 10126678 9786033 9680649 9660976 9305319 9135173 9190370 8834917 8825685 8638784 9139421
4649 9139421 9051524 8723675 8582460 8401404 8874976 8923724 8598023 8417824 8157026 8309643
4639 8309643 8217365 8070005 7647940 7801725 7704482 7300108 7337748 7367097 7618979 6879018
4629 6879018 6876345 6810254 6712659 6435890 6480868 6306750 6200109 5935542 5815233 5839716 5787901
4618 5787901 5756797 5730497 5339714 5413404 5304512 5469508 5222811 5624943 5355608 5132903
$$ packed form
4689A6140009K864l10480l75975J85483R8857K58794k02940m18539o7046m70899
4679A4840128q2450J53192j72249n80994m89073k44423J77320j82616o92052O4614
4669A2791397o07600l43473o0789k60503n00926n11890m17401n6468L5625N8706
4659A0126678l40645j05384j9673l55657j70146N5197l55453r232j86901N00637
4649I139421q7897l27849j41215j81056M73572M8748l25701j80199k60798J52617
4639H309643r2278j47360m22065J53785r7243m04374L7640K9349K51882p39961
4629F879018k673o6091r7595k76769M4978j74118j06641k64567j20309K4483n1815
4618E787901l1104k6300l90783P3690j08892J64996k46697M02132k69335k22705
$$ plain form
4608 5132903 5334345 5496207 5386278 4852076 4511355 4460276 4808973 4987589 4931302 4938567
4598 4938567 4522447 4196089 4281749 4344433 4629898 4465101 4835230 4649089 4685758 4736762
4588 4736762 4177745 4046378 4294551 4381742 4789494 4429559 4530503 4780295 4727231 4510080
4578 4510080 4344239 4360049 4136418 3930553 3940538 4313558 4588851 4503447 4666540 4488485
4568 4488485 4434895 4339721 4556687 4418033 4408890 4330976 4263828 3908481 4288589 5041413 4790084
4557 4790084 4602979 4557408 4159384 4310227 4300450 4329298 4506209 4308789 4389109 4677169
4547 4677169 4694551 4893590 4953375 4995631 5076192 4870306 4741593 5068160 5324459 5572276
4537 5572276 5381887 5056841 5290547 5205299 5157531 5231057 5056714 5467655 5340377 4946584
$$ packed form
4608E132903K01442J61862j09929n34202l40721n1079L48697J78616n6287P265
4598D938567m16120l26358Q5660O2684K85465j64797L70129j86141L6669N1004
4588D736762n59017j31367K48173Q7191M07752l59935J00944K49792n3064k17151
4578D510080j65841J5810k23631k05865R985L73020K75293q5404J63093j78055
4568D488485n3590r5174K16966j38654r143p7914o7148l55347L80108P52824k51329
4557D790084j87105m5571l98024J50843r777K8848J76911j97420Q0320K88060
4547D677169J7382J99039N9785M2256Q0561k05886j28713L26567K56299K47817
4537E572276j90389l25046K33706q5248m7768P3526j74343M10941j27278l93793
$$ plain form
4527 4946584 4912527 5301184 5375941 5536291 5679840 5361106 5627494 5630191 5388705 5558852
4517 5558852 5647852 5784960 6215784 5913542 6242115 6418755 6353383 6361518 6425658 6126739
4507 6126739 6370582 6582369 6826042 6825824 7209749 7117455 7044610 6922207 7037664 7402528
4497 7402528 7800406 8110377 8131460 8047135 8328174 8326194 8131209 8206283 8756955 9080342
4487 9080342 8773073 8847304 8993559 8652143 8482027 8999088 9144145 9209031 9407818 9491041
4477 9491041 9626459 9772307 9818294 10083862 10086105 10272511 10751711 10963329 11088610 10844644
4467 10844644 10711652 10961539 11346166 11190618 11316332 12079493 12045783 12222206 12337088 12262431
4457 12262431 12387011 12802111 12810979 13033352 13243774 13189046 13338448 13898125 14029743 13989230
$$ packed form
4527D946584l4057L88657P4757J60350J43549l18734K66388K697k41486J70147
4517E558852Q9000J37108M30824l02242L28573J76640o5372Q135O4140k98919
4507F126739K43843K11787K43673k18L83925r2294p2845j22403J15457L64864
4497G402528L97878L09971K1083q4325K81039j980j94985P5074N50672L23387
4487I080342l07269P4231J46255l41416j70116N17061J45057O4886J98787Q3223
4477I491041J35418J45848M5987K65568K243J86406M79200K11618J25281k43966
4467A0844644j32992K49887L84627j55548J25714P63161l3710J76423J14882p4657
4457A2262431J24580M15100Q868K22373K10422n4728J49402N59677J31618m0513
$$ plain form
4447 13989230 14277981 14619314 14900974 15100976 15446418 15617206 15857986 16101156 16604536
4438 16604536 16838018 17481398 17864293 18025497 18476378 19273093 20031399 19946126 20812279 21712772
4428 21712772 22120116 22589408 23594082 24199229 24518162 25338287 25934114 26549476 27224038
4419 27224038 28270987 29613411 30905698 31816973 33434906 34961845 36665856 38554410
4411 38554410 40366408 42544964 45155282 48240386 51464479 55223212 59661766 64619842
4403 64619842 70183012 76387955 83715861 91926263 100462701 107980160 113966060 119435401
4395 119435401 125362530 131911404 140311151 150482184 160754446 169579362 175701695 178729779
4387 178729779 180201272 181779924 185274241 191357174 198083125 204150551 206087053 202606972
$$ packed form
4447A3989230K88751L41333K81660K00002L45442J70788K40780K43170N03380
4438A6604536K33482O43380L82895J61204M50881P96715P58306q5273Q66153R00493
4428B1712772M07344M69292J004674O05147L18933Q20125N95827O15362O74562
4419B7224038J046949J342424J292287R11275J617933J526939J704011J888554
4411C8554410J811998K178556K610318L085104L224093L758733M438554M958076
4403F4619842N563170O204943P327906Q210402Q536438P517459N985900N469341
4395A19435401N927129O548874Q399747J0171033J0272262Q824916O122333L028084
4387A78729779J471493J578652L494317O082933O725951O067426J936502l480081
$$ plain form
4379 202606972 195755790 187841601 180883271 175633568 172868624 170337612 166527525 160167598
4371 160167598 150687466 140280302 130261502 121769326 114828026 109109222 103667393 97979592
4363 97979592 90680748 82992652 75347670 68437647 62984772 58004031 53688678 50268368
4355 50268368 46973072 43948611 42086569 40116911 37908511 35958463 34362562 33644668
4347 33644668 32444152 31272228 30195136 29004259 27983900 27342606 26458424 25743138 24712102
4338 24712102 24244023 23495284 23057128 22744807 22073753 21642582 21101945 20960601 20465319
4329 20465319 19992487 19699815 19645253 19581470 19235608 18838795 18558823 18170332 17928295 18028427
4319 18028427 18172735 17700356 17586538 17537352 16996657 17169890 17279029 17062808 17117955 16726602
$$ packed form
4379B02606972o851182p914189o958330n249703k764944k531012l810087o359927
4371A60167598r480132j0407164j0018800q492176o941300n718804n441829n687801
4363I7979592p298844p688096p644982o910023n452875m980741m315353l420310
4355E0268368l295296l024461j862042j969658k208400j950048j595901p17894
4347C3644668j200516j171924j077092j190877j020359o41294q84182p15286j031036
4338B4712102m68079p48739m38156l12321o71054m31171n40637j41344m95282
4329B0465319m72832k92672n4562o3783l45862l96813k79972l88491k42037J00132
4319A8028427J44308m72379j13818m9186n40695J73233J09139k16221N5147l91353
$$ plain form
4309 16726602 16721975 16789546 16672193 16616554 16848834 16732348 17016491 17186499 16748356 17078770
4299 17078770 16684690 16968366 17386562 17404236 17479767 17246151 17286292 17636739 17495717 17158295
4289 17158295 17660091 18029032 17579224 17657251 17766222 18154245 18230935 18015457 18272133 18165884
4279 18165884 18262932 18032788 18461711 18779498 18821777 18874102 18964896 18893305 19305020 19308647 19322795
4268 19322795 19852262 20243921 20492169 20674230 20902403 21426716 21883487 22315310 22935527
4259 22935527 23534370 24110543 24412622 24477181 25060163 25706848 26230152 26864949 27086293 28166716
4249 28166716 28721497 29604415 30464540 31287641 31928689 33040369 34188981 34831141 35836853
4240 35836853 37291231 38800104 40124033 41433537 42441656 43997489 45350953 47092853
$$ packed form
4309A6726602m627O7571j17353n5639K32280j16486K84143J70008m38143L30414
4299A7078770l94080K83676M18196J7674P5531k33616M0141L50447j41022l37422
4289A7158295N01796L68941m49808P8027J08971L88023P6690k15478K56676j06249
4279A8165884R7048k30144M28923L17787M2279N2325R0794p1591M11715L627J4148
4268A9322795N29467L91659K48248J82061K28173N24313M56771M31823O20217
4259B2935527N98843N76173L02079O4559N82982O46685N23304O34797K21344J080423
4249B8166716N54781Q82918Q60125Q23101O41048J111680J148612O42160J005712
4240C5836853J454378J508873J323929J309504J008119J555833J353464J741900
$$ plain form
4232 47092853 48673362 50300298 52636852 55933225 59053026 62214394 65647620 69475001
4224 69475001 73748161 78696596 84506085 90897593 98149799 106545714 115742745 126199344
4216 126199344 137712929 150601689 164732727 179069388 193274212 206012691 215713725
4209 215713725 220683766 220763896 216067921 206371580 193442198 178069588 162877843 148620703
4201 148620703 135558904 124204452 115042742 107311088 100741434 96080891 91696447 88121711
4193 88121711 85304497 82849532 81219865 79551819 77904849 76560220 75368258 74342400
4185 74342400 73041891 71967035 71292476 70208502 69144813 67711209 66988785 66369045 65719740
4176 65719740 65080297 63798097 62822078 61713100 60697816 59673183 57952701 55781684
$$ packed form
4232D7092853J580509J626936K336554L296373L119801L161368L433226L827381
4224F9475001M273160M948435N809489O391508P252206Q395915R197031J0456599
4216A26199344J1513585J2888760J4131038J4336661J4204824J2738479R701034
4209B15713725M970041Q0130m695975r696341j2929382j5372610j5191745j4257140
4201A48620703j3061799j1354452r161710p731654o569654m660543m384444l574736
4193H8121711k817214k454965j629667j668046j646970j344629j191962j025858
4185G4342400j300509j074856o74559j083974j063689j433604p22424o19740o49305
4176F5719740o39443j282200r76019j108978j015284j024633j720482k171017
$$ plain form
4168 55781684 54753439 53153256 52118246 50578929 49764965 48998918 48157085 47527322 47440162
4159 47440162 46984827 46158412 45688896 45530621 44877028 43441502 42902840 41565402 40650277
4150 40650277 40069110 39240183 38280957 37448657 36923468 36239970 35985109 35821439 35303331
4141 35303331 34590571 34150607 33756411 33784045 34119633 34266415 34120095 33712606 33603092 33580675
4131 33580675 33807558 34121955 34262478 34263435 34900191 35215004 35369428 35964909 36432335 36653262
4121 36653262 36983375 37719273 38584268 39281062 39771101 40337053 41160047 41985267 42862711
4112 42862711 43974840 44751162 45406933 46461988 47540198 48494580 49916540 51267264 52576479
4103 52576479 54155434 55515991 57094870 58594955 60706107 62716378 64801863 67689015
$$ packed form
4168E5781684j028245j600183j035010j539317q13964p66047q41833o29763q7160
4159D7440162m55335q26415m69516j58275o53593j435526n38662j337438r15125
4150D0650277n81167q28927r59226q32300n25189o83498k54861j63670n18108
4141C5303331p12760m39964l94196K7634L35588J46782j46320m07489j09514k2417
4131C3580675K26883L14397J40523R57O36756L14813J54424N95481M67426K20927
4121C6653262L30113P35898Q64995O96794M90039N65952Q22994Q25220Q77444
4112D2862711J112129P76322O55771J055055J078210R54382J421960J350724J309215
4103E2576479J578955J360557J578879J500085K111152K010271K085485K887152
$$ plain form
4095 67689015 70292365 72764885 76257065 80232127 84427982 89105404 94148284 100771318
4087 100771318 108015592 115376336 124431095 134239800 145595506 158760208 172751909 189237681
4079 189237681 207356491 226760779 247980771 268917570 287158236 297503574 295998454
4072 295998454 284186782 265834872 245126810 225108470 206703803 190020568 175325433
4065 175325433 163079788 152850946 144122887 136788532 130453551 125409855 120945258 117023187
4057 117023187 113864309 111551337 109013081 106459130 104733278 103521911 102427355 101419464
4049 101419464 101157975 100572694 100414827 100320121 100418865 101388418 101821724 102574567 103541508 104099173
4039 104099173 104910099 106397990 107089193 108695992 109838838 110857087 112546946 114722618
$$ packed form
4095F7689015K603350K472520L492180L975062M195855M677422N042880O623034
4087A00771318P244274P360744R054759R808705J1355706J3164702J3991701J6485772
4079A89237681J8118810J9404288K1219992K0936799J8240666J0345338j505120
4072B95998454j1811672j8351910k0708062k0018340j8404667j6683235j4695135
4065A75325433j2245645j0228842q728059p334355o334981n043696m464597l922071
4057A17023187l158878k312972k538256k553951j725852j211367j094556j007891
4049A01419464k61489n85281j57867r4706R8744R69553M33306P52843R66941N57665
4039A04099173Q10926J487891O91203J606799J142846J018249J689859K175672
$$ plain form
4031 114722618 116601343 118206972 119793256 121665301 123371804 124801993 126897460 128645834
4023 128645834 130115615 131455179 132834968 135030572 136209409 137244574 139094855 140742953
4015 140742953 142408903 144279846 146443986 148507581 151307398 154085697 156891346 160505170
4007 160505170 164107179 168496600 174709487 183404196 194412272 206213569 218841278 236224777
3999 236224777 261016060 299095291 333549689 327369660 290755352 250418732 215471125
3992 215471125 187642881 166734632 151191708 139693189 129670527 121919950 114639961
3985 114639961 108736825 103940535 99339006 95443086 91708229 88471422 85495154 82582362
3977 82582362 79702944 77123326 74381332 72102095 69648936 67827832 66384562 64635808
$$ packed form
4031A14722618J878725J605629J586284J872045J706503J430189K095467J748374
4023A28645834J469781J339564J379789K195604J178837J035165J850281J648098
4015A40742953J665950J870943K164140K063595K799817K778299K805649L613824
4007A60505170L602009M389421O212887Q694709J1008076J1801297J2627709J7383499
3999B36224777K4791283L8079231L4454398o180029l6614308m0336620l4947607
3992B15471125k7828244k0908249j5542924j1498519j0022662p750577p279989
3985A14639961n903136m796290m601529l895920l734857l236807k976268k912792
3977H2582362k879418k579618k741994k279237k453159j821104j443270j748754
$$ plain form
3969 64635808 62965822 61627323 60134929 58902556 57491955 56235420 55420756 54039175
3961 54039175 53241183 52516542 51501745 50615499 49615123 48686139 47796285 47132483 46402794
3952 46402794 46092975 45774941 44777637 43811497 43460716 42912417 42555014 41957328 41482844
3943 41482844 41278347 40773588 40689944 40504683 40344582 40378353 40128437 40283413 40075056 39916729
3933 39916729 39846158 39691022 39744471 39788963 40018108 39876742 39707695 39807161 40336638 40413562
3923 40413562 40344969 40159111 40260405 40760552 40920348 40835428 41016432 41166426 41095030 41146861
3913 41146861 41397276 41530737 41659013 41976554 42016336 42644473 42672754 42950849 43245668 43310997
3903 43310997 43582906 43186755 43288172 43540925 43349420 43597263 44266632 44540038 44701847
$$ packed form
3969F4635808j669986j338499j492394j232373j410601j256535q14664j381581
3961E4039175p97992p24641j014797q86246j000376r28984q89854o63802p29689
3952D6402794l09819l18034r97304r66140l50781n48299l57403n97686m74484
3943D1482844k04497n04759q3644j85261j60101L3771k49916J54976k08357j58327
3933C9916729p0571j55136N3449M4492K29145j41366j69047R9466N29477P6924
3923D0413562o8593j85858J01294N00147J59796q4920J81004J49994p1396N1831
3913D1146861K50415J33461J28276L17541L9782O28137K8281K78095K94819O5329
3903D3310997K71909l96151J01417K52753j91505K47843O69369K73406J61809
$$ plain form
3894 44701847 45085548 45123931 45508773 45875924 45938964 46119886 46565995 46826620 47089410 47531813
3884 47531813 47930094 48400825 48596232 48930883 49094999 49229895 49693045 49798867 50228802
3875 50228802 50206346 50389315 50720764 51191472 51557498 51902001 52086721 52728183 52987907 52813502
3865 52813502 52822272 52978661 53491476 53872541 54132161 54482785 54780817 55068969 55668614 56574118
3855 56574118 56981957 56882050 57759136 58462323 58509477 59610877 60321626 60915101 62395186
3846 62395186 63488394 64158464 65326358 66721037 67957571 70057282 71948769 74012202
3838 74012202 76110103 78349734 81202154 84091478 86552331 89784966 93500091 96723038
3830 96723038 100612179 104996543 109617583 113782034 118583428 124176146 129265403 134309725
$$ packed form
3894D4701847L83701L8383L84842L67151O3040J80922M46109K60625K62790M42403
3884D7531813L98281M70731J95407L34651J64116J34896M63150J05822M29935
3875E0228802k2456J82969L31449M70708L66026L44503J84720O41462K59724j74405
3865E2813502Q770J56389N12815L81065K59620L50624K98032K88152N99645R05504
3855E6574118M07839r9907Q77086P03187M7154J101400P10749N93475J480085
3846F2395186J093208O70070J167894J394679J236534K099711J891487K063433
3838G4012202K097901K239631K852420K889324K460853L232635L715125L222947
3830I6723038L889141M384364M621040M164451M801394N592718N089257N044322
$$ plain form
3822 134309725 139413195 145164245 150728441 156176320 161142854 166035649 170950531 175315756
3814 175315756 179011998 181747268 184564319 186584692 188252299 188957340 189066534 188799014
3806 188799014 187929851 186855391 184950296 182245027 179106807 176086973 172040442 167999025
3798 167999025 163828111 158849381 154265033 149430493 144382001 138847003 133652701 128463783
3790 128463783 123614908 119236930 114300357 109765920 105312715 101142904 96484059 92757091
3782 92757091 88869185 85325047 82272982 78853403 76056134 73084022 69990818 67999397
3774 67999397 65908536 63924529 62367393 60494730 59146248 57748772 56295161 55130635
3766 55130635 53869006 52865921 52150350 50837483 49880849 49279531 48474326 47717705 47295786
$$ packed form
3822A34309725N103470N751050N564196N447879M966534M892795M914882M365225
3814A75315756L696242K735270K817051K020373J667607P05041J09194k67520
3806A88799014q69163j074460j905095k705269l138220l019834m046531m041417
3798A67999025m170914m978730m584348m834540n048492n534998n194302n188918
3790A28463783m848875m377978m936573m534437m453205m169811m658845l726968
3782I2757091l887906l544138l052065l419579k797269k972112l093204j991421
3774F7999397k090861j984007j557136j872663j348482j397476j453611j164526
3766E5130635j261629j003085p15571j312867r56634o01318q05205p56621m21919
$$ plain form
3757 47295786 47044292 45965970 45364968 44554271 43509378 43046708 42461569 42200599 41488542
3748 41488542 40591473 40204335 39479076 38699187 38283495 37745330 37148213 36476939 35622620
3739 35622620 35402829 34647336 34246490 33632084 33072480 32374646 31419393 31130000 30607132
3730 30607132 30003500 29088686 28490756 28276397 27831457 27329247 26686275 26655989 26239882 25741528
3720 25741528 25477113 25216986 25212528 24756808 24874203 24887454 24730650 24302710 23846991 23921328
3710 23921328 24014814 23973872 23811022 23541879 23374814 23230894 22984791 22713522 22444444 22403467
3700 22403467 22368995 22114735 22322560 22029626 22158561 22524720 22026708 22027619 22033702 22017181 22080162
3689 22080162 22353090 22041475 22167379 22412475 22268038 22458158 22356960 22280054 22602169 22885457
$$ packed form
3757D7295786k51494j078322o01002q10697j044893m62670n85139k60970p12057
3748D1488542q97069l87138p25259p79889m15692n38165n97117o71274q54319
3739C5622620k19791p55493m00846o14406n59604o97834r55253k89393n22868
3730C0607132o03632r14814n97930k14359m44940n02210o42972l0286m16107m98354
3720B5741528k64415k60127m458m55720J17395J3251j56804m27940m55719P4337
3710B3921328R3486m0942j62850k69143j67065j43920k46103k71269k69078m0977
3700B2403467l4472k54260K07825k92934J28935L66159m98012R11O083j6521O2981
3689B2080162K72928l11615J25904K45096j44437J90120j01198p6906L22115K83288
$$ plain form
3679 22885457 22969007 23327423 22870482 23293694 23576030 23956237 24544343 25026178 25611821 26148911
3669 26148911 26159467 26424802 27388585 28110409 28667295 28844005 29701767 30749167 31282285
3660 31282285 32099191 32850983 33444508 34472232 35403707 35902728 36976906 37457297 38321168
3651 38321168 39484021 40026862 41122326 41626498 42442850 43242687 43678337 44278668 44663556
3642 44663556 45413350 46044215 46411791 46703727 46955589 47184773 47519365 47204583 47105041 47212721
3632 47212721 47557631 47004965 47218017 47604809 47628419 47815976 48014571 48773064 48849386 49074787
3622 49074787 49183924 49313187 49869775 50412624 51168350 52117031 52579623 53572461 54918732
3613 54918732 56177029 57368916 59224007 61177254 62873272 64793805 66295815 68260710
$$ packed form
3679B2885457Q3550L58416m56941M23212K82336L80207N88106M81835N85643N37090
3669B6148911J0556K65335R63783P21824N56886J76710Q57762J047400N33118
3660C1282285Q16906P51792N93525J027724R31475M99021J074178M80391Q63871
3651C8321168J162853N42841J095464N04172Q16352P99837M35650O00331L84888
3642D4663556P49794O30865L67576K91936K51862K29184L34592l14782r9542J07680
3632D7212721L44910n52666K13052L86792K3610J87557J98595P58493P6322K25401
3622D9074787J09137J29263N56588N42849P55726R48681M62592R92838J346271
3613E4918732J258297J191887J855091J953247J696018J920533J502010J964895
$$ plain form
3605 68260710 71143112 73507385 76323764 79180838 81936197 84690727 87197891 89963542
3597 89963542 92838592 95664937 98321925 100854541 103601149 106080549 108328757 110792580
3589 110792580 112929300 115176650 116578191 118060683 119298039 120514043 121426011 122421733
3581 122421733 122846006 123503278 124077550 124050752 123927550 124174098 124196040 124239068 124567477 124507146
3571 124507146 124407405 124378163 124455666 124773687 125164619 124613224 124606936 124478739 125230000 125518990
3561 125518990 125509729 125583961 126056942 126376185 126716097 126613017 126431037 126700929 127002739 126687229
3551 126687229 126399807 126030979 125733770 125132329 124509914 123629262 122089284 120293169 118733818
3542 118733818 116831279 114850666 113047474 110571619 108326307 105754825 103456195 100969125
$$ packed form
3605F8260710K882402K364273K816379K857074K755359K754530K507164K765651
3597H9963542K875050K826345K656988K532616K746608K479400K248208K463823
3589A10792580K136720K247350J401541J482492J237356J216004R11968R95722
3581A22421733M24273O57272N74272k6798j23202K46548K1942M3028L28409o0331
3571A24507146r9741k9242P7503L18021L90932n51395o288j28197P51261K88990
3561A25518990r261P4232M72981L19243L39912j03080j81980K69892L01810l15510
3551A26687229k87422l68828k97209o01441o22415q80652j539978j796115j559351
3542A18733818j902539j980613j803192k475855k245312k571482k298630k487070
$$ plain form
3534 100969125 98458824 95732217 93325701 90667308 88423778 86239562 83167899 80951263
3526 80951263 78794913 76314884 74075447 71847912 70002145 68085831 66223418 64773910
3518 64773910 63277041 62060781 60982704 59869133 58834318 58171096 57552237 56667295 55963927
3509 55963927 56107769 55742821 54939290 54128991 53919351 53719123 53260400 52908933 52465716
3500 52465716 52068649 51812993 51377574 51168395 50576133 50179157 49795526 49491555 48901725
3491 48901725 48648658 48015793 47316448 46660350 45872700 45100016 44363494 43278571 42226692
3482 42226692 41477955 40012784 39358854 38643197 37648249 36526972 35415571 34235436 33516696
3473 33516696 32842340 31572748 30736370 29939195 28821357 28072922 27295311 26904482 25884190
$$ packed form
3534A00969125k510301k726607k406516k658393k243530k184216l071663k216636
3526H0951263k156350k480029k239437k227535j845767j916314j862413j449508
3518F4773910j496869j216260j078077j113571j034815o63222o18859q84942p03368
3509E5963927J43842l64948q03531q10299k09640k00228m58723l51467m43217
3500E2465716l97067k55656m35419k09179n92262l96976l83631l03971n89830
3491D8901725k53067o32865o99345o56098p87650p72684p36522j084923j051879
3482D2226692p48737j465171o53930p15657r94948j121277j111401j180135p18740
3473C3516696o74356j269592q36378p97175j117838p48435p77611l90829j020292
$$ plain form
3464 25884190 24728812 24355663 24209901 23599976 22677944 21780156 21152485 20623154 20543972
3455 20543972 19986101 19574674 19368508 18774228 18559884 17907060 17084359 16982958 16669930
$$ packed form
3464B5884190j155378l73149j45762o09925r22032q97788o27671n29331p9182
3455B0543972n57871m11427k06166n94280k14344o52824q22701j01401l13028
$$ [...]
##END NTUPLES=NMR SPECTRUM
##END=
