##TITLE=1H_TG-2351-X
 DMSO
 8 sc, 
 11.03.2022
##JCAMPDX= 6.0         $$ Bruker NMR JCAMP-DX V2.0
##DATA TYPE= NMR SPECTRUM
##DATA CLASS= NTUPLES
##ORIGIN= UXNMR, Bruker Analytische Messtechnik GmbH
##OWNER= root
$$ XWIN-NMR		Version 3.5
$$ Fri Mar 11 11:33:29 2022 Russian Standard Time (UT+4h)  she@DPX200
##.OBSERVE FREQUENCY= 200.131346
##.OBSERVE NUCLEUS= ^1H
##.ACQUISITION MODE= SIMULTANEOUS
##.ACQUISITION SCHEME= undefined
##.AVERAGES= 8
##.DIGITISER RES= 18
##SPECTROMETER/DATA SYSTEM= spect
##.PULSE SEQUENCE= zg30
##.SOLVENT NAME= DMSO
##.SHIFT REFERENCE= (INTERNAL, DMSO, 0, 15.6995)
##AUDIT TRAIL= $$ (NUMBER, WHEN, WHO, WHERE, WHAT)
$$ ##TITLE= Audit trail, XWIN-NMR		Version 3.5
$$ ##JCAMPDX= 5.01
$$ ##ORIGIN= Bruker BioSpin GmbH
$$ ##OWNER= she
$$ F:/spectra/data/she/nmr/H-F/1/pdata/1/auditp.txt
$$ ##AUDIT TRAIL=  $$ (NUMBER, WHEN, WHO, WHERE, WHAT)
(   1,<2022-03-11 11:32:15.92 +0400>,<she>,<DPX200>,
      <created by zg, POWCHK disabled, PULCHK disabled
       configuration hash MD5:
       00 E9 B6 7A A2 85 ED C7 34 08 36 98 17 FE 4E 26
       data hash MD5: 16K
       00 E9 38 59 23 19 BF 1A E0 17 03 CF 04 75 B7 C9>)
(   2,<2022-03-11 11:32:19.87 +0400>,<she>,<DPX200>,
      <Start of raw data processing
       efp BC_mod = 2 LB = 0.24 FT_mod = 6 PKNL = 1 PHC0 = -16590.92 PHC1 = 12.80078 SI = 16K 
       data hash MD5: 16K
       46 71 36 2C 29 CA 8D 1C 44 FB 12 57 F4 70 CA BD>)
(   3,<2022-03-11 11:32:38.09 +0400>,<she>,<DPX200>,
      <pk PHC0 = -0.7944641 PHC1 = 0.6000004 
       data hash MD5: 16K
       FA DF A0 2E DE 27 CC 61 E1 18 FA 8B C4 35 18 CE>)
(   4,<2022-03-11 11:32:41.54 +0400>,<she>,<DPX200>,
      <abs ABSG = 5 
       data hash MD5: 16K
       08 E4 AB 15 03 99 51 AE 25 DF 60 A1 54 AD AF 6B>)
$$ ##END=
$$ 
$$ hash MD5
$$ 90 21 5D AC DA F2 89 50 34 E9 2D E0 25 34 8F 2F
##$RELAX= 
##$RELAX= 
##$RELAX= 
##$RELAX= 
##$RELAX= 
##$RELAX= 
$$ Bruker specific parameters
$$ --------------------------
##$DU= <F:/spectra>
##$EXPNO= 1
##$NAME= <H-F>
##$PROCNO= 1
##$TYPE= <nmr>
##$USER= <she>
##$AMP= (0..31)
100 100 100 100 100 100 100 100 100 100 100 100 100 100 100 100 100 100 
100 100 100 100 100 100 100 100 100 100 100 100 100 100 
##$AQSEQ= 0
##$AQ_mod= 1
##$AUNM= <au_zg>
##$AUTOPOS= <>
##$BF1= 200.13
##$BF2= 200.13
##$BF3= 200.13
##$BF4= 200.13
##$BF5= 200.13
##$BF6= 200.13
##$BF7= 200.13
##$BF8= 200.13
##$BYTORDA= 1
##$CFDGTYP= 0
##$CFRGTYP= 5
##$CHEMSTR= <none>
##$CNST= (0..31)
1 1 145 1 1 1 1 1 1 1 1 1 1 1 1 1 1 1 1 1 1 1 1 1 1 1 1 1 1 1 1 1 
##$CPDPRG= <>
##$CPDPRG1= <>
##$CPDPRG2= <>
##$CPDPRG3= <>
##$CPDPRG4= <mlev>
##$CPDPRG5= <mlev>
##$CPDPRG6= <mlev>
##$CPDPRG7= <mlev>
##$CPDPRG8= <mlev>
##$CPDPRGB= <>
##$CPDPRGT= <>
##$D= (0..31)
0 1.2 0 0 0 0 0 0 0 0.06 0 0.03 0 0 0 0 0.0002 0 0 0 0 0 0 0 0 0 0 0 0 
0 0 0 
##$DATE= 1646983935
##$DBL= (0..7)
120 120 120 120 120 120 120 120 
##$DBP= (0..7)
150 150 150 150 150 150 150 150 
##$DBP07= 0
##$DBPNAM0= <>
##$DBPNAM1= <>
##$DBPNAM2= <>
##$DBPNAM3= <>
##$DBPNAM4= <>
$$ [...]
##$SUBNAM2= <"">
##$SUBNAM3= <"">
##$SUBNAM4= <"">
##$SUBNAM5= <"">
##$SUBNAM6= <"">
##$SUBNAM7= <"">
##$SUBNAM8= <"">
##$SUBNAM9= <"">
##$SW= 18.0517287032376
##$SWIBOX= (0..15)
0 0 2 0 0 0 0 0 0 0 0 0 0 0 0 0 
##$SW_h= 3612.71676300578
##$TD= 16384
##$TD0= 1
##$TE= 0
##$TE2= 300
##$TE3= 300
##$TEG= 300
##$TL= (0..7)
0 120 120 120 120 120 120 120 
##$TP= (0..7)
150 150 150 150 150 150 150 150 
##$TP07= 0
##$TPNAME0= <>
##$TPNAME1= <>
##$TPNAME2= <>
##$TPNAME3= <>
##$TPNAME4= <>
##$TPNAME5= <>
##$TPNAME6= <>
##$TPNAME7= <>
##$TPOAL= (0..7)
0.5 0.5 0.5 0.5 0.5 0.5 0.5 0.5 
##$TPOFFS= (0..7)
0 0 0 0 0 0 0 0 
##$TUNHIN= 0
##$TUNHOUT= 0
##$TUNXOUT= 0
##$USERA1= <user>
##$USERA2= <user>
##$USERA3= <user>
##$USERA4= <user>
##$USERA5= <user>
##$V9= 5
##$VALIST= <valist>
##$VCLIST= <CCCCCCCCCCCCCCC>
##$VD= 0
##$VDLIST= <DDDDDDDDDDDDDDD>
##$VPLIST= <PPPPPPPPPPPPPPP>
##$VTLIST= <TTTTTTTTTTTTTTT>
##$WBST= 1024
##$WBSW= 4
##$XGAIN= (0..3)
0 0 0 0 
##$XL= 0
##$YL= 0
##$YMAX_a= 163484
##$YMIN_a= -249530
##$ZGOPTNS= <>
##$ZL1= 120
##$ZL2= 120
##$ZL3= 120
##$ZL4= 120
##$ABSF1= 15.69952
##$ABSF2= -2.352329
##$ABSG= 5
##$ABSL= 3
##$ALPHA= 0
##$AQORDER= 0
##$ASSFAC= 0
##$ASSFACI= 0
##$ASSFACX= 0
##$ASSWID= 0
##$AUNMP= <proc_1d>
##$AZFE= 0.1
##$AZFW= 0.1
##$BCFW= 0
##$BC_mod= 2
##$BYTORDP= 0
##$COROFFS= 0
##$CY= -3
##$DATMOD= 1
##$DC= 0
##$DFILT= <>
##$DTYPP= 0
##$F1P= 0
##$F2P= 0
##$FCOR= 1
##$FTSIZE= 16384
##$FT_mod= 6
##$GAMMA= 0
##$GB= 0
##$INTBC= 1
##$INTSCL= 0
##$ISEN= 128
##$LB= 0.24
##$LEV0= 0
##$LPBIN= 0
##$MAXI= 10000
##$MC2= 0
##$MEAN= 0
##$ME_mod= 0
##$MI= 1.114404
##$NCOEF= 0
##$NC_proc= -8
##$NLEV= 6
##$NOISF1= 3.799351
##$NOISF2= 2.8
##$NSP= 0
##$NTH_PI= 0
##$NZP= 0
##$OFFSET= 15.69952
##$PC= 1
##$PHC0= -16591.71
##$PHC1= 13.40078
##$PH_mod= 1
##$PKNL= yes
##$PPARMOD= 0
##$PSCAL= 0
##$PSIGN= 0
##$REVERSE= no
##$SF= 200.130010414241
##$SI= 16384
##$SIGF1= 3
##$SIGF2= 2
##$SINO= 5.538805
##$SIOLD= 16384
##$SREGLST= <1H.CDCl3>
##$SSB= 0
##$STSI= 16384
##$STSR= 0
##$SW_p= 3612.71676300578
##$SYMM= 0
##$S_DEV= 0
##$TDeff= 16384
##$TDoff= 0
##$TI= <>
##$TILT= no
##$TM1= 0
##$TM2= 0
##$TOPLEV= 0
##$USERP1= <user>
##$USERP2= <user>
##$USERP3= <user>
##$USERP4= <user>
##$USERP5= <user>
##$WDW= 1
##$XDIM= 16384
##$YMAX_p= 523057252
##$YMIN_p= -2685679
$$ End of Bruker specific parameters
$$ ---------------------------------
##NTUPLES= NMR SPECTRUM
##VAR_NAME=  FREQUENCY,     SPECTRUM/REAL,   SPECTRUM/IMAG
##SYMBOL=    X,             R,               I
##VAR_TYPE=  INDEPENDENT,   DEPENDENT,       DEPENDENT
##VAR_FORM=  AFFN,          ASDF,            ASDF
##VAR_DIM=   16384,         16384,           16384
##UNITS=     HZ,            ARBITRARY UNITS, ARBITRARY UNITS
##FACTOR=    0.220516191357247, 1,           1
##FIRST=     3141.94512332982, 0,            0
##LAST=      -470.771639675956, 0,           0
##MIN=       -470.771639675956, -2685679,    0
##MAX=       3141.94512332982, 523057252,    0
$$ Real data points
##PAGE= N=1
##DATA TABLE= (X++(R..R)), XYDATA
$$ [...]
$$ plain form
9092 2318422 2378948 2677585 2744242 2182934 1938404 2084077 2044665 2320392 1923919 1870407
9082 1870407 1896216 2325843 2499690 2791095 2888082 2851639 2498479 2628733 2904751 2968520
9072 2968520 2922765 2772564 3052939 3339490 3621741 3771126 3565635 3353584 3244770 3509543
9062 3509543 3797771 3933832 3822019 3616681 4130169 4052096 4123865 4370919 4459486 4963232
9052 4963232 5134867 4593213 4572498 4809340 5014346 4610026 4734496 5521356 5575037 5651157
9042 5651157 5694428 5911471 6289456 6555639 6608232 6695475 6718155 6902848 7193375 7235139
9032 7235139 7674810 8035783 8411051 8723357 9080383 9418796 9683052 9594114 9835144 9854939
9022 9854939 10652390 10715497 11200380 11979435 11995977 12221692 13078370 13607680 14082679 14518711
$$ packed form
9092B318422O0526K98637O6657n61308k44530J45673l9412K75727l96473n3512
9082A870407K5809M29627J73847K91405R6987l6443l53160J30254K76018O3769
9072B968520m5755j50201K80375K86551K82251J49385k05491k12051j08814K64773
9062C509543K88228J36061j11813k05338N13488p8073P1769K47054Q8567N03746
9052D963232J71635n41654k0715K36842K05006m04320J24470P86860N3681P6120
9042E651157M3271K17043L77985K66183N2593Q7243K2680J84693K90527M1764
9032G235139M39671L60973L75268L12306L57026L38413K64256q8938K41030J9795
9022I854939P97451O3107M84883P79055J6542K25715Q56678N29310M74999M36032
$$ plain form
9012 14518711 15052522 15782594 16206853 16950745 17899826 19185240 19719629 20528007 21375879
9003 21375879 23054236 24962822 26405909 28412082 30820826 32940844 35468851 38503799
8995 38503799 41274635 43605627 46772614 51196480 56988599 63271839 71364902 80944589
8987 80944589 90976374 100264490 106598943 107329763 102769260 95062234 85901684 78135361
8979 78135361 72678380 68528931 65494286 62423069 59353766 55996431 52375187 48553329
8971 48553329 46031127 44513581 43678478 42959949 42961119 43058753 43607017 44726948 46324849
8962 46324849 48590698 51288875 54485758 57857563 62800009 67683406 73062081 77483444
8954 77483444 81487654 86001343 91013008 97653550 106048935 115613555 125239773 131877951
$$ packed form
9012A4518711N33811P30072M24259P43892R49081J285414N34389Q08378Q47872
9003B1375879J678357J908586J443087K006173K408744K120018K528007L034948
8995C8503799K770836K330992L166987M423866N792119O283240Q093063R579687
8987H0944589J0031785R288116O334453P30820m560503p707026r160550p766323
8979G8135361n456981m149449l034645l071217l069303l357335l621244l821858
8971D8553329k522202j517546q35103p18529J170R7634N48264J119931J597901
8962D6324849K265849K698177L196883L371805M942446M883397N378675M421363
8954G7483444M004210M513689N011665O640542Q395385R564620R626218O638178
$$ plain form
8946 131877951 133025204 126308818 113002270 97141482 83099266 71695073 63024385
8939 63024385 56602793 51687196 48319283 45630274 42875640 40353360 37914090 35020606
8931 35020606 32460171 30123897 28097914 26397417 24967078 23618832 22351505 21024439
8923 21024439 19671221 18935128 18257963 17413717 16548609 16094031 15425521 15037804 14488791
8914 14488791 13984510 13178612 13310258 13030785 12207682 12106498 11938626 11587691 11482663
8905 11482663 10962666 10406226 10285853 9683892 9125769 8943432 8502247 8064046 7901496
8896 7901496 7310751 7295653 6996669 6777588 6575482 6887345 6754419 5811477 5565085 5349127
8886 5349127 5262382 5269120 4870771 4923549 5283047 5235835 5238331 5137335 4593834 4859536 4320781
$$ packed form
8946A31877951J147253o716386j3306548j5860788j4042216j1404193q670688
8939F3024385o421592m915597l367913k689009k754634k522280k439270k893484
8931C5020606k560435k336274k025983j700497j430339j348246j267327j327066
8923B1024439j353218p36093o77165q44246q65108m54578o68510l87717n49013
8914A4488791n04281q05898J31646k79473q23103j01184j67872l50935j05028
8905A1482663n19997n56440j20373o01961n58123j82337m41185m38201j62550
8896G901496n90745j5098k98984k19081k02106L11863j32926r42942k46392k15958
8886E349127q6745O738l98349N2778L59498m7212K496j00996n43501K65702n38755
$$ plain form
8875 4320781 3868135 3442890 3339687 3583633 3836047 3920990 4032506 3862377 3805671 3759079
8865 3759079 3774615 3973345 3788350 3404799 3658051 3287053 3210149 3337426 3454667 3546256
8855 3546256 3319928 3062911 3237386 3617794 3474546 3405982 3247585 3464240 3340782 3398362
8845 3398362 3212737 2794752 2545688 2798473 2635708 3001568 2749913 2780591 2937844 2624885
8835 2624885 2405873 2445856 2502612 2168088 2142606 2222253 2479690 2385567 2759513 2447088
8825 2447088 2026526 2304283 1894416 2157638 2237162 2054060 2212006 2456624 2641339 2666573
8815 2666573 2875725 2970934 2811815 2728648 2708230 2604614 2474317 2732788 2501518 2327385
8805 2327385 2836540 3110067 2846075 2791853 2880459 2730217 2893381 2878801 2748779 3059803
$$ packed form
8875D320781m52646m25245j03203K43946K52414Q4943J11516j70129n6706m6592
8865C759079J5536J98730j84995l83551K53252l70998p6904J27277J17241R1589
8855C546256k26328k57017J74475L80408j43248o8564j58397K16655j23458N7580
8845C398362j85625m17985k49064K52785j62765L65860k51655L0678J57253l12959
8835B624885k19012L9983N6756l34524k5482P9647K57437r4123L73946l12425
8825B447088m20562K77757m09867K63222P9524j83102J57946K44618J84715K5234
8815B666573K09152R5209j59119q3167k0418j03616j30297K58471k31270j74133
8805B327385N09155K73527k63992n4222Q8606j50242J63164j4580j30022L11024
$$ plain form
8795 3059803 3013639 3448884 3552336 2932587 2389604 2561754 2832452 3034376 3317603 3396172
8785 3396172 3748388 3886279 3741136 3317738 3367342 3414228 3360511 3847111 3979929 3943390
8775 3943390 4323854 4362498 4426849 4403287 4439852 4621111 4401751 4622358 4805706 5402748
8765 5402748 5374240 5292400 5317814 5190037 5530464 5749598 5773621 6343579 6618448 6338773
8755 6338773 6808796 7208706 7540718 7661906 7845362 8005566 7811054 8063741 8792196 9021001
8745 9021001 9281199 9643392 9909112 9850515 10487821 10536711 10866429 11184286 11166304 11306868
8735 11306868 11614409 11862359 12196560 12215286 12854898 13444467 14226832 14793758 14954153 15989096
8725 15989096 16880475 17368591 17640222 18283092 18867503 19925564 21384058 22436852 23898278
$$ packed form
8795C059803m6164M35245J03452o19749n42983J72150K70698K01924K83227P8569
8785C396172L52216J37891j45143m23398M9604M6886n3717M86600J32818l6539
8775C943390L80464L8644O4351k3562L6565J81259k19360K20607J83348N97042
8765E402748k8508q1840K5414j27777L40427K19134K4023N69958K74869k79675
8755F338773M70023L99910L32012J21188J83456J60204j94512K52687P28455K28805
8745I021001K60198L62193K65720n8597O37306M8890L29718L17857j7982J40564
8735A1306868L07541K47950L34201J8726O39612N89569P82365N66926J60395J034943
8725A5989096Q91379M88116K71631O42870N84411J058061J458494J052794J461426
$$ plain form
8716 23898278 25184190 26832542 28595641 30395545 32906472 35689690 38913210 41932383
8708 41932383 45029006 48534638 52362156 56583896 61723570 67732099 74383228 82272024
8700 82272024 91564332 101182829 110057536 116330834 118937685 118928385 115483074 109259767 101541904
8691 101541904 93802125 86620483 79878385 74407103 69425854 65359060 61119568 56871534
8683 56871534 53289289 50137415 47042486 45014455 43499408 42781334 42552479 42361478 42621059
8674 42621059 43360896 45082803 47239690 49657906 52280278 55707252 59542716 62878794
8666 62878794 66960479 70640775 74446513 79049772 83195720 88228827 93212104 96535310
8658 96535310 98051412 96651847 92101781 86649973 79239085 70424520 61725108 54396409
$$ packed form
8716B3898278J285912J648352J763099J799904K510927K783218L223520L019173
8708D1932383L096623L505632L827518M221740N139674O008529O651129P888796
8700H2272024R292308R618497Q874707O273298K606851r300l445311o223307p717863
8691A01541904p739779p181642o742098n471282m981249m066794m239492m248034
8683E6871534l582245l151874l094929k028031j515047p18074k28855j91001K59581
8674D2621059P39837J721907K156887K418216K622372L426974L835464L336078
8666F2878794M081685L680296L805738M603259M145948N033107M983277L323206
8658I6535310J516102j399565m550066n451808p410888q814565q699412p328699
$$ plain form
8650 54396409 48110818 43398827 39750625 36644464 34062670 31285257 29244732 26959731
8642 26959731 25727574 23800221 22089279 20778824 19471953 18839976 18107679 16974251
8634 16974251 15905748 15544514 15134728 14185076 13863404 13881045 13432092 13209659 13084959
8625 13084959 12949424 12605023 11884259 11919940 11713648 11333071 10600538 10168833 9707898 9540782
8615 9540782 9025426 8516583 8480191 7873583 7594220 7266064 6758454 6697091 6660778 6297033
8605 6297033 6005923 5605696 5313185 5114139 5025474 4901972 4880153 4570261 4720947 4615690
8595 4615690 3885303 4108317 4067701 3888666 3411060 3195884 3238493 3292722 3422971 3572015
8585 3572015 3211734 3218848 3334045 2846137 2616719 2518088 2734254 2791753 3021890 3000431
$$ packed form
8650E4396409o285591m711991l648202l106161k581794k777413k040525k285001
8642B6959731j232157j927353j710942j310455j306871o31977p32297j133428
8634A6974251j068503l61234m09786r49652l21672J7641m48953k22433j24700
8625A3084959j35535l44401p20764L5681k06292l80577p32533m31705m60935j67116
8615I540782n15356n08843l6392o06608k79363l28156n07610o1363l6313l63745
8605F297033k91110m00227k92511j99046q8665j23502k1819l09892J50686j05257
8595D615690p30387K23014m0616j79035m77606k15176M2609N4229J30249J49044
8585C572015l60281P114J15197m87908k29418r8631K16166N7499K30137k1459
$$ plain form
8575 3000431 3383186 3147240 2596861 2603972 2440073 2243247 2368846 2184181 2094192 1927771
8565 1927771 1542437 1659643 1813672 1589459 2092847 2104139 2000180 1652694 1613829 1406135
8555 1406135 1855915 1844409 1371385 1162673 1303607 1183161 1359214 1284445 1182300 1518414
8545 1518414 1285419 1415405 1604340 1506686 1199229 801266 1046158 1242828 1104927 974431
8535 974431 947681 768450 898656 767268 610737 572679 584020 289401 130278 422162
8525 422162 481856 183845 27079 188016 360841 594187 614373 285484 238041 328659
8515 328659 251187 376792 180314 -49407 343693 914356 590340 582370 472292 573503
8505 573503 510634 450890 293500 248191 234835 501170 474692 527718 72107 223459 170386
$$ packed form
8575C000431L82755k35946n50379P111j63899j96826J25599j84665q9989j66421
8565A927771l85334J17206J54029k24213N03388J1292j03959l47486l8865k07694
8555A406135M49780j1506m73024k08712J40934j20446J76053p4769j02145L36114
8545A518414k32995J29986J88935r7654l07457l97963K44892J96670j37901j30496
8535I74431k6750j79231J30206j31388j56531l8058J1341k94619j59123K91884
8525D22162N9694k98011j56766J60937J72825K33346K0186l28889m7443R0618
8515C28659p7472J25605j96478k29721L93100N70663l24016p970j10078J01211
8505E73503o2869n9744j57390m5309j3356K66335k6478N3026m55611J51352n3073
$$ plain form
8494 170386 137423 413625 596011 409645 403737 105160 370414 697351 742237 328373
8484 328373 92904 -131461 191300 427088 500410 312303 73518 180463 279750 424747
8474 424747 370796 179224 -489049 -327413 -97491 -12366 -86984 -512990 -588466 -327868
8464 -327868 58895 227940 -135580 -18298 -50796 -488057 -171367 -18215 -157249 154568
8454 154568 44189 -246531 9957 670229 470713 46638 -195603 -326045 -109939 -178440
8444 -178440 -52999 431295 403449 354160 -242044 -39071 -174936 -198122 -374066 -281920
8434 -281920 -548902 -485859 -857267 -491648 -385959 -466839 67577 -12292 -40982 -284697
8424 -284697 -553447 -623962 -334628 -580568 -147604 -12280 135256 -13797 606 -114793
$$ packed form
8494A70386l2963K76202J82386j86366n908k98577K65254L26937M4886m13864
8484C28373k35469k24365L22761K35788P3322j88107k38785J06945R9287J44997
8474D24747n3951j91572o68273J61636K29922Q5125p4618m26006p5476K60598
8464c27868L86763J69045l63520J17282l2498m37261L16690J53152j39034L11817
8454A54568j10379k90720K56488O60272j99516m24075k42241j30442K16106o8501
8444a78440J25441M84294k7846m9289n96204K02973j35865k3186j75944R2146
8434b81920k66982O3043l71408L65619J05689q0880N34416p9869k8690k43715
8424b84697k68750p0515K89334k45940M32964J35324J47536j49053J4403j15399
$$ plain form
8414 -114793 -120149 -266973 -559590 -479074 -453330 -338280 -498369 -564974 -79489 -36678 -380919
8403 -380919 -277432 -84553 68141 -396175 -444479 -239652 60944 70513 -78874 -450445
8393 -450445 -713688 -608371 -479201 -195597 -407192 -680363 -781213 -504262 -211270 -262430
8383 -262430 -269065 -258425 -498512 -525718 -494148 -613552 -787113 -818684 -192043 216403 -82714
8372 -82714 -358337 -340570 -184858 -153479 -133922 -328162 -337206 -291938 -334464 -230676 -253503
8361 -253503 -657938 -475789 -462847 -186780 -21058 -236009 -176965 -371379 -402717 -561040
8351 -561040 -472213 -344483 -689195 -516887 -2387 -241868 -205085 47603 -18024 48765
8341 48765 112891 167919 231852 195745 226123 332474 595939 268925 201156 71035 39457
$$ packed form
8414a14793n356j46824k92617Q0516K5744J15050j60089o6605M85485M2811l44241
8403c80919J03487J92879J52694m64316m8304K04827L00596R569j49387l71571
8393d50445k63243J05317J29170K83604k11595k73171j00850K76951K92992n1160
8383b62430o635J0640k40087k7206L1570j19404j73561l1571O26641M08446k99117
8372h2714k75623J7767J55712L1379J9557j94240r044M5268m2526J03788k2827
8361b53503m04435J82149J2942K76067J65722k14951N9044j94414l1338j58323
8351e61040Q8827J27730l44712J72308N14500k39481L6783K52688o5627O6789
8341D8765O4126N5028O3933l6107L0378J06351K63465l27014o7769j30121l1578
$$ plain form
8330 39457 -265462 -286644 58883 -163360 12814 42914 -225349 -303326 -338654 -634298 -412239
8319 -412239 -532430 -315279 -275182 -188909 -267640 -266661 -414371 -149000 -161585 -300431 -329620
8308 -329620 -189793 325 -52225 245282 -345893 -429205 -58608 -155211 -242709 -327332 -102639
8297 -102639 137244 271089 334235 -206829 -584058 -464422 -220365 -18566 71933 18982
8287 18982 110414 -152444 -389334 -616088 -619611 -283013 -241001 -237913 -283331 -414220 -397328
8276 -397328 -422365 -387700 -758205 -828210 -581441 -785837 -483857 -667179 -1053368 -877301
8266 -877301 -412411 -16959 -238198 266068 107782 2686 -281008 -293774 -171842 -123971
8256 -123971 -331594 -247200 26922 -343512 -931552 -730708 -464042 -413832 -322708 -347332
$$ packed form
8330C9457l04919k1182L45527k22243J76174L0100k68263p7977l5328k95644K22059
8319d12239j20191K17151M0097Q6273p8731R79j47710K65371j2585j38846k9189
8308c29620J39827J90118n2550K97507n91175q3312L70597r6603q7498q4623K24693
8297a02639K39883J33845O3146n41064l77229J19636K44057K01799R0499n2951
8287A8982R1432k62858k36890k26754l523L36598M2012L088m5418j30889J6892
8276c97328k5037L4665l70505p0005K46769k04396L01980j83322l86189J76067
8266h77301M64890L95452k21239N04266j58286j05096k83694j2766J21932M7871
8256a23971k07623Q4394K74122l70434n88040K00844K66666N0210R1124k4624
$$ plain form
8246 -347332 -231377 -932467 -672907 -498546 -637503 -452925 -266490 -729615 -716113 -458323
8236 -458323 -576298 -710326 -551960 -716707 -515848 -323276 -614180 -430255 -364035 -289311
8226 -289311 -345432 -322935 -204145 -16228 24538 70500 163373 -100567 -486853 -230171 -462676
8215 -462676 -466888 -567841 -1080292 -1018810 -1277256 -981816 -491051 -867231 -816466 -845570 -1223447
8204 -1223447 -883347 -976151 -681700 -536709 -745360 -611067 -382125 -510613 -917001 -1376297
8194 -1376297 -2302489 -2685679 -420395 1079640 203593 -80401 177202 640821 -149991
8185 -149991 -129624 -170601 -322777 -465978 -575909 233032 266440 -12407 -79069 -25811 37846
8174 37846 -39380 -341948 -282738 124702 -480044 -503675 22881 -69378 509615 158132 -243744
$$ packed form
8246c47332J15955p01090K59560J74361j38957J84578J86435m63125J3502K57790
8236d58323j17975j34028J58366j64747K00859J92572k90904J83925O6220P4724
8226b89311n6121K2497J18790J87917M0766M5962R2873k63940l86286K56682k32505
8215d62676m212j00953n12451O1482k58446K95440M90765l76180N0765k9104l77877
8204a223447L40100r2804K94451J44991k08651J34293K28942j28488m06388m59296
8194a376297r26192l83190K265284J500035q76047k83994K57603M63619p90812
8185a49991K0367m0977j52176j43201j09931Q08941L3408k78847o6662N3258O3657
8174C7846p7226l02568N9210M07440o04746k3631N26556r2259N78993l51483m01876
$$ plain form
8163 -243744 -143103 -177103 -298509 -591 -78825 177344 377961 380726 268075 -227419
8153 -227419 -385738 -521827 -520546 -49670 -115367 -281264 -452141 -834125 -456005 82386
8143 82386 -29233 -790425 -785606 -406887 -372033 -276223 -428054 -710952 -498108 -199478 -7795
8132 -7795 -46219 -432518 -349338 -11701 -174839 -448816 -370711 -108869 -314352 -401068 -497178
8121 -497178 -263706 -103328 109136 -98474 95770 -213035 -497162 -597433 -498349 -139236
8111 -139236 -379373 -162057 -179268 -169081 -316727 109125 250031 -476782 -747893 -592833
8101 -592833 -468583 -111912 -648673 -513450 -387712 -46018 -31256 -127080 -476531 -514654
8091 -514654 -213611 -236873 -413295 -425793 127088 44407 -280231 -215360 -202568 -28811 74260
$$ packed form
8163b43744J00641l4000j21406K97918p8234K56169K00617K765j12651m95494
8153b27419j58319j36089J281M70876o5697j65897j70877l81984L78120N38391
8143H2386j11619p61192M819L78719L4854R5810j51831k82898K12844K98630J91683
8132g795l8424l86299Q3180L37637j63138k73977P8105K61842k05483q6716r6110
8121d97178K33472J60378K12464k07610J94244l08805k84127j00271R9084L59113
8111a39236k40137K17316j7211J0187j47646M25852J40906p26813k71111J55060
8101e92833J24250L56671n36761J35223J25738L41694J4762r5824l49451l8123
8091e14654L01043k3262j76422j2498N52881q2681l24638O4871J2792J73757J03071
$$ plain form
8080 74260 -610993 -540242 -245220 205776 364933 -63175 -477844 -99410 -151721 -150846 -444096
8069 -444096 -536118 -581444 -586968 -305216 -327531 -501362 -490148 -129127 -55612 -399300 -700756
8058 -700756 -314631 -115616 21782 162819 51109 -376406 -693472 -811640 -546788 -94949
8048 -94949 -503508 -937561 -938849 -731586 -515849 -643849 -448887 -273645 -63078 240988
8038 240988 319825 242493 -243174 -295885 -514100 -650625 -414745 -346968 -548053 -253294
8028 -253294 -327840 -470789 -529906 -284248 -182414 -362364 -118128 30003 -405509 -288704
8018 -288704 285585 -181290 -468630 -520063 -341654 -411865 -522442 -144137 -69229 -414857
8008 -414857 -744990 -756346 -713026 -447693 -76378 -110302 -431001 -418334 -517777 -1010057 -789766
$$ packed form
8080G4260o85253P0751K95022M50996J59157m28108m14669L78434n2311Q75k93250
8069d44096r2022m5326n524K81752k2315j73831J1214L61021P3515l43688l01456
8058g00756L86125J99015J37398J41037j11710m27515l17066j18168K64852M51839
8048i4949m08559m34053j288K07263K15737j28000J94962J75242K10567L04066
8038B40988P8837p7332m85667n2711k18215j36525K35880O7777k01085K94759
8028b53294p4546j42949n9117K45658J01834j79950K44236J48131m35512J16805
8018b88704N74289m66875k87340n1433J78409p0211j10577L78305P4908l45628
8008d14857l30133j1356M3320K65333L71315l3924l20699J2667r9443m92280K20291
$$ plain form
7997 -789766 -574586 -234946 -1519 -158103 -263040 -410439 41983 48054 13996 -159987
7987 -159987 -346251 -335908 -477914 -118118 -508817 -502907 -736010 -751354 -563656 -235964
7977 -235964 -123460 -130954 285325 -8394 -293217 -676025 -191079 -159638 -162706 -345515 -263917
7966 -263917 -340466 -700410 -449791 -594830 -713784 -704779 -486618 -702335 -615116 -807021
7956 -807021 -668579 -561828 -368451 -351492 -377275 -464101 -254504 112650 208306 269600 -255197
7945 -255197 -397744 -332528 -439781 -334367 -399334 -451499 -692153 -255991 -555186 -629167
7935 -629167 -212110 60885 239712 54411 195633 -521615 -633038 -351194 -540748 -428288
7925 -428288 -559979 -741765 -733192 -595956 -834951 -462535 -77360 -143866 -110490 -789903
$$ packed form
7997g89766K15180L39640K33427j56584j04937j47399M52422O071l4058j73983
7987a59987j86264J0343j42006L59796l90699N910k33103j5344J87698L27692
7977b35964J12504p494M16279k93719k84823l82808M84946L1441l068j82809Q1598
7966b63917p6549l59944K50619j45039j18954R005K18161k15717Q7219j91905
7956h07021J38442J06751J93377J6959k5783q6826K09597L67154R5656O1294n24797
7945b55197j42547O5216j07253J05414o4967n2165k40654M36162k99195p3981
7935f29167M17057K72995J78827j85301J41222p17248j11423K81844j89554J12460
7925d28288j31691j81786Q573J37236k38995L72416L85175o6506L3376o79413
$$ plain form
7915 -789903 -646532 -661447 -560111 -409632 -391887 -267748 -303185 -84486 42262 -159921
7905 -159921 -286283 -392267 -472982 -321539 -301918 -485570 -462566 -462543 -306602 -481165 -279198
7894 -279198 -457382 -445814 -261658 -413852 -193783 -311014 -155207 -138041 8999 -194419
7884 -194419 -251252 -432129 -204046 -385903 -454534 -198642 -533711 -172351 -213559 -37912
7874 -37912 -407139 -289903 -357362 -326357 -406129 -353603 -664182 -762556 -58349 -109460 -107384
7863 -107384 7834 -230506 -750805 -243910 240841 4884 -427583 -474402 -535013 -267728
7853 -267728 -628237 -852892 -457384 -136117 -201495 -640396 -371335 -360511 -454610 -232267
7843 -232267 -106140 -54406 -226037 -237766 -53164 -158162 -562374 -346357 -621770 -551922
$$ packed form
7915g89903J43371j4915J01336J50479J7745J24139l5437K18699J26748k02183
7905a59921j26362j05984q0715J51443J9621j83652K3004K3J55941j74563K01967
7894b79198j78184J1568J84156j52194K20069j17231J55807J7166J47040k03418
7884a94419n6833j80877K28083j81857o8631K55892l35069L61360m1208J75647
7874c7912l69227J17236o7459L1005p9772N2526l10579r8374P04207n1111K076
7863a07384J15218k38340n20299N06895M84751k35957m32467m6819o0611K67285
7853b67728l60509k24655L95508L21267o5378m38901K69061J0824r4099K22343
7843b32267J26127N1734j71631j1729J84602j04998m04212K16017k75413O9848
$$ plain form
7833 -551922 -366511 -831666 -704476 -53085 596 -620255 -450435 -391433 -45929 -290116
7823 -290116 -130409 -363436 -640409 -572172 -553681 201966 -111569 98123 136892 -239870
7813 -239870 -203034 -105843 -204438 -825180 -1001216 278772 391677 396236 273452 -104210
7803 -104210 -98968 -445715 -405370 -415096 -336661 -410222 -279204 -292985 -98357 -199612 -309481
7792 -309481 -207831 -361835 -571986 76407 -30520 -458764 -555839 -349131 -647071 -528880
7782 -528880 -274665 34760 332902 262124 118018 230340 321791 34322 300548 266865
7772 266865 307745 267291 104434 -35450 191597 202500 -68689 -148081 -10867 303340
7762 303340 721150 519868 327886 762573 777037 218440 299187 -193111 248953 343701
$$ packed form
7833e51922J85411m65155J27190O51391N3681o20851J69820N9002L45504k44187
7823b90116J59707k33027k76973O8237J8491P55647l13535K09692L8769l76762
7813b39870L6836R7191r8595o20742j76036J279988J12905M559j22784l77662
7803a04210N242l46747M0345r726P8435p3561J31018j3781J94628j01255j09869
7792c09481J01650j54004k10151O48393j06927m28244r7075K06708k97940J18191
7782e28880K54215L09425K98142p0778j44106J12322R1451k87469K66226l3683
7772B66865M0880m0454j62857j39884K27047J0903k71189p9392J37214L14207
7762C03340M17810k01282j91982M34687J4464n58597Q0747m92298M42064R4748
$$ plain form
7752 343701 265167 -65400 -70656 -67644 -275869 15910 46656 142164 -302495 -522802 -281942
7741 -281942 -15906 281773 223142 -153264 -185135 81115 402040 157832 -109156 -208632
7731 -208632 107870 -4943 -338130 -611804 -851036 -208671 -40747 -325876 -110349 -319763
7721 -319763 -568907 -567323 -441548 -3097 100099 -46452 -254522 -116904 96868 -334826
7711 -334826 -485245 -545731 -381145 -114982 -64176 -412898 -756004 -596890 -536879 -266403
7701 -266403 21188 12840 -173558 315517 64907 -159338 -56800 -284156 -112808 -691492
7691 -691492 17069 110663 71392 -41494 -340504 -460556 -520009 -379083 -350121 -387814 -673885
7680 -673885 -629089 -216479 -37240 201086 280361 142984 -104703 -119890 -387607 -490416
$$ packed form
7752C43701p8534l30567n256L012k08225K91779L0746R5508m44659k20307K40860
7741b81942K66036K97679n8631l76406l1871K66250L20925k44208k66988r9476
7731b08632L16502j12813l33187k73674k39232O42365J67924k85129K15527k09414
7721c19763k49144J584J25775M38451J03196j46551k08070J37618K13772m31694
7711c34826j50419o0486J64586K66163N0806l48722l43106J59114O0011K70476
7701b66403K87591q348j86398M89075k50610k24245J02538k27356J71348n78684
7691f91492P08561R3594l9271j12886k99010j20052n9453J40926K8962l7693k86071
7680f73885M4796M12610J79239K38326P9275j37377k47687j5187k67717j02809
$$ plain form
7670 -490416 -218321 -233578 589947 798966 553722 156895 -23843 -151367 -98282 -38588
7660 -38588 -52826 108738 -59808 80980 394390 461699 176986 -68935 -23756 -154730
7650 -154730 -175132 19381 -109083 -102167 -74201 -378852 -14131 -130465 -45625 -41303 148326
7639 148326 534087 474558 251326 231158 -143274 -31614 -108668 -281187 -209230 259715
7629 259715 502486 242348 -186156 -202781 -151331 -214203 -228516 -194719 -161225 -206086 -38834
7618 -38834 -93406 -224913 -342053 125919 254712 -179655 -307972 -425456 -265275 -21100
7608 -21100 -185004 -366974 -203097 66952 131733 169024 266724 205328 138399 538096 385511
7597 385511 516435 180272 68241 31298 244187 222129 37106 -166683 220776 -172766
$$ packed form
7670d90416K72095j5257Q23525K09019k45244l96827j80738j27524N3085N9694
7660c8588j4238J61564j68546J40788L13410O7309k84713k45921M5179j30974
7650a54730k0402J94513j28464O916K7966l04651L64721j16334Q4840M322J89629
7639A48326L85761n9529k23232k0168l74432J11660p7054j72519P1957M68945
7629B59715K42771k60138m28504j6625N1450o2872j4313L3797L3494m4861J67252
7618c8834n4572j31507j17140M67972J28793m34367j28317j17484J60181K44175
7608b1100j63904j81970J63877K70049O4781L7291R7700o1396o6929L99697j52585
7597C85511J30924l36163j12031l6943K12889k2058j85023k03789L87459l93542
$$ plain form
7587 -172766 -77808 162688 117864 116689 -103933 -154703 -98631 98828 -139314 -93655 36765
7576 36765 -187023 -176963 -110205 413194 350375 281741 274491 546215 308569 303002 469775
7565 469775 237794 218978 153347 809925 732310 153953 -120928 410730 166018 69083
7555 69083 -85810 102639 59182 -183975 -119374 143919 335064 71212 102346 537309
7545 537309 459091 315302 357347 566232 484443 59244 31876 186832 296972 442494
7535 442494 551116 414870 380812 521023 446992 926688 976735 539761 481610 687243
7525 687243 639029 428245 -23185 153996 448451 354318 220287 122329 -25378 87905
7515 87905 319614 313868 216541 389921 322004 24862 154432 725600 480661 489431 657552
$$ packed form
7587a72766R4958K40496m4824j175k20622n0770N6072J97459k38142M5659J30420
7576C6765k23788J0060O6758N23399o2819o8634p250K71724k37646n567J66773
7565D69775k31981j8816o5631O56578p7615n78357k74881N31658k44712r6935
7555F9083j54893J88449m3457k43157O4601K63293J91145k63852L1134M34963
7545E37309p8218j43789M2045K08885q1789m25199k7368J54956J10140J45522
7535D42494J08622j36246l4058J40211p4031M79696N0047m36974n8151K05633
7525F87243m8214k10784m51430J77181K94455r4133j34031r7958j47707J13283
7515H7905K31709n746r7327J73380o7917k97142J29570N71168k44939Q770J68121
$$ plain form
7504 657552 598825 644188 202551 756269 637305 275012 377093 406988 217271 649876
7494 649876 561573 428069 438630 642412 867925 571633 852088 493077 561645 922408
7484 922408 617350 537424 582670 506822 473144 857927 779333 1194631 1028492 1238859 1313585
7473 1313585 926008 1338654 1608868 1384249 1361999 829175 627698 968002 1263841 1300303
7463 1300303 811130 1060160 1242764 1218972 1153282 1285896 1148038 1032583 1179358 1170615
7453 1170615 1516132 1621898 1830867 1624267 1418985 1265073 1466857 1280012 1146442 1572875
7443 1572875 1475012 1718099 1552294 2022246 1617045 1932779 2044881 1875149 1976130 2084389
7433 2084389 2173557 2106089 2066006 2389612 2677220 2642236 2968355 3146782 3034694 3135991
$$ packed form
7504F57552n8727M5363m41637N53718j18964l62293J02081K9895j89717M32605
7494F49876q8303j33504J0561K03782K25513k96292K80455l59011O8568L60763
7484I22408l05058p9926M5246p5848l3678L84783p8594M15298j66139K10367P4726
7473A313585l87577M12646K70214k24619k2250n32824k01477L40304K95839L6462
7463A300303m89173K49030J82604k3792o5690J32614j37858j15455J46775q743
7453A170615L45517J05766K08969k06600k05282j53912K01784j86845j33570M26433
7443A572875r7863K43087j65805M69952m05201L15734J12102j69732J00981J08259
7433B084389Q9168o7468m0083L23606K87608l4984L26119J78427j12088J01297
$$ plain form
7423 3135991 3178668 2809251 2754824 2840437 3100286 3483322 3328388 3547161 3733079 3499482
7413 3499482 3854492 3856091 3715650 4127739 4591762 4542528 4509752 4793055 4967792 5073448
7403 5073448 5104834 5273119 5535666 5860786 6098815 6115341 6171898 6082960 6831965 6768870
7393 6768870 7029233 7571263 7573198 8027606 8198322 8401189 8797773 9182273 9303613 9911022
7383 9911022 10242152 10626364 11340023 11713236 12604287 13430139 14089790 14952673 15818795 16925504
7373 16925504 17936947 19369671 20693418 22450085 24471271 26456684 29469038 32412188
7365 32412188 35709565 39359305 43988422 50096905 56916757 65713276 75504331 87437763
7357 87437763 101576816 116311287 129926544 137056436 133589729 120649867 102416975
$$ packed form
7423C135991M2677l69417n4427Q5613K59849L83036j54934K18773J85918k33597
7413C499482L55010J599j40441M12089M64023m9234l2776K83303J74737J05656
7403E073448L1386J68285K62547L25120K38029J6526N6557q8938P49005o3095
7393F768870K60363N42030J935M54408J70716K02867L96584L84500J21340O07409
7383I911022L31130L84212P13659L73213Q91051Q25852O59651Q62883Q66122J106709
7373A6925504J011443J432724J323747J756667K021186J985413L012354K943150
7365C2412188L297377L649740M629117O108483O819852Q796519R791055J1933432
7357H7437763J4139053J4734471J3615257P129892l466707j2939862j8232892
$$ plain form
7350 102416975 83908046 68597936 56655206 48112731 41776190 36959572 33244741 30217733
7342 30217733 27788339 25863174 24239393 22501126 20871927 19583208 17871079 16466407
7334 16466407 15525793 14569417 13420476 12621545 11697162 11261873 11121887 10754480 10117708
7325 10117708 9541177 9076334 8851449 8268672 7752742 7599343 7566266 7554122 6764130 6131786
7315 6131786 6228055 6113996 5804480 5563005 5468867 5225376 4855732 4936976 4797048 4427980
7305 4427980 4493177 4269587 4161039 3829784 3736298 3830399 3645628 3164044 3097698 3389562
7295 3389562 3629242 3392323 2846926 3355441 3711783 2916306 2634962 2527680 2659003 2794536
7285 2794536 2730162 3070221 3062230 2664018 2340224 2415007 2396611 2262848 2221754 2019249 2029589
$$ packed form
7350A02416975j8508929j5310110j1942730q542475o336541m816618l714831l027008
7342C0217733k429394j925165j623781j738267j629199j288719j712129j404672
7334A6466407r40614r56376j148941p98931r24383m35289j39986l67407o36772
7325A0117708n76531m64843k24885n82777n15930j53399l3077j2144p89992o32344
7315F131786R6269j14059l09516k41475r4138k43491l69644Q1244j39928l69068
7305D427980O5197k23590j08548l31255r3486R4101j84771m81584o6346K91864
7295C389562K39680k36919n45397N08515L56342p95477k81344j07282J31323J35533
7285B794536o4374L40059p991l98212l23794P4783j8396j33763m1094k02505J0340
$$ plain form
7274 2029589 2013100 1703313 1661064 1869016 1778688 1789647 1882228 1434196 1709326 1574428
7264 1574428 1549261 1495426 1807064 1589440 1394296 1534084 1383528 1425251 1513522 1421409
7254 1421409 1155166 831836 1091928 875726 810866 1149147 1092909 926030 791708 802529
7244 802529 790122 1025835 1226307 1229836 910879 413419 996069 1150828 1189970 1152116 1122341
7233 1122341 722486 882998 726469 437955 728063 748612 682627 639302 419507 217747
7223 217747 173944 186811 -14056 490166 566105 440328 200590 280748 472416 548547 467880
7212 467880 559650 444576 876712 532585 209355 682058 555783 697296 495349 740700
7202 740700 410862 390226 297866 284284 235441 679117 967931 1059698 948303 670829 654028
$$ packed form
7274B029589j6489l09787m2249K07952r0328J0959R2581m48032K75130j34898
7264A574428k5167n3835L11638k17624j95144J39788j50556M1723Q8271r2113
7254A421409k66243l23330K60092k16202o4860L38281n6238j66879j34322J0821
7244H02529j2407K35713K00472L529l18957m97460N82650J54759L9142l7854k9775
7233A122341l99855J60512j56529k88514K90108K0549o5985m3325k19795k01760
7223B17747m3803J2867k00867N04222P5939j25777k39738Q0158J91668P6131q0667
7212D67880R1770j15074M32136l44127l23230M72703j26275J41513k01947K45351
7202G40700l29838k0636r2360j3582m8843M43676K88814R1767j11395k77474j6801
$$ plain form
7191 654028 882962 808578 1108847 836840 774686 427218 300605 1154256 850435 391900
7181 391900 731969 625105 458214 796270 491542 251854 403997 419174 401508 299285
7171 299285 103938 -237516 -52333 355281 312305 216776 728726 563074 579462 281052
7161 281052 394420 574629 783261 490536 408348 344477 213197 509597 370309 205474
7151 205474 401037 466202 5024 -44475 600534 888418 327488 95585 301895 -76639
7141 -76639 -6804 181250 472607 476634 465669 230352 -41395 564693 856185 366330 80835
7130 80835 181365 155471 -185563 84146 164158 43614 94541 298422 -11671 258941
7120 258941 538502 471087 683648 816126 508870 452061 787847 292337 217295 10387
$$ packed form
7191F54028K28934p4384L00269k72007o2154l47468j26613Q53651l03821m58535
7181C91900L40069j06864j66891L38056l04728k39688J52143J5177j7666j02223
7171B99285j95347l41454J85183M07614m2976r5529N11950j65652J6388k98410
7161B81052J13368J80209K08632k92725q2188o3871j31280K96400j39288j64835
7151B05474J95563O5165m61178m9499O45009K87884n60930k31903K06310l78534
7141g6639O9835J88054K91357M027j0965k35317k71747O06088K91492m89855k85495
7130H0835J00530k5894l41034K69709Q0012j20544N0927K03881l10093K70612
7120B58941K79561o7415K12561J32478l07256n6809L35786m95510p5042k06908
$$ plain form
7110 10387 160613 235926 229721 393402 190554 186122 342188 322436 611690 262412 126516
7099 126516 121431 338661 259819 195832 10454 226466 260570 281246 211767 184201 -134948
7088 -134948 -38346 137945 -17532 -39914 -121189 -210930 403713 543025 471161 151230 478233
7077 478233 622069 505459 195288 176990 666874 717960 553196 406687 447244 153387
7067 153387 354690 102757 229238 501911 499811 344182 222218 316016 21891 196648
7057 196648 576574 188800 405574 413112 222477 330025 484524 90760 -122374 -329578
7047 -329578 136561 222666 465836 477676 114214 670873 605791 725511 593686 441063
7037 441063 495366 742478 452969 555352 677608 226149 -322007 22945 179607 143490
$$ packed form
7110A0387J50226P5313o205J63681k02848m432J56066j9752K89254l49278j35896
7099A26516n085K17230p8842o3987j85378K16012L4104K0676o9479k7566l19149
7088a34948R6602J76291j55477k2382q1275q9741O14643J39312p1864l19931L27003
7077D78233J43836j16610l10171j8298M89884N1086j64764j46509M0557k93857
7067A53387K01303k51933J26481K72673k100j55629j21964R3798k94125J74757
7057A96648L79926l87774K16774P538j90635J07548J54499l93764k13134k07204
7047c29578M66139Q6105K43170J1840l63462N56659o5082J19720j31825j52623
7037D41063N4303K47112k89509J02383J22256m51459n48156L44952J56662l6117
$$ plain form
7027 143490 -127474 -3766 277828 389063 73053 267264 459730 661944 636527 448566
7017 448566 553657 471676 321324 466422 378417 90558 74121 170769 154199 -253612 92838
7006 92838 329010 403338 261608 368353 158355 271880 224774 33066 535636 931990
6996 931990 761592 794485 371921 249626 155674 624229 752221 443478 145444 92556
6986 92556 434026 254435 293260 432360 600479 324709 393511 518559 402635 253735
6976 253735 566200 492566 116673 83880 410248 514988 694869 786543 504579 540239
6966 540239 436823 840086 932902 751566 784167 974406 818616 700173 1002467 939647
6956 939647 543463 925122 876622 1042170 936426 854519 798113 1011216 1154963 1118201
$$ packed form
7027A43490k70964J23708K81594J11235l16010J94211J92466K02214k5417j87961
7017D48566J05091q1981j50352J45098q8005k87859j6437R6648j6570m07811L46450
7006I2838K36172P4328j41730J06745k09998J13525m7106j91708N02570L96354
6996I31990j70398L2893m22564j22295r3952M68555J27992l08743k98034n2888
6986I2556L41470j79591L8825J39100J68119k75770O8802J25048j15924j48900
6976B53735L12465p3634l75893l2793L26368J04740J79881R1674k81964L5660
6966E40239j03416M03263R2816j81336L2601J90239j55790j18443L02294o2820
6956I39647l96184L81659m8500J65548j05744q1907n6406K13103J43747l6762
$$ plain form
6946 1118201 801528 733976 761220 1140377 1295701 965555 918220 821499 918729 621662
6936 621662 769304 836842 612155 1041517 915173 983312 838801 706156 709937 657993 651727
6925 651727 631163 756792 725592 307700 165137 382705 355409 57721 403456 782773
6915 782773 459057 351963 424857 417907 276129 224643 446445 419756 -48774 -66150 523999
6904 523999 650026 833498 699689 579338 463555 540853 788786 667872 496872 -8543
6894 -8543 280328 197476 629562 347015 341645 236183 728591 865855 978847 602257 474039
6883 474039 793048 877914 617062 503015 659844 717351 507178 418672 915793 823091
6873 823091 645906 899885 1072529 1095164 1392244 1152033 1148548 857231 516808 682858
$$ packed form
6946A118201l16673o7552K7244L79157J55324l30146m7335r6721R7230k97067
6936F21662J47642O7538k24687M29362j26344O8139j44511j32645L781n1944o266
6925F51727k0564J25629l1200m17892j42563K17568k7296k97688L45735L79317
6915G82773l23716j07094P2894o950j41778n1486K21802k6689m68530j7376N90149
6904E23999J26027J83472j33809j20351j15783P7298K47933j20914j71000n05415
6894h543K88871q2852M32086k82547n370j05462M92408J37264J12992l76590j28218
6883D74039L19009Q4866k60852j14047J56829N7507k10173q8506M97121r2702
6873H23091j77185K53979J72644K2635K97080k40211l485k91317l40423J66050
$$ plain form
6863 682858 453311 671638 688135 741684 792971 676349 564516 845280 439152 455252
6853 455252 878197 965157 1148704 913518 1115520 960886 1097766 1299937 949312 429605
6843 429605 336916 460466 218092 186219 550530 443636 807472 845691 617553 594911
6833 594911 682056 926432 591230 568361 868702 637698 356106 512284 642732 988289
6823 988289 741926 744756 1054997 931710 836701 1230356 1049383 854086 1138023 846193
6813 846193 710384 772632 884662 1067093 1274051 1363850 1366893 1415016 1462044 1285678 1028115
6802 1028115 881728 906726 889913 1135160 1470941 1659770 1237056 1403517 1250057 1160121
6792 1160121 1286563 1027788 1182851 1332579 1001966 981221 1032818 1025060 1253978 1321186
$$ packed form
6863F82858k29547K18327J6497N3549N1287j16622j11833K80764m06128J6100
6853D55252M22945Q6960J83547k35186K02002j54634J36880K02171l50625n19707
6843D29605r2689J23550k42374l1873L64311j06894L63836L8219k28138k2642
6833E94911Q7145K44376l35202k2869L00341k31004k81592J56178J30448L45557
6823I88289k46363K830L10241j23287r5009L93655j80973j95297K83937k91830
6813H46193j35809O2248J12030J82431K06958Q9799L043M8123M7028j76366k57563
6802A028115j46387K4998j6813K45247L35781J88829m22714J66461j53460q9936
6792A160121J26442k58775J55063J49728l30613k0745N1597p758K28918O7208
$$ plain form
6782 1321186 794017 835272 960127 802699 900674 1083419 902332 796235 824656 959201
6772 959201 1146612 1005516 901867 709318 1198410 1110596 1259961 1719975 1207949 1218922
6762 1218922 1116447 1054117 1207179 968455 954502 1214497 1348895 1313257 945853 792250
6752 792250 1048388 1488278 1723245 1184808 968424 612135 735048 991090 1246893 1412043
6742 1412043 1526152 1605731 1880512 1996565 1642980 1644649 1415462 1448644 1295554 1009452
6732 1009452 1204465 1344416 1421810 980892 862241 1253827 1211877 1040750 1346111 1359103
6722 1359103 1243749 1766206 1901728 1964791 1846179 1865038 1495267 1390766 1423208 1696912
6712 1696912 1469385 1240595 1307864 1151126 1222405 1492347 1645696 1520846 1357240 1508351
$$ packed form
6782A321186n27169M1255J24855j57428R7975J82745j81087j06097K8421J34545
6772I59201J87411j41096j03649j92549M89092q7814J49365M60014n12026J0973
6762A218922j02475o2330J53062k38724j3953K59995J34398l5638l67404j53603
6752G92250K56138M39890K34967n38437k16384l56289J22913K56042K55803J65150
6742A412043J14109P9579K74781J16053l53585J669k29187L3182j53090k86102
6732A009452J95013J39951P7394m40918j18651L91586m1950j71127L05361J2992
6722A359103j15354N22457J35522O3063j18612J8859l69771j04501L2442K73704
6712A696912k27527k28790O7269j56738P1279K69942J53349j24850j63606J51111
$$ plain form
6702 1508351 1502161 927616 1217791 1108611 1611894 1688900 1490541 1708388 1537157 1781977
6692 1781977 1919861 1660721 1670852 1675237 1846259 2044329 1638284 1533034 1458740 1509848
6682 1509848 1959147 1865097 2059867 1940028 1499438 1760029 2020521 2104001 2016646 1954980
6672 1954980 2061868 2133945 1891086 1865074 1864674 1937414 1934615 2207048 1900396 2254216 2098971
6661 2098971 1770858 1690857 1425111 1366922 1635699 2046625 1848488 1606016 1682675 2098036
6651 2098036 2281513 2329145 2328085 2409227 2174379 2258944 2401860 2091916 2065354 2322207 2212889
6640 2212889 2049168 2041420 2212041 1974864 2174822 2476822 2659024 2349986 1869672 2161716
6630 2161716 2064287 1663725 1882113 2369577 2616177 2392084 2692594 2754807 2576910 2832072
$$ packed form
6702A508351o190n74545K90175j09180N03283P7006j98359K17847j71231K44820
6692A781977J37884k59140J0131M385J71022J98070m06045j05250p4294N1108
6682A509848M49299r4050J94770j19839m40590K60591K60492Q3480q7355o1666
6672A954980J06888P2077k42859k6012m00P2740k799K72433l06652L53820j55245
6661B098971l28113q0001k65746n8189K68777M10926j98137k42472P6659M15361
6651B098036J83477M7632j060Q1142k34848Q4565J42916l09944k6562K56853j09318
6640B212889j63721p748J70621k37177J99958L02000J82202l09038m80314K92044
6630B161716r7429m00562K18388M87464K46600k24093L00510O2213j77897K55162
$$ plain form
6620 2832072 2870497 2448769 2215337 2247509 2644673 2614623 2370565 2433444 2410287 2360171 2309557
6609 2309557 2150057 2547955 2680624 2645994 2687998 2846264 2814109 3105663 3058244 3258910
6599 3258910 3144564 3008825 3020980 2870025 2965969 2805191 2648913 2773533 2729486 2690068
6589 2690068 3254590 3083716 3336502 3409405 3502075 2925239 2934853 3367099 3307231 3206943
6579 3206943 3451069 3352493 2926340 3336504 3875846 3755705 3396514 3174371 3282124 3414855
6569 3414855 3843691 3667817 3515112 3591692 3761719 3889371 3609870 4115919 3891682 3957632
6559 3957632 3755698 3799773 3744701 4073586 4551950 4428133 4550325 4619279 4543470 4331052
6549 4331052 4782515 4425689 4252311 4085432 3834594 4035667 4383912 4432833 4535780 4890590
$$ packed form
6620B832072L8425m21728k33432L2172L97164l0050k44058O2879k3157n0116n0614
6609B309557j59500L97898J32669l4630M2004J58266l2155K91554m7419K00666
6599C258910j14346j35739J2155j50955R5944j60778j56278J24620m4047l9418
6589B690068N64522j70874K52786P2903R2670n76836R614M32246n9868j00288
6579C206943K44126r8576m26153M10164N39342j20141l59191k22143J07753J32731
6569C414855M28836j75874j52705P6580J70027J27652k79501N06049k24237O5950
6559C957632k01934M4075n5072L28885M78364j23817J22192O8954p5809k12418
6549D331052M51463l56826j73378j66879k50838K01073L48245M8921J02947L54810
$$ plain form
6539 4890590 4663462 4827092 4992380 4768531 4663128 4877431 4948067 4924313 5388236 4806756
6529 4806756 4627222 5107127 5700428 5709758 5341336 5173619 5157473 5095466 5173588 5387320
6519 5387320 5650677 5521458 5854464 5748756 5812380 5992855 6015476 5785783 5781529 5773539 5800589
6508 5800589 6333774 6382394 6264397 5824806 6238469 6445717 6245136 6231060 6172237 5963100
6498 5963100 6364159 6648553 6747775 6543659 6519984 6549990 6350987 6634322 7086426 7134712
6488 7134712 6822540 7084616 7282708 6839398 7459721 7400193 7546976 7634191 7801132 7957582
6478 7957582 7961144 8079244 8009199 7840918 8143544 8271453 8286047 8406281 8039710 7965399
6468 7965399 8110794 8535741 8617369 8829998 8921591 8514333 8725588 8928182 8939774 9223111
$$ packed form
6539D890590k27128J63630J65288k23849j05403K14303P0636k3754M63923n81480
6529D806756j79534M79905N93301R330l68422j67717j6146o2007P8122K13732
6519E387320K63357j29219L33006j05708O3624J80475K2621k29693m254p990K7050
6508E800589N33185M8620j17997m39591M13663K07248k00581j4076n8823k09137
6498E963100M01059K84394R9222k04116k3675L0006j99003K83335M52104M8286
6488G134712l12172K62076J98092m43310O20323n9528J46783Q7215J66941J56450
6478G957582L562J18100p0045j68281L02626J27909J4594J20234l66571p4311
6468G965399J45395M24947Q1628K12629R1593m07258K11255K02594J1592K83337
$$ plain form
6458 9223111 9157928 9202748 9528450 9904893 9642864 9708100 9791698 10019560 10086310 10174354 10340187
6447 10340187 10244880 10141107 10768541 10717353 10368695 10847402 11167176 10772480 10517278 10697082
6437 10697082 10890318 11334805 11180637 11040709 11338947 11418259 11889232 12133222 11966445 12081303
6427 12081303 12587089 12853483 13269468 13021666 13031783 12768076 12880280 13256066 13440968 13585026
6417 13585026 13514926 13885420 13962997 14282826 14666046 14838853 14906254 15344939 15167692 15289248
6407 15289248 15221088 15255708 15749928 15867868 15850858 16194762 16449644 16389580 16346245 16864717
6397 16864717 16986509 17317470 17383860 18132831 18337483 18279722 18539212 18256185 18575749 18978010
6387 18978010 19018479 19445045 19691385 19874282 20039238 20550407 20390664 20701992 21394454 21947140
$$ packed form
6458I223111o5183M4820L25702L76443k62029O5236Q3598K27862O6750Q8044J65833
6447A0340187r5307j03773O27434n1188l48658M78707L19774l94696k55202J79804
6437A0697082J93236M44487j54168j39928K98238P9312M70973K43990j66777J14858
6427A2081303N05786K66394M15985k47802J0117k63707J12204L75786J84902J44058
6417A3585026p0100L70494P7577L19829L83220J72807O7401M38685j77247J21556
6407A5289248o8160L4620M94220J17940j7010L43904K54882o0064m3335N18472
6397A6864717J21792L30961O6390P48971K04652n7761K59490k83027L19564M02261
6387A8978010M0469M26566K46340J82897J64956N11169j59743L11328O92462N52686
$$ plain form
6377 21947140 22516528 22466959 22772958 22691452 22696259 23050468 23175731 23819137 24422408 24265398
6367 24265398 24293294 24791759 25310968 25745330 25981095 26412851 26965327 27104804 27990304 28402900
6357 28402900 28393072 28853640 29594044 29864300 30207262 30774815 31405493 32048340 32741375 33231278
6347 33231278 33616334 34446795 34917382 35341687 35674809 36324781 37273154 37839115 38581222
6338 38581222 39726848 40437078 41126395 41987670 42544741 43403720 43773805 44585210 45454700
6329 45454700 46711251 47917237 48822643 49818190 50853909 52089959 52645938 53615326 54739825
6320 54739825 56260475 57846133 59003484 60157545 60840791 62267365 63767822 65657247
6312 65657247 67530382 68665194 69969805 71744119 73659577 75363229 76879042 78948503
$$ packed form
6377B1947140N69388m9569L05999q1506M807L54209J25263O43406O03271j57010
6367B4265398K7896M98465N19209M34362K35765M31756N52476J39477Q85500M12596
6357B8402900r828M60568P40404K70256L42962N67553O30678O42847O93035M89903
6347C3231278L85056Q30461M70587M24305L33122O49972R48373N65961P42107
6338C8581222J145626P10230O89317Q61275N57071Q58979L70085Q11405Q69490
6329D5454700J256551J205986R05406R95547J035719J236050N55979R69388J124499
6320E4739825J520650J585658J157351J154061O83246J426574J500457J889425
6312F5657247J873135J134812J304611J774314J915458J703652J515813K069461
$$ plain form
6304 78948503 80848661 82696616 84677844 86657601 89202821 91065117 92839740 95281624
6296 95281624 97897587 100172973 102590571 105552653 108387501 111401845 114271758 117010908
6288 117010908 119911817 123272258 126446692 130463804 134167090 137894258 141528014 146017322
6280 146017322 150771637 155097475 159456812 164047415 169089449 174496574 180104733 185379396
6272 185379396 191587120 197605211 203808287 210704744 217550215 224898845 232699213 241088358
6264 241088358 249478661 258289776 267685648 277174438 286893724 296710634 307541074 318742062
6256 318742062 329844431 341751252 354553239 367257543 380132119 392794632 406015510
6249 406015510 419195434 432236370 444739111 457285891 469052845 479575244 489985067
$$ packed form
6304G8948503J900158J847955J981228J979757K545220J862296J774623K441884
6296I5281624K615963K275386K417598K962082K834848L014344K869913K739150
6288A17010908K900909L360441L174434M017112L703286L727168L633756M489308
6280A46017322M754315M325838M359337M590603N042034N407125N608159N274663
6272A85379396O207724O018091O203076O896457O845471P348630P800368Q389145
6264B41088358Q390303Q811115R395872R488790R719286R816910J0830440J1200988
6256C18742062J1102369J1906821J2801987J2704304J2874576J2662513J3220878
6249D06015510J3179924J3040936J2502741J2546780J1766954J0522399J0409823
$$ plain form
6242 489985067 499691788 507523446 513792344 518445897 521595674 523057252 522228409 519590558
6234 519590558 515357842 509663546 502251031 493254200 483274928 472573074 460646766 448256924
6226 448256924 435585484 422045222 408594287 395250689 381654732 368094325 354922963
6219 354922963 341715860 330008754 318073842 306230279 295019168 284403481 274305884
6212 274305884 264568350 255185551 246600516 237681515 229319351 221457020 213828619 206578342
6204 206578342 199409224 193076645 187102622 180886958 175312732 170138269 164722618 159471063
6196 159471063 154422894 149944529 145394189 141114684 137229857 133367678 129470193 125846315
6188 125846315 121910202 118311044 115251783 112094744 109103382 106351676 103483804 101076240
$$ packed form
6242D89985067R706721P831658O268898M653553L149777J461578q28843k637851
6234E19590558m232716n694296p412515q996831r979272j0701854j1926308j2389842
6226D48256924j2671440j3540262j3450935j3343598j3595957j3560407j3171362
6219C54922963j3207103j1707106j1934912j1843563j1211111j0615687j0097597
6212B74305884r737534r382799q585035q919001q362164p862331p628401p250277
6204B06578342p169118o332579n974023o215664n574226n174463n415651n251555
6196A59471063n048169m478365m550340m279505l884827l862179l897485l623878
6188A25846315l936113l599158l059261l157039k991362k751706k867872k407564
$$ plain form
6180 101076240 98419706 95882837 93808249 91668193 89199998 87301976 85464303 83446419
6172 83446419 81423806 79593916 77701726 75855614 74304048 72701020 70964886 69780152
6164 69780152 68264624 66857629 65464887 63974874 62588611 61392692 60293211 59252981
6156 59252981 58059095 56585476 55016428 54010085 53251715 52500917 51366553 50691539 49387893
6147 49387893 48100791 47291449 46606061 45967675 45475224 44800139 43543837 42923569 42237514
6138 42237514 41400228 40888104 40050429 39456811 38654341 37711862 36952253 36656206 35948087
6129 35948087 35517383 34887582 34273061 34073520 33523846 33102694 32192702 31973094 31570545
6120 31570545 30872629 30208286 30147359 29382216 28846066 28116205 28178125 27954191 27629020 26951795
$$ packed form
6180A01076240k656534k536869k074588k140056k468195j898022j837673k017884
6172H3446419k022613j829890j892190j846112j551566j603028j736134j184734
6164F9780152j515528j406995j392742j490013j386263j195919j099481j040230
6156E9252981j193886j473619j569048j006343p58370p50798j134364o75014j303646
6147D9387893j287102q09342o85388o38386m92451o75085j256302o20268o86055
6138D2237514q37286n12124q37675n93618q02470r42479p59609k96047p08119
6129C5948087m30704o29801o14521j99541n49674m21152r09992k19608m02549
6120C1570545o97916o64343o0927p65143n36150p29861O1920k23934l25171o77225
$$ plain form
6110 26951795 26197636 25887422 25631335 25356589 25215580 25148367 24371849 24133000 23987966 23740443
6100 23740443 23260665 23042829 22885139 22530645 22447163 22227166 22047835 21750134 21330497 20895193
6090 20895193 21072480 20933483 20599717 20263208 20315812 20200971 20004675 19944845 19658174 19235377
6080 19235377 18699957 18682987 18787507 18390041 18000297 18254146 18075719 17850507 17619603 17517633
6070 17517633 17372994 16898690 16794620 16529091 16810284 16919840 17095946 17231906 17394219
6061 17394219 17274640 16618015 16887861 16700296 16308371 16313424 16642131 16394560 16872712 16657522
6051 16657522 16726424 16996791 16703826 16499657 16235134 16487973 16287745 15977093 16681538 16495987
6041 16495987 16418029 16371213 16263234 16746974 16930943 17444545 17740908 17585466 17835086 18311952
$$ packed form
6110B6951795p54159l10214k56087k74746j41009o7213p76518k38849j45034k47523
6100B3740443m79778k17836j57690l54494q3482k19997j79331k97701m19637m35304
6090B0895193J77287j38997l33766l36509N2604j14841j96296n9830k86671m22797
6080A9235377n35420j6970J04520l97466l89744K53849j78427k25212k30904j01970
6070A7517633j44639m74304j04070k65529K81193J09556J76106J35960J62313
6061A7394219j19579o56625K69846j87565l91925N053L28707k47571M78152k15190
6051A6657522O8902K70367k92965k04169k64523K52839k00228l10652P04445j85551
6041A6495987p7958m6816j07979M83740J83969N13602K96363j55442K49620M76866
$$ plain form
6031 18311952 18389283 18216955 18370352 18725621 19189166 19130237 19172749 19483483 19964488 19891388
6021 19891388 19798013 20409185 20236117 20799893 21448732 21821293 22070825 22541304 22646724 23291264
6011 23291264 24154887 24582713 24721100 25083274 25493264 26035139 26816825 27511513 27629384
6002 27629384 28352412 29319372 29860050 30305850 30691005 31376530 31499474 32199506 32916368
5993 32916368 32998121 33475904 33882973 34372194 34732054 35255052 35683607 35924218 35808923 36249075
5983 36249075 36829495 36754725 36722979 36686504 36908590 36763065 36326374 36625302 37055535 37156112
5973 37156112 37580505 37693139 38026557 38175280 38750544 39548107 40044736 40236825 40397337
5964 40397337 40240464 40409476 40651545 40617473 40775148 40878363 40681516 40782578 40792620 40382469
$$ packed form
6031A8311952P7331j72328J53397L55269M63545n8929M2512L10734M81005p3100
6021A9891388r3375O11172j73068N63776O48839L72561K49532M70479J05420O44540
6011B3291264Q63623M27826J38387L62174M09990N41875P81686O94688J17871
6002B7629384P23028R66960N40678M45800L85155O85525J22944P00032P16862
5993C2916368Q1753M77783M07069M89221L59860N22998M28555K40611j15295M40152
5983C6249075N80420p4770l1746l6475K22086j45525m36691K98928M30233J00577
5973C7156112M24393J12634L33418J48723N75264P97563M96629J92089J60512
5964D0397337j56873J69012K42069l4072J57675J03215j96847J01062J0042m10151
$$ plain form
5954 40382469 40155894 39764316 39622520 39427824 39211364 39815239 39463428 39524115 39821536 39877932
5944 39877932 40288220 40510659 40853993 40689963 41093656 41465177 41219307 41195113 41084891 41023864
5934 41023864 40650708 40701707 40919054 40774851 40618248 40661320 40848636 41280815 41790305 41867101
5924 41867101 41349736 41561878 42033532 42781564 42895783 43578689 44719386 45316799 46611863
5915 46611863 48105655 49434288 51045287 53277676 55429777 58764112 61454875 65085974
5907 65085974 69433321 73646985 78206046 83502452 89083294 94955233 100659170 106254158
5899 106254158 111767347 116128186 118646103 119452004 118247316 115445746 111752703 107393229
5891 107393229 102653726 97445946 92936093 89230092 86341735 84115707 82410110 81398103
$$ packed form
5954D0382469k26575l91578j41796j94696k16460O03875l51811O0687K97421N6396
5944C9877932M10288K22439L43334j64030M03693L71521k45870k4194j10222o1027
5934D1023864l73156N0999K17347j44203j56603M3072J87316M32179N09490P6796
5924D1867101n17365K12142M71654P48032J14219O82906J140697N97413J295064
5915D6611863J493792J328633J610999K232389K152101L334335K690763L631099
5907F5085974M347347M213664M559061N296406N580842N871939N703937N594988
5899A06254158N513189M360839K517917Q05901j204688k801570l693043m359474
5891A07393229m739503n207780m509853l706001k888357k226028j705597j012007
$$ plain form
5883 81398103 80626742 80770336 80651935 80745166 81226273 81787060 81991388 81400161 80080077
5874 80080077 78514343 76717527 74128156 70727218 66935632 63170517 59221425 55295814
5866 55295814 51613025 47971881 45108180 42516644 39932749 37634460 35509433 33867027
5858 33867027 32021526 30300312 28753310 27834109 27280018 25959369 24551894 24196305 23418996
5849 23418996 22480080 22018074 21064094 20408782 19594242 18953648 18136186 17570902 17337292
5840 17337292 16482924 15921903 16092712 15530144 14824499 14646122 14050007 13999112 13924909 13552090
5830 13552090 12869952 12515476 12272220 11968620 11729816 11920853 11511091 10633510 10531564
5821 10531564 10524288 10262727 9854143 9823278 10210827 9638899 9642776 9459551 9028822 8752243
$$ packed form
5883H1398103p71361J43594j18401R3231M81107N60787K04328n91227j320084
5874H0080077j565734j796816k589371l400938l791586l765115l949092l925611
5866E5295814l682789l641144k863701k591536k583895k298289k125027j642406
5858C3867027j845501j721214j547002r19201n54091j320649j407475l55589p77309
5849B3418996r38916m62006r53980o55312q14540o40594q17462n65284k33610
5840A7337292q54368n61021J70809n62568p05645j78377n96115n0895p4203l72819
5830A3552090o82138l54476k43256l03600k38804J91037m09762q77581j01946
5821A0531564p276k61561m08584l0865L87549n71928L877j83225m30729k76579
$$ plain form
5811 8752243 8656074 8102507 8049217 8152218 8263043 8120901 7740652 7554506 7470078 7372826
5801 7372826 7151728 7059814 6817302 6734825 7008398 6529923 6153825 6255728 6214046 5992164
5791 5992164 5681502 5622488 5742671 5622758 5362750 5706963 5592524 5201679 5082543 5214198
5781 5214198 4846317 4761627 4680701 4431334 4596605 4272690 4286239 4092946 4273296 4327047
5771 4327047 4449403 4119889 3587297 3323497 3434346 4075943 3985208 4140569 3899456 3892828
5761 3892828 3783305 3609689 3354631 2925983 2983116 3183368 3481627 3177789 3065466 3117357
5751 3117357 2872697 3033919 2901635 2731665 2368328 2497345 2799395 3563385 3480754 3009304
5741 3009304 2497840 2611803 2750853 2524569 2743060 2682148 2328465 2143970 2558230 2709425
$$ packed form
5811H752243r6169n53567n3290J03001J10825j42142l80249j86146q4428r7252
5801G372826k21098r1914k42512q2477K73573m78475l76098J01903m1682k21882
5791E992164l10662n9014J20183j19913k60008L44213j14439l90845j19136J31655
5781E214198l67881q4690q0926k49367J65271l23915J3549j93293J80350N3751
5771D327047J22356l29514n32592k63800J10849O41597r0735J55361k41113o628
5761C892828j09523j73616k55058m28648N7133K00252K98259l03838j12323N1891
5751C117357k44660J61222j32284j69970l63337J29017L02050P63990q2631m71450
5741C009304n11464J13963J39050k26284K18491o0912l53683j84495M14260J51195
$$ plain form
5731 2709425 2213174 2073893 2148574 2151089 2135983 2442550 2476379 2191415 2135030 1980971 1974545
5720 1974545 2185314 2008295 2059630 1928052 2012941 2337599 2468623 2264393 2076678 2403520
5710 2403520 2621481 2678147 2186900 1700401 1429528 1473691 1850523 1713601 1628227 1817359
5700 1817359 1940106 1834352 1836747 1596475 1647914 1845116 1780713 1753810 1818879 1907384 1749844
5689 1749844 1409966 1883004 1758244 1648063 1611415 847127 1217003 1579515 1629541 1673321
5679 1673321 1700891 1725497 1849934 1399231 1071462 1458264 1785051 2146428 1918496 1498375
5669 1498375 1562280 1724218 1412770 1033725 1017761 1333681 1288606 1536930 1916587 1713038
5659 1713038 1688985 1361359 1460110 1389795 1456133 1215169 1062627 986287 1037198 1436887 1368521
$$ packed form
5731B709425m96251j39281P4681K515j5106L06567L3829k84964n6385j54059o426
5720A974545K10769j77019N1335j31578Q4889L24658J31024k04230j87715L26842
5710B403520K17961N6666m91247m86499k70873M4163L76832j36922q5374J89132
5700A817359J22747j05754K395k40272N1439J97202o4403k6903O5069Q8505j57540
5689A749844l39878M73038j24760j10181l6648p64288L69876L62512N0026M3780
5679A673321K7570K4606J24437m50703l27769L86802L26787L61377k27932m20121
5669A498375O3905J61938l11448l79045j5964L15920m5075K48324L79657k03549
5659A713038k4053l27626R8751p0315O6338k40964j52542p6340N0911L99689o8366
$$ plain form
5648 1368521 1343052 1121033 1233694 1399434 1108641 1065349 794172 1069356 1334596 1072041
5638 1072041 783179 1091240 1393574 1219268 1308123 1555069 1274596 1253344 923456 1286816
5628 1286816 1284944 1254022 1554170 1715093 1538282 1064654 1136054 1521033 1367848 1636953
5618 1636953 1392752 1074890 1180347 1217351 1583959 1509599 1229910 1167593 926285 1193148
5608 1193148 1640807 1556533 1406198 1547942 1602015 1456368 1722257 1600258 1241008 1376590
5598 1376590 1412676 1234872 1076728 1088381 1254293 1103534 897958 823486 1007523 1411388
5588 1411388 987039 971798 1216005 1398564 1453091 1206634 1044758 941168 1127593 852069
5578 852069 930607 1084558 1257614 1390151 1290775 925211 1154131 1456178 1636992 1124123
$$ packed form
5648A368521k5469k22019J12661J65740k90793m3292k71177K75184K65240k62555
5638A072041k88862L08061L02334j74306Q8855K46946k80473k1252l29888L63360
5628A286816j872l0922L00148J60923j76811m73628P1400L84979j53185K69105
5618A636953k44201l17862J05457L7004L66608p4360k79689o2317k41308K66863
5608A193148M47659q4274j50335J41744N4073j45647K65889j21999l59250J35582
5598A376590L6086j77804j58144J1653J65912j50759k05576p4472J84037M03865
5588A411388m24349j5241K44207J82559N4527k46457j61876j03590J86425k75524
5578H52069P8538J53951J73056J32537r9376l65564K28920L02047J80814n12869
$$ plain form
5568 1124123 1612687 1928208 1661752 1591669 1932094 1625902 1446561 1420201 961520 1385300
5558 1385300 1932174 1441340 1236766 1279083 1724178 1594038 1302576 1323711 1457326 1493724
5548 1493724 1717469 1595263 1492765 1093703 1054114 1372553 1436279 1099958 1150470 1271812
5538 1271812 1375587 1439382 1312313 1122164 1209996 1539755 1147815 1029098 1297007 1083631
5528 1083631 1031933 1069181 935099 1112696 767631 900348 584563 634325 820925 634024
5518 634024 794286 1030299 921767 921031 1247092 989258 1019983 1026193 871140 1120056 1124698
5507 1124698 884737 785547 896603 680625 978269 592371 790869 694146 824829 685624
5497 685624 809404 601377 525173 732225 434930 440480 943953 995949 765188 1008394
$$ packed form
5568A124123M88564L15521k66456p0083L40425l06192j79341k6360m58681M23780
5558A385300N46874m90834k04574M2317M45095j30140k91462K1135J33615L6398
5548A493724K23745j22206j02498l99062l9589L18439O3726l36321N0512J21342
5538A271812J03775O3795j27069j90149Q7832L29759l91940j18717K67909k13376
5528A083631n1698L7248j34082J77597l45065J32717l15785M9762J86600j86901
5518F34024J60262K36013j08532p36L26061k57834L0725O210j55053K48916M642
5507A124698k39961r9190J11056k15978K97644l85898J98498r6723J30683j39205
5497F85624J23780k08027p6204K07052k97295N550N03473N1996k30761K43206
$$ plain form
5487 1008394 1060911 818317 963117 518972 515086 599613 1009138 1134572 1055257 557879
5477 557879 73776 330099 295215 357892 247212 247280 419972 913726 631292 618772 556307
5466 556307 300338 459176 833600 532131 316071 294220 606057 866667 555477 626913
5456 626913 837379 732687 700463 766886 1193809 843298 921997 809130 520225 1014590
5446 1014590 976364 1043437 775658 567919 672184 430683 839082 696950 626962 759035
5436 759035 826287 924582 967040 826723 885301 794128 458927 368444 625568 476199 361472
5425 361472 794636 904227 927546 480276 368120 490498 442231 574435 171413 252644
5415 252644 489534 682019 680011 334238 411423 485339 469645 762441 554503 496213 544635
$$ packed form
5487A008394N2517k42594J44800m44145l886Q4527M09525J25434p9315m97378
5477E57879m84103K56323l4884O2677j10680O8J72692M93754k82434j2520o2465
5466E56307k55969J58838L74424l01469k16060k1851L11837K60610l11190P1436
5456F26913K10466j04692l2224O6423M26923l50511P8699j12867k88905M94365
5446A014590l8226O7073k67779k07739J04265k41501M08399j42132o9988J32073
5436G59035O7252R8295M2458j40317N8578r1173l35201r0483K57124j49369j14727
5425C61472M33164J09591K3319m47270j12156J22378m8267J32204m03022Q1231
5415B52644K36890J92485k008l45773P7185P3916j5694K92796k07938n8290M8422
$$ plain form
5404 544635 904998 783220 300697 271039 -82303 402877 693265 666880 443831 395085
5394 395085 711084 836858 564624 755968 579732 577555 761787 706441 409211 501121
5384 501121 634264 399051 230227 269272 632327 941516 450295 54220 -172659 -112955
5374 -112955 628096 762002 412110 459837 455794 611366 597134 548880 575569 736711 837205
5363 837205 730734 657820 489163 553079 502039 595865 488095 494461 544543 824881 808345
5352 808345 569467 869220 854584 612542 523693 950088 1272330 832996 781537 1122046
5342 1122046 915508 439975 626079 457908 590471 394601 343113 515776 419897 502063
5332 502063 290893 598367 492424 702846 657890 917076 387922 413 392931 881832
$$ packed form
5404E44635L60363j21778m82523k9658l53342M85180K90388k6385k23049m8746
5394C95085L15999J25774k72234J91344j76236k177J84232n5346k97230R1910
5384E01121J33143k35213j68824L9045L63055L09189m91221l96075k26879N9704
5374a12955P41051J33906l49892M7727m043J55572j4232m8254K6689J61142J00494
5363H37205j06471p2914j68657O3916n1040R3826j07770O366N0082K80338j6536
5352H08345k38878K99753j4636k42042q8849M26395L22242m39334n1459L40509
5342A122046k06538m75533J86104j68171J32563j95870n1488J72663r5879Q2166
5332E02063k11170L07474j05943K10422m4956K59186n29154l87509L92518M88901
$$ plain form
5322 881832 1002669 858419 691613 355612 380567 184881 364666 670494 631904 440312
5312 440312 637566 634935 468798 409261 755375 729873 818338 948108 1136360 1236385 1292160
5301 1292160 938445 1141091 818600 1037249 872048 1171505 1420877 550848 755631 1084780
5291 1084780 1150192 1258109 1034778 1035610 1245922 1067180 1423308 963854 951925 1111690
5281 1111690 878594 947160 1212220 1112200 1410263 1351232 835983 998332 1149073 1202771
5271 1202771 965060 1127340 965002 722181 993044 714281 858596 895871 831240 788938
5261 788938 952612 1337219 903426 625556 1316904 1295993 1227366 1207577 1057057 1499785
5251 1499785 952036 1099300 1451446 1090445 1031228 1150824 944520 737361 893499 940784
$$ packed form
5322H81832J20837j44250j66806l36001K4955j95686J79785L05828l8590j91592
5312D40312J97254k631j66137n9537L46114k5502Q8465J29770J88252J00025N5775
5301A292160l53715K02646l22491K18649j65201K99457K49372q70029K04783L29149
5291A084780O5412J07917k23331Q32K10312j78742L56128m59454j1929J59765
5281A111690k33096O8566K65060j00020K98063n9031n15249J62349J50741N3698
5271A202771k37711J62280j62338k42821K70863k78763J44315L7275o4631m2302
5261G88938J63674L84607m33793k77870O91348k0911o8627j9789j50520M42728
5251A499785n47749J47264L52146l61001n9217J19596k06304k07159J56138M7285
$$ plain form
5241 940784 1098663 973799 962096 944200 628602 984258 950328 1000918 1162776 958720
5231 958720 802188 760708 819353 684483 878639 872980 825104 926675 1013901 819816 675326
5220 675326 949376 1185075 1149407 1003031 780230 959899 850103 786770 975492 931532
5210 931532 945186 536065 646017 547734 354272 556631 494299 699162 636915 905133
5200 905133 827373 656481 1052321 951648 574638 470891 1047017 1241929 1230801 1118095
5190 1118095 833957 1245379 1128060 657637 691791 353696 624436 773538 616695 993961
5180 993961 1057117 763363 440437 553361 684723 978020 500091 360235 557513 412984
5170 412984 521989 1094033 828092 823552 1111049 1226984 1341472 928316 1123128 1168875
$$ packed form
5241I40784J57879j24864j1703j7896l15598L55656l3930N0590J61858k04056
5231I58720j56532m1480N8645j34870J94156n659m7876J01571Q7226j94085j44490
5220F75326K74050K35699l5668j46376k22801J79669j09796o3333J88722m3960
5210I31532J3654m09121J09952r8283j93462K02359o2332K04863o2247K68218
5200I05133p7760j70892L95840j00673l77010j03747N76126J94912j1128j12706
5190A118095k84138M11422j17319m70423L4154l38095K70740J49102j56843L77266
5180I93961O3156k93754l22926J12924J31362K93297m77929j39856J97278j44529
5170D12984J09005N72044k65941m540K87497J15935J14488m13156J94812M5747
$$ plain form
5160 1168875 1289335 1003049 783766 989292 812041 641866 919161 1112382 966126 1024787
5150 1024787 1093209 905542 684497 630997 665065 475727 668436 736340 524970 503950
5140 503950 706389 768188 840694 786509 825725 891239 1178832 1352851 1034527 1458480 1245328
5129 1245328 1220337 997057 977707 909333 927169 1006554 1061040 1244920 999076 1123415 899900
5118 899900 1136882 1040204 545492 674182 982909 1101951 1273216 1396287 1315202 1173234
5108 1173234 1060214 1426623 1325898 1433705 1638911 1370462 1213425 1189954 1324213 1438639
5098 1438639 1393076 1188174 1131662 1132036 1124297 1413203 1601400 1534051 1513956 1389760 1450341
5087 1450341 1492713 1512671 1623971 1809605 1657689 1581607 1749159 1617094 1597649 1674063
$$ packed form
5160A168875J20460k86286k19283K05526j77251j70175K77295J93221j46256N8661
5150A024787O8422j87667k21045n3500L4068j89338J92709O7904k11370k1020
5140E03950K02439O1799P2506n4185L9216O5514K87593J74019l18324M23953k13152
5129A245328k4991k23280j9350o8374J7836P9385N4486J83880k45844J24339k23515
5118H99900K36982r6678m94712J28690L08727J19042J71265J23071q1085j41968
5108A173234j13020L66409j00725J07807K05206k68449j57037k3471J34259J14426
5098A438639m5563k04902n6512L74p739K88906J88197o7349k0095j24196O0581
5087A450341M2372J9958J11300J85634j51916p6082J67552j32065j9445P6414
$$ plain form
5077 1674063 1838387 2278008 1983577 1736519 1607056 1875545 1937200 2278877 1975124 1765955
5067 1765955 1835340 1721953 1938708 1928866 1720078 2089359 2059963 2007402 2042760 2075522 2347083
5056 2347083 2038250 1581617 1792622 1995352 2182715 2536746 2663105 2635182 2858991 2881458
5046 2881458 2763124 2648587 2654631 2520395 2231450 2181373 2640560 2963091 2719712 2852109
5036 2852109 3014811 2912424 2908425 3195153 3747003 3750658 3490574 3301883 3496789 3597925
5026 3597925 3474693 3404505 3147074 3334187 3588643 3962454 3785276 4085462 4150385 4045922
5016 4045922 4420669 4588528 4670001 4987256 5175501 5371756 5134737 5633959 5669343 5618022
5006 5618022 5606351 5504692 6021856 6678716 6638043 6830710 7008749 7374143 7401171 7981181
$$ packed form
5077A674063J64324M39621k94431k47058j29463K68489O1655L41677l03753k09169
5067A765955O9385j13387K16755r842k08788L69281k9396n2561L5358L2762K71561
5056B347083l08833m56633K11005K02730J87363L54031J26359k7923K23809K2467
5046B881458j18334j14537O044j34236k88945n0077M59187L22531k43379J32397
5036B852109J62702j02387l999K86728N51850L655k60084j88691J94906J01136
5026C597925j23232p0188k57431J87113K54456L73811j77178L00186O4923j04463
5016D045922L74747J67859Q1473L17255J88245J96255k37019M99222L5384n1321
5006E618022j1671j01659N17164O56860m0673J92667J78039L65394K7028N80010
$$ plain form
4996 7981181 8323890 8497574 9110836 9220173 9440239 9762889 10140517 10616669 10988668 11659348
4986 11659348 12172386 12202075 12489774 12525688 12458217 12645337 13262463 13737187 13993133 14181839
4976 14181839 14177360 14497393 14810551 14700155 14541229 14655675 14356334 14742175 15048831 14908720
4966 14908720 14480966 14906332 14978972 14876890 14994846 14832230 14638097 14505092 14909844 15001089
4956 15001089 15362227 15433973 15386774 15774499 16119495 16427173 16817137 17188438 17846576 18272855
4946 18272855 18455322 19034671 19699429 20187503 20709310 21042239 21436322 21539764 22144325
4937 22144325 22627418 23300833 23628701 23632474 23948767 24516331 24187385 24127640 24364360 24621966
4927 24621966 24769753 24818651 24836768 25391518 25741299 25486861 25044086 24857272 24392421 23984735
$$ packed form
4996G981181L42709J73684O13262J09337K20066L22650L77628M76152L71999O70680
4986A1659348N13038K9689K87699L5914o7471J87120O17126M74724K55946J88706
4976A4181839m479L20033L13158j10396j58926J14446k99341L85841L06656j40111
4966A4908720m27754M25366P2640j02082J17956j62616j94133j33005M04752R1245
4956A5001089L61138P1746m7199L87725L44996L07678L89964L71301O58138M26279
4946A8272855J82467N79349O64758M88074N21807L32929L94083J03442O04561
4937B2144325M83093O73415L27868L773L16293N67564l28946n9745K36720K57606
4927B4621966J47787M8898J8117N54750L49781k54438m42775j86814m64851m07686
$$ plain form
4917 23984735 24189069 23979658 23597043 23018498 22566984 22324133 21860830 21719599 21468004
4908 21468004 20815219 20616699 20494293 20648176 20769425 20231287 19631162 19602550 19901723 19896113
4898 19896113 19924952 19902597 19823115 20019334 20295194 20101615 20173134 20350506 20078245 20067035
4888 20067035 20547613 20503235 20511255 20048333 20133067 20192182 20036655 20208217 20024223 19722283
4878 19722283 18994932 18881992 19009860 18424144 17885160 17380144 17124524 16813605 16169864
4869 16169864 15905008 15894485 15541798 14448117 13673763 13204248 12980728 12934766 12044366 11788011
4859 11788011 11696514 11112041 10376686 9990657 10034212 10051123 9796209 9303617 8533628 8043449
4849 8043449 8213636 8383873 7765761 7245146 7011041 7169581 7142600 7332721 7245625 6744931
$$ packed form
4917B3984735K04334k09411l82615n78545m51514k42851m63303j41231k51595
4908B1468004o52785j98520j22406J53883J21249n38138o00125k8612K99173n610
4898A9896113K8839k2355p9482J96219K75860j93579P1519J77372k72261j1210
4888B0067035M80578m4378Q020m62922Q4734N9115j55527J71562j83994l01940
4878A9722283p27351j12940J27868n85716n38984n05016k55620l10919o43741
4869A6169864k64856j0523l52687j093681p74354m69515k23520m5962q90400k56355
4859A1788011r1497n84473p35355l86029M3555J6911k54914m92592p69989m90179
4849H043449J70187J70237o18112n20615k34105J58540k6981J90121q7096n00694
$$ plain form
4839 6744931 6849705 6564352 6821351 6486549 6066142 5650720 5646297 6121008 6239318 5904766
4829 5904766 5907124 5728768 6005505 5951033 5939166 5721373 5306577 5774542 5717914 5607546
4819 5607546 5904553 5497380 5726330 5659653 5898475 5500743 5551522 6106620 6543800 6139989
4809 6139989 5849569 6176832 6667034 6531742 6669459 7007899 6762818 6857608 7165895 7328539
4799 7328539 7566149 7887177 8070548 8228410 8146433 8579647 9027912 9165280 9835585 9735528
4789 9735528 9899853 10360615 10397984 10853636 11344229 11429817 11689556 12327508 12472734 12885570
4779 12885570 13244482 13497659 13675849 14148089 14454150 14175048 14099736 14391142 14789013 15224512
4769 15224512 15060219 14708655 14870142 15078982 14928911 15031522 15359498 15059662 14777875
$$ packed form
4839F744931J04774k85353K56999l34802m20407m15422m423M74711J18310l34552
4829E904766K358j78356K76737n4472j1867k17793m14796M67965n6628j10368
4819E607546K97007m07173K28950o6677K38822l97732N0779N55098M37180m03811
4809F139989k90420L27263M90202j35292J37717L38440k45081R4790L08287J62644
4799G328539K37610L21028J83371J57862q1977M33214M48265J37368O70305j00057
4789I735528J64325M60762L7369M55652M90593Q5588K59739O37952J45226M12836
4779A2885570L58912K53177J78190M72240L06061k79102p5312K91406L97871M35499
4769A5224512j64293l51564J61487K08840j50071J02611L27976k99836k81787
$$ plain form
4760 14777875 15020284 15222558 15266504 15409263 16080827 16091959 16192414 16837966 17202537 17358588
4750 17358588 17883172 18584512 18794060 19291768 19875797 19933200 20084569 19842330 20427374 21234656
4740 21234656 21814150 22067781 22523456 22811768 23159620 23298456 23461481 23534723 23359448 23336623
4730 23336623 23946359 24058208 24108170 24112644 23495408 22989409 22939590 22867901 22616500 21784204
4720 21784204 21792533 21910603 21432115 20900791 20889383 21057031 20652680 20055184 20035254 19788356
4710 19788356 20031738 20331149 20160867 19809609 19837241 19873876 19915735 20271003 19870005 19811790
4700 19811790 20084503 20196763 19914664 19647409 19773950 20427937 20488978 20775015 20762856 20820654
4690 20820654 21013596 21130114 20931648 20584481 20826556 20862861 20591132 20531546 20272096 19855090
$$ packed form
4760A4777875K42409K02274M3946J42759O71564J1132J00455O45552L64571J56051
4750A7358588N24584P01340K09548M97708N84029N7403J51369k42239N85044Q07282
4740B1234656N79494K53631M55675K88312L47852J38836J63025P3242j75275k2825
4730B3336623O09736J11849M9962M474o17236n05999m9819p1689k51401q32296
4720B1784204Q329J18070m78488n31324j1408J67648m04351n97496j9930k46898
4710A9788356K43382K99411j70282l51258K7632L6635M1859L55268m00998n8215
4700A9811790K72713J12260k82099k67255J26541O53987O1041K86037j2159N7798
4690B0820654J92942J16518j98466l47167K42075L6305k71729n9586k59450m17006
$$ plain form
4680 19855090 19532852 19062770 18711480 18423355 18406512 17885420 16970390 16671476 16482347 16096620
4670 16096620 15701573 15639341 15412861 14774610 14148612 13702797 13552274 13304174 13068548 12814454
4660 12814454 12258257 11770508 11451121 11517189 11676713 11533521 10902305 11074033 10729922 10187860
4650 10187860 10344108 10460296 10559160 10591730 10117957 10077917 10202754 10180245 9924141 9964636
4640 9964636 9675639 9495146 9371931 8802176 9257555 9527766 8877173 8524678 8657986 8434081
4630 8434081 8026110 7794416 7740538 7463119 7195018 7055320 6643070 6249789 6118203 6087821
4620 6087821 5769089 5642424 5606782 5717120 5627115 5480024 5449417 5488848 5080326 5047379
4610 5047379 5145308 5006946 4776853 4402600 4321086 3999438 4284022 4496410 4009334 3656058
$$ packed form
4680A9855090l22238m70082l51290k88125j6843n21092r15030k98914j89129l85727
4670A6096620l95047o2232k26480o38251o25998m45815j50523k48100k35626k54094
4660A2814454n56197m87749l19387O6068J59524j43192o31216J71728l44111n42062
4650A0187860J56248J16188R8864L2570m73773m0040J24837k2509k56104M0495
4640I964636k88997j80493j23215n69755M55379K70211o50593l52495J33308k23905
4630H434081m07971k31694n3878k77419k68101j39698m12250l93281j31586l0382
4620F087821l18732j26665l5642J10338r0005j47091l0607L9431m08522l2947
4610E047379R7929j38362k30093l74253q1514l21648K84584K12388m87076l53276
$$ plain form
4600 3656058 3993012 3353022 3177645 3738679 3620521 3775954 3660872 4075124 3682797 3716833
4590 3716833 3617419 3313535 3177501 3422040 3530381 3553932 3490729 3787013 3670707 3394242
4580 3394242 3574605 3320547 3556766 3710150 3262847 2943666 3296187 3306338 2828509 2961567
4570 2961567 3440721 3224819 3153993 3402253 3683507 3423367 3340271 3346828 3204511 3008759
4560 3008759 3090047 3063574 3290380 3248587 3289016 3316347 3208525 2815691 2875572 2948271 2543736
4549 2543736 2844871 3345189 3344392 3088928 2821223 3208545 3574851 3728753 3316852 3484675
4539 3484675 3353999 3357949 3315856 3085809 3101419 3170158 3267728 3445346 3353045 3448893 3241073
4528 3241073 3383515 3516243 3841308 3737272 3353441 3768898 3802044 3980312 3838919 4159887
$$ packed form
4600C656058L36954o39990j75377N61034j18158J55433j15082M14252l92327L4036
4590C716833r9414l03884j36034K44539J08341K3551o3203K96284j16306k76465
4580C394242J80363k54058K36219J53384m47303l19181L52521J0151m77829J33058
4570B961567M79154k15902p0826K48260K81254k60140q3096O557j42317j95752
4560C008759Q1288k6473K26806m1793M0429K7331j07822l92834N9881P2699m04535
4549B543736L01135N00318p97k55464k67705L87322L66306J53902m11901J67823
4539C484675j30676L950m2093k30047J5610O8739R7570J77618r2301R5848k07820
4528C241073J42442J32728L25065j04036l83831M15457L3146J78268j41393L20968
$$ plain form
4518 4159887 4325042 3977423 3958023 3632667 4138818 4726159 4377348 4235509 4485633 4808820
4508 4808820 4933946 4822059 4747036 4565722 4220125 4868794 4699354 4676332 5134095 4778788
4498 4778788 5136948 5560279 5910117 6337764 5983582 5750323 5583689 5564904 5551070 5909108
4488 5909108 5827718 5780710 5490667 4802906 4585578 4658702 5058881 5151434 5550645 5896664
4478 5896664 5934087 5700302 5664127 5781277 5725008 5720173 6067887 6154716 6250818 6646229 6276640
4467 6276640 6962751 7280387 7311436 7537118 7612553 8082369 8291037 8295084 8489080 8617932
4457 8617932 8846087 8609645 8895726 9360081 9552063 9483015 9595141 10003818 10194803 10461201
4447 10461201 10479285 10705961 11276720 11598703 11722494 12247541 12593084 13332111 13954045 14008650
$$ packed form
4518D159887J65155l47619j9400l25356N06151N87341l48811j41839K50124L23187
4508D808820J25126j11887p5023j81314l45597O48669j69440k3022M57763l55307
4498D778788L58160M23331L49838M27647l54182k33259j66634j8785j3834L58038
4488E909108q1390m7008k90043o87761k17328P3124M00179R2553L99211L46019
4478E896664L7423k33785l6175J17150n6269m835L47714Q6829R6102L95411l69589
4467F276640O86111L17636L1049K25682P5435M69816K08668M047J93996J28852
4457H617932K28155k36442K86081M64355J91982o9048J12126M08677J90985K66398
4447A0461201J8084K26676N70759L21983J23791N25047L45543P39027O21934N4605
$$ plain form
4437 14008650 14004266 14260548 14739683 15035715 15413983 15755914 16038414 16518649 16928386 17324582
4427 17324582 17448172 18500117 19512694 20072074 20563968 21145945 22004604 22698885 23613351
4418 23613351 24416057 25545686 26755869 27791124 28913904 30581410 32150808 34136663
4410 34136663 35975507 37862031 40392666 43625303 47043588 51294661 56402349 61814857
4402 61814857 68345573 76232253 84742962 92892188 100281864 105313843 109091812 113986579
4394 113986579 120200712 129335612 140939592 153065696 163106564 167634512 167383303 166164320
4386 166164320 166797204 170907516 178933005 189086669 198216079 200530873 193378206 180674493
4378 180674493 169253492 161156283 157416626 156969370 157611825 155949791 148593618 136421041
$$ packed form
4437A4008650m384K56282M79135K96032L78268L41931K82500M80235M09737L96196
4427A7324582J23590J051945J012577N59380M91894N81977Q58659O94281R14466
4418B3613351Q02706J129629J210183J035255J122780J667506J569398J985855
4410C4136663J838844J886524K530635L232637L418285M251073N107688N412508
4402F1814857O530716P886680Q510709Q149226P389676N031979L777969M894767
4394A13986579O214133R134900J1603980J2126104J0040868M527948k51209j218983
4386A66164320O32884M110312Q025489J0153664R129410K314794p152667j2703713
4378A80674493j1421001q097209l739657m47256O42455j662034p356173j2172577
$$ plain form
4370 136421041 123634240 113129553 104972646 99420586 95908382 92390743 86765026 79335772
4362 79335772 71009241 63372992 56614333 51001662 46769650 43086113 40042652 37947594
4354 37947594 35963187 34053648 32166687 30777153 29387136 28035995 27282374 26210714
4346 26210714 25056139 24285889 23557006 23021129 22357390 21682911 21089372 20578884 20008236
4337 20008236 19565275 19277622 19126877 18818459 18243766 17931430 17445998 16874076 16265459
4328 16265459 16167464 15935802 15789303 15713084 15326872 14648710 13993826 14048839 14373527 14453070
4318 14453070 14101983 14223920 14178581 13887369 13746423 13583190 13441785 13368014 13335211 13543921
4308 13543921 13262135 13088132 13469938 13581156 13277607 13500606 13363134 13409305 13852732 13708718
$$ packed form
4370A36421041j2786801j0504687q156907n552060l512204l517639n625717p429254
4362G9335772q326531p636249o758659n612671m232012l683537l043461k095058
4354C7947594j984407j909539j886961j389534j390017j351141p53621j071660
4346B6210714j154575p70250p28883n35877o63739o74479n93539n10488n70648
4337B0008236m42961k87653j50745l08418n74693l12336m85432n71922o08617
4328A6265459r7995k31662j46499p6219l86212o78162o54884N5013L24688P9543
4318A4453070l51087J21937m5339k91212j40946j63233j41405p3771l2803K08710
4308A3543921k81786j74003L81806J11218l03549K22999j37472M6171M43427j44014
$$ plain form
4298 13708718 13748352 13286207 13643108 13886616 13924473 14051337 13939086 13924895 13702824 13962297
4288 13962297 14269574 14486610 14590726 14849463 14786445 14847339 15287241 15319435 15627009 15616723
4278 15616723 16114644 15994346 15845666 16193718 16751091 16493149 16437627 17100239 17678711 17715493
4268 17715493 17951493 18004470 18454617 19278271 19981511 20283209 20639997 20260234 20990833 21588478
4258 21588478 22171797 23069816 23555144 23719756 24254580 24779599 25181569 25899223 26522599
4249 26522599 27436069 28850649 29886712 30066796 30890990 31739011 32849846 34222318 35663915
4240 35663915 36777141 38128880 39695947 41163399 42488146 44047545 46244900 48595929
4232 48595929 50863452 53903910 56679620 59957796 63703681 68629061 73824998 79342169
$$ packed form
4298A3708718L9634m62145L56901K43508L7857J26864j12251j4191k22071K59473
4288A3962297L07277K17036J04116K58737o3018O0894M39902L2194L07574j0286
4278A5616723M97921j20298j48680L48052N57373k57942n5522O62612N78472L6782
4268A7715493K36000N2977M50147Q23654P03240L01698L56788l79763P30599N97645
4258B1588478N83319Q98019M85328J64612N34824N25019M01970P17654O23376
4249B6522599R13470J414580J036063J80084Q24194Q48021J110835J372472J441597
4240C5663915J113226J351739J567067J467452J324747J559399K197355K351029
4232D8595929K267523L040458K775710L278176L745885M925380N195937N517171
$$ plain form
4224 79342169 85356773 92263065 100163843 109146963 119635299 130979899 143931794 159524467
4216 159524467 177518044 198405437 221244883 245817932 269973380 290671623 305920133
4209 305920133 313024389 310285117 298015236 277361932 252212681 224591488 197572311
4202 197572311 172972923 152100635 134998430 121352848 109505325 100059319 92570021
4195 92570021 86183452 80801041 75890117 71388358 67900626 64578392 61840858 59413145
4187 59413145 56890903 54681291 53297071 52280964 50717326 49298897 48303617 46731695
4179 46731695 45698351 44747515 43781630 42754118 41481636 40747483 39817065 38888427 37790286
4170 37790286 36641079 35618082 34810407 33752259 33020843 32373514 32162130 32058879 31531835
$$ packed form
4224G9342169O014604O906292P900778Q983120J0488336J1344600J2951895J5592673
4216A59524467J7993577K0887393K2839446K4573049K4155448K0698243J5248510
4209C05920133P104256k739272j2269881k0653304k5149251k7621193k7019177
4202A97572311k4599388k0872288j7102205j3645582j1847523r446006p489298
4195I2570021o386569n382411m910924m501759l487732l322234k737534k427713
4187E9413145k522242k209612j384220j016107j563638j418429r95280j571922
4179D6731695j033344r50836r65885j027512j272482p34153r30418r28638j098141
4170C7790286j149207j022997q07675j058148p31416o47329k11384j03251n27044
$$ plain form
4161 31531835 31293567 31289953 30885493 30632986 30389804 30357411 29829328 29480628 29026503 28601806
4151 28601806 28216531 28248741 27615279 27100304 26690117 26778205 26429209 26337017 26383956 26153510
4141 26153510 26252446 26392426 26558648 26592118 26787124 27123288 26884985 27072023 27497582 27755943
4131 27755943 27921090 28181808 28280009 28576782 29044336 29711515 29740184 30506693 31031436 31031834
4121 31031834 31785640 32528040 33300247 33661363 34069347 35031320 36058387 36365483 37012363
4112 37012363 38045327 39002767 40109101 41309872 42739913 43788879 44624381 46007364
4104 46007364 47538313 49134276 50923649 52906562 54887039 57004285 59062986 61452439
4096 61452439 64179195 67551974 71314175 74949186 79369145 84142980 89558169 96025864
$$ packed form
4161C1531835k38268l614m04460k52507k43182l2393n28083l48700m54125m24697
4151B8601806l85275L2210o33462n14975m10187Q8088l48996r2192M6939k30446
4141B6153510R8936J39980J66222L3470J95006L36164k38303J87038M25559K58361
4131B7755943J65147K60718R8201K96773M67554O67179K8669P66509N24743L98
4121C1031834P53806P42400P72207L61116M07984R61973J027067L07096O46880
4112C7012363J032964R57440J106334J200771J430041J048966Q35502J382983
4104D6007364J530949J595963J789373J982913J980477K117246K058701K389453
4096F1452439K726756L372779L762201L635011M419959M773835N415189O467695
$$ plain form
4088 96025864 103479229 111933992 121371287 132175766 145088003 160421686 178699726 200095065
4080 200095065 225035884 252986565 284483344 318664771 353574677 382607276 393534640
4073 393534640 379164189 343479834 300631005 261593543 229086598 202116699 179931140
4066 179931140 162064425 147630900 136082822 127054237 119428339 112909619 108271440 104071739
4058 104071739 100614816 97706355 95685613 93579071 92018092 91052829 90108011 89745173
4050 89745173 89142471 88978192 89037327 89844134 90739535 91710455 92966485 94138711 95320236
4041 95320236 97122327 99121050 101290155 103373190 105559694 108066334 111022072 113229947
4033 113229947 116110627 118958823 121026405 123916889 126127544 128413049 131602343 134090915
$$ packed form
4088I6025864P453365Q454763R437295J0804479J2912237J5333683J8278040K1395339
4080B00095065K4940819K7950681L1496779L4181427L4909906K9032599J0927364
4073C93534640j4370451l5684355m2848829l9037462l2506945k6969899k2185559
4066A79931140j7866715j4433525j1548078r028585p625898o518720m638179m199701
4058A04071739l456923k908461k020742k106542j560979r65263r44818l62838
4050H9745173o02702j64279N9135Q06807Q95401R70920J256030J172226J181525
4041I5320236J802091J998723K169105K083035K186504K506640K955738K207875
4033A13229947K880680K848196K067582K890484K210655K285505L189294K488572
$$ plain form
4025 134090915 136272051 138800586 141452925 143791205 146197060 148083209 150061022 151443113
4017 151443113 153137603 154566380 155940324 156540751 157769808 158506961 159228607 159931284 160548518
4008 160548518 161150302 161835378 162261301 163401061 165136629 168774543 173375349 178876421
4000 178876421 186056399 197577411 215528058 230878840 219093663 188123406 163433563
3993 163433563 145184564 132594033 123342893 115669966 108910225 103176948 97749583 93177086
3985 93177086 89207792 85669244 81899528 78188956 74719839 72067154 68560636 65507938
3977 65507938 62786773 60539400 58759071 56550765 54059549 52329438 50418814 49224791
3969 49224791 47581489 45706042 44401962 42946020 41454037 40443493 38897895 38045500
$$ packed form
4025A34090915K181136K528535K652339K338280K405855J886149J977813J382091
4017A51443113J694490J428777J373944O00427J229057P37153P21646P02677O17234
4008A60548518O01784O85076M25923J139760J735568L637914M600806N501072
4000A78876421P179978J1521012J7950647J5350782j1785177l0970257k4689843
3993A63433563j8248999j2590531r251140p672927o759741n733277n427365m572497
3985I3177086l969294l538548l769716l710572l469117k652685l506518l052698
3977F5507938k721165k247373j780329k208306k491216j730111j910624j194023
3969D9224791j643302j875447j304080j455942j491983j010544j545598q52395
$$ plain form
3961 38045500 37492576 36690795 35771034 35203641 34151924 33493727 32518734 31893587 31392596
3952 31392596 30774399 29756731 29457841 28966462 28211118 28139028 27452853 26976845 26676515
3943 26676515 26223929 26006550 25448863 24893021 25221712 25192323 25095238 24920055 24971759 24887622
3933 24887622 25023521 24503960 24398180 24359468 24430433 24663134 24856027 24801306 25067642 25395424
3923 25395424 25356116 25275056 25629846 25806914 25889758 25650686 25278909 24900287 24738592 24618937
3913 24618937 24422013 24694397 24700658 25044374 25029933 25334486 25571742 25918033 26298574 26574247
3903 26574247 26519154 26465191 27095634 27443805 28017396 27863406 27882727 28514914 29172627 29740512
3893 29740512 30124255 30827566 31437815 32171135 32278813 33219272 34210286 34723002 35501856
$$ packed form
3961C8045500n52924q01781r19761n67393j051717o58197r74993o25147n00991
3952C1392596o18197j017668k98890m91379p55344p2090o86175m76008l00330
3943B6676515m52586k17379n57687n55842L28691k9389r7085j75183N1704q4137
3933B4887622J35899n19561j05780l8712P0965K32701J92893n4721K66336L27782
3923B5395424l9308q1060L54790J77068Q2844k39072l71777l78622j61695j19655
3913B4618937j96924K72384O261L43716j4441L04553K37256L46291L80541K75673
3903B6574247n5093n3963O30443L48171N73591j53990J9321O32187O57713N67885
3893B9740512L83743P03311O10249P33320J07678R40459R91014N12716P78854
$$ plain form
3884 35501856 36450318 37573615 38269058 38930121 39963281 41057127 41937347 42666820 43466200
3875 43466200 44459550 44933924 45953270 46898169 47668620 48685043 48927146 49196570 49693594
3866 49693594 50079429 50937186 51502879 52238805 52966117 53520995 54150580 55032285 55992516
3857 55992516 56460020 57393299 58133085 59111567 60392561 61163985 62382454 63902545 65071572
3848 65071572 66164205 68107583 69751182 72119892 74619210 77253904 79928756 82877702
3840 82877702 85924927 89429096 93398860 97642444 102126926 106968594 112111926 118080492
3832 118080492 124270769 130667764 137848225 145036706 152340538 160484835 168959728 177759432
3824 177759432 186484905 195280820 203964311 212964541 221179937 229274893 237296737 244103328
$$ packed form
3884C5501856R48462J123297O95443O61063J033160J093846Q80220P29473P99380
3875D3466200R93350M74374J019346R44899P70451J016423K42103K69424M97024
3866D9693594L85835Q57757N65693P35926P27312N54878O29585Q81705R60231
3857E5992516M67504R33279P39786R78482J280994P71424J218469J520091J169027
3848F5071572J092633J943378J643599K368710K499318K634694K674852K948946
3840H2877702L047225L504169L969764M243584M484482M841668N143332N968566
3832A18080492O190277O396995P180461P188481P303832Q144297Q474893Q799704
3824A77759432Q725473Q795915Q683491R000230Q215396Q094956Q021844O806591
$$ plain form
3816 244103328 250612581 256227513 260712866 264452184 267144939 268734603 269418400 269111427
3808 269111427 268349071 265906965 262804869 259400439 255152081 250055640 244101432 237818395
3800 237818395 231537436 224500397 217167051 209466622 201655939 193677435 185983452 177521314
3792 177521314 169687467 161809587 154181220 146916967 139755758 133225601 127051219 120755413
3784 120755413 115045043 109510781 104588326 99705504 95312292 91128870 87279314 83693554
3776 83693554 80629868 77760573 74942750 72371067 69709316 68311167 66070134 64159365
3768 64159365 62901584 61494828 60097147 58781055 57989980 57289531 56330660 55572619 54779529
3759 54779529 54029831 53076960 52035272 51495095 51294311 50530019 49508392 48592972 47721162
$$ packed form
3816B44103328O509253N614932M485353L739318K692755J589664O83797l06973
3808B69111427p62356k442106l102096l404430m248358n096441n954208o283037
3800B37818395o280959p037039p333346p700429p810683p978504p693983q462138
3792A77521314p833847p877880p628367p264253p161209o530157o174382o295806
3784A20755413n710370n534262m922455m882822m393212m183422l849556l585760
3776H3693554l063686k869295k817823k571683k661751j398149k241033j910769
3768F4159365j257781j406756j397681j316092p91075p00449r58871p58041p93090
3759E4779529p49698r52871j041688n40177k00784p64292j021627r15420q71810
$$ plain form
3750 47721162 47161701 46314062 45328520 45322290 44508977 43882821 43577940 42496585 41395539
3741 41395539 40528697 40016103 39404969 38825887 37827796 36824143 36178037 35619077 34764346
3732 34764346 34226705 33368457 32521294 32070603 31595002 31097670 30368709 29927963 29253675
3723 29253675 28640812 28491909 28077501 27959071 27573982 27003021 26821286 26491938 26022062
3714 26022062 25438070 25097599 24842847 24677787 24650960 24706816 24214810 23932351 23462926 23076203
3704 23076203 22631918 22452720 22323410 22527166 22414274 22253167 21840308 21349570 21519826
3695 21519826 21551412 21755964 21405221 21201319 21094886 21343255 21479924 21658582 21184374 21263127
3685 21263127 21811204 21620983 21648087 22062334 22445285 22493638 22789394 23156521 23511488 23595275
$$ packed form
3750D7721162n59461q47639r85542o230q13313o26156l04881j081355j101046
3741D1395539q66842n12594o11134n79082r98091j003653o46106n58960q54731
3732C4764346n37641q58248q47163m50691m75601m97332p28961m40746o74288
3723B9253675o12863j48903m14408j18430l85089n70961j81735l29348m69876
3714B6022062n83992l40471k54752j65060k6827N5856m92006k82459m69425l86723
3704B3076203m44285j79198j29310K03756j12892j61107m12859m90738J70256
3695B1519826L1586K04552l50743k03902j06433K48369J36669J78658m74208P8753
3685B1263127N48077j90221K7104M14247L82951M8353K95756L67127L54967Q3787
$$ plain form
3675 23595275 23619833 23913286 24822877 25283289 25793363 26482435 27239714 27812495 28694410 29368061
3665 29368061 30188991 31224510 32406448 33346669 34202650 35428213 36479056 37694461 38906032
3656 38906032 39919176 40970142 42426742 43479461 44637805 45996338 47042328 47819231
3648 47819231 48742550 49968690 50905237 51548787 52635111 52922659 53263420 53897782 54045372
3639 54045372 54349577 54704233 54676978 54899268 54741076 54842706 54703252 54429295 53947881 53855389
3629 53855389 54129511 53797176 53626068 53699167 53510133 53659740 53883966 54110375 54367892 54730266
3619 54730266 55539258 56110026 57449971 58725031 60317225 61742379 63309468 65566300
3611 65566300 67390755 69273424 72071626 75109989 78325057 81518972 84385813 88089690
$$ packed form
3675B3595275K4558K93453R09591M60412N10074O89072P57279N72781Q81915O73651
3665B9368061Q20930J035519J181938R40221Q55981J225563J050843J215405J211571
3656C8906032J013144J050966J456600J052719J158344J358533J045990P76903
3648D7819231R23319J226140R36547O43550J086324K87548L40761O34362J47590
3639E4045372L04205L54656k7255K22290j58192J01630j39454k73957m81414r2492
3629E3855389K74122l32335j71108P3099j89034J49607K24226K26409K57517L62374
3619E4730266Q08992N70768J339945J275060J592194J425154J567089K256832
3611F5566300J824455J882669K798202L038363L215068L193915K866841L703877
$$ plain form
3603 88089690 91703226 95448052 99783891 103712706 107846843 112245188 115996526 119869702
3595 119869702 123665079 127365414 130996749 134163778 136967269 139618123 141879428 144130776
3587 144130776 146337328 148251277 149414812 150511666 151407698 151712885 151960204 152035321 151918511
3578 151918511 152019414 151475755 150648561 150087727 149279119 149050175 148696717 148227856 147554640
3569 147554640 147574192 147582925 147426440 147255239 147566116 147849735 148037067 147811884 147640562 148522648
3559 148522648 149018784 149509894 150309199 150650771 150761014 150998611 151389839 151591306 151344504
3550 151344504 151149450 150387397 149525968 148380575 146425702 145132795 143042993 140482463
3542 140482463 138223795 135099701 131889666 128759160 125615809 122307619 118735577 114771582
$$ packed form
3603H8089690L613536L744826M335839L928815M134137M398345L751338L873176
3595A19869702L795377L700335L631335L167029K803491K650854K261305K251348
3587A44130776K206552J913949J163535J096854Q96032L05187K47319P5117j16810
3578A51918511J00903n43659q27194n60834q08608k28944l53458m68861o73216
3569A47554640J9552Q733j56485j71201L10877K83619J87332k25183j71322Q82086
3559A48522648M96136M91110P99305L41572J10243K37597L91228K01467k46802
3550A51344504j95054p62053q61429j145393j954873j292907k089802k560530
3542A40482463k258668l124094l210035l130506l143351l308190l572042l963995
$$ plain form
3534 114771582 111124540 107497736 104156757 100534497 96722796 93304036 89411894 85609903
3526 85609903 82527694 79580659 76589569 73758704 70831689 68508837 66524455 64567005
3518 64567005 62658813 61085940 59644029 58692878 57963855 57486985 56991726 56318421 55877927
3509 55877927 55692279 55645008 55359179 54917780 55103257 54564137 54279273 54218516 54063296 53740890
$$ packed form
3534A14771582l647042l626804l340979l622260l811701l418760l892142l801991
3526H5609903l082209k947035k991090k830865k927015k322852j984382j957450
3518F4567005j908192j572873j441911r51151p29023m76870m95259o73305m40494
3509E5877927j85648m7271k85829m41399J85477n39120k84864o0757j55220l22406
$$ [...]
##END NTUPLES=NMR SPECTRUM
##END=
