##TITLE=1H_TG-2351-1
 CDCl3
 8 sc, 
 9.03.2022
##JCAMPDX= 6.0         $$ Bruker NMR JCAMP-DX V2.0
##DATA TYPE= NMR SPECTRUM
##DATA CLASS= NTUPLES
##ORIGIN= UXNMR, Bruker Analytische Messtechnik GmbH
##OWNER= root
$$ XWIN-NMR		Version 3.5
$$ Wed Mar  9 11:45:25 2022 Russian Standard Time (UT+4h)  she@DPX200
##.OBSERVE FREQUENCY= 200.131346
##.OBSERVE NUCLEUS= ^1H
##.ACQUISITION MODE= SIMULTANEOUS
##.ACQUISITION SCHEME= undefined
##.AVERAGES= 8
##.DIGITISER RES= 18
##SPECTROMETER/DATA SYSTEM= spect
##.PULSE SEQUENCE= zg30
##.SOLVENT NAME= CDCl3
##.SHIFT REFERENCE= (INTERNAL, CDCl3, 0, 15.7238)
##AUDIT TRAIL= $$ (NUMBER, WHEN, WHO, WHERE, WHAT)
$$ ##TITLE= Audit trail, XWIN-NMR		Version 3.5
$$ ##JCAMPDX= 5.01
$$ ##ORIGIN= Bruker BioSpin GmbH
$$ ##OWNER= she
$$ F:/spectra/data/she/nmr/H-F/1/pdata/1/auditp.txt
$$ ##AUDIT TRAIL=  $$ (NUMBER, WHEN, WHO, WHERE, WHAT)
(   1,<2022-03-09 11:44:15.26 +0400>,<she>,<DPX200>,
      <created by zg, POWCHK disabled, PULCHK disabled
       configuration hash MD5:
       00 E9 B6 7A A2 85 ED C7 34 08 36 98 17 FE 4E 26
       data hash MD5: 16K
       5B 57 15 8F B2 9C 37 44 E5 F7 54 94 26 60 6A C4>)
(   2,<2022-03-09 11:44:17.92 +0400>,<she>,<DPX200>,
      <Start of raw data processing
       efp BC_mod = 2 LB = 0.24 FT_mod = 6 PKNL = 1 PHC0 = -16590.67 PHC1 = 16.60078 SI = 16K 
       data hash MD5: 16K
       75 05 6A FA 9B 05 FA 3C 74 FD 00 A0 6D 56 6B 48>)
(   3,<2022-03-09 11:44:35.10 +0400>,<she>,<DPX200>,
      <pk PHC0 = 4.918209 PHC1 = -8.199999 
       data hash MD5: 16K
       FB 5A 12 5F 6A 0C 87 15 E2 95 C0 81 AF 76 35 08>)
(   4,<2022-03-09 11:44:38.31 +0400>,<she>,<DPX200>,
      <abs ABSG = 5 
       data hash MD5: 16K
       A1 E9 DD 33 F5 AC 19 29 AB 8E 9A 61 26 78 41 20>)
$$ ##END=
$$ 
$$ hash MD5
$$ 53 18 28 34 77 5A 34 7F 26 3F 72 E6 50 5B AD C6
##$RELAX= 
##$RELAX= 
##$RELAX= 
##$RELAX= 
##$RELAX= 
##$RELAX= 
$$ Bruker specific parameters
$$ --------------------------
##$DU= <F:/spectra>
##$EXPNO= 1
##$NAME= <H-F>
##$PROCNO= 1
##$TYPE= <nmr>
##$USER= <she>
##$AMP= (0..31)
100 100 100 100 100 100 100 100 100 100 100 100 100 100 100 100 100 100 
100 100 100 100 100 100 100 100 100 100 100 100 100 100 
##$AQSEQ= 0
##$AQ_mod= 1
##$AUNM= <au_zg>
##$AUTOPOS= <>
##$BF1= 200.13
##$BF2= 200.13
##$BF3= 200.13
##$BF4= 200.13
##$BF5= 200.13
##$BF6= 200.13
##$BF7= 200.13
##$BF8= 200.13
##$BYTORDA= 1
##$CFDGTYP= 0
##$CFRGTYP= 5
##$CHEMSTR= <none>
##$CNST= (0..31)
1 1 145 1 1 1 1 1 1 1 1 1 1 1 1 1 1 1 1 1 1 1 1 1 1 1 1 1 1 1 1 1 
##$CPDPRG= <>
##$CPDPRG1= <>
##$CPDPRG2= <>
##$CPDPRG3= <>
##$CPDPRG4= <mlev>
##$CPDPRG5= <mlev>
##$CPDPRG6= <mlev>
##$CPDPRG7= <mlev>
##$CPDPRG8= <mlev>
##$CPDPRGB= <>
##$CPDPRGT= <>
##$D= (0..31)
0 1.2 0 0 0 0 0 0 0 0.06 0 0.03 0 0 0 0 0.0002 0 0 0 0 0 0 0 0 0 0 0 0 
0 0 0 
##$DATE= 1646811854
##$DBL= (0..7)
120 120 120 120 120 120 120 120 
##$DBP= (0..7)
150 150 150 150 150 150 150 150 
##$DBP07= 0
##$DBPNAM0= <>
##$DBPNAM1= <>
##$DBPNAM2= <>
##$DBPNAM3= <>
##$DBPNAM4= <>
$$ [...]
##$SUBNAM2= <"">
##$SUBNAM3= <"">
##$SUBNAM4= <"">
##$SUBNAM5= <"">
##$SUBNAM6= <"">
##$SUBNAM7= <"">
##$SUBNAM8= <"">
##$SUBNAM9= <"">
##$SW= 18.0517287032376
##$SWIBOX= (0..15)
0 0 2 0 0 0 0 0 0 0 0 0 0 0 0 0 
##$SW_h= 3612.71676300578
##$TD= 16384
##$TD0= 1
##$TE= 0
##$TE2= 300
##$TE3= 300
##$TEG= 300
##$TL= (0..7)
0 120 120 120 120 120 120 120 
##$TP= (0..7)
150 150 150 150 150 150 150 150 
##$TP07= 0
##$TPNAME0= <>
##$TPNAME1= <>
##$TPNAME2= <>
##$TPNAME3= <>
##$TPNAME4= <>
##$TPNAME5= <>
##$TPNAME6= <>
##$TPNAME7= <>
##$TPOAL= (0..7)
0.5 0.5 0.5 0.5 0.5 0.5 0.5 0.5 
##$TPOFFS= (0..7)
0 0 0 0 0 0 0 0 
##$TUNHIN= 0
##$TUNHOUT= 0
##$TUNXOUT= 0
##$USERA1= <user>
##$USERA2= <user>
##$USERA3= <user>
##$USERA4= <user>
##$USERA5= <user>
##$V9= 5
##$VALIST= <valist>
##$VCLIST= <CCCCCCCCCCCCCCC>
##$VD= 0
##$VDLIST= <DDDDDDDDDDDDDDD>
##$VPLIST= <PPPPPPPPPPPPPPP>
##$VTLIST= <TTTTTTTTTTTTTTT>
##$WBST= 1024
##$WBSW= 4
##$XGAIN= (0..3)
0 0 0 0 
##$XL= 0
##$YL= 0
##$YMAX_a= 444225
##$YMIN_a= -636585
##$ZGOPTNS= <>
##$ZL1= 120
##$ZL2= 120
##$ZL3= 120
##$ZL4= 120
##$ABSF1= 15.71053
##$ABSF2= -2.341319
##$ABSG= 5
##$ABSL= 3
##$ALPHA= 0
##$AQORDER= 0
##$ASSFAC= 0
##$ASSFACI= 0
##$ASSFACX= 0
##$ASSWID= 0
##$AUNMP= <proc_1d>
##$AZFE= 0.1
##$AZFW= 0.1
##$BCFW= 0
##$BC_mod= 2
##$BYTORDP= 0
##$COROFFS= 0
##$CY= -3
##$DATMOD= 1
##$DC= 0
##$DFILT= <>
##$DTYPP= 0
##$F1P= 0
##$F2P= 0
##$FCOR= 1
##$FTSIZE= 16384
##$FT_mod= 6
##$GAMMA= 0
##$GB= 0
##$INTBC= 1
##$INTSCL= 0
##$ISEN= 128
##$LB= 0.24
##$LEV0= 0
##$LPBIN= 0
##$MAXI= 10000
##$MC2= 0
##$MEAN= 0
##$ME_mod= 0
##$MI= 1.114404
##$NCOEF= 0
##$NC_proc= -6
##$NLEV= 6
##$NOISF1= 3.799351
##$NOISF2= 2.8
##$NSP= 0
##$NTH_PI= 0
##$NZP= 0
##$OFFSET= 15.72375
##$PC= 1
##$PHC0= -16585.75
##$PHC1= 8.400782
##$PH_mod= 1
##$PKNL= yes
##$PPARMOD= 0
##$PSCAL= 0
##$PSIGN= 0
##$REVERSE= no
##$SF= 200.130005564122
##$SI= 16384
##$SIGF1= 3
##$SIGF2= 2
##$SINO= 5.538805
##$SIOLD= 16384
##$SREGLST= <1H.CDCl3>
##$SSB= 0
##$STSI= 16384
##$STSR= 0
##$SW_p= 3612.71676300578
##$SYMM= 0
##$S_DEV= 0
##$TDeff= 16384
##$TDoff= 0
##$TI= <>
##$TILT= no
##$TM1= 0
##$TM2= 0
##$TOPLEV= 0
##$USERP1= <user>
##$USERP2= <user>
##$USERP3= <user>
##$USERP4= <user>
##$USERP5= <user>
##$WDW= 1
##$XDIM= 16384
##$YMAX_p= 321315323
##$YMIN_p= -543784
$$ End of Bruker specific parameters
$$ ---------------------------------
##NTUPLES= NMR SPECTRUM
##VAR_NAME=  FREQUENCY,     SPECTRUM/REAL,   SPECTRUM/IMAG
##SYMBOL=    X,             R,               I
##VAR_TYPE=  INDEPENDENT,   DEPENDENT,       DEPENDENT
##VAR_FORM=  AFFN,          ASDF,            ASDF
##VAR_DIM=   16384,         16384,           16384
##UNITS=     HZ,            ARBITRARY UNITS, ARBITRARY UNITS
##FACTOR=    0.220516191357247, 1,           1
##FIRST=     3146.79419789192, 0,            0
##LAST=      -465.922565113855, 0,           0
##MIN=       -465.922565113855, -543784,     0
##MAX=       3146.79419789192, 321315323,    0
$$ Real data points
##PAGE= N=1
##DATA TABLE= (X++(R..R)), XYDATA
$$ [...]
$$ plain form
7145 3203442 3346458 3463357 3523282 3609795 3704545 3798638 3908190 4062450 4225150 4364713
7135 4364713 4560689 4716068 4897646 5073597 5245692 5322494 5446507 5622756 5805052 5965209
7125 5965209 6204491 6417442 6581950 6666034 6790918 6890420 7094486 7315246 7512764 7814019
7115 7814019 7937156 8239829 8613366 8975906 9371400 9798105 10180218 10699811 11315428 11922067
7105 11922067 12675761 13505419 14504423 15708211 17097260 18605115 20461459 22697289 25468707
7096 25468707 28813402 32844494 37547076 43223689 49530818 56737559 65129252 74138624
7088 74138624 81627033 84179250 80759097 71570294 59694798 48595977 39934679 33638794
7080 33638794 29317399 26150603 23699793 21798246 20232157 18942072 18080165 17388062
$$ packed form
7145C203442J43016J16899N9925Q6513R4750R4093J09552J54260J62700J39563
7135D364713J95976J55379J81578J75951J72095P6802J24013J76249J82296J60157
7125E965209K39282K12951J64508Q4084J24884R9502K04066K20760J97518L01255
7115G814019J23137L02673L73537L62540L95494M26705L82113N19593O15617O06639
7105A1922067P53694Q29658R99004J203788J389049J507855J856344K235830K771418
7096B5468707L344695M031092M702582N676613O307129P206741Q391693R009372
7088G4138624P488409K552217l420153r188803j1875496j1098821q661298o295885
7080C3638794m321395l166796k450810j901547j566089j290085q61907o92103
$$ plain form
7072 17388062 16760401 16493787 16289018 16253841 16448699 16663463 16829065 16874725 16797426 16538287
7062 16538287 16212011 16084835 16108219 16292680 16828088 17557679 18511725 19476534 20277049 20533080
7052 20533080 20204015 19125475 17659505 15866755 13950007 12297726 10824057 9857259
7044 9857259 9011268 8323932 7755616 7184713 6660677 6274715 5846314 5540575 5300481 5086573
7034 5086573 4974027 4741387 4487437 4360614 4312352 4243503 4049329 3932090 3811906 3703673
7024 3703673 3598486 3516874 3497292 3446684 3471288 3345777 3321763 3368863 3409737 3457772 3414528
7013 3414528 3518421 3651156 3807670 3903930 3819178 3543195 3284929 3070057 2799314 2491337
7003 2491337 2404226 2325710 2141425 2108952 2001148 1887381 1897793 1896243 1869107 1668158 1707597
$$ packed form
7072A7388062o27661k66614k04769l5177J94858K14764J65602M5660p7299k59139
7062A6538287l26276j27176K3384J84461N35408P29591R54046R64809Q00515K56031
7052B0533080l29065j078540j465970j792750j916748j652281j473669r66798
7044I857259q45991o87336n68316n70903n24036l85962m28401l05739k40094k13908
7034E086573j12546k32640k53950j26823m8262o8849j94174j17239j20184j08233
7024C703673j05187q1612j9582n0608K4604j25511k4014M7100M0874M8035m3244
7013C414528J03893J32735J56514R6260q4752k75983k58266k14872k70743l07977
7003B491337q7111p8516j84285l2473j07804j13767J0412j550k7136k00949L9439
$$ plain form
6992 1707597 1675985 1608011 1561458 1628398 1608551 1504258 1485176 1511081 1375457 1315333 1204587
6981 1204587 1139355 1091000 1144338 1162967 1136413 1071746 1049871 1043390 986981 1089510 1093728 1145722
6969 1145722 981582 950437 959612 891978 757279 803163 794567 805761 803393 783573 727959 689780
6957 689780 638076 655250 666565 706570 754147 695549 654465 721492 644725 627357 549758 512257
6945 512257 562880 528030 560988 576632 623175 633107 648979 577239 545324 584978 532556 611565
6933 611565 521396 487746 538777 612625 664352 553810 494009 445718 428167 459218 487149
6922 487149 405512 337802 380019 544794 481936 428849 539307 504821 438880 584105 578644
6911 578644 593696 670909 625614 537941 554653 597711 538987 439053 594519 618199 590716
$$ packed form
6992A707597l1612o7974m6553O6940j9847j04293j9082K5905j35624o0124j10746
6981A204587o5232m8355N3338J8629k6554o4667k1875o481n6409J02529M218N1994
6969A145722j64140l1145R175o7634j34699M5884q596J1194k368j9820n5614l8179
6957F89780n1704J7174J1315M0005M7577n8598m1084O7027p6767j7368p7599l7501
6945E12257N0623l4850L2958J5644M6543R932J5872p1740l1915L9654n2422P9009
6933F11565r0169l3650N1031P3848N1727j10542n9801m8291j7551L1051K7931
6922D87149q1637o7710M2217J64775o2858n3087J10458l4486o5941J45225n461
6911E78644J5052P7213m5295q7673J6712M3058n8724r9934J55466K3680k7483
$$ plain form
6900 590716 555599 495495 520856 513648 521107 456734 385842 425534 454410 374428 443667 436810
6888 436810 334089 355230 426576 395858 390037 390732 409960 417637 394344 424566 411689 400474
6876 400474 587558 451026 376179 337583 342053 484899 502139 474297 502952 422130 348644
6865 348644 331088 236481 277172 213902 263969 289988 367162 375376 239557 292896 314037 372660
6853 372660 398443 373349 235752 152199 242950 238702 355033 314460 251437 323368 195606
6842 195606 158614 262366 285739 220181 187776 225028 225246 201240 211377 193226 129562 170559
6830 170559 228051 206673 166650 128179 124174 175446 170444 157979 122520 179985 243255 246410
6818 246410 193029 145984 144971 183355 156585 183666 241963 198733 281083 178570 188462 191729
$$ packed form
6900E90716l5117o0104K5361p208P459o4373p0892L9692K8876p9982O9239o857
6888D36810j02721K1141P1346l0718n821O95J9228P677k3293L0222j2877j1215
6876D00474J87084j36532p4847l8596M470J42846J7240k7842K8655q0822p3486
6865C48644j7556r4607M0691o3270N0067K6019P7174Q214j35819N3339K1141N8623
6853C72660K5783k5094j37597q3553R0751m248J16331m0573o3023P1931j27762
6842A95606l6992J03752K3373o5558l2405L7252K18k4006J0137j8151o3664M0997
6830A70559N7492k1378m0023l8471m005N1272n002j2465l5459N7465O3270L155
6818B46410n3381m7045j013L8384k6770K7081N8297m3230Q2350j02513R892L267
$$ plain form
6806 191729 97399 85078 135566 101247 81344 76835 64304 162786 179817 203652 101240 3853
6794 3853 70295 126290 136809 97895 81028 88333 88558 160905 196287 229850 195090 186081 118684
6781 118684 91127 107472 147372 223525 204356 121839 119611 102015 22259 -39701 51977 104801
6769 104801 84730 120258 197909 95262 96390 57819 89213 143865 157690 127207 73990 30702
6757 30702 25663 123036 10928 -58194 -66457 20538 104679 79145 -39220 39684 57566 29603
6745 29603 -17316 193773 200915 146057 121183 42406 119483 108231 141578 82731 28584 -2215
6733 -2215 -32535 92743 146412 203506 185613 179320 206553 142542 144001 155802 160645 107268
6721 107268 59730 96978 13548 6730 -19752 33965 44195 -33147 -37148 65750 118590 16659
$$ packed form
6806A91729r4330j2321N0488l4319j9903m509j2531R8482J7031K3835j02412r7387
6794C853O6442N5995J0519l8914j6867P305K25P2347L5382L3563l4760r009o7397
6781A18684k7557J6345L9900P6153j9169q2517k228j7596p9756o1960R1678N2824
6769A04801k0071L5528P7651j02647J128l8571L1394N4652J3825l0483n3217m3288
6757C0702n039R7373j12108o9122q263Q6995Q4141k5534j18365P8904J7882k7963
6745B9603m6919K11089P142n4858k4874p8777P7077j1252L3347n8847n4147l0799
6733b215l0320J25278N3669N7094j7893o293K7233o4011J459J1801M843n3377
6721A07268m7538L7248q3430o818k6482N3717J0230p7342m001J02898N2840j01931
$$ plain form
6709 16659 37906 6942 66966 92885 129689 38017 94423 145055 136144 203950 143320 117835
6697 117835 231463 299879 199746 217744 263086 307734 313461 275456 372443 442622 491380
6686 491380 438416 354541 359290 323692 263829 380027 438348 284097 239293 168993 138114
6675 138114 155738 135285 196493 170497 181903 170583 80532 127078 174740 160969 139293 121061
6663 121061 63614 128060 141819 -1192 -46285 70234 108225 100681 157606 279340 287895
6652 287895 185589 99135 41836 40918 143019 176265 56579 -29238 32746 41737 53258 37656
6640 37656 31311 141216 40411 8549 137074 180097 184991 228884 129547 53856 -17279 -43018
6628 -43018 -30080 61688 109829 14450 49344 162995 151762 209870 209473 256969 166989 140482
$$ packed form
6709A6659K1247l0964O0024K5919L6804r1672N6406N0632q911O7806o0630k5485
6697A17835J13628O8416j00133J7998M5342M4648N727l8005R6987P0179M8758
6686D91380n2964q3875M749l5598n9863J16198N8321j54251m4804p0300l0879
6675A38114J7624k0453O1208k5996J1406j1320r0051M6546M7662j3771k1676j8232
6663A21061n7447O4446J3759j43011m5093J16519L7991p544N6925J21734Q555
6652B87895j02306q6454n7299r18J02101L3246j19686q5817O1984Q991J1521j5602
6640C7656o345J09905j00805l1862J28525M3023M894M3893r9337p5691p1135k5739
6628d3018J2938R1768M8141r5379L4894J13651j1233N8108l97M7496q9980k6507
$$ plain form
6616 140482 54649 -1737 100375 154807 153143 184957 169063 212780 144527 51470 51694 68199
6604 68199 168278 131640 92566 46499 112949 103747 116575 225108 320561 280843 139837
6593 139837 44033 182995 169260 159045 140560 74435 65307 -245 102965 249461 231324
6582 231324 129005 108908 136725 40407 66045 77056 120677 53279 71093 57290 24735
6571 24735 -85558 -20590 -7487 15107 94489 42263 25268 29096 87328 182877 138471 185391
6559 185391 148026 152014 8920 54950 54430 -72647 47171 68942 222469 98763 27551
6548 27551 -4806 30996 52313 40603 11930 50984 -25226 -25860 -52094 24246 -51523 -40488
6536 -40488 21709 11616 17819 -12741 -55585 83133 228151 158486 53287 -30195 -31364 -8440
$$ packed form
6616A40482q5833n6386J02112N4432j664L1814j5894M3717o8253r3057K24J6505
6604F8199J00079l6638l9074m6067O6450r202J2828J08533R5453l9718j41006
6593A39837r5804J38962j3735j0215j8485o6125r128o5552J03210J46496j8137
6582B31324j02319k0097K7817r6318K5638J1011M3621o7398J7814j3803l2555
6571B4735j10293O4968J3103K2594P9382n2226j6995L828N8232R5549m4406M6920
6559A85391l7365L988j43094M6030n20j27077J19818K1771J53527j23706p1212
6548B7551l2357L5802K1317j1710k8673L9054p6210o34k6234P6340p5769J1035
6536d0488O2197j0093O203l0560m2844J38718J45018o9665j05199q3482j169K2924
$$ plain form
6524 -8440 82623 154860 64089 -47594 72369 -3702 23721 -21734 -46892 36930 -39242 -31481
6512 -31481 -70774 -37734 26744 -51519 -71373 -23677 58165 131032 26606 56927 108736 68755
6500 68755 48812 52010 119228 96062 -23826 65434 115592 104359 49557 119521 27399 2338
6488 2338 78365 76428 81742 2473 56817 23990 -6267 -14760 -37828 38371 -50597 -85226 -61525
6475 -61525 -31226 54607 30246 -20851 27455 52617 -20514 -29742 60438 56471 46425 87472
6463 87472 158387 148790 109426 134871 92927 124419 196644 271542 248581 170757 150783 87216
6451 87216 97617 95628 34153 11011 65338 92132 55196 148099 175754 102166 79003 82831
6439 82831 -7280 -14203 82371 123379 114056 77813 37452 41547 61268 69112 115001 128061 147176
$$ packed form
6524h440R1063P2237r0771j11683J19963p6071K7423m5455k5158Q3822p6172P761
6512c1481l9293L3040O4478p8263j9854M7696Q1842P2867j04426L0321N1809l9981
6500F8755j9943L198O7218k3166j19888Q9260N0158j1233n4802O9964r2122k5061
6488B338P6027j937N314p9269N4344l2827l0257q493k3068P6199q8968l4629K3701
6475f1525L0299Q5833k4361n1097M8306K5162p3131r228R0180l967j0046M1047
6463H7472P0915r597l9364K5445m1944L1492P2225P4898k2961p7824j9974o3567
6451H7216J0401j989o1475k3142N4327K6794l6936R2903K7655p3588k3163L828
6439H2831r0111o923R6574M1008r323l6243m0361M095J9721P844M5889J3060J9115
$$ plain form
6426 147176 174143 77026 97781 193032 90047 38655 130075 40753 192772 212278 254711
6415 254711 106628 66639 156177 70585 79715 108211 110217 218610 169342 215980 228783 169516
6403 169516 183154 189285 265820 225639 253495 281769 183399 137132 92014 199984 187815 234657
6391 234657 234951 135934 102286 129360 110171 143875 145129 231579 263605 233550 224320 251493
6379 251493 321678 315004 312335 176679 230424 224001 175259 100068 195256 96455 196764 191099
6367 191099 127845 185784 270905 261765 160945 163138 217342 240673 260246 275986 184918 205097
6355 205097 180905 108618 123222 142167 107959 177767 239246 228750 282991 246621 164872 183264
6343 183264 224434 249039 261616 248540 320006 355333 397207 418975 386416 470896 503632 546123
$$ packed form
6426A47176K6967r7117K0755R5251j02985n1392R1420q9322J52019J9506M2433
6415B54711j48083l9989Q9538q5592R130K8496K006J08393m9268M6638J2803n9267
6403A69516J3638O131P6535m0181K7856K8274r8370m6267m5118J07970j2169M6842
6391B34657K94r9017l3648K7074j9189L3704J254Q6450L2026l0055r230K7173
6379B51493P0185o674k669j35656N3745o423m8742p5191R5188r8801J00309n665
6367A91099o3254N7939Q5121r140j00820K193N4204K3331J9573J5740r1068K0179
6355B05097k4192p2287J4604J8945l4208O9808O1479j0496N4241l6370q1749J8392
6343A83264M1170K4605J2577j3076P1466L5327M1874K1768l2559Q4480L2736M2491
$$ plain form
6331 546123 604170 435558 528695 588910 759083 815692 841226 845164 748238 652928 550176
6320 550176 488202 505025 488824 507671 488936 442639 366775 362487 241551 302919 386832 363961
6308 363961 292663 289451 276638 270736 243307 202101 233794 261194 249261 273640 377699 402535
6296 402535 447860 303756 303902 167904 272302 359115 449725 413396 372628 346809 376564
6285 376564 435261 347875 318639 343667 371573 469086 387059 383173 389766 466738 551631 545828
6273 545828 510638 470533 521142 544337 471572 486448 463450 469315 518993 570124 650440 718771
6261 718771 760349 741899 815518 854574 897731 1027887 1239849 1344561 1494625 1689654 1941756
6250 1941756 2247696 2430938 2920431 3311054 3307558 2875483 2195873 1712499 1396669 1213533
$$ packed form
6331E46123N8047j68612R3137O0215J70173N6609K5534L938r6926r5310j02752
6320E50176o1974J6823j6201J8847j8735m6297p5864m288j20936O1368Q3913k2871
6308C63961p1298l212j2813n902k7429m1206L1693K7400j1933K4379J04059K4836
6296D02535M5325j44104J46j35998J04398Q6813R0610l6329m0768k5819K9755
6285C76564N8697q7386k9236K5028K7906R7513q2027l886O593P6972Q4893n803
6273E45828l5190m0105N0609K3195p2765J4876k2998N865M9678N1131Q0316O8331
6261G18771M1578j8450P3619L9056M3157J30156K11962J04712J50064J95029K52102
6250A941756L05940J83242M89493L90623l496m32075o79610m83374l15830j83136
$$ plain form
6240 1213533 1109427 1162744 961343 840139 851210 872980 700914 559584 633598 723220
6230 723220 558218 599835 640732 676886 662349 591258 575810 525292 611389 559634 528809
6219 528809 458252 499125 577636 570728 545090 573124 625854 661267 634380 671743 653216 667289
6207 667289 677763 473987 436494 516476 424472 556143 568130 568973 607562 586469 553299 634944
6195 634944 706585 572653 511361 578390 554621 605238 499066 425302 417411 395087 480910
6184 480910 594895 557578 509977 515044 621177 609705 544910 566886 581774 610519 573524
6173 573524 568438 586122 558046 563366 600039 637834 653506 716393 717803 623039 628057 519875
6161 519875 592930 592972 548798 530838 575555 737471 740130 641846 645158 580350 652225 620252
$$ packed form
6240A213533j04106N3317k01401j21204J1071K1770j72066j41330P4014Q9622
6230G23220j65002M1617M0897L6154j4537p1091j5448n0518Q6097n1755l0825
6219E28809p0557M0873P8511o908k5638K8034N2730L5413k6887L7363j8527J4073
6207F67289J0474k03776l7493P9982r2004J31671J1987Q43L8589k1093l3170Q1645
6195F34944P1641j33932o1292O7029k3769N0617j06172p3764p891k2324Q5823
6184D80910J13985l7317m7601N067J06133j1472o4795K1976J4888K8745l6995
6173E73524n086J7684k8076N320L6673L7795J5672O2887J410r4764N018j08182
6161E19875P3055M2m4174j7960M4717J61916K659r8284L312o4808P1875l1973
$$ plain form
6149 620252 526977 515048 552383 521318 467480 509642 451352 478463 627985 704283 674672
6138 674672 685536 744952 744315 682074 723562 792599 804693 815669 827708 827796 744670 816359 797034
6125 797034 824893 848817 862210 779138 799651 891471 898318 954865 943434 1085476 1053126 965093
6113 965093 1109983 1129678 1066173 1080806 973761 928598 952171 1000530 1033351 957405 985467
6102 985467 1061165 1154637 1163800 1240890 1192471 1238844 1175114 1109674 1160982 1204439 1186540 1187879
6090 1187879 1266709 1194938 1202110 1228520 1145457 1184152 1201595 1196460 1136292 1119228 1140388 1104418
6078 1104418 1148519 1131517 1102965 1033280 977172 981665 1167256 1166206 1202727 1238212 1201631 1216277
6066 1216277 1153385 1124481 1101809 1138141 1211683 1193619 1251534 1242779 1177011 1123094 1163556 1235332
$$ packed form
6149F20252r3275j1929L7335l1065n3838M2162n8290K7111J49522P6298k9611
6138F74672J0864N9416o37o2241M1488O9037J2094J0976J2039Q8q3126P1689j9325
6125G97034K7859K3924J3393q3072K0513R1820O847N6547j1431J42042l2350q8033
6113I65093J44890J9695o3505J4633j07045m5163K3573M8359L2821p5946K8062
6102I85467P5698R3472R163P7090m8419M6373o3730o5440N1308M3457j7899J339
6090A187879P8830p1771P172K6410q3063L8695J7443n135o0168j7064K1160l5970
6078A104418M4101j7002k8552o9685n6108M493J85591j050L6521L5485l6581J4646
6066A216277o2892k8904k2672L6332P3542j8064N7915q755o5768n3917M0462P1776
$$ plain form
6054 1235332 1232153 1254190 1279628 1242587 1201539 1285367 1363591 1306525 1320755 1373517 1233785
6043 1233785 1256327 1309646 1270289 1263975 1392425 1442210 1395471 1416627 1445150 1548250 1571725
6032 1571725 1493380 1416234 1449526 1470822 1439637 1398806 1368226 1442094 1528864 1486113 1541035
6021 1541035 1434491 1486381 1578024 1595923 1687651 1615676 1513496 1459741 1547538 1639848 1671723
6010 1671723 1677672 1758651 1797737 1772398 1617756 1623752 1741574 1708042 1730745 1761585 1676434
5999 1676434 1723008 1860706 1763865 1874340 1869436 1785839 1720818 1802415 1800813 1839346 1774917
5988 1774917 1792600 1785732 1905996 1975566 1980466 2032275 1925196 1856201 2017006 2160485 2023153
5977 2023153 1956502 1904441 1986597 2025640 2007995 1942314 1869840 1929765 1984525 2040658 2045213 2121267
$$ packed form
6054A235332l179K2037K5438l7041m1048Q3828P8224n7066J4230N2762j39732
6043A233785K2542N3319l9357o314J28450M9785m6739K1156K8523J03100K3475
6032A571725p8345p7146L3292K1296l1185m0831l0580P3868Q6770m2751N4922
6021A541035j06544N1890R1643J7899R1728p1975j02180n3755Q7797R2310L1875
6010A671723N949Q0979L9086k5339j54642N996J17822l3532K2703L0840q5151
5999A676434M6574J37698r6841J10475m904q3597o5021Q1597j602L8533o4429
5988A774917J7683o868J20264O9570M900N1809j07079o8995J60805J43479j37332
5977B023153o6651n2061Q2156L9043j7645o5681p2474N9925N4760N6133M555P6054
$$ plain form
5965 2121267 2137308 2113313 2202632 2147761 2195401 2256151 2168000 2233909 2373999 2310957 2182132
5954 2182132 2146449 2245183 2325524 2394648 2398115 2387606 2398592 2415795 2524102 2504660 2577802
5943 2577802 2636280 2647174 2826276 2724312 2874892 2914402 2783151 2788085 2744597 2750018 2876334
5932 2876334 2899969 2921904 3054831 3142552 3126070 3028736 3082454 3146645 3198622 3234042 3206148
5921 3206148 3263414 3332480 3505049 3569717 3609128 3605982 3701275 3769899 3845458 3789717 3843865
5910 3843865 3985910 4065938 4111855 4169794 4254307 4172327 4168735 4224602 4189973 4368247 4458405
5899 4458405 4501440 4433501 4514184 4655266 4786135 4799203 4817798 5008053 4984362 5024436 5097578
5888 5097578 5102072 5187383 5272769 5284390 5438448 5476953 5624060 5721086 5844187 6065673 6150912
$$ packed form
5965B121267J6041k3995Q9319n4871M7640O0750q8151O5909J40090o3042j28825
5954B182132l5683R8734Q0341O9124L467j0509J0986J7203J08307j9442P3142
5943B577802N8478J0894J79102j01964J50580L9510j31251M934m3488N421J26316
5932B876334K3635K1935J32927Q7721j6482r7334N3718O4191N1977L5420k7894
5921C206148N7266O9066J72569O4668L9411l146R5293O8624P5559n5741N4148
5910C843865J42045Q0028M5917N7939Q4513q1980l592N5867l4629J78274R0158
5899D458405M3035o7939Q0683J41082J30869J3068J8595J90255k3691M0074P3142
5888E097578M494Q5311Q5386J1621J54058L8505J47107R7026J23101K21486Q5239
$$ plain form
5877 6150912 6189217 6266098 6353893 6541750 6764273 6798056 6883232 7052495 7147969 7181212 7152918
5866 7152918 7240171 7267509 7297683 7384190 7557088 7639405 7728490 7798858 7886869 7885695 7973033
5855 7973033 8114012 8226471 8384315 8478443 8613973 8733922 8870733 9018955 9321396 9529901
5845 9529901 9634145 9876572 10079176 10309717 10690256 10999000 11458996 11942463 12599741 13369344
5835 13369344 13936146 14462921 15079135 15575126 15994094 16038065 15901303 15855952 15663422 15606295
5825 15606295 15746073 15698086 15554789 15474479 15327927 15210361 15112170 15176216 15286327 15394828
5815 15394828 15572428 15814245 15981608 16394075 16739282 17163258 17711508 18255552 18851500
5806 18851500 19440795 19969356 20642573 21457139 22238980 23153083 24289834 25545521 26962288
$$ packed form
5877F150912L8305P6881Q7795J87857K22523L3783Q5176J69263R5474L3243k8294
5866G152918Q7253K7338L0174Q6507J72898Q2317Q9085P0368Q8011j174Q7338
5855G973033J40979J12459J57844R4128J35530J19949J36811J48222L02441K08505
5845I529901J04244K42427K02604K30541L80539L08744M59996M83467O57278P69603
5835A3369344N66802N26775O16214M95991M18968M3971j36762m5351j92530n7127
5825A5606295J39778m7987j43297q0310j46552j17566r8191O4046J10111J08501
5815A5394828J77600K41817J67363M12467L45207M23976N48250N44044N95948
5806A8851500N89295N28561O73217Q14566P81841R14103J136751J255687J416767
$$ plain form
5797 26962288 28666204 30781454 33067025 35726603 38816453 42388657 46235488 50421280
5789 50421280 54889568 59217490 62933966 65360269 66343279 65719609 63513666 60185081
5781 60185081 56677629 53547691 50859053 49026564 47935603 47647842 47935757 48871803 50709491
5772 50709491 53146848 56244726 60197717 64584314 69503017 74983310 80701740 85988190
5764 85988190 89663180 90524662 87549012 81268878 73169425 64813005 57453255 51505980
5756 51505980 46429763 42300832 38967971 36060518 33631688 31565683 29724761 28203255
5748 28203255 26795641 25687902 24686749 23796113 23131218 22477226 21869457 21384788 20940337
5739 20940337 20663911 20416831 20053171 19702202 19398792 19131376 18942550 18733091 18500922
$$ packed form
5797B6962288J703916K115250K285571K659578L089850L572204L846831M185792
5789E0421280M468288M327922L716476K426303R83010o23670k205943l328585
5781F0185081l507452l129938k688638j832489j090961k87761K87915R36046J837688
5772E0709491K437357L097878L952991M386597M918703N480293N718430N286450
5764H5988190L674990Q61482k975650o280134q099453q356420p359750n947275
5756E1505980n076217m128931l332861k907453k428830k066005j840922j521506
5748B8203255j407614j107739j001153q90636o64895o53992o07769m84669m44451
5739B0940337k76426k47080l63660l50969l03410k67416j88826k09459k32169
$$ plain form
5730 18500922 18285596 18204765 17970295 17854166 17742945 17753017 17727673 17687778 17868090 18047656
5720 18047656 18301644 18608393 18966458 19236379 19587792 19895920 20352012 20764274 21171439
5711 21171439 21622384 22026826 22242406 22465933 22417057 22298286 22385332 22349905 22486927 22739780
5701 22739780 23050683 23470298 24022330 24504089 25100206 25713972 26190856 26768378 27474356
5692 27474356 28158788 28792993 29064672 29100828 29037033 28749366 28451442 28365311 28398457 28326700
5682 28326700 28405283 28541662 28828913 29345549 29998116 30751493 31457193 32305003 33007682 33593824
5672 33593824 33997538 34091278 34062524 33874464 33584727 33343704 33077171 32802465 32451990 32120159
5662 32120159 31653282 31442561 31413793 31357683 31496210 31705425 31777088 31754522 31470968 30704444
$$ packed form
5730A8500922k15326q0831k34470j16129j11221J0072k5344l9895J80312J79566
5720A8047656K53988L06749L58065K69921L51413L08128M56092M12262M07165
5711B1171439M50945M04442K15580K23527m8876j18771Q7046l5427J37022K52853
5701B2739780L10903M19615N52032M81759N96117O13766M76884N77522P05978
5692B7474356O84432O34205K71679L6156o3795k87667k97924q6131L3146p1757
5682B8326700P8583J36379K87251N16636O52567P53377P05700Q47810P02679N86142
5672C3593824M03714R3740k8754j88060k89737k41023k66533k74706l50475l31831
5662C2120159m66877k10721k8768n6110J38527K09215P1663k2566k83554p66524
$$ plain form
5652 30704444 29791776 28927209 28010933 27164695 26366781 25543442 24859008 24329964 23922265
5643 23922265 23486609 23260151 23213370 23324597 23440496 23662526 23985554 24155734 24104820 23818619
5633 23818619 23418977 22875657 22325612 21576246 20661660 19960833 19094592 18362113 17792951
5624 17792951 17172513 16802285 16477735 16118666 15933959 15809075 15553351 15347633 15225416
5615 15225416 15154461 14896499 14711630 14468542 14118287 13762252 13423702 13101655 12658627 12313978
5605 12313978 11900271 11537349 11256449 10955955 10683406 10428488 10321237 10245972 10080126 9822157
5595 9822157 9654083 9573283 9390771 9090415 8922664 8918041 8788484 8683422 8540284 8374967
5585 8374967 8204421 8071087 7889649 7853379 7749346 7698487 7538892 7487043 7296472 7087368
$$ packed form
5652C0704444r12668q64567r16276q46238p97914q23339o84434n29044m07699
5643B3922265m35656k26458m6781J11227J15899K22030L23028J70180n0914k86201
5633B3818619l99642n43320n50045p49366r14586p00827q66241p32479n69162
5624A7792951o20438l70228l24550l59069j84707j24884k55724k05718j22217
5615A5225416p0955k57962j84869k43088l50255l56035l38550l22047m43028l44649
5605A2313978m13707l62922k80900l00494k72549k54918j07251p5265j65846k57969
5595I822157j68074q0800j82512l00356j67751m623j29557j05062j43138j65317
5585H374967j70546j33334j81438l6270j04033n0859j59595n1849j90571k09104
$$ plain form
5575 7087368 7031855 7019725 7000039 6940680 6765775 6622628 6725968 6770720 6626807 6585540 6565173
5564 6565173 6494906 6466047 6534791 6567879 6534408 6420298 6329124 6217399 6162760 6112459 6065557
5553 6065557 6038968 6049950 6012651 5980396 5876068 5845246 5872585 5937876 5852899 5786224 5829407
5542 5829407 5807018 5779334 5672936 5604370 5571058 5651190 5531217 5524587 5558168 5522973 5530239
5531 5530239 5473771 5343243 5293779 5234153 5246130 5105863 5152848 5113028 5134557 5050451 5046925
5520 5046925 5010917 4995282 5074362 5041864 5030420 5052910 5008507 5107719 5135115 5117993 5060854
5509 5060854 4950114 4901790 4848274 4919600 5027708 5025640 4944640 4942203 4885231 4873322 4926702
5498 4926702 4919109 4865424 4842412 4763454 4780626 4848600 4967674 5031917 4957364 4922059 4933548
$$ packed form
5575G087368n5513j2130j9686n9359j74905j43147J03340M4752j43913m1267k0367
5564F565173p0267k8859O8744L3088l3471j14110r1174j11725n4639n0301m6902
5553F065557k6589J0982l7299l2255j04328l0822K7339O5291q4977o6675M3183
5542E829407k2389k7684j06398o8566l3312Q0132j19973o630L3581l5195P266
5531E530239n6468j30528m9464n9626J1977j40267M6985l9820K1529q4106l526
5520E046925l6008j5635P9080l2498j1444K2490m4403R9212K7396j7122n7139
5509E060854j10740m8324n3516P1326J08108k068q1000k437n6972j1909N3380
5498D926702p593n3685k3012p8958J7172O7974J19074O4243p4553l5305J1489
$$ plain form
5487 4933548 5044025 5175278 5243518 5209718 5209771 5149246 5157852 5045044 4955753 4901126 4767601
5476 4767601 4795434 4701245 4747466 4788168 4712872 4696471 4679188 4601948 4644320 4727593 4701359
5465 4701359 4779439 4818122 4783510 4922318 4968922 5149685 5175563 5274924 5442155 5539487 5740093
5454 5740093 5849637 6138848 6304520 6206565 5906312 5573893 5297287 5138933 5098586 5126775
5444 5126775 5064037 4952349 4955251 5006852 4972835 4977591 5042116 5005449 5015489 5097740 5049622 5115156
5432 5115156 5254253 5387361 5414899 5370015 5455912 5566521 5735411 5830550 5960846 6172658
5422 6172658 6297071 6516988 6605667 6467281 6224608 5893151 5705965 5524539 5382419 5353976
5412 5353976 5270882 5224837 5198975 5248251 5241583 5255720 5319700 5324704 5340401 5406269 5358561 5340233
$$ packed form
5487D933548J10477J31253O8240l3800N3o0525Q606j12808q9291n4627j33525
5476D767601K7833r4189M6221M0702p5296j6401j7283p7240M2372Q3273k6234
5465D701359P8080L8683l4612J38808M6604J80763K5878R9361J67231R7332K00606
5454E740093J09544K89211J65672r7955l00253l32419k76606j58354m0347K8189
5444E126775o2738j11688K902N1601l4017M756O4525l6667J0040Q2251m8118O5534
5432E115156J39097J33108K7538m4884Q5897J10609J68890R5139J30296K11812
5422F172658J24413K19917Q8679j38386k42673l31457j87186j81426j42120k8443
5412E353976q3094m6045k5862M9276o668J4137O3980N004J5697O5868m7708j8328
$$ plain form
5400 5340233 5485812 5517417 5638357 5752347 5905339 6128323 6232990 6431967 6727144 6960061
5390 6960061 7144169 7262733 7294546 7173544 6927230 6908242 6859814 6710127 6804459 6958372
5380 6958372 6915191 7034938 7131610 7107837 7226563 7243889 7329940 7461272 7502380 7485599 7542279
5369 7542279 7609573 7641236 7483705 7341391 7123350 6999246 6906758 6797159 6697766 6678956
5359 6678956 6597479 6541655 6578524 6536049 6447560 6362862 6301873 6187172 5982781 5980878 5908594
5348 5908594 5869404 5833230 5700918 5643351 5675576 5660202 5615437 5626175 5578729 5576581 5598318
5337 5598318 5689062 5775286 5617805 5649262 5732063 5746071 5836464 5843820 5850613 5809058 5919484
5326 5919484 5917366 5894667 5919466 5941598 5964330 6003548 5895536 5796427 5895104 5921165 5994778
$$ packed form
5400E340233J45579L1605J20940J13990J52992K22984J04667J98977K95177K32917
5390F960061J84108J18564L1813j21002k46314j8988m8428j49687R4332J53913
5380F958372m3181J19747R6672k3773J18726J7326Q6051J31332M1108j6781N6680
5369G542279O7294L1663j57531j42314k18041j24104r2488j09599r9393j8810
5359F678956q1477n5824L6869m2475q8489q4698o0989j14701k04391j903p2284
5348E908594l9190l6174j32312n7567L2225j5374m4765J0738m7446k148K1737
5337E598318R0744Q6224j57481L1457Q2801J4008R0393P356O793m1555J10426
5326E919484k118k2699K4799K2132K2732L9218j08012r9109R8677K6061P3613
$$ plain form
5315 5994778 6011675 6009167 6035146 6102092 6218166 6225119 6319736 6333394 6362803 6443834 6500458 6515083
5303 6515083 6543394 6559855 6571134 6661978 6553569 6514413 6513616 6493922 6541875 6623348 6659924 6656007
5291 6656007 6625751 6688393 6778473 6799219 6830947 6941840 7106658 7095372 7109203 7062085 6968583
5280 6968583 6970114 7104260 7156197 7214001 7271090 7354474 7376046 7415087 7335536 7439365 7560111
5269 7560111 7665044 7779987 7825146 7851761 7875863 7925928 7960781 8039976 8076908 8151050 8179180
5258 8179180 8291469 8400617 8418571 8460458 8577432 8652188 8737270 8831362 8818027 8889512 9042375
5247 9042375 9059929 9093574 9204317 9208849 9265590 9436901 9527700 9738225 9741618 9865016 10009929
5236 10009929 10026817 10136505 10253876 10396848 10476796 10580004 10651493 10811158 11036016 11084471
$$ packed form
5315E994778J6897k508K5979O6946J16074O953R4617J3658K9409Q1031N6624J4625
5303F515083K8311J6461J1279R0844j08409l9156p97j9694M7953Q1473L6576l917
5291F656007l0256O2642R0080K0746L1728J10893J64818j1286J3831m7118r3502
5280F968583J531J34146N1937N7804N7089Q3384K1572L9041p9551J03829J20746
5269G560111J04933J14943M5159K6615K4102N0065L4853P9195L6932P4142K8130
5258H179180J12289J09148J7954M1887J16974P4756Q5082R4092j3335P1485J52863
5247I042375J7554L3645J10743M532N6741J71311R0799K10525L393J23398J44913
5236A0009929J6888J09688J17371J42972P9948J03208P1489J59665K24858M8455
$$ plain form
5226 11084471 10989098 11249467 11425782 11645112 11789187 11798935 11763405 11855101 11919252 12046044
5216 12046044 12304984 12311537 12536184 12588695 12582800 12824414 13016133 13143845 13289581 13326235
5206 13326235 13565843 13823404 13848523 13899043 14075503 14338600 14454676 14758572 14967085 15089263
5196 15089263 15292537 15427182 15567636 15742075 15961470 16122470 16207142 16404281 16527680 16726279
5186 16726279 16857058 17008258 17188465 17398868 17506309 17585599 17918211 18143518 18270169 18444193
5176 18444193 18637564 18755187 18998245 19144509 19380636 19480469 19643436 19923255 20074637 20144237
5166 20144237 20248903 20458495 20546012 20732255 20889379 20966221 21168614 21366958 21543549 21541165
5156 21541165 21682628 21835873 21948044 22079266 22235825 22412542 22507591 22609965 22598405 22565595
$$ packed form
5226A1084471r5373K60369J76315K19330J44075R748l5530R1696O4151J26792
5216A2046044K58940O553K24647N2511n895K41614J91719J27712J45736L6654
5206A3326235K39608K57561K5119N0520J76460K63097J16076L03896K08513J22178
5196A5089263K03274J34645J40454J74439K19395J61000Q4672J97139J23399J98599
5186A6726279J30779J51200J80207K10403J07441P9290L32612K25307J26651J74024
5176A8444193J93371J17623K43058J46264K36127R9833J62967K79819J51382O9600
5166B0144237J04666K09592Q7517J86243J57124P6842K02393J98344J76591k384
5156B1541165J41463J53245J12171J31222J56559J76717R5049J02374j1560l2810
$$ plain form
5146 22565595 22671416 22762362 22774691 22891506 22958747 22969900 23002634 23011884 23028214 23022571 23019467
5135 23019467 22958352 22903011 22855638 22952191 22856695 22713672 22739287 22706138 22593590 22483347 22360922
5124 22360922 22177324 22167427 22029568 21995756 21909661 21788213 21740945 21572996 21390926 21181921
5114 21181921 20995302 20850006 20745319 20560185 20423337 20248358 20065638 19916002 19736494
5105 19736494 19511353 19327208 19145118 19104326 18982478 18845312 18643485 18443195 18197104 18021602
5095 18021602 17803423 17668930 17501434 17308248 17094815 16907904 16835519 16552548 16357851 16215214
5085 16215214 15950847 15785797 15568674 15442161 15345089 15040319 14850318 14684666 14512961 14400773
5075 14400773 14282105 14151231 14086404 13949638 13795682 13634899 13436406 13265595 13032838 12779091
$$ packed form
5146B2565595J05821R0946J2329J16815O7241J1153L2734R250J6330n643l104
5135B3019467o1115n5341m7373R6553r5496j43023K5615l3149j12548j10243j22425
5124B2360922j83598r897j37859l3812q6095j21448m7268j67949j82070k09005
5114B1181921j86619j45296j04687j85134j36848j74979j82720j49636j79508
5105A9736494k25141j84145j82090m0792j21848j37166k01827k00290k46091j75502
5095A8021602k18179j34493j67496j93186k13433j86911p2385k82971j94697j42637
5085A6215214k64367j65050k17123j26513r7072l04770j90001j65652j71705j12188
5075A4400773j18668j30874o4827j36766j53956j60783j98493j70811k32757k53747
$$ plain form
5065 12779091 12681581 12695174 12536890 12288847 12092768 11917378 11671390 11509526 11414148 11365793
5055 11365793 11319996 11093110 10892070 10870130 10827718 10651684 10530315 10398145 10272737 10097070
5045 10097070 10062466 9923928 9799168 9809578 9744724 9599124 9525332 9325016 9181406 9054314
5035 9054314 8935122 8854242 8748044 8693661 8696553 8639454 8542385 8496302 8396716 8282454 8299387
5024 8299387 8198521 7993085 7903066 7896901 7792272 7718870 7608617 7604729 7532006 7409552 7317923
5013 7317923 7380943 7350855 7217783 7198100 7042153 6912870 6984012 6863532 6827442 6873393 6708151
5002 6708151 6712267 6665978 6688302 6598303 6543117 6650400 6577117 6533060 6466323 6404439 6229445
4991 6229445 6266387 6207942 6089269 6026473 5891480 5963239 6058080 6064426 5968812 5948636 5912481
$$ packed form
5065A2779091r7510J3593j58284k48043j96079j75390k45988j61864r5378m8355
5055A1365793m5797k26886k01040k1940m2412j76034j21369j32170j25408j75667
5045A0097070l4604j38538j24760J0410o4854j45600p3792k00316j43610j27092
5035I054314j19192q0880j06198n4383K892n7099r7069m6083r9586j14262J6933
5024H299387j00866k05436r0019o165j04629p3402j10253l888p2723j22454r1629
5013G317923O3020l0088j33072j9683j55947j29283P1142j20480l6090M5951j65242
5002F708151M116m6289K2324q9999n5186J07283p3283m4057o6737o1884j74994
4991F229445L6942n8445j18673o2796j34993P1759R4841O346r5614k0176l6155
$$ plain form
4980 5912481 5881871 5819081 5763911 5718740 5719170 5774759 5808606 5685983 5551071 5594256 5662565
4969 5662565 5593494 5639427 5558604 5470329 5583383 5641465 5699868 5589567 5751359 5753463 5744378
4958 5744378 5826218 5943110 5967612 6059459 6206171 6121045 6057497 6052400 6119124 6103057 6058202
4947 6058202 5940304 5864987 5817802 5862289 5861911 5875803 5885980 5906288 5787191 5703321 5614134
4936 5614134 5509492 5468667 5516698 5480446 5351642 5268055 5288124 5216638 5109908 5128324 5074581
4925 5074581 4996179 4991416 4897398 4846525 4818365 4766847 4682115 4553487 4541199 4595556 4625023
4914 4625023 4652632 4586112 4496540 4440586 4525486 4401469 4473306 4442722 4382967 4403001 4420896
4903 4420896 4388764 4346703 4373685 4434028 4517667 4490925 4507311 4545025 4601307 4659153 4624965
$$ packed form
4980E912481l0610o2790n5170m5171M30N5589L3847j22623j34912M3185O8309
4969E662565o9071M5933q0823q8275J13054N8082N8403j10301J61792K104r085
4958E744378Q1840J16892K4502R1847J46712q5126o3548n097O6724j6067m4855
4947F058202j17898p5317m7185M4487l78J3892J0177K0308j19097q3870q9187
4936E614134j04642m0825M8031l6252j28804q3587K0069p1486j06730J8416n3743
4925E074581p8402m763r4018n0873k8160n1518q4732j28628j2288N4357K9467
4914D625023K7609o6520q9572n5954Q4900j24017P1837l0584n9755K0034J7895
4903D420896l2132m2061K6982O0343Q3639k6742J6386L7714N6282N7846l4188
$$ plain form
4892 4624965 4708047 4805525 4867827 4969078 5129234 5135313 5115085 5145383 5238439 5281346 5257316
4881 5257316 5307972 5205064 5257094 5193487 5137093 5199599 5131434 5101531 5085825 5014455 4997392
4870 4997392 4796601 4634090 4589597 4626806 4568061 4464168 4430971 4400606 4298241 4236674 4193659
4859 4193659 4179788 4140010 4023552 3955429 3819682 3877009 3976278 3841116 3733853 3756154 3815784
4848 3815784 3815733 3755413 3676343 3662930 3707010 3691937 3713030 3676395 3678696 3621381 3554630 3539750
4836 3539750 3470632 3436037 3444957 3440335 3502119 3490360 3418907 3419795 3370638 3379095 3356906 3372197
4824 3372197 3399840 3392040 3295904 3288836 3298968 3321893 3412792 3422998 3332696 3488639 3506723 3505078
4812 3505078 3532385 3507964 3507931 3637534 3704162 3609084 3575170 3511329 3519576 3529606 3466643 3492957
$$ packed form
4892D624965Q3082R7478O2302J01251J60156O079k0228L0298R3056M2907k4030
4881E257316N0656j02908N2030o3607n6394O2506o8165k9903j5706p1370j7063
4870D997392k00791j62511m4493L7209n8745j03893l3197l0365j02365o1567m3015
4859D193659j3871l9778j16458o8123j35747N7327R9269j35162j07263K2301N9630
4848C815784n1o0320p9070j3413M4080j5073K1093l6635K301n7315o6751j4880
4836C539750o9118l4595Q920m622O1784j1759p1453Q88m9157Q457k2189J5291
4824C372197K7643p800r6136p068J0132K2925R0899J0206r0302J55943J8084j645
4812C505078K7307k4421l3J29603O6628r5078l3914o3841Q247J0030o2963K6314
$$ plain form
4800 3492957 3577294 3536110 3546535 3533589 3522439 3493674 3595804 3569307 3520095 3594520 3590343
4789 3590343 3668715 3668917 3588785 3592485 3631781 3622120 3608707 3581669 3617023 3718592 3758819 3657661
4777 3657661 3693376 3805492 3829005 3820956 3847759 3814103 3871971 3946521 4085494 4060883 4010096
4766 4010096 4075731 4107840 4090093 4079461 4027609 4219088 4213919 4231041 4317181 4379008 4305181
4755 4305181 4357064 4570155 4690237 4651856 4593583 4549617 4524970 4607952 4806088 4834389 4818181
4744 4818181 4870325 4776687 4934950 5030653 5023045 5112474 5147401 5224212 5277507 5283419 5425082
4733 5425082 5456776 5470322 5611660 5716962 5712278 5800750 5840854 5960746 6085464 6237326 6388484
4722 6388484 6437230 6500863 6659682 6897237 7087089 7229114 7386486 7470275 7761232 8004186
$$ packed form
4800C492957Q4337m1184J0425j2946j1150k8765J02130k6497m9212P4425m177
4789C590343P8372K02q0132L700L9296r661j3413k7038L5354J01569M0227j01158
4777C657661L5715J12116K3513q049K6803l3656N7868P4550J38973k4611n0787
4766D010096O5635L2109j7747j0632n1852J91479n169J7122Q6140O1827p3827
4755D305181N1883K13091J20082l8381n8273m3966k4647Q2982J98136K8301j6208
4744D818181N2144r3638J58263R5703p608Q9429L4927P6811N3295N912J41663
4733E425082L1694J3546J41338J05302m684Q8472M0104J19892J24718J51862J51158
4722F388484M8746O3633J58819K37555J89852J42025J57372Q3789K90957K42954
$$ plain form
4712 8004186 8379272 8732188 9134404 9536971 10116163 10661735 11308189 12135467 12999026 13919779
4702 13919779 14925928 15953429 16894335 17641327 18030108 17769932 17168793 16354904 15472463
4693 15472463 14911152 14391837 14188824 14217362 14356736 14591605 14983543 15561381 16162899 16912779
4683 16912779 17760608 18687750 19376047 19850269 19728666 18921895 17888698 16693310 15633851
4674 15633851 14856874 14199374 13642097 13278497 13028053 12797931 12689358 12559620 12533330 12615513
4664 12615513 12616434 12650339 12888322 13019191 13234641 13562451 13917685 14305359 14840204 15485091
4654 15485091 16144481 16998708 18004812 19177716 20623030 22202020 23884017 25736639
4646 25736639 27553351 29238203 30462995 30768920 30294059 29070174 27314385 25613547
$$ packed form
4712H004186L75086L52916M02216M02567N79192N45572O46454Q27278Q63559R20753
4702A3919779J006149J027501R40906P46992L88781k60176o01139q13889q82441
4693A5472463n61311n19315k03013K8538J39374K34869L91938N77838O01518P49880
4683A6912779Q47829R27142O88297M74222j21603q06771j033197j195388j059459
4674A5633851p76977o57500n57277l63600k50444k30122j08573j29738k6290Q2183
4664A2615513R21L3905K37983J30869K15450L27810L55234L87674N34845O44887
4654A5485091O59390Q54227J006104J172904J445314J578990J681997J852622
4646B5736639J816712J684852J224792L05925m74861j223885j755789j700838
$$ plain form
4638 25613547 24191763 23179011 22649729 22271597 22143478 22474496 23166938 23940069 24729214
4629 24729214 25799503 26911582 27947644 28658216 28701639 27945085 26440699 24318599 22230351
4620 22230351 20349213 18802438 17407915 16349116 15390237 14646483 14102355 13619666 13206523
4611 13206523 12825661 12465579 12198963 11865408 11611214 11447332 11235948 11129951 10900187
4602 10900187 10711453 10571274 10564789 10425807 10265412 10110671 10003463 9874759 9814349 9692282
4592 9692282 9617727 9537988 9425615 9297158 9160979 9133389 9076184 9017070 8990906 8983299 9011636
4581 9011636 8964704 8948166 8996974 8901566 9006559 9032963 9041868 9028799 9194816 9245030 9311167
4570 9311167 9375420 9470666 9476801 9581020 9727363 9927526 10138342 10404279 10583680 10655740
$$ packed form
4638B5613547j421784j012752n29282l78132j28119L31018O92442P73131P89145
4629B4729214J070289J112079J036062P10572M3423p56554j504386k122100k088248
4620B2230351j881138j546775j394523j058799r58879p43754n44128m82689m13143
4611A3206523l80862l60082k66616l33555k54194j63882k11384j05997k29764
4602A0900187j88734j40179o485j38982j60395j54741j07208j28704o0410j22067
4592I692282p4555p9739j12373j28457j36179k7590n7205n9114k6164p607K8337
4581I011636m6932j6538M8808r5408J04993K6404Q905j3069J66017N0214O6137
4570I311167O4253R5246O135J04219J46343K00163K10816K65937J79401P2060
$$ plain form
4560 10655740 10940190 11317229 11629745 12029430 12589909 13182622 13815434 14536151 15388610
4551 15388610 16474459 17652389 18854528 20265501 21831020 23339144 25036940 26854818
4543 26854818 28320398 29207672 29220677 28202307 26464380 24478637 22567380 20921431 19580150
4534 19580150 18444419 17634543 17015212 16591331 16145907 15806852 15552220 15425088 15407305
4525 15407305 15496571 15498128 15680132 16130234 16547502 16938081 17424067 18044090 18793300 19639405
4515 19639405 20459644 21655756 22843178 24151148 25564535 27107887 28613690 29869565
4507 29869565 30370326 30064968 28883104 27168049 25300546 23618257 22310056 21271728
4499 21271728 20491110 19851835 19461863 19290371 19227395 19341612 19585713 19939270 20493725 21013973
$$ packed form
4560A0655740K84450L77039L12516L99685N60479N92713O32812P20717Q52459
4551A5388610J085849J177930J202139J410973J565519J508124J697796J817878
4543B6854818J465580Q87274J3005j018370j737927j985743j911257j645949j341281
4534A9580150j135731q09876o19331m23881m45424l39055k54632j27132j7783
4525A5407305Q9266J557J82004M50102M17268L90579M85986O20023P49210Q46105
4515A9639405Q20239J196112J187422J307970J413387J543352J505803J255875
4507B9869565N00761l05358j181864j715055j867503j682289j308201j038328
4499B1271728p80618o39275l89972j71492o2976J14217K44101L53557N54455N20248
$$ plain form
4489 21013973 21654421 22293134 22633424 22328433 21559383 20422307 19104780 17778662 16774662
4480 16774662 16073625 15396986 14875170 14323891 13995509 13733620 13489419 13307285 13249480 13223387
4470 13223387 13179322 13098235 13202110 13340487 13496629 13708859 13984255 14231006 14641519 15061744
4460 15061744 15665600 16171523 16870098 17517201 18250492 19117553 19902233 20470529 20683742
4451 20683742 20242741 19263457 18192953 17205579 16381668 15594355 14907073 14257918 13615780
4442 13615780 13171852 12635901 12207092 11912883 11620918 11272732 11044105 10871073 10594355
4433 10594355 10584741 10399288 10184787 10189667 10039286 9880292 9842697 9814713 9682718 9641332 9669310
4422 9669310 9570492 9467467 9450702 9512658 9501654 9452202 9483546 9574833 9478151 9455108 9475464
$$ packed form
4489B1013973O40448O38713L40290l04991p69050j137076j317527j326118j004000
4480A6774662p01037o76639n21816n51279l28382k61889k44201j82134n7805k6093
4470A3223387m4065q1087J03875J38377J56142K12230K75396K46751M10513M20225
4460A5061744O03856N05923O98575O47103P33291Q67061P84680N68296K13213
4451B0683742m41001r79284j070504r87374q23911p87313o87282o49155o42138
4442A3615780m43928n35951m28809k94209k91965l48186k28627j73032k76718
4433A0594355r614j85453k14501M880j50381j58994l7595k7984j31995m1386K7978
4422I669310r8818j03025j6765O1956j1004m9452L1344R1287r6682k3043K0356
$$ plain form
4411 9475464 9573351 9599320 9683530 9682973 9680501 9675657 9647103 9728623 9817853 9834528 9890459 9948247
4399 9948247 10071246 10126378 10173684 10202698 10290335 10344963 10363577 10431575 10322806 10395605 10435666
4388 10435666 10369893 10479730 10526722 10492919 10681803 10709782 10752385 10882396 10952551 10949533 11017557
4377 11017557 11009477 11018571 11065587 11183994 11362517 11453136 11561236 11850872 11977871 12145704
4367 12145704 12310350 12425193 12583874 12802432 12993844 13070098 13289473 13474774 13505529 13457967
4357 13457967 13399571 13322047 13266794 13040779 12929805 12881378 12889117 12913499 13054336 13054914 13133140
4346 13133140 13193350 13302741 13339063 13386530 13463963 13618183 13697494 13694968 13693612 13859013 14021149
4335 14021149 14119115 14065596 14158235 14442455 14624975 14694293 14989099 15238876 15583963 15724511
$$ packed form
4411I475464R7887K5969Q4210n57k472m844k8554Q1520Q9230J6675N5931N7788
4399I948247J22999N5132M7306K9014Q7637N4628J8614O7998j08769P2799M0061
4388A0435666o5773J09837M6992l3803J88884K7979M2603J30011P0155l018O8024
4377A1017557q080R094M7016J18407J78523R0619J08100K89636J26999J67833
4367A2145704J64646J14843J58681K18558J91412P6254K19375J85301L0755m7562
4357A3457967n8396p7524n5253k26015j10974m8427P739K4382J40837N78P8226
4346A3133140O0210J09391L6322M7467P7433J54220P9311k526j356J65401J62136
4335A4021149R7966n3519R2639K84220J82520O9318K94806K49777L45087J40548
$$ plain form
4325 15724511 15869269 16093990 16157303 16273539 16416739 16514608 16708694 16762024 16954855 17070401
4315 17070401 17179725 17335580 17449549 17632011 17777728 17940700 18179628 18341126 18436638 18539862
4305 18539862 18793940 18998994 19077781 19320813 19549561 19963520 20325927 20639499 21014729 21603025
4295 21603025 21960034 22399382 22873249 23219529 23705786 24112154 24571033 24973349 25411284
4286 25411284 25999745 26481741 27042879 27640126 28211562 28854395 29530826 30325473 31019451
4277 31019451 31760750 32541820 33380299 34250665 34997511 35855571 36756451 37742444 38870793
4268 38870793 39947709 41082400 42413550 43921948 45611201 47491728 49447585 51401836
4260 51401836 53553990 55669861 57816991 60064553 62195606 64470597 66961810 69738392
$$ packed form
4325A5724511J44758K24721O3313J16236J43200R7869J94086N3330J92831J15546
4315A7070401J09324J55855J13969J82462J45717J62972K38928J61498R5512J03224
4305A8539862K54078K05054P8787K43032K28748M13959L62407L13572L75230N88296
4295B1603025L57009M39348M73867L46280M86257M06368M58879M02316M37935
4286B5411284N88461M81996N61138N97247N71436O42833O76431P94647O93978
4277C1019451P41299P81070Q38479Q70366P46846Q58060R00880R85993J128349
4268C8870793J076916J134691J331150J508398J689253J880527J955857J954251
4260E1401836K152154K115871K147130K247562K131053K274991K491213K776582
$$ plain form
4252 69738392 72739172 75989183 79491908 83545385 88282710 93579565 99689018 106633192
4244 106633192 114596042 123678856 134069590 145837805 159157229 174143993 190614844
4237 190614844 207375819 222755491 234699722 241494612 241446913 234125234 220281001 202140279
4229 202140279 182303141 163066175 146092706 132725526 122838940 115939316 111275208
4222 111275208 108205522 106116717 104642418 103490921 102224611 100793815 99187351 97237007
4214 97237007 94890553 92136468 89295586 86097317 82669057 79135955 75755114 72507588
4206 72507588 69692498 67109957 64983404 63166296 61758902 60706925 59649865 58677285
4198 58677285 57706263 56758697 56017980 55147066 54478500 53975723 53594903 53439861 53595140
$$ packed form
4252F9738392L000780L250011L502725M053477M737325N296855O109453O944174
4244A06633192P962850R082814J0390734J1768215J3319424J4986764J6470851
4237A90614844J6760975J5379672J1944231O794890m7699p321679j3844233j8140722
4229B02140279j9837138j9236966j6973469j3367180r886586o899624m664108
4222A11275208l069686k088805j474299j151497j266310j430796j606464j950344
4214I7237007k346454k754085k840882l198269l428260l533102l380841l247526
4206G2507588k815090k582541k126553j817108j407394j051977j057060r72580
4198E8677285r71022r47566p40717q70914o68566n02777l80820j55042J55279
$$ plain form
4189 53595140 53694285 54137588 54733091 55165933 55646722 56517533 57463156 58625508 60004219
4180 60004219 61514920 63290397 65293344 67673323 70512577 74031949 78231576 83133504
4172 83133504 88710440 95564651 103797416 113732123 126141134 140852838 157838599 177272172
4164 177272172 198937797 223465572 251494641 282493312 309804017 321315323 311414441
4157 311414441 283332951 248603904 214932478 185685991 161706100 142601587 127796995
4150 127796995 116071755 106611354 98485914 91469154 85586821 80858926 76935461 73829311
4142 73829311 71165077 69121036 67044788 64502524 61883179 59506593 57412299 55958487
4134 55958487 54504937 53354941 52042691 50762034 49650116 48885080 48152692 47637878 47050639
$$ packed form
4189E3595140R9145M43303N95503M32842M80789Q70811R45623J162352J378711
4180F0004219J510701J775477K002947K379979K839254L519372M199627M901928
4172H3133504N576936O854211Q232765R934707J2409011J4711704J6985761J9433573
4164A77272172K1665625K4527775K8029069L0998671K7310705J1511306r900882
4157C11414441k8081490l4729047l3671426k9246487k3979891j9104513j4804592
4150A27796995j1725240r460401q125440p016760n882333m727895l923465l106150
4142G3829311k664234k044041k076248k542264k619345k376586k094294j453812
4134E5958487j453550j149996j312250j280657j111918p65036p32388n14814n87239
$$ plain form
4125 47050639 46668067 46196987 46020868 45529915 45130245 44679918 44184086 43240483 42474126
4116 42474126 41551844 40960142 40113032 39546113 38939373 38493200 37761021 37333934 36748670
4107 36748670 36484080 36226896 36208202 35907819 36188762 36532539 37057986 37214576 37671022 37945250
4097 37945250 38421737 38905482 39935715 40642586 41583989 42230912 43288624 44504249 46383029
4088 46383029 48303636 51214541 54266073 58144055 62059996 67364982 74000001 83390698
4080 83390698 94251679 108635917 124901384 142876804 161144048 186122726 220299529
4073 220299529 270552897 291071935 244770589 188013073 138569479 108583750 90507259
4066 90507259 79324527 70981972 64367016 58817958 54681318 50844406 47526240 45024476
$$ packed form
4125D7050639l82572m71080j76119m90953l99670m50327m95832r43603p66357
4116D2474126r22282n91702q47110n66919o06740m46173p32179m27087n85264
4107C6748670k64590k57184j8694l00383K80943L43777N25447J56590M56446K74228
4097C7945250M76487M83745J030233P06871R41403O46923J057712J215625J878780
4088D6383029J920607K910905L051532L877982L915941N304986O635019R390697
4080H3390698J0860981J4384238J6265467J7975420J8267244K4978678L4176803
4073B20299529N0253368K0519038m6301346n6757516m9443594k9985729j8076491
4066I0507259j1182732q342555o614956n549058m136640l836912l318166k501764
$$ plain form
4058 45024476 42944491 40907151 39121287 37512413 36310372 35040883 33938355 32784170
4050 32784170 31745007 31104691 30560763 30012944 29286216 28759282 28421352 28328012 28121388
4041 28121388 27972561 27798305 27570064 27197770 26874737 26472101 26162914 25890548 25815535 25840603
4031 25840603 25958019 25861587 25971255 26098371 26351956 26499426 26642969 26737745 26997897 27329556
4021 27329556 27900715 28288477 28768615 29148736 29635093 30029437 30764230 31474013 32312428
4012 32312428 32908869 33812451 34734397 35729982 36693834 37937330 39097111 40347776 41550818
4003 41550818 42954475 44359791 45819989 47402525 49108884 50746659 52477814 54322196
3995 54322196 56286455 58167866 60295671 62296499 64545585 66647919 68762144 70835610
$$ packed form
4058D5024476k079985k037340j785864j608874j202041j269489j102528j154185
4050C2784170j039163o40316n43928n47819p26728n26934l37930r3340k06624
4041B8121388j48827j74256k28241l72294l23033m02636l09187k72366p5013K5068
4031B5840603J17416r6432J09668J27116K53585J47470J43543R4776K60152L31659
4021B7329556N71159L87762M80138L80121M86357L94344P34793P09783Q38415
4012C2312428N96441R03582R21946R95585R63852J243496J159781J250665J203042
4003D1550818J403657J405316J460198J582536J706359J637775J731155J844382
3995E4322196J964259J881411K127805K000828K249086K102334K114225K073466
$$ plain form
3987 70835610 73016573 75212287 77326177 79221020 81161903 82883818 84696898 86306231
3979 86306231 87958427 89490393 91023229 92343043 93644199 94729501 95815226 96714895
3971 96714895 97469935 98105009 98423486 98504996 98500167 98082350 97692614 97088624 96288675 95496371
3961 95496371 94628432 93556941 92502853 91225166 89899325 88504211 86995013 85208473
3953 85208473 83332814 81348452 79425120 77266257 75255756 73263864 71159941 69104170
3945 69104170 67049651 64986446 62808413 60754938 58691366 56643618 54605850 52600992
3937 52600992 50718906 48906348 47049119 45221117 43530195 41999664 40450305 39048991
3929 39048991 37521475 36231985 34931748 33686735 32509335 31356934 30185183 29063587
$$ packed form
3987G0835610K180963K195714K113890J894843J940883J721915J813080J609333
3979H6306231J652196J531966J532836J319814J301156J085302J085725Q99669
3971I6714895P55040O35074L18477Q1510m829m17817l89736o03990p99949p92304
3961I5496371q67939j071491j054088j277687j325841j395114j509198j786540
3953H5208473j875659j984362j923332k158863k010501j991892k103923k055771
3945F9104170k054519k063205k178033k053475k063572k047748k037768k004858
3937E2600992j882086j812558j857229j828002j690922j530531j549359j401314
3929C9048991j527516j289490j300237j245013j177400j152401j171751j121596
$$ plain form
3921 29063587 28182196 27269659 26291588 25384221 24545924 23753364 22948682 22293477 21608618
3912 21608618 21058615 20388906 19796483 19282579 18758438 18229742 17744842 17306809 16915189
3903 16915189 16538609 16259276 16027753 15622093 15231669 14991495 14780496 14545933 14408735
3894 14408735 14209929 13873806 13664098 13447015 13290881 13030463 12822239 12618119 12531748 12513147
3884 12513147 12255082 12206882 12096660 11871081 11780940 11596737 11561197 11406359 11469429 11421745
3874 11421745 11446547 11341625 11433853 11590139 11637187 11592966 11429237 11270874 11020646 10719866
3864 10719866 10523762 10272947 10071375 9986170 9835470 9712535 9704678 9534094 9461844 9370588
3854 9370588 9367843 9269473 9239062 9236199 9357743 9326081 9254800 9239630 9236228 9306019 9247670 9217370
$$ packed form
3921B9063587q81391r12537r78071r07367q38297p92560q04682o55205o84859
3912B1608618n50003o69709n92423n13904n24141n28696m84900m38033l91620
3903A6915189l76580k79333k31523m05660l90424k40174k10999k34563j37198
3894A4408735j98806l36123k09708k17083j56134k60418k08224k04120q6371j8601
3884A2513147k58065m8200j10222k25579r0141j84203l5540j54838O3070m7684
3874A1421745K4802j04922R2228J56286M7048m4221j63729j58363k50228l00780
3864A0719866j96104k50815k01572q5205j50700j22935p857j70584p2250r1256
3854I370588k745r8370l0411k863J21544l1662p1281j5170l402O9791n8349l0300
$$ plain form
3842 9217370 9253187 9304790 9296692 9294697 9440818 9385291 9322653 9264604 9371444 9431850 9389283
3831 9389283 9367848 9249178 9313741 9268079 9277161 9258808 9301960 9389173 9323343 9294584 9299213 9294495
3819 9294495 9348764 9262833 9205011 9260968 9226185 9115242 9195726 9214941 9223244 9261648 9163296
3808 9163296 9146714 9002717 8971201 8987745 8974044 9016415 9024625 9005044 9038847 9087782 9004420
3797 9004420 9018019 9005863 9015237 8979006 9059430 9014011 9040714 9185664 9289627 9408788 9403503
3786 9403503 9624599 9671159 9882062 9979320 9913306 9913395 9694929 9672980 9552945 9440177 9450056
3775 9450056 9468625 9481653 9426582 9401078 9454721 9466817 9564720 9725911 9809122 9882592 9881601 9946449
3763 9946449 10049671 10168727 10193420 10189593 10288098 10329437 10427945 10396015 10398316 10489707 10631621
$$ packed form
3842I217370L5817N1603q098j995J46121n5527o2638n8049J06840O0406m2567
3831I389283k1435j18670O4563m5662R082j8353M3152Q7213o5830k8759M629m718
3819I294495N4269q5931n7822N5957l4783j10943Q0484J9215Q303L8404r8352
3808I163296j6582j43997l1516J6544j3701M2371Q210j9581L3803M8935q3362
3797I004420J3599j2156R374l6231Q0424m5419K6703J44950J03963J19161n285
3786I403503K21096M6560K10903R7258o6014Q9k18466k1949j20035j12768R879
3775I450056J8569J3028n5071k5504N3643J2096R7903J61191Q3211P3470r91O4848
3763I946449J03222J19056K4693l827R8505M1339R8508l1930K301R1391J41914
$$ plain form
3752 10631621 10704112 10760043 10916372 11027659 11020179 11143220 11085897 11168086 11333155 11302307 11281512
3741 11281512 11476327 11681975 11727283 11716380 11870715 11907386 12035469 12205086 12369863 12378640
3731 12378640 12591076 12815364 12899739 13077890 13218819 13318880 13442555 13529833 13672429 13824696
3721 13824696 13902031 14069989 14228844 14437708 14677882 14856134 15049417 15109301 15282640 15426425
3711 15426425 15624493 15822465 16031270 16286616 16536854 16746355 17023771 17301807 17571116
3702 17571116 17776024 18065901 18409277 18712970 18922583 19286553 19672534 19932599 20187092
3693 20187092 20452255 20724570 21130792 21446977 21869480 22359123 22823154 23333494 23785809
3684 23785809 24305551 24842580 25481382 26133988 26802400 27434147 28172488 29041759 29806215
$$ packed form
3752A0631621P2491N5931J56329J11287p480J23041n7323Q2189J65069l0848k0795
3741A1281512J94815K05648M5308j0903J54335L6671J28083J69617J64777Q777
3731A2378640K12436K24288Q4375J78151J40929J00061J23675Q7278J42596J52267
3721A3824696P7335J67958J58855K08864K40174J78252J93283N9884J73339J43785
3711A5426425J98068J97972K08805K55346K50238K09501K77416K78036K69309
3702A7571116K04908K89877L43376L03693K09613L63970L85981K60065K54493
3693B0187092K65163K72315M06222L16185M22503M89643M64031N10340M52315
3684B3785809N19742N37029O38802O52606O68412O31747P38341Q69271P64456
$$ plain form
3675 29806215 30641161 31703679 32718647 33836487 34902721 36161733 37401642 38592745
3667 38592745 39797125 41153518 42324565 43529287 44829402 45958667 46980725 48159618
3659 48159618 49225773 50204077 51216743 52175263 53214130 54270283 55021620 55570487 56139365
3650 56139365 56691451 57042273 57312348 57487017 57545922 57634023 57746835 57746515 57783187 57707164 57729266
3639 57729266 57754779 57760967 57751927 57696551 57863041 58007504 58063963 58193092 58524363 58857856 59237247
3628 59237247 59823775 60604105 61435810 62452787 63659074 65049218 66604541 68268810 70192820
3619 70192820 72180821 74479008 76888064 79504014 82242979 85113535 88113076 91173165
3611 91173165 94214944 97098495 99979693 102816076 105571684 108298854 110854469 113216787
$$ packed form
3675B9806215Q34946J062518J014968J117840J066234J259012J239909J191103
3667C8592745J204380J356393J171047J204722J300115J129265J022058J178893
3659D8159618J066155R78304J012666R58520J038867J056153P51337N48867N68878
3650E6139365N52086L50822K70075J74669N8905Q8101J12812l20L6672p6023K2102
3639E7729266K5513O188r040n5376J66490J44463N6459J29129L31271L33493L79391
3628E9237247N86528P80330Q31705J016977J206287J390144J555323J664269J924010
3619G0192820J988001K298187K409056K615950K738965K870556K999541L060089
3611I1173165L041779K883551K881198K836383K755608K727170K555615K362318
$$ plain form
3603 113216787 115655200 118037426 120286738 122484707 124491425 126362323 127846770 128961596
3595 128961596 129824737 130422456 130508451 130325735 130053721 129714058 129145944 128673321 128111536
3586 128111536 127532214 126906182 126495956 125921081 125378672 124936809 124549125 124223484 124013639
3577 124013639 123979999 124149818 124743545 125356825 126296039 127494996 129005722 130579808 132234332
3568 132234332 134086409 135945851 137889273 139947547 141819764 143781739 145795336 147725937
3560 147725937 149690536 151612809 153759736 155846019 157792929 159766091 161846251 163794090
3552 163794090 165499062 167266573 168839643 170290853 171737975 173495851 175058001 177006145
3544 177006145 179231722 181873495 184950028 188612313 193170206 198438604 204439939 211362843
$$ packed form
3603A13216787K438413K382226K249312K197969K006718J870898J484447J114826
3595A28961596Q63141N97719Q5995j82716k72014l39663n68114m72623n61785
3586A28111536n79322o26032m10226n74875n42409m41863l87684l25641k09845
3577A24013639l3640J69819N93727O13280R39214J198957J510726J574086J654524
3568A32234332J852077J859442J943422K058274J872217J961975K013597J930601
3560A47725937J964599J922273K146927K086283J946910J973162K080160J947839
3552A63794090J704972J767511J573070J451210J447122J757876J562150J948144
3544A77006145K225577K641773L076533L662285M557893N268398O001335O922904
$$ plain form
3536 211362843 218936275 227109661 235633694 244229587 252372782 259747898 266023916 270904978
3528 270904978 274283267 276045426 276484758 275843522 274231805 272268300 270050971 267703400
3520 267703400 265436890 263036890 260346277 256983636 252764373 247492279 240937357 232862912
3512 232862912 223698832 213562953 202725007 191581414 180399845 169725145 159786310
3505 159786310 150772392 142584673 135359219 128911402 123204962 118202257 113715238 109713684
3497 109713684 106026876 102538683 99410154 96420992 93442575 90571227 87932374 85555360
3489 85555360 83030323 80490625 78242556 76159028 73943790 71814685 69726576 67858047
3481 67858047 66026070 64289723 62492882 60722270 59023901 57158674 55391000 53696598
$$ packed form
3536B11362843P573432Q173386Q524033Q595893Q143195P375116O276018M881062
3528B70904978L378289J762159M39332o41236j611717j963505k217329k347571
3520B67703400k266510k400000k690613l362641m219263n272094o554922q074445
3512B32862912r164080j0135879j0837946j1143593j1181569j0674700r938835
3505A59786310r013918q187719p225454o447817n706440n002705m487019m001554
3497A09713684l686808l488193l128529k989162k978417k871348k638853k377014
3489H5555360k525037k539698k248069k083528k215238k129105k088109j868529
3481F7858047j831977j736347j796841j770612j698369j865227j767674j694402
$$ plain form
3473 53696598 52230575 50670698 49171796 47807232 46531198 45297000 44151091 42913479
3465 42913479 41862406 40902179 39845088 38910402 38046910 37215891 36340826 35612621 34835461
3456 34835461 34058261 33289080 32603910 32031806 31362303 30779035 30144774 29535808 28972652
3447 28972652 28356607 27785775 27326626 26909759 26411208 25885359 25439874 24984345 24554937
3438 24554937 24168900 23739630 23429873 23115989 22687422 22385149 22089611 21774656 21501698
3429 21501698 21290008 20946114 20514124 20125766 19664962 19305146 19020363 18636711 18346002
3420 18346002 18100500 17865728 17748943 17471803 17190449 16994684 16816990 16649659 16527769
3411 16527769 16401025 16355826 16376678 16297337 16410415 16660222 16872063 16813297 16199237 15415082
$$ packed form
3473E3696598j466023j559877j498902j364564j276034j234198j145909j237612
3465D2913479j051073r60227j057091r34686q63492q31019q75065p28205p77160
3456C4835461p77200p69181o85170n72104o69503n83268o34261o08966n63156
3447B8972652o16045n70832m59149m16867m98551n25849m45485m55529m29408
3438B4554937l86037m29270l09757l13884m28567l02273k95538l14955k72958
3429B1501698k11690l43894m31990l88358m60804l59816k84783l83652k90709
3420A8346002k45502k34772j16785k77140k81354j95765j77694j67331j21890
3411A6527769j26744m5199K0852p9341J13078K49807K11841n8766o14060p84155
$$ plain form
3401 15415082 14703654 14332735 13829294 13371627 13120988 12952539 12655910 12371699 12041163
3392 12041163 11862655 11653751 11610195 11397100 11172915 10916235 10675093 10599811 10510489 10387090
3382 10387090 10303880 10210811 10123592 10051257 9888143 9822767 9709353 9777343 9716248 9516586 9468717
3371 9468717 9405854 9431850 9380340 9323477 9184885 9139747 9041708 8901623 8867105 8702436 8735175
3360 8735175 8610675 8504162 8401470 8383342 8384293 8345963 8206504 8076752 8063873 8022422 8064177
3349 8064177 7899392 7771148 7732009 7795318 7890713 7913399 7798756 7803167 7917741 7819992 7789990
3338 7789990 7862005 7894474 7931281 7893507 7796113 7806104 7818599 7795296 7853474 7920662 7890247 7916416
3326 7916416 7979321 7972843 7972123 7996458 8070893 8175808 8128279 8124259 8190082 8369334 8478121 8489920
$$ packed form
3401A5415082p11428l70919n03441m57667k50639j68449k96629k84211l30536
3392A2041163j78508k08904m3556k13095k24185k56680k41142p5282q9322j23399
3382A0387090q3210r3069q7219p2335j63114o5376j13414O7990o1095j99662m7869
3371I468717o2863K5996n1510n6863j38592m5138r8039j40085l4518j64669L2739
3360H735175j24500j06513j02692j8128R51l8330j39459j29752j2879m1451M1755
3349H064177j64785j28244l9139O3309R5395K2686j14643M411J14574r7749l0002
3338G789990P2015L2469L6807l7774r7394R991J2495k3303N8178O7188l0415K6169
3326G916416O2905o478p20K4335P4435J04915m7529m020O5823J79252J08787J1799
$$ plain form
3314 8489920 8663133 8736289 8859874 9044435 9156761 9192340 9312711 9417203 9358958 9477185
3304 9477185 9550136 9696685 9774850 9768570 9832012 9829508 9767842 9759795 9872020 9955662 10059979
3293 10059979 10131796 10137050 10289022 10453476 10651216 10827521 11025536 11218187 11435277 11656085
3283 11656085 11899799 12161612 12406376 12670030 12907450 13136997 13426461 13778016 14174902
3274 14174902 14616106 15035574 15697559 16485136 17298750 18095299 18744586 19438664 20105316
3265 20105316 20928795 21554003 22145652 22578255 22731635 22725230 22712191 22578186 22316164 21987119
3255 21987119 21538179 21018241 20650107 20025192 19367938 18566361 17668384 16901016 16195152
3246 16195152 15674975 15196560 14674916 14287423 13863431 13350342 12853558 12319358 12013080
$$ packed form
3314H489920J73213P3156J23585J84561J12326L5579J20371J04492n8245J18227
3304I477185P2951J46549P8165o280O3442k504o1666q047J12225Q3642J04317
3293A0059979P1817N254J51972J64454J97740J76305J98015J92651K17090K20808
3283A1656085K43714K61813K44764K63654K37420K29547K89464L51555L96886
3274A4174902M41204M19468O61985P87577Q13614P96549O49287O94078O66652
3265B0105316Q23479O25208N91649M32603J53380o405j3039j34005k62022l29045
3255B1987119m48940n19938l68134o24915o57254q01577q97977p67368p05864
3246A6195152n20177m78415n21644l87493m23992n13089m96784n34200l06278
$$ plain form
3237 12013080 11760036 11561026 11318956 11190728 11145401 11059702 10725787 10123697 9662567 9184015
3227 9184015 8808502 8436125 8149860 7910449 7667385 7506142 7263942 7002174 6904211 6778827
3217 6778827 6647518 6437105 6251102 6111462 5993658 5924181 5950475 6063614 5988833 6087275
3207 6087275 6104445 6225069 6498159 6603714 6822786 7237429 7643144 7878486 7445462 6769823
3197 6769823 6116289 5503981 5123818 5002540 4870940 4681996 4482026 4388152 4245183 4038728
3187 4038728 3903360 3854785 3792642 3789203 3695286 3612567 3633097 3563623 3552478 3689230 3634900
3176 3634900 3662221 3666152 3682804 3810091 3880852 3924462 4146904 4323295 4379708 4198000 3893033
3165 3893033 3535367 3197751 3114838 2930789 2819941 2874681 2744127 2660085 2652237 2505463
$$ packed form
3237A2013080k53044j99010k42070j28228m5327q5699l33915o02090m61130m78552
3227I184015l75513l72377k86265k39411k43064j61243k42200k61768r7963j25384
3217F778827j31309k10413j86003j39640j17804o9477K6294J13139p4781R8442
3207F087275J7170J20624K73090J05555K19072M14643M05715K35342m33024o75639
3197F769823o53534o12308l80163j21278j31600j88944j99970r3874j42969k06455
3187D038728j35368m8575o2143l439r3917q2719K0530o9474j1145J36752n4330
3176C634900K7321L931J6652J27287P0761M3610K22442J76391N6413j81708l04967
3165C893033l57666l37616q2913j84049j10848N4740j30554q4042p848j46774
$$ plain form
3155 2505463 2471042 2464499 2500018 2513596 2469563 2394905 2325228 2319836 2345676 2301868 2224729 2104500
3143 2104500 2026101 2096516 2077071 2072441 2048910 2069586 2052460 2012341 1908948 2008130 1917450
3132 1917450 1871356 1890260 1864274 1831240 1820331 1860873 1810576 1811094 1894307 1836779 1766210 1738157
3120 1738157 1771122 1727065 1650622 1639336 1564111 1608641 1700805 1648626 1672501 1670464 1626084 1639176
3108 1639176 1501830 1500930 1460534 1510123 1587170 1407309 1382726 1490317 1544134 1500007 1502593
3097 1502593 1501180 1425722 1460750 1401406 1396067 1361036 1450912 1420440 1487790 1461501 1433264 1414995
3085 1414995 1444809 1423736 1329879 1335460 1453238 1460707 1376600 1363423 1392846 1247597 1253837 1281481
3073 1281481 1277660 1338983 1271991 1275006 1331352 1351230 1344547 1287617 1338805 1240037 1261643 1320395
$$ packed form
3155B505463l4421o543L5519J3578m4033p4658o9677n392K5840m3808p7139j20229
3143B104500p8399P0415j9445m630k3531K0676j7126m0119j03393R9182r0680
3132A917450m6094J8904k5986l3034j0909M0542n0297N18Q3213n7528p0569k8053
3120A738157L2965m4057p6443j1286p5225M4530R2164n2179K3875k037m4380J3092
3108A639176j37346r00m0396M9589P7047j79861k4583J07591N3817m4127K586
3097A502593j413p5458L5028n9344n339l5031Q9876l0472O7350k6289k8237j8269
3085A414995K9814k1073r3857N581J17778P469q4107j3177K9423j45249O240K7644
3073A281481l821O1323o6992L015N6346J9878o683n6930N1188r8768K1606N8752
$$ plain form
3061 1320395 1291612 1229747 1308966 1309874 1204903 1196718 1267518 1287988 1160060 1195545 1220876 1154037
3049 1154037 1173094 1139617 1088673 1228552 1296949 1256105 1156613 1207991 1167866 1097990 1164170
3038 1164170 1171972 1197295 1271186 1202881 1267679 1271486 1246411 1366808 1369896 1379260 1244917 1216280
3026 1216280 1293453 1356791 1389797 1339296 1389063 1351360 1221342 1383813 1455316 1406121 1484955
3015 1484955 1475996 1463048 1535812 1503560 1498048 1474548 1442459 1512341 1534922 1476092 1515021 1532209
3003 1532209 1644477 1739600 1709170 1626587 1587566 1670456 1598635 1623344 1608004 1642619 1759978
2992 1759978 1775015 1786841 1841178 1800152 1799748 1822021 1866912 1877668 1917679 1854860 2013081 1955939
2980 1955939 1925385 2017629 2013270 2049368 2038551 2157525 2178491 2208837 2272859 2276114 2292418 2328004
$$ packed form
3061A320395k8783o1865P9219R08j04971q185P0800K0470j27928L5485K5331o6839
3049A154037J9057l3477n0944J39879O8397m0844r9492N1378m0125o9876O6180
3038A164170P802K5323P3891o8305O4798L807k5075J20397L088R364j34343k8637
3026A216280P7173O3338L3006n0501M9767l7703j30018J62471P1503m9195P8834
3015A484955q959j2948P2764l2252n512k3500l2089O9882K2581n8830L8929J7188
3003A532209J12268R5123l0430q2583l9021Q2890p1821K4709j5340L4615J17359
2992A759978J5037J1826N4337m1026m04K2273M4891J0756M0011o2819J58221n7142
2980A955939l0554R2244m359L6098j0817J18974K0966L0346O4022L255J6304L5586
$$ plain form
2968 2328004 2432900 2457135 2525414 2528174 2609247 2684393 2713688 2736844 2753358 3026794 3166659
2957 3166659 3182428 3255919 3368989 3439682 3692939 3884321 3937357 4244652 4581679 4794504
2947 4794504 4988754 5105622 5329165 5659473 5976118 6214843 6450185 6438222 6383554 6259699
2937 6259699 6311544 6320072 6252119 6351424 6260883 6302888 6265751 6264862 6342710 6403454 6439345 6564131
2925 6564131 6613802 6843869 7112070 7249405 7528517 7787536 8271182 8738659 9174772 9771613
2915 9771613 10380630 11282431 12068173 12223376 11491335 10529828 9492287 8516362 7837343
2906 7837343 7276549 6853975 6399176 6111623 6031026 5819172 5659093 5546232 5401931 5268746
2896 5268746 5260305 5212829 5187725 5250813 5292706 5342626 5384855 5466497 5509251 5582071 5719526
$$ packed form
2968B328004J04896K4235O8279K760Q1073P5146K9295K3156J6514K73436J39865
2957C166659J5769P3491J13070P0693K53257J91382N3036L07295L37027K12825
2947D794504J94250J16868K23543L30308L16645K38725K35342j1963n4668j23855
2937F259699N1845Q528o7953R9305r0541M2005l7137q89P7848O0744L5891J24786
2925F564131M9671K30067K68201J37335K79112K59019M83646M67477M36113N96841
2915I771613O09017R01801P85742J55203p32041r61507j037541r75925o79019
2906G837343n60794m22574m54799k87553q0597k11854j60079j12861j44301j33185
2896E268746q441m7476k5104O3088M1893M9920M2229Q1642M2754P2820J37455
$$ plain form
2885 5719526 5912655 6004764 6085700 5945624 5726703 5534837 5240469 4928611 4605672 4329392
2875 4329392 4012370 3797998 3680766 3539513 3333234 3133250 2976074 2920753 2839706 2741299
2865 2741299 2701145 2684771 2565774 2416963 2413037 2295918 2272123 2125282 1996747 2012318 1999259
2854 1999259 1885878 1837329 1754904 1678647 1591138 1588624 1540191 1330120 1346260 1375450 1360288
2843 1360288 1331169 1155411 1147446 1101961 1092016 1118070 1097434 1064341 1069218 1044247 994686 862036
2831 862036 860140 834903 808608 866129 770190 840411 878813 820473 874537 828645 702844 703051
2819 703051 654013 593181 610775 687041 623907 627832 571894 551285 524476 458519 525888 599849
2807 599849 654650 608205 524249 493877 430752 432874 456841 429961 482960 458525 442751 456017
$$ packed form
2885E719526J93129R2109Q0936j40076k18921j91866k94368l11858l22939k76280
2875D329392l17022k14372j17232j41253k06279j99984j57176n5321q1047r8407
2865B741299m0154j6374j18997j48811l926j17119k3795j46841j28535J5571j3059
2854A999259j13381m8549q2425p6257q7509k514m8433k10071J6140K9190j5162
2843A360288k9119j75758p965m5485r945K6054k0636l3093M877k4971m9561j32650
2831H62036j896k5237k6295N7521r5939P0221L8402n8340N4064m5892j25801K07
2819G03051m9038o0832J7594P6266o3134L925n5938k0609k6809o5957O7369P3961
2807E99849N4801m6445q3956l0372o3125K122K3967k6880N2999k4435j5774J3266
$$ plain form
2795 456017 359813 403497 375031 336436 426331 477586 421115 432808 407438 429249 485096 366039
2783 366039 296255 273983 230017 340054 324247 287050 333748 287112 295199 305873 353416 307933
2771 307933 286509 172883 272686 200061 214905 292845 312530 331011 323012 247915 275197 303409
2759 303409 255369 176748 148248 137214 161986 208799 204612 198578 225703 189883 202323 270629
2747 270629 226965 217439 157640 172399 201271 207411 161078 201668 219222 220516 235286 246454
2735 246454 165243 103185 143469 206763 169577 125865 52878 116396 206664 104514 89529
2724 89529 136443 117193 155921 117948 33761 5060 47571 144127 36883 31354 57732 105567
2712 105567 206697 129591 165727 55901 34450 109138 27109 160871 163172 111579 120366
$$ packed form
2795D56017r6204M3684k8466l8595Q9895N1255n6471J1693k5370K1811N5847j19057
2783C66039o9784k2272m3966J10037j5807l7197M6698m6636Q087J0674M7543m5483
2771C07933k1424j13626R9803p2625J4844P7940J9685J8481p999p5097K7282K8212
2759C03409m8040p8621k8500j1034K4772M6813m187o034K7125l5820J2440O8306
2747B70629m3664r526n9799J4759K8872O140m6333M0590J7554J294J4770J1168
2735B46454q1211o2058M0284O3294l7186m3712p2987O3518R0268j02150j4985
2724H9529M6914j9250L8728l7973q4187k8701M2511R6556j07244n529K6378M7835
2712A05567J01130p7106L6136j09826k1451P4688q2029J33762K301n1593Q787
$$ plain form
2701 120366 148532 120275 98284 112390 34084 116205 140948 85296 -680 -17051 -117497
2690 -117497 77186 76622 59722 131642 94490 99404 36025 21382 36870 55458 133665 70992
2678 70992 90936 142782 167441 206560 134106 134286 181356 153517 52293 80300 122929 138514
2666 138514 229096 287850 167651 114582 81338 7910 41993 -28928 60242 9720 -26956
2655 -26956 -3432 -59241 -19568 54055 45144 73951 14784 -2169 190061 264075 132089 89940
2643 89940 128091 92258 118589 120397 139059 124532 -8952 12635 82627 42657 11816 88613
2631 88613 50924 -37526 22159 110978 116759 57528 105302 32671 50279 -11685 -30858 19438
2619 19438 -59660 -159113 -181603 -104711 10406 44192 32316 76239 61731 14034 41455 -22711
$$ packed form
2701A20366K8166k8257k1991J4106p8306Q2121K4743n5652q5976j6371j00446
2690a17497J94683n64j6900P1920l7152M914o3379j4643J5488J8588P8207o2673
2678G0992J9944N1846K4659L9119p2454J80M7070k7839j01224K8007M2629J5585
2666A38514R0582N8754j20199n3069l3244p3428L4083p0921Q9170n0522l6676
2655b6956K3524n5809L9673P3623q911K8807n9167j6953J92230P4014j31986m2149
2643H9940L8151l5833K6331J808J8662j4527j33484K1587O9992l9970l0841P6797
2631H8613l7689q8450N9685Q8819N781n9231M7774p2631J7608o1964j9173N0296
2619A9438p9098r9453k2490P6892J15117L3786j1876M3923j4508m7697K7421o4166
$$ plain form
2607 -22711 35518 14658 60598 -6390 -83241 17749 77448 92231 58281 75530 137672 103486
2595 103486 29526 8650 -5884 51642 -35911 -143150 2878 13963 63219 38994 -50782
2584 -50782 -85623 26059 61014 58842 -11232 28327 38531 118182 69127 -4944 -185267 -233985
2572 -233985 -108070 -105819 -118826 -39436 -13511 -118823 -9186 -17067 -44000 -47471 55419
2561 55419 42244 -41221 -59498 -42561 -50865 -60791 15528 104150 63702 25585 -48043 -115693
2549 -115693 -65700 -28672 -100935 -106599 -99107 -94941 -25798 -39677 -60500 -66011 32962 -30047
2537 -30047 -58112 -48862 -46584 5095 -74095 -84048 -33973 49823 15556 3940 -2979 -13561 15919
2524 15919 77111 16623 -32194 -32858 -64678 -46741 -55248 -137870 -81368 39742 43068 -15393
$$ packed form
2607b2711N8229k0860M5940o6988p6851J00990N9699J4783l3950J7249O2142l4186
2595A03486p3960k0876j4534N7526q7553j07239J46028J1085M9256k4225q9776
2584e0782l4841J11682L4955k172p0074L9559J0204P9651m9055p4071j80323m8718
2572b33985J25915K251j3007P9390K5925j05312J09637p881k6933l471J02890
2561E5419j3175q3465j8277J6937q304r926P6319Q8622m0448l8117p3628o7650
2549a15693M9993L7028p2263n664P492M166O9143j3879k0823n511R8973o3009
2537c0047k8065R250K278N1679p9190r953N0075Q3796l4267j1616o919j0582K9480
2524A5919O1192o0488m8817o64l1820J7937q507q2622N6502J21110L326n8461
$$ plain form
2512 -15393 -97954 11983 11491 -52208 -34127 -67669 29887 -5062 1505 -23820 -50807 -42997
2500 -42997 -357 -23104 27057 -9609 -154194 -153380 -34350 -52903 15004 -11756 -49914 -104147
2488 -104147 -119330 -98852 -91624 -63555 -60707 14595 -15326 -46417 -115820 -60224 -20432 17643
2476 17643 25554 36641 65517 122366 111674 113768 -49596 -111357 -103978 -98419 -65392 -107684
2464 -107684 -56375 -118469 -96713 10221 35976 41578 -29063 -126246 -62343 49248 84283
2453 84283 -96022 -135094 -111910 -57010 -82599 -80778 -48414 -105476 -38791 -113353 -111519 -113370
2441 -113370 -206007 -161950 -92481 23147 -66545 -106650 -35579 -60617 -38897 -52069 -124995
2430 -124995 -83498 -46739 26715 76063 59856 68827 15766 22817 46364 158936 84835 -26978
$$ packed form
2512a5393q2561J09937m92o3699J8081l3542R7556l4949O567k5325k6987P810
2500d2997M2640k2747N0161l6666j44585Q14J19030j8553O7907k6760l8158n4233
2488a04147j5183K0478P228K8069K848P5302k9921l1091o9403N5596L9792L8075
2476A7643P911J1087K8876N6849j0692K094j63364o1761P379N559L3027m2292
2464a07684N1309o2094K1756J06934K5755N602p0641r7183O3903J11591L5035
2453H4283j80305l9072K3184N4900k5589J821L2364n7062O6685p4562J834j851
2441a13370r2637M4057O9469J15628q9692m0105P1071k5038K1720j3172p2926
2430a24995M1497L6759P3454M9348j6207Q971n3061P051K3547J12572p4101j11813
$$ plain form
2418 -26978 -42311 -118858 -15400 64480 -68826 -102534 -17047 -40107 -158509 -74842 -48862
2407 -48862 -61660 4962 14397 17271 20689 28838 16475 23420 24787 45600 -22882 -118991 -13780
2394 -13780 2586 -101182 -28104 55456 -35545 -1971 13964 11044 45489 57942 146557 219673
2382 219673 194541 162115 158059 205787 176522 120039 182530 171394 172070 82542 42278 92144
2370 92144 82556 1367 -63024 -23363 102086 101043 86772 47257 35528 65025 58667 14482
2358 14482 -89767 -20609 12413 75776 10239 8248 27363 -1492 199 33579 87664 68289
2346 68289 13597 -8560 -59451 -4909 192 -87469 -123248 -36965 -36437 -44549 -71224 -100802 -27256
2333 -27256 11359 -5847 -46485 -33425 -18991 204 -19012 29854 27540 25671 45396 74130
$$ packed form
2418b6978j5333p6547J03458P9880j33306l3708Q5487k3060j18402Q3667K5980
2407d8862j2798O6622R435K874L418Q149j2363O945J367K0813o8482r6109J05211
2394a3780J6366j03768P3078Q3560r1001L3574J5935k920L4445J2453Q8615P3116
2382B19673k5132l2426m056M7728k9265n6483O2491j1136O76q9528m0264M9866
2370I2144r588q1189o4391L9661J25449j043j4271l9515j1729K9497o358m4185
2358A4482j04249O9158L3022O3363o5537j991J9115k8855J691L3380N4085j9375
2346F8289n4692k2157n0891N4542N101q7661l5779Q6283N28q112k6675k9578P3546
2333b7256L8615j7206m0638J3060J4434J9195j9216M8866k314j869J9725K8734
$$ plain form
2321 74130 84646 59105 67948 31819 27287 75416 45891 93314 69931 6754 -74264 -20755
2309 -20755 5465 63561 159522 43620 7553 22701 8702 36261 88400 40699 53481 38811
2297 38811 50780 75403 70775 -16699 -15922 39864 59106 15386 33157 60131 110557 125925
2285 125925 129835 127384 52730 -25075 79629 115121 22864 22241 68525 103307 80959 83540
2273 83540 69396 121612 146341 118167 143101 97601 134757 172643 164271 137897 131476 145577
2261 145577 172654 251542 243627 184170 196242 211908 186148 218961 316799 284344 226296 310660
2249 310660 317909 298829 261373 267912 248818 319664 367564 309683 237679 192658 194895 208997
2237 208997 242885 323250 313475 322194 261401 239906 200491 218930 242016 367435 320249 244411
$$ packed form
2321G4130J0516k5541Q843l6129m532M8129k9525M7423k3383o3177q1018N3509
2309b0755K6220N8096R5961j15902l6067J5148j3999K7559N2139m7701J2782j4670
2297C8811J1969K4623m628q7474P77N5786J9242m3720J7771K6974N0426J5368
2285A25925L910k451p4654p7805J04704L5492r2257o23M6284L4782k2348K581
2273H3540j4144N2216K4729k8174K4934m5500L7156L7886q372k6374o421J4101
2261A45577K7077P8888p915n9457J2072J5666k5760L2813R7838l2455n8048Q4364
2249C10660P249j9080l7456O539j9094P0846M7900n7881p2004m5021K237J4102
2237B08997L3888Q0365r775Q719o0793k1495l9415J8439K3086J25419m7186p5838
$$ plain form
2225 244411 311892 383878 473530 586889 505907 440898 503597 422720 416776 400594 496263 506847
2213 506847 483769 468950 370378 464136 580791 736783 649329 595863 623326 694766 750808
2202 750808 681088 577389 581389 613583 735492 701029 666128 647651 651102 618674 678348 721954
2190 721954 763072 806681 739373 726024 787770 838762 770993 734422 770737 757742 794920 846633
2178 846633 887082 905065 931280 1016783 959399 1026151 1114320 1106736 1140225 1122105 1166956 1217473
2166 1217473 1249964 1383846 1331277 1364911 1531461 1634341 1659104 1671194 1730853 1817924 1812712
2155 1812712 1799559 1900924 2060134 2180497 2142500 2134907 2192563 2175514 2160857 2224220 2256449
2144 2256449 2324601 2457590 2667257 2775923 2836728 2922522 3078095 3230779 3479665 3825155
$$ packed form
2225B44411O7481P1986Q9652J13359q0982o5009O2699q0877n944j6182R5669J0584
2213E06847k3078j4819r8572R3758J16655J55992q7454n3466K7463P1440N6042
2202G50808o9720j03699M000L2194J21909l4463l4901j8477L451l2428N9674M3606
2190G21954M1118M3609o7308j3349O1746N0992o7769l6571L6315j2995L7178N1713
2178H46633M0449J7983K6215Q5503n7384O6752Q8169p584L3489j8120M4851N0517
2166A217473L2491J33882n2569L3634J66550J02880K4763J2090N9659Q7071n212
2155A812712j3153J01365J59210J20363l7997p593N7656j7049j4657O3363L2229
2144B256449O8152J32989K09667J08666O0805Q5794J55573J52684K48886L45490
$$ plain form
2134 3825155 3994615 4254283 4491505 4778227 5209309 5606573 6168433 6704130 7046318 7644904
2124 7644904 8323457 9284100 10515431 12128311 14118061 16761131 19640274 22612115 25986688
2115 25986688 30522298 37781643 46412751 43912096 33865171 24571889 18115215 14661234
2107 14661234 12261313 10713545 9223907 8259683 7369830 6740472 6077372 5610007 5379043
2098 5379043 5297960 4889745 4494907 4105913 3735044 3353037 3132270 2985066 2909441 2716252
2088 2716252 2615194 2448351 2279990 2186883 2121002 2021905 1921087 1833829 1776330 1619159
2078 1619159 1620198 1468851 1366975 1261653 1185266 1163821 1167081 1182856 1026088 963315 1052167
2067 1052167 956769 984753 972831 989037 830645 776033 761061 814735 691836 668930 676988
$$ packed form
2134C825155J69460K59668K37222K86722M31082L97264N61860N35697L42188N98586
2124G644904O78553R60643J231331J612880J989750K643070K879143K971841L374573
2115B5986688M535610P259345Q631108k500655j0046925r293282o456674l453981
2107A4661234k399921j547768j489638r64224q89853o29358o63100m67365k30964
2098E379043q1083m08215l94838l88994l70869l82007k20767j47204p5625j93189
2088B716252j01058j66843j68361r3107o5881r9097j00818q7258n7499j57171
2078A619159J039j51347j01876j05322p6387k1445L260J5775j56768o2773Q8852
2067A052167r5398K7984j1922J6206j58392n4612j4972N3674j22899k2906Q058
$$ plain form
2056 676988 622458 588396 623101 597430 507911 499348 500682 479041 497619 527061 497381 443826
2044 443826 516646 415759 354353 495462 449203 479912 596984 484649 472853 441071 391964
2033 391964 315662 389115 349782 318231 379705 417519 358967 324694 310953 266451 224237 256750
2021 256750 238481 292438 262992 229754 262265 188264 230098 292045 258461 267379 224074 189603
2009 189603 152087 183470 133920 40356 53359 9340 118039 64727 141177 203975 94683
1998 94683 40379 103164 99971 176730 156595 218003 170714 222692 93009 96627 63564 138512
1986 138512 103398 115694 92866 122142 187057 200270 197949 83967 98526 22476 -52810 89798
1974 89798 111316 44319 70107 -82712 -114026 -11080 22282 -7181 -24028 -40468 -123920
$$ packed form
2056F76988n4530l4062L4705k5671q9519q563J334k1641J8578K9442k9680n3555
2044D43826P2820j00887o1406J41109m6259L0709J17072j12335j1796l1782m9107
2033C91964p6302P3453l9333l1551O1474L7814n8552l4273j3741m4502m2214L2513
2021B56750j8269N3957k9446l3238L2511p4001M1834O1947l3584Q918m3305l4471
2009A89603l7516L1383m9550r3564J3003m4019J08699n3312P6450O2798j09292
1998I4683n4304O2785l193P6759k0135O1408m7289N1978j29683L618l3063P4948
1986A38512l5114J2296k2828K9276O4915J3213k321j13982J4559p6050p5286J42608
1974H9798K1518o6997K5788j52819l1314J02946L3362k9463j6847j6440q3452
$$ plain form
1963 -123920 26481 94644 58057 6222 176920 196353 196113 178444 101391 26583 -48651 16783
1951 16783 -79452 31962 154597 52248 -5644 -16671 -15345 28822 -54681 10494 34355
1940 34355 -108278 -78563 -14117 22751 43155 1211 -21507 -67138 64030 57388 -38141 -28648
1928 -28648 27800 30324 93968 3464 -62492 -57467 23473 74832 129947 97472 -6332 64995
1916 64995 162774 138788 99397 97278 -55569 -46204 -14295 52103 52126 42110 59063 41805 -52838
1903 -52838 -126990 -49862 29834 30974 53062 -28330 -99163 -39814 -106636 -107343 -43719 -7791
1891 -7791 -178 43854 51605 59751 105604 135100 48218 49391 82935 -28361 -77869 -56970 -114861
1878 -114861 -37295 101172 18337 -92722 -72676 -21711 -14088 -33039 -63367 -94662 -17969
$$ packed form
1963a23920J50401O8163l6587n1835J70698J9433k40j7669p7053p4808p5234O5434
1951A6783r6235J11414J22635j02349n7892j1027J326M4167q3503O5175K3861
1940C4355j42633K9715O4446L6868K0404m1944k2718m5631J31168o642r5529R493
1928b8648N6448K524O3644r0504o5956N025Q0940N1359N5115l2475j03804P1327
1916F4995R7779k3986l9391k119j52847R365L1909O6398K3j0016J6953j7258r4643
1903e2838p4152P7128P9696J140K2088q1392p0833N9349o6822p07O3624L5928
1891g791P613M4032P751Q146M5853K9496q6882J173L3544j11296m9508K0899n7891
1878a14861P7566J38467q2835j11059K0046N0965P623j8951l0328l1295P6693
$$ plain form
1867 -17969 -79261 -25706 18472 -9305 12365 1375 -17030 -107698 -58541 15470 -17024 -109037
1855 -109037 -44044 -91926 -18213 42586 -25935 3225 68973 200974 212678 52348 165930
1844 165930 169290 165636 176803 120794 83903 -14457 -49822 -62939 -82014 -81863 -146221 -162412
1832 -162412 -91237 -120648 -49045 -79822 -65560 -27913 20778 -15611 -6237 39810 -145521 -245656
1820 -245656 -108317 -40452 -188737 -170959 -92806 -117058 -86977 -36528 -57767 -98124 -97342 -25820
1808 -25820 -29949 -61983 -20880 -5159 42411 -13032 -43727 26165 65517 41729 -46279 -106832
1796 -106832 -128671 -126630 -111944 -47983 -89068 -110913 70887 -75572 -56968 -15499 -8741 1484
1784 1484 -103447 -39710 -28881 -109376 -48707 -1409 -12011 -139667 -126253 -72792 -72824 -95315
$$ packed form
1867a7969o1292N3555M4178k7777K1670j0990j8405r0668M9157P4011l2494r2013
1855a09037O4993m7882P3713O0799o8521K9160O5748J32001J1704j60330J13582
1844A65930L360l654J1167n6009l6891r8360l5365j3117j9075J51o4358j6191
1832a62412P1175k9411P1603l0777J4262L7647M8691l6389R374M6047j85331j00135
1820b45656J37339O7865j48285J7778P8153k4252L0081N0449k1239m0357P82P1522
1808b5820m129l2034M1103J5721M7570n5443l0695O9892L9352k3788q8008o0553
1796a06832k1839K041J4686O3961m1085k1845J81800j46459J8604M1469O758J0225
1784A484j04931O3737J0829q0495O0669M7298j0602j27656J3414N3461l2k2491
$$ plain form
1772 -95315 -114440 -3936 -40512 -73923 -75501 -61763 -123637 -145311 -69570 7445 78683 47907
1760 47907 -29315 -3650 -24455 -66391 -20903 -29693 33533 57959 -21438 -17268 -26625 -129951
1748 -129951 -11666 -15325 -73222 44451 8274 -56476 -94051 -23689 -76518 -96272 -21364
1737 -21364 35994 -10745 -104643 -50598 -13662 -30524 -5358 36831 -665 -121436 -82188 -29062
1725 -29062 -15612 -43116 -62624 34310 -36584 -118726 -113973 -84295 49202 40853 28067 29840
1713 29840 39304 56001 -7499 -41381 -126601 -171164 -112178 -85455 -101125 -63303 -27619 -39106
1701 -39106 -83266 -57042 -83243 -75783 20205 -23415 -26753 -107942 -106154 -73995 -84814 -58297
1689 -58297 34118 21381 -73274 -97187 -58831 -50742 -84409 -112673 -142547 -74327 -156095 -128195
$$ packed form
1772i5315j9125J10504l6576l3411j578J3738o1874k1674P5741P7015P1238l0776
1760D7907p7222K5665k0805m1936M5488q790O3226K4426p9397M170r357j03326
1748a29951J18285l659n7897J17673l6177o4750l7575P0362n2829j9754P4908
1737b1364N7358m6739r3898N4045L6936j6862K5166M2189l7496j20771L9248N3126
1725b9062J3450k7504j9508R6934p0894q2142M753K9678J33497q349j2786J773
1713B9840R464J6697o3500l3882q5220m4563N8986K6723j5670L7822L5684j1487
1701c9106m4160K6224k6201P460R5988m3620l338q1189J788L2159j0819K6517
1689e8297R2415j2737r4655k3913L8356Q089l3667k8264k9874O8220q1768K7900
$$ plain form
1677 -128195 -80324 -119580 -81238 42406 53887 -5731 17364 -102849 -134874 -105465 -114917
1666 -114917 -100659 -152307 -148213 -130700 -118826 21903 17439 -25077 -106548 -113411 -126188 -88581
1654 -88581 -95839 24530 -11904 -96751 -81720 -113472 -135679 -83385 -14631 -92858 -126000 -93651
1642 -93651 -25158 -78331 -84693 -44203 13283 -22416 -53564 -77748 -48536 26393 -87320 -51056
1630 -51056 -83180 -184977 -132624 -103113 -97804 -93515 -54181 -77054 -77975 -28582 -63703 -59954 24269
1617 24269 -14775 40402 9156 6666 -49939 -53552 -14174 4685 1854 37931 -50463 -93644
1605 -93644 -94992 -136901 -135791 -170045 -139169 -169955 -123325 78064 18847 17039 -81365 -89548
1593 -89548 19327 -30036 6078 19972 18265 -7378 -44549 -40070 -47004 -140815 -82644 55467
$$ packed form
1677a28195M7871l9256L8342J23644J1481n9618K3095j20213l2025K9409r452
1666a14917J4258n1648M094J7513J1874J40729m464m2516q1471o863j2777L7607
1654h8581p258J20369l6434q4847J5031l1752k2207N2294O8754p8227l3142L2349
1642i3651O8493n3173o362M0490N7486l5699l1148k4184K9212P4929j13713L6264
1630e1056l2124j01797N2353K9511N309M289L9334k2873r21M9393l5121L749Q4223
1617B4269l9044N5177l1246k490n6605l613L9378J8859k831L6077q8394m3181
1605i3644j348m1909J110l4254L0876l0786M6630K01389n9217j808r8404q183
1593h9548J08875m9363L6114J3894j707k5643l7171M479o934r3811N8171J38111
$$ plain form
1581 55467 12510 -139931 -140788 -28412 3907 -9267 -79868 -45323 -65361 -162617 -94699 -57104
1569 -57104 -67136 -61009 8510 -49136 39934 3816 -103512 -37025 -83508 -17553 23078 95659
1557 95659 130031 13071 51961 -7191 -52768 -19076 -35990 -80306 -56765 -57635 -23580 -18563
1545 -18563 12219 28503 25027 20808 38453 -92108 -154925 -96592 -118618 -70263 -87947 -562
1533 -562 -2523 -10417 -47391 -33731 -30350 -40567 -89322 -153805 -32413 -72888 -115917 -74289 -48604
1520 -48604 -48171 -57656 -91191 -155126 -107146 -42343 -64236 -71005 -14381 -60644 -69654 -40558 -69772
1507 -69772 15712 -74597 -115867 -126088 -146961 -91745 -107543 -43725 -51174 -12170 48184 90339
1495 90339 6573 -164119 -143046 -161944 -216457 -134154 -81457 -80828 -110142 -116798 -18801 90813
$$ packed form
1581E5467m2957j52441q57J12376L2319j3174p0601L4545k0038r7256O7918L7595
1569e7104j0032O127O9519n7646Q9070l6118j07328O6487m6483O5955M0631P2581
1557I5659L4372j16960L8890n9152m5577L3692j6914m4316K3541q70L4055N017
1545a8563L0782J6284l476m219J7645j30561o2817N8333k2026M8355j7684Q7385
1533e62j961p894l6974J3660L381j0217m8755o4483J21392m0475m3029M1628K5685
1520d8604M33r485l3535o3935M7980O4803k1893o769N6624m6263r010K9096k9214
1507f9772Q5484r0309m1270j0221k0873N5216j5798O3818p449L9004O0354M2155
1495I0339q3766j70692K1073j8898n4513Q2303N2697O29k9314o656R7997J09614
$$ plain form
1483 90813 42609 -49605 -96907 -35127 -137965 -31933 39290 33056 111268 55490 104728 46960
1471 46960 -21775 71121 -47459 -69355 -5913 -39896 -72529 -172752 -114060 -114997 -67609 -65139
1459 -65139 -72292 -86577 -6210 -46253 -81050 -51209 -59942 7741 14391 -37875 -101512 14446
1447 14446 109761 29720 -99149 -214218 -95681 -89617 -73682 14596 -51362 -142562 -107991
1436 -107991 -14185 -43438 -115465 -85325 -52354 -99997 -51058 -3393 -10218 11631 8201 -79148
1424 -79148 -48406 20398 -123821 -100418 -36032 -94394 -119088 -33886 -30084 -100431 -28993 2842
1412 2842 -38061 -43285 15462 134922 38993 -49943 28459 6301 78212 61958 -68692 -94940
1400 -94940 72795 38722 13224 -4282 -47700 -11433 -71658 -124678 -149723 -104882 7873
$$ packed form
1483I0813m8204r2214m7302O1780j02838J06032P1223o234P8212n5778M9238n7768
1471D6960o8735R2896j18580k1896O3442l3983l2633j00223N8692r37M7388K470
1459f5139p153j4285Q0367m0043l4797K9841q733O7683O650n2266o3637J15958
1447A4446R5315q0041j28869j15069J18537O064J5935Q8278o5958r1200L4571
1436a07991R3806k9253p2027L0140L2971m7643M8939M7665o825K1849l430q7349
1424g9148L0742O8804j44219K3403O4386n8362k4694Q5202L802p0347P1438L1835
1412B842m0903n224N8747J19460r5929q8936P8402k2158P1911j6254j30650k6248
1400i4940J67735l4073k5498j7506m3418L6267o0225n3020k5045M4841J12755
$$ plain form
1389 7873 -39327 -92439 -117751 -154407 -113022 -34992 -30868 -60568 -52227 -76209 -93969 -95981 -44814
1376 -44814 -43493 -121687 -86690 -42348 -90316 -128850 -60071 1040 -92331 -122601 -59294 -30198
1364 -30198 -143628 -155165 -183587 -142141 -107454 -62506 -98258 -84955 8264 25949 11087 -32272
1352 -32272 -80579 -10060 64254 -16940 -76407 -76489 -9958 -37898 -14615 3477 5844 2454 -49077
1339 -49077 -69646 -40224 -141021 -76840 17291 -20375 -26044 8330 -62361 -140546 -137108 -119293
1327 -119293 -100769 -112546 -93705 -33836 41652 -16993 -103180 -14419 21310 -29295 -137266
1316 -137266 -91361 -26827 8399 15832 -34730 -2557 -10750 -32386 -27554 68210 40662 117940
1304 117940 144917 -1335 -42341 -72431 -30570 -11833 -54966 -161826 -128118 -142106 -115177
$$ packed form
1389G873m7200n3112k5312l6656M1385P8030M124k9700Q341k3982j7760k012N1167
1376d4814J321p8194L4997M4342m7968l8534O8779O1111r3371l0270O3307K9096
1364c0198j13430j1537k8422M1446L4687M4948l5752J3303R3219J7685j4862m3359
1352c2272m8307P0519P4314q1194n9467q2O6531k7940K3283J8092K367l390n1531
1339d9077k0569K9422j00797O4181R4131l7666n669L4374p0691p8185L438J7815
1327a19293J8524j1777J8841N9869P5488n8645q6187Q8761L5729n0605j07971
1316a37266M5905O4534L5226P433n0562L2173q193k1636M832R5764k7548P7278
1304A17940K6977j46252m1006l0090M1861J8737m3133j06860L3708j3988K6929
$$ plain form
1293 -115177 -85940 -43004 -7027 -14650 -25208 15744 80559 47015 2999 -42093 13545 -41048
1281 -41048 -138275 -142518 -28227 -76216 -149247 -118720 -96958 -77861 -20852 -69384 -169346 -58687
1269 -58687 31810 -67425 9000 35187 -15755 -59973 -8063 14135 50443 23422 35981 31922
1257 31922 -19435 -169105 -234690 -77504 12344 -18424 -52590 -40216 -103547 -152831 -58577
1246 -58577 82743 -2786 -42183 28666 7093 -36845 -23393 23045 -32626 -53210 -109139 -160239
1234 -160239 -160863 -192258 -62472 -6889 -40925 -16128 9500 -92556 22142 83493 35494
1223 35494 21441 -18277 -961 5204 -62679 -60006 -26339 -46416 -75233 35862 141394 150073
1211 150073 -2555 -1902 -7837 9647 99373 13230 89479 101838 -22694 -14722 71278 92147
$$ packed form
1293a15177K9237M2936L5977p623j0558M0952O4815l3544m4016m5092N5638n4593
1281d1048r7227m243J14291m7989p3031L0527K1762J9097N7009m8532r9962J10659
1269e8687R0497r9235P6425K6187n0942m4218N1910K2198L6308k7021J2559m059
1257C1922n1357j49670o5585J57186Q9848l0768l4166J2374o3331m9284R4254
1246e8577J41320q5529l9397P0849k1573m3938J3452M6438n5671k0584n5929n1100
1234a60239o24l1395J29786N5583l4036K4797K5628j02056J14698O1351m7999
1223C5494j4053l9718J7316O165o7883K673L3667k0077k8817J11095J05532Q679
1211A50073j52628O53n935J7484Q9726q6143P6249J2359j24532P972Q6000K0869
$$ plain form
1199 92147 -3153 -83164 19540 -10147 -41048 -44025 -86854 -79953 -11233 7618 -7057 21230
1187 21230 31485 111582 101296 69973 -6519 58894 -44825 11384 1498 -15906 7519 -38155
1175 -38155 -28269 -42375 -74629 -68460 -44206 -6957 -17030 16921 69755 -40439 86117 24825
1163 24825 -27264 14755 -16293 -92170 -64642 -99534 -70373 -3188 -8001 -87400 -126866 -194945
1151 -194945 -151426 -75146 -50953 34638 65809 -57380 -25416 5840 -17966 2387 3736 -21222
1139 -21222 -45675 -33040 -62496 -162262 -70135 -11515 -18424 -23987 -29702 -40709 45866 28077
1127 28077 101953 130212 82170 -11124 -66336 7549 42365 41107 15872 13758 -6203 14259
1115 14259 -82317 -24698 110133 93733 -8983 3466 1757 59119 6277 -8784 -57490 -30742
$$ packed form
1199I2147r5300q0011J02704k9687l0901k977m2829O901O8720J8851j4675K8287
1187B1230J0255Q0097j0286l1323p6492O5413j03719N6209r886j7404K3425m5674
1175c8155R886j4106l2254O169K4254L7249j0073L3951N2834j10194J26556o1292
1163B4825n2089M2019l1048p5877K7528l4892K9161O7185m813p9399l9466o8079
1151a94945M3519P6280K4193Q5591L1171j23189L1964L1256k3806K0353J349k4958
1139b1222k4453J2635k9456r9766R2127N8620o909n563n715j1007Q6575j7789
1127B8077P3876K8259m8042r3294n5212P3885L4816j258k5235k114j9961K0462
1115A4259r6576N7619J34831j6400j02716J2449j709N7362n2842j5061m8706K6748
$$ plain form
1103 -30742 44456 74613 3425 -14198 -15459 -42737 -86562 -63265 37852 -38914 -49221 23720
$$ packed form
1103c0742P5198L0157p1188j7623j261k7278m3825K3297J01117p6766j0307P2941
$$ [...]
##END NTUPLES=NMR SPECTRUM
##END=
