##TITLE=1H_TG-2350-A
 CDCl3
 8 sc, 
 10.03.2022
##JCAMPDX= 6.0         $$ Bruker NMR JCAMP-DX V2.0
##DATA TYPE= NMR SPECTRUM
##DATA CLASS= NTUPLES
##ORIGIN= UXNMR, Bruker Analytische Messtechnik GmbH
##OWNER= root
$$ XWIN-NMR		Version 3.5
$$ Thu Mar 10 12:20:12 2022 Russian Standard Time (UT+4h)  she@DPX200
##.OBSERVE FREQUENCY= 200.131346
##.OBSERVE NUCLEUS= ^1H
##.ACQUISITION MODE= SIMULTANEOUS
##.ACQUISITION SCHEME= undefined
##.AVERAGES= 8
##.DIGITISER RES= 18
##SPECTROMETER/DATA SYSTEM= spect
##.PULSE SEQUENCE= zg30
##.SOLVENT NAME= CDCl3
##.SHIFT REFERENCE= (INTERNAL, CDCl3, 0, 15.716)
##AUDIT TRAIL= $$ (NUMBER, WHEN, WHO, WHERE, WHAT)
$$ ##TITLE= Audit trail, XWIN-NMR		Version 3.5
$$ ##JCAMPDX= 5.01
$$ ##ORIGIN= Bruker BioSpin GmbH
$$ ##OWNER= she
$$ F:/spectra/data/she/nmr/H-F/1/pdata/1/auditp.txt
$$ ##AUDIT TRAIL=  $$ (NUMBER, WHEN, WHO, WHERE, WHAT)
(   1,<2022-03-10 12:18:51.73 +0400>,<she>,<DPX200>,
      <created by zg, POWCHK disabled, PULCHK disabled
       configuration hash MD5:
       00 E9 B6 7A A2 85 ED C7 34 08 36 98 17 FE 4E 26
       data hash MD5: 16K
       8A DA 8D B0 31 3A 0A 43 41 D4 B2 4C 4A 93 02 BF>)
(   2,<2022-03-10 12:18:55.26 +0400>,<she>,<DPX200>,
      <Start of raw data processing
       efp BC_mod = 2 LB = 0.24 FT_mod = 6 PKNL = 1 PHC0 = -16586.62 PHC1 = 8.200779 SI = 16K 
       data hash MD5: 16K
       EC 6A B5 FD 97 1C AE 5E 35 9C 78 D9 9D 42 D0 C0>)
(   3,<2022-03-10 12:19:15.01 +0400>,<she>,<DPX200>,
      <pk PHC0 = 0.9595986 PHC1 = -0.4 
       data hash MD5: 16K
       6C C3 E2 F4 76 4B CC 6A 27 EE B9 A8 95 0F E2 72>)
(   4,<2022-03-10 12:19:18.17 +0400>,<she>,<DPX200>,
      <abs ABSG = 5 
       data hash MD5: 16K
       9A BA 29 9D D8 B0 63 AA 7D 8D A7 9F 53 02 63 E8>)
$$ ##END=
$$ 
$$ hash MD5
$$ 62 CB 80 37 FF 42 E9 A1 03 C9 BD 64 5D D5 0D C6
##$RELAX= 
##$RELAX= 
##$RELAX= 
##$RELAX= 
##$RELAX= 
##$RELAX= 
$$ Bruker specific parameters
$$ --------------------------
##$DU= <F:/spectra>
##$EXPNO= 1
##$NAME= <H-F>
##$PROCNO= 1
##$TYPE= <nmr>
##$USER= <she>
##$AMP= (0..31)
100 100 100 100 100 100 100 100 100 100 100 100 100 100 100 100 100 100 
100 100 100 100 100 100 100 100 100 100 100 100 100 100 
##$AQSEQ= 0
##$AQ_mod= 1
##$AUNM= <au_zg>
##$AUTOPOS= <>
##$BF1= 200.13
##$BF2= 200.13
##$BF3= 200.13
##$BF4= 200.13
##$BF5= 200.13
##$BF6= 200.13
##$BF7= 200.13
##$BF8= 200.13
##$BYTORDA= 1
##$CFDGTYP= 0
##$CFRGTYP= 5
##$CHEMSTR= <none>
##$CNST= (0..31)
1 1 145 1 1 1 1 1 1 1 1 1 1 1 1 1 1 1 1 1 1 1 1 1 1 1 1 1 1 1 1 1 
##$CPDPRG= <>
##$CPDPRG1= <>
##$CPDPRG2= <>
##$CPDPRG3= <>
##$CPDPRG4= <mlev>
##$CPDPRG5= <mlev>
##$CPDPRG6= <mlev>
##$CPDPRG7= <mlev>
##$CPDPRG8= <mlev>
##$CPDPRGB= <>
##$CPDPRGT= <>
##$D= (0..31)
0 1.2 0 0 0 0 0 0 0 0.06 0 0.03 0 0 0 0 0.0002 0 0 0 0 0 0 0 0 0 0 0 0 
0 0 0 
##$DATE= 1646900331
##$DBL= (0..7)
120 120 120 120 120 120 120 120 
##$DBP= (0..7)
150 150 150 150 150 150 150 150 
##$DBP07= 0
##$DBPNAM0= <>
##$DBPNAM1= <>
##$DBPNAM2= <>
##$DBPNAM3= <>
##$DBPNAM4= <>
$$ [...]
##$SUBNAM2= <"">
##$SUBNAM3= <"">
##$SUBNAM4= <"">
##$SUBNAM5= <"">
##$SUBNAM6= <"">
##$SUBNAM7= <"">
##$SUBNAM8= <"">
##$SUBNAM9= <"">
##$SW= 18.0517287032376
##$SWIBOX= (0..15)
0 0 2 0 0 0 0 0 0 0 0 0 0 0 0 0 
##$SW_h= 3612.71676300578
##$TD= 16384
##$TD0= 1
##$TE= 0
##$TE2= 300
##$TE3= 300
##$TEG= 300
##$TL= (0..7)
0 120 120 120 120 120 120 120 
##$TP= (0..7)
150 150 150 150 150 150 150 150 
##$TP07= 0
##$TPNAME0= <>
##$TPNAME1= <>
##$TPNAME2= <>
##$TPNAME3= <>
##$TPNAME4= <>
##$TPNAME5= <>
##$TPNAME6= <>
##$TPNAME7= <>
##$TPOAL= (0..7)
0.5 0.5 0.5 0.5 0.5 0.5 0.5 0.5 
##$TPOFFS= (0..7)
0 0 0 0 0 0 0 0 
##$TUNHIN= 0
##$TUNHOUT= 0
##$TUNXOUT= 0
##$USERA1= <user>
##$USERA2= <user>
##$USERA3= <user>
##$USERA4= <user>
##$USERA5= <user>
##$V9= 5
##$VALIST= <valist>
##$VCLIST= <CCCCCCCCCCCCCCC>
##$VD= 0
##$VDLIST= <DDDDDDDDDDDDDDD>
##$VPLIST= <PPPPPPPPPPPPPPP>
##$VTLIST= <TTTTTTTTTTTTTTT>
##$WBST= 1024
##$WBSW= 4
##$XGAIN= (0..3)
0 0 0 0 
##$XL= 0
##$YL= 0
##$YMAX_a= 464515
##$YMIN_a= -697638
##$ZGOPTNS= <>
##$ZL1= 120
##$ZL2= 120
##$ZL3= 120
##$ZL4= 120
##$ABSF1= 15.71494
##$ABSF2= -2.336909
##$ABSG= 5
##$ABSL= 3
##$ALPHA= 0
##$AQORDER= 0
##$ASSFAC= 0
##$ASSFACI= 0
##$ASSFACX= 0
##$ASSWID= 0
##$AUNMP= <proc_1d>
##$AZFE= 0.1
##$AZFW= 0.1
##$BCFW= 0
##$BC_mod= 2
##$BYTORDP= 0
##$COROFFS= 0
##$CY= -3
##$DATMOD= 1
##$DC= 0
##$DFILT= <>
##$DTYPP= 0
##$F1P= 0
##$F2P= 0
##$FCOR= 1
##$FTSIZE= 16384
##$FT_mod= 6
##$GAMMA= 0
##$GB= 0
##$INTBC= 1
##$INTSCL= 0
##$ISEN= 128
##$LB= 0.24
##$LEV0= 0
##$LPBIN= 0
##$MAXI= 10000
##$MC2= 0
##$MEAN= 0
##$ME_mod= 0
##$MI= 1.114404
##$NCOEF= 0
##$NC_proc= -5
##$NLEV= 6
##$NOISF1= 3.799351
##$NOISF2= 2.8
##$NSP= 0
##$NTH_PI= 0
##$NZP= 0
##$OFFSET= 15.71604
##$PC= 1
##$PHC0= -16585.66
##$PHC1= 7.800779
##$PH_mod= 1
##$PKNL= yes
##$PPARMOD= 0
##$PSCAL= 0
##$PSIGN= 0
##$REVERSE= no
##$SF= 200.130007107443
##$SI= 16384
##$SIGF1= 3
##$SIGF2= 2
##$SINO= 5.538805
##$SIOLD= 16384
##$SREGLST= <1H.CDCl3>
##$SSB= 0
##$STSI= 16384
##$STSR= 0
##$SW_p= 3612.71676300578
##$SYMM= 0
##$S_DEV= 0
##$TDeff= 16384
##$TDoff= 0
##$TI= <>
##$TILT= no
##$TM1= 0
##$TM2= 0
##$TOPLEV= 0
##$USERP1= <user>
##$USERP2= <user>
##$USERP3= <user>
##$USERP4= <user>
##$USERP5= <user>
##$WDW= 1
##$XDIM= 16384
##$YMAX_p= 304759714
##$YMIN_p= -123030
$$ End of Bruker specific parameters
$$ ---------------------------------
##NTUPLES= NMR SPECTRUM
##VAR_NAME=  FREQUENCY,     SPECTRUM/REAL,   SPECTRUM/IMAG
##SYMBOL=    X,             R,               I
##VAR_TYPE=  INDEPENDENT,   DEPENDENT,       DEPENDENT
##VAR_FORM=  AFFN,          ASDF,            ASDF
##VAR_DIM=   16384,         16384,           16384
##UNITS=     HZ,            ARBITRARY UNITS, ARBITRARY UNITS
##FACTOR=    0.220516191357247, 1,           1
##FIRST=     3145.2511283749, 0,             0
##LAST=      -467.465634630883, 0,           0
##MIN=       -467.465634630883, -123030,     0
##MAX=       3145.2511283749, 304759714,     0
$$ Real data points
##PAGE= N=1
##DATA TABLE= (X++(R..R)), XYDATA
$$ [...]
9538 311930 307927 336141 310779 344876 368003 335117 283928 298523 359984 341341 376003 397847
9526 397847 372181 336991 348835 373618 364049 319472 318694 365537 371314 395633 381474 330293
9514 330293 307715 365524 389032 360008 318184 351886 351970 359842 388354 360320 367331 400042 439042
9501 439042 394061 396765 377283 366678 396926 425005 388951 374165 394040 373631 381786 368092
9489 368092 398059 445018 416684 407000 407935 393800 366633 391220 396394 427675 446172 451694 395988
9476 395988 412721 422193 439625 446013 420124 451702 475505 485170 472711 487532 490949 508702
9464 508702 453175 497682 487786 445159 476299 516806 494155 496334 471602 461482 493998 502733
9452 502733 523353 534711 518671 479849 498845 509671 565862 510211 560970 552557 518046 508358
9440 508358 518790 537383 551188 521828 553390 535910 510887 571592 558269 594419 571132 525808
9428 525808 557000 586442 577354 611011 569169 536942 591774 615298 653253 614202 618103 658621
9416 658621 578057 539332 542337 598427 621511 623886 636540 604635 552520 620444 641801 632931
9404 632931 595914 588691 576288 609658 670977 649938 687616 677791 682248 678404 666311 689300
9392 689300 668970 627496 663991 695060 673208 706898 687941 711013 670334 709196 669334 726022
9380 726022 715908 735834 735095 736652 787807 782693 807172 811768 810424 807119 847459 854107 799702
9367 799702 801734 815162 806812 862320 895253 923110 903531 969377 977639 996639 1021229 1025858
9355 1025858 1025665 1056447 1108301 1152530 1128247 1137753 1118515 1153151 1144344 1162289 1147778 1151703
9343 1151703 1228602 1287414 1332134 1258404 1239829 1212823 1173330 1158842 1136448 1123160 1071251
9332 1071251 1086107 1061841 1103106 1067203 1102500 1133225 1115278 1144450 1191166 1222507 1195486
9321 1195486 1214880 1179240 1204216 1214972 1273748 1302166 1385160 1421171 1466702 1489985 1567211
9310 1567211 1538969 1494142 1494642 1478944 1485123 1492213 1503757 1518825 1475467 1482610 1492116 1449509 1433581
9297 1433581 1405645 1428114 1401077 1384141 1416725 1413631 1440700 1448042 1445173 1510541 1504240 1576327
9285 1576327 1609046 1573803 1608848 1640258 1646378 1670571 1713232 1744475 1755077 1720245 1706624 1705468
9273 1705468 1674727 1643295 1695975 1775523 1781814 1842371 1844889 1881713 1886904 1947187 1972521 1986906
9261 1986906 1992194 1996086 2030429 2020806 1973005 1919241 1939014 1945446 1959860 1990653 2061593 2056044
9249 2056044 2028507 2065225 2089144 2151991 2135759 2196364 2219336 2212884 2237639 2278732 2320341 2260845
9237 2260845 2224693 2214356 2271034 2334448 2320919 2381142 2373148 2375555 2392515 2436200 2515828 2539866
9225 2539866 2506634 2509256 2573624 2592274 2620104 2634404 2628587 2625997 2655719 2631132 2676816 2736330
9213 2736330 2756716 2829478 2857596 2909126 2954682 3023957 3165889 3263623 3359659 3470498 3619124
9202 3619124 3660718 3711607 3725293 3686313 3678175 3687296 3784006 3882078 3995886 4145037 4261895
9191 4261895 4366344 4408541 4544738 4780411 5037711 5287265 5560705 5739484 5783892 5677222
9181 5677222 5388089 5085436 4836716 4648189 4555565 4524162 4470054 4472311 4404812 4320196 4212491
9170 4212491 4211929 4244910 4211926 4299382 4379138 4446201 4482942 4530655 4499486 4446611 4460678 4543259
9158 4543259 4582231 4674330 4843688 5029744 5227601 5353049 5515817 5643845 5791732 5959255
9148 5959255 6198973 6524049 6777445 6925361 6833586 6575148 6208434 5939820 5588027 5370187
9138 5370187 5200511 5047169 4888548 4712842 4599611 4557295 4436278 4339024 4269694 4212829
9128 4212829 4134016 4061206 3981345 3962024 3978931 3948969 3967517 3972587 3985966 3972276 4012594 4012821
9116 4012821 4042914 4110735 4174326 4245607 4342907 4404498 4509234 4675157 4712974 4729613 4800146
9105 4800146 4851216 4921491 4969579 5054836 5077585 5094745 5076500 5003731 4887078 4821385 4713100
9094 4713100 4658864 4639962 4664527 4656365 4654306 4635752 4631928 4593199 4600767 4621889 4683881 4671078
9082 4671078 4727041 4804599 4846940 4883553 4951472 5033233 5106608 5128684 5168035 5252804 5281895
9071 5281895 5315179 5342158 5388753 5457159 5524138 5582589 5623307 5662276 5698339 5774488 5887760
9060 5887760 5991694 6087402 6178693 6264820 6298741 6420375 6506243 6577502 6693391 6780497 6889591
9049 6889591 7056823 7192706 7338032 7449300 7556314 7688782 7785561 7926394 8101482 8215271
9039 8215271 8344103 8428111 8585832 8762316 8864116 9007976 9115313 9240743 9405476 9482193
9029 9482193 9637482 9832056 9968754 10123693 10276709 10451579 10626925 10871772 11088337 11319729
9019 11319729 11597691 11859282 12200546 12573708 12874571 13251973 13662420 14085103 14538333
9010 14538333 14979986 15420555 15895945 16459493 17051186 17706282 18420915 19254382 20148851
9001 20148851 21202775 22324628 23413949 24583906 25695798 26875088 28252288 29872964
8993 29872964 31750658 33810931 35968429 38119328 40592727 43461433 46787194 50897470
8985 50897470 56118895 62626746 70240278 77916527 84503527 88539982 89363668 86711706
8977 86711706 81318393 74835384 68592721 63593970 59863491 57012773 54425659 51731788
8969 51731788 48788833 45488648 42317076 39729644 37764025 36526206 35879110 35721273
8961 35721273 35890430 36421489 37147822 38196710 39557380 41410595 43910066 47216734 51156408
8952 51156408 55337172 59456909 63300329 66817846 70203293 74068106 79087046 85518756
8944 85518756 92882966 99686071 103941495 104354317 99974888 91652772 80662156 69180955
8936 69180955 59012181 51010826 45117277 40819494 37645522 35046743 32675139 30296381
8928 30296381 27792279 25290665 22960754 20875371 19127093 17616837 16369857 15305348
8920 15305348 14449083 13710510 13049988 12483101 11976949 11477357 11114204 10766530 10315037
8911 10315037 9898471 9549793 9270776 8938656 8686417 8489684 8286081 8128896 7845764
8902 7845764 7670689 7481998 7274842 7037843 6786039 6625940 6498186 6348021 6148860 5950590
8892 5950590 5760034 5635295 5532568 5391962 5307646 5182057 5112616 5002682 4949363 4909060
8882 4909060 4810434 4762037 4773394 4764785 4696395 4611007 4606807 4626124 4570022 4554987 4556142 4560854
8870 4560854 4487863 4412981 4395423 4362796 4350525 4343489 4315000 4281330 4310092 4328489 4271370 4248784
8858 4248784 4223757 4182013 4183697 4176506 4104914 4054298 4017472 3972855 3930576 3886305 3856683 3837436
8846 3837436 3898379 3874435 3837107 3871502 3849024 3828113 3855695 3885446 3876808 3872145 3907422 3910686
8834 3910686 3961829 3988972 4014942 3969565 3955591 4023002 4038996 3985203 3956162 4028659 4037997 3989141
8822 3989141 4004573 4020566 3993111 4007672 4028528 4083952 4123987 4078594 4057338 4082938 4163399
8811 4163399 4189870 4176137 4205998 4224073 4239360 4294424 4358672 4402083 4411042 4413438 4478090 4549321
8799 4549321 4603712 4684789 4721210 4763990 4863597 4881836 4895273 4907628 4922237 4990462 5059880
8788 5059880 5127507 5169224 5163073 5194016 5262897 5314869 5354663 5403472 5433088 5489011 5552627 5642029
8776 5642029 5661230 5700580 5802113 5873478 5967381 6042650 6108484 6287609 6360021 6416201 6547392
8765 6547392 6630093 6706192 6819388 6851654 6916494 6955064 7003688 7109337 7208241 7316643 7430596
8754 7430596 7538972 7703988 7898458 8034484 8139000 8327019 8455006 8600939 8770574 8919215
8744 8919215 9109342 9303410 9502983 9721130 9985648 10256670 10517564 10891845 11173152 11541546
8734 11541546 11987102 12500707 12974483 13500545 14079573 14781929 15489499 16410337 17566340
8725 17566340 18931866 20374150 21782073 23341014 25437971 28815322 34554586 40325669
8717 40325669 40835431 36965889 31259260 26535873 23574439 21703357 20517523 19797338
8709 19797338 19471889 19395949 19530812 19813282 20113016 20439237 20837482 21174287 21475885 21835894
8699 21835894 22288151 22678029 23079161 23455162 23855569 24317317 24861377 25432133 26120701
8690 26120701 26837187 27712927 28670750 29671231 30852951 32226294 33641935 35348245 37215842
8681 37215842 39221227 41494229 44189871 47218641 50675088 54861073 59669805 64923935
8673 64923935 70619481 76633922 82259293 86860944 91499017 95145617 96001661 95992003 94756950
8664 94756950 91421703 87742257 83277842 77933808 72813694 68274456 64083034 60057955
8656 60057955 56622211 53552464 50620775 48036046 45813965 43854771 42438636 41402981
8648 41402981 40818941 40687136 41119633 41855615 42921295 44317150 46020333 47980653 50036339
8639 50036339 52502075 55355954 58221805 61353591 64704882 67644221 70387041 73026943
8631 73026943 74610811 74805033 74795325 73564481 70162330 66502845 62164680 56770261 51732595
8622 51732595 46725241 41933365 37879850 34456663 31763158 29450241 27434308 25720156
8614 25720156 24059966 22524161 21218019 19937841 18793176 17767876 16819238 16049996
8606 16049996 15327969 14595140 13929288 13314523 12688404 12090816 11476427 10898612 10329473
8597 10329473 9900908 9454557 9017775 8712086 8402260 8105480 7858753 7551560 7283944
8588 7283944 7026264 6817162 6602014 6395714 6149328 5997220 5848379 5704384 5557520 5351704
8578 5351704 5401247 5314739 5258410 5185485 5149858 5169036 5119536 5119535 5164893 5241473 5253337 5211950
8566 5211950 5212532 5246416 5188858 5175534 5144292 5084095 5005767 4943817 4803786 4703258 4588143
8555 4588143 4446079 4301774 4116009 3940075 3744986 3554931 3400031 3252128 3171269 3134212
8545 3134212 3034529 2910577 2855441 2773152 2660824 2581767 2541716 2466337 2381233 2320739 2277151
8534 2277151 2278291 2221217 2105748 2037619 1999580 1958793 1929437 1885810 1870150 1861177 1788239 1788182
8522 1788182 1833501 1787884 1765392 1763770 1733760 1695416 1674935 1620012 1630922 1614840 1563366 1536774
8510 1536774 1462385 1443693 1362366 1355737 1330946 1274341 1294917 1284142 1276142 1260396 1274436 1238608
8498 1238608 1188501 1207906 1244386 1186868 1165701 1166526 1155102 1160081 1145334 1115412 1112055 1095134
8486 1095134 1088443 1107124 1088081 1052100 996630 984206 953082 934851 909350 899679 911972 920969
8474 920969 944407 893439 856892 870552 917006 921423 909097 915621 895601 824421 828871 801315
8462 801315 787762 804115 833476 838495 876005 873005 834589 848667 825635 799796 786393 806805
8450 806805 841762 822089 818535 782151 783383 759198 751904 756858 709493 713777 745601 716309 690291
8437 690291 721666 676783 662919 645361 633677 631830 628488 594042 619363 638802 626947 612169
8425 612169 579227 567847 588348 603454 588671 584173 529900 540686 531149 528544 578755 538389
8413 538389 556398 530313 520517 555379 497684 452214 459235 458685 440579 457294 448749 477312 489497
8400 489497 456816 491414 542755 511486 443783 433158 473036 463484 474311 469093 490876 417033
8388 417033 398130 433753 470349 445658 391680 406990 394769 401513 418377 417910 397520 401685
8376 401685 379902 369633 375186 411613 375341 342051 295410 276290 314032 342305 356700 346809
8364 346809 331254 314364 312538 376037 376892 369312 326804 339142 308606 334172 281837 281084 309006
8351 309006 293122 268570 304409 318082 290798 321044 348532 319434 333571 311292 311297 347184
8339 347184 356456 322588 281092 314097 301758 267697 267465 303078 289454 317415 297774 303620
8327 303620 341070 371379 363521 355197 353545 356085 324313 400102 444072 478841 498436 514942
8315 514942 536690 523521 571295 610657 573419 558667 619957 652048 625788 593534 578457 585554
8303 585554 567002 561307 527852 499267 500735 464027 469506 493867 509883 478623 422700 432435
8291 432435 429511 373098 390567 367825 384651 411020 425239 407319 389666 427121 441995 459879
8279 459879 489513 509632 521813 530439 441461 494185 462368 437065 485428 488179 483161 464152
8267 464152 460900 463338 406185 413611 454763 411027 371264 342312 278240 281210 289235 272578 316233
8254 316233 303028 259253 234700 221125 194416 200785 249838 252388 230646 209787 232156 243519
8242 243519 253593 292150 325348 318111 283812 216574 184605 155740 157707 155549 139500 151596
8230 151596 109814 128374 128425 153284 149495 120476 89404 60814 53204 69187 61428 103061 120249
8217 120249 89228 129442 57811 27649 112686 139237 120327 79955 50007 52301 114319 122335
8205 122335 120716 98235 117841 85952 76658 97439 91283 47153 34795 65163 53788 101322
8193 101322 148214 348131 222383 65439 32585 9159 13392 -16110 19227 23668 51440
8182 51440 51323 19954 -42824 11029 37967 37672 17171 -1459 -27044 -37338 -52960 -32351 8770
8169 8770 -20461 -23528 -33209 -11220 -19427 1870 47347 30101 28194 -17686 -15085 -9804 18794
8156 18794 23957 36873 32278 -1781 6097 43589 22393 44146 20012 3486 35949 44014 18537
8143 18537 2409 32606 -6801 -38060 -62371 -59740 -11256 3680 8079 -6764 -38403 -8962
8131 -8962 -314 3921 27009 12257 3946 28442 39518 69431 37908 23666 6224 20866 30598
8118 30598 34002 52413 27948 26939 81227 75812 81072 69336 27760 9380 -32659 -34352 -55619
8105 -55619 -65901 -58228 33709 47391 10398 -25740 -78677 -20031 5120 -13118 -13622 44902
8093 44902 1287 -13615 -9199 -29782 22318 -7351 -13197 23244 -3605 -34113 20843 5890
8081 5890 30077 46866 52612 63707 59884 49266 66105 36573 14325 -3011 -35639 -17142
8069 -17142 1345 68894 64447 61918 57529 44847 3870 23053 -22202 30647 -7280 -7477 37267
8056 37267 6773 27202 24718 16862 -3102 31178 67360 61664 87840 51187 -118 32048
8044 32048 90582 93823 88005 46971 46201 35037 -23346 -18482 -14159 -15965 -14080 -47262 -61863
8031 -61863 -66862 -71006 -37299 -16155 -19439 4423 27783 47886 2524 45133 40993 30170 29124
8018 29124 2540 34834 10093 -8389 -13155 5353 40761 27244 45408 42963 41623 43681 15021
8005 15021 9120 7707 16846 -50851 -49754 -28552 -15336 -15227 -13759 -29881 -15745 -41916 -80782
7992 -80782 -104040 -68452 -88039 -56523 -18338 -13106 -18580 5223 34686 11270 -12608 -44933
7980 -44933 -78530 -40713 -61415 -78028 -64090 -19830 2760 11853 -18620 -54877 -55063 -44137
7968 -44137 -71773 -45039 -15403 8134 -41122 -80170 -109217 -64937 -12227 19285 -33628 -35054
7956 -35054 -59569 -39766 15687 -12097 -36015 -49898 -60737 -57064 -84613 -119472 -80259 -30438
7944 -30438 -25133 -21367 27637 -27866 -56452 -51071 -17131 -11929 3447 -328 -41115 -19405 -22156
7931 -22156 -79795 -84931 -17711 23001 -29355 -23230 -2861 53757 27811 13011 -5869 -14411
7919 -14411 -23334 2382 -2143 -46235 -48659 -10069 -25974 -28874 -18621 7366 -6712 -29932 -4449
7906 -4449 15210 -6757 17359 32394 34909 -32224 -10581 -28930 -43108 -51010 12377 -569
7894 -569 -15103 7176 -20294 8785 29900 -1351 -46673 -75890 -44254 -55176 -70051 -11787
7882 -11787 -3514 -38637 23538 13673 -76515 -42989 -17528 14251 -9486 14336 2391 1085
7870 1085 10337 62881 6442 -16007 -10330 -47912 -40261 -43849 -32440 -34732 5709 -10299 -37861
7857 -37861 -27984 -27128 -12925 -13938 -26458 -20561 9851 12468 43959 43088 12587 63 -51119
7844 -51119 -52348 -28413 -38304 -30040 31052 15863 22056 23621 18998 1873 -28761 -12874 -85018
7831 -85018 -67074 -22254 -20847 -37015 65792 85966 35458 21370 32980 10490 -4763 -66639
7819 -66639 -50405 -41338 12679 17543 -33842 -9667 16816 -17606 11503 12117 -9134 31003 1231
7806 1231 -11978 -94422 -59340 -8127 -17044 -42260 7032 21244 2455 57477 61962 -13479
7794 -13479 -47409 -20775 33037 4078 -26490 30069 6811 -26888 -22098 -4172 25230 45889
7782 45889 52813 -3149 -10196 -25205 -39812 -4507 14998 20980 27034 36627 -14904 -38638 -31036
7769 -31036 -26603 -22330 11207 4894 -13998 -11907 -22686 -52099 -1751 31646 21897 67345 -8558
7756 -8558 -20876 37775 -9389 -19382 15082 -16616 -34341 22150 41692 40164 36704 55181 43044
7743 43044 48987 63138 93439 86719 63669 13498 53427 55280 54652 95494 41371 65646 93558
7730 93558 103951 82591 113784 70705 35336 18878 10800 -20827 29936 33307 9500 31948
7718 31948 -15010 -12491 -22284 19991 39677 28741 57245 -16269 -3410 32594 46041 83247
7706 83247 24664 43879 8777 1685 29044 17527 58579 36815 26938 24127 55094 63070 20690
7693 20690 28818 22019 29513 59056 64042 56932 34374 50366 97864 83179 66345 92638 82289
7680 82289 61974 69222 53380 77670 166052 157909 121171 126821 112506 112263 114727 76662 78252
7667 78252 90122 93576 37111 56937 95981 84433 85437 86537 114222 142533 119004 84305
7655 84305 60864 97954 123140 100225 81967 123346 117598 135359 114417 45584 96892 108682
7643 108682 77238 95163 156233 158134 120728 157530 176106 113619 127617 144367 134585 110411
7631 110411 123849 111928 112324 100939 150105 145454 129572 181090 165048 107790 127013 90362
7619 90362 108490 150744 135333 100373 102341 170769 162040 192975 163356 161712 112154 150963
7607 150963 154743 191580 215596 155987 188741 171832 122436 115147 117757 123936 158577 168530 168004
7594 168004 162214 217512 186176 159963 169462 182779 186842 217202 238213 202943 173253 252357
7582 252357 251444 225344 255619 264927 238572 277167 322808 299852 334040 306213 322461 308722
7570 308722 300053 338574 339353 316471 313018 298982 319107 346194 368465 415133 386958 404051
7558 404051 459860 404094 409980 417415 432628 484361 472978 471046 493621 589501 636189 631229
7546 631229 699289 791634 849676 904355 929691 1027164 1119115 1200146 1332320 1444956 1578188
7535 1578188 1657148 1814122 1984180 2127777 2214731 2228920 2176533 2098665 2130892 2167926 2134609
7524 2134609 1987163 1792349 1613912 1521327 1423022 1285357 1160407 1090014 954394 841906
7514 841906 812306 786981 760201 730988 680101 711583 771750 796458 794842 793418 812804 824945
7502 824945 865334 813539 749196 768580 740876 706641 689050 642452 566882 542851 521875 473552
7490 473552 400820 445635 481207 464643 467876 460919 438866 418945 396324 324294 313507 345484
7478 345484 364927 367036 344232 307231 317211 297531 309204 350113 385808 393787 377429 360200
7466 360200 302784 300846 378637 409258 359575 349995 353428 343886 336558 342384 338927 368010 394565
7453 394565 310954 299598 284849 338497 398894 436710 369629 335653 403418 409108 333043 349528
7441 349528 321884 333723 363234 365855 371971 412761 448238 435685 406969 396346 399132 382611
7429 382611 384107 385099 379957 392911 383365 377809 440654 402221 400568 423041 464817 444223 436079
7416 436079 423608 462819 454588 431360 468222 475722 497643 505533 464937 447305 489136 467928
7404 467928 472822 445235 455255 458044 507892 508543 477526 427173 477431 461786 473287 520149
7392 520149 544207 576818 525527 526329 518760 507647 543107 512163 505897 537990 558132 568261
7380 568261 641125 688211 647899 695921 750182 813224 828799 858599 921448 968598 955130 965748
7368 965748 969799 1022137 1074410 1119509 1147613 1091226 1057722 1068698 1086505 1065537 1013146 947173
7356 947173 888663 861138 793752 759742 694208 706170 690279 687882 699525 693187 648970 662395
7344 662395 660976 619533 594950 579497 565580 608328 622855 587510 571412 600435 593896 561372
7332 561372 567700 587683 604517 619299 596526 577867 591179 618083 647269 672421 632713 622495
7320 622495 675412 685658 672461 674105 602705 598109 594598 578994 642861 661793 693665 727064
7308 727064 736748 707525 754688 735710 658668 630547 662353 675846 652807 663742 673869 681490
7296 681490 729754 724052 742889 763128 753526 777071 762546 741644 756599 766068 712230 706513
7284 706513 737246 808074 773027 775157 818038 802955 815768 868145 893389 867219 830252 869447
7272 869447 918410 924464 930687 949939 1012592 1010018 1033359 993631 991324 1008392 1077515 1052181
7260 1052181 1092252 1134502 1165946 1125375 1087590 1099948 1111181 1103385 1133972 1161429 1166865 1190765
7248 1190765 1178882 1183819 1195622 1237016 1233670 1265317 1256476 1215550 1267105 1384799 1430275 1379746
7236 1379746 1389014 1450695 1453502 1399988 1403524 1437394 1467863 1495947 1506031 1488967 1547411 1585543
7224 1585543 1642991 1681519 1680344 1686259 1716686 1708770 1723413 1740830 1714601 1723473 1780938 1836642
7212 1836642 1850480 1906104 1939713 1979411 1996933 2037869 1996523 2009825 2054472 2094863 2078267
7201 2078267 2097786 2203060 2209036 2153298 2178353 2186011 2248125 2281130 2274604 2342546 2396386 2431121
7189 2431121 2431404 2478385 2514560 2558879 2651163 2717594 2778078 2836773 2890546 2986853 3031713 3095673
7177 3095673 3124802 3203278 3296568 3400573 3502624 3639472 3735862 3848052 4019317 4231383
7167 4231383 4363643 4485706 4614899 4681495 4757307 4854831 4919539 4957693 5050055 5129812 5237563
7156 5237563 5368599 5436681 5488626 5552992 5598868 5680752 5708757 5754146 5820274 5956351 6085442
7145 6085442 6261996 6443536 6629381 6808874 6987068 7240705 7470946 7706767 7910643 8184365
7135 8184365 8428881 8717298 9000722 9307428 9531811 9799864 10169522 10554278 11012537 11501696
7125 11501696 12052033 12760499 13544108 14363276 15348771 16594252 18070665 19769977 21913828
7116 21913828 24415406 27595014 31505972 36376578 42342888 49461010 57530972 65938023
7108 65938023 73850592 79681850 82773509 83714517 83443594 83234813 82041579 79980525 74604127
7099 74604127 66521851 57241563 47194342 38597774 31768295 26757763 23047133 20324909
7091 20324909 18156156 16421415 14944488 13656591 12596408 11709673 10849383 10112419 9474183
7082 9474183 8936418 8405186 7987639 7563104 7244679 6972418 6743590 6520311 6292922 6080712
7072 6080712 5945840 5899305 5867678 5829108 5823645 5891952 6061905 6175802 6179747 6132145 6055510
7061 6055510 5878560 5649611 5420030 5177960 4786437 4348861 3956523 3566319 3224931 2952898
7051 2952898 2729516 2532705 2344618 2233207 2110182 2023077 1979573 1971999 1925053 1907291 1823647
7040 1823647 1803005 1800319 1783450 1773492 1683583 1658271 1593652 1574275 1541857 1474029 1427419 1393571
7028 1393571 1379564 1386011 1385043 1330078 1376632 1375939 1328601 1299110 1337164 1332750 1221640 1148311
7016 1148311 1116140 1109931 1091204 1068680 1056782 1026151 962269 935393 940997 875079 875583 809054
7004 809054 813031 827910 811529 861559 857247 828009 850641 810704 814529 816904 815886 771167 696246
6991 696246 700815 685181 712095 703387 681000 668215 650385 620586 541591 540254 531317 493631
6979 493631 490097 442351 464627 494123 521318 501475 480542 468146 423036 376101 383157 396933
6967 396933 358024 369850 360282 327140 336803 327448 356787 309606 313976 274138 291771 343897
6955 343897 361380 364767 374767 355884 339061 328029 347086 348483 300180 256246 349035 349094 344399
6942 344399 313291 325413 307046 272725 315586 299881 286022 278008 301960 332972 314410 337150
6930 337150 340269 334829 378123 319306 322621 332129 320031 323952 366506 353857 353518 345289 393111
6917 393111 372711 306658 317097 345060 331622 314379 337967 302304 302111 251387 238034 277340
6905 277340 286355 282343 279011 322446 336005 351300 366152 382773 385615 424176 522702 496983
6893 496983 422158 401301 455332 501002 537542 557350 507143 411304 438458 427154 399462 384328
6881 384328 338871 324833 281218 259511 246837 249920 264389 262682 245793 233820 266593 254705
6869 254705 209332 283223 294728 289300 291000 294719 286135 289349 249841 266754 284744 259987 291904
6856 291904 272606 249600 253739 275067 298896 279012 211859 190079 171972 146262 174539 201822
6844 201822 175595 155546 208094 188701 190973 214096 154559 172782 193572 180318 165086 175044
6832 175044 179941 164807 127088 169680 178217 167187 166869 137742 168966 169456 139214 141753 142365
6819 142365 117920 105606 118068 139680 139268 127301 132549 104705 126087 164253 131610 104039
6807 104039 103886 134728 87409 87184 94127 106051 124103 131998 167587 170489 150025 148384 169778
6794 169778 187564 142341 169218 135087 98099 61326 51929 57735 31664 27887 68499 127858
6782 127858 182307 130023 100746 55406 56194 103201 149654 150275 123099 128174 110435 128593 145376
6769 145376 126142 122680 92888 93035 146041 111110 70479 137780 171811 103463 92768 111418
6757 111418 135135 142786 226441 182594 182627 167731 134795 188361 176890 164941 169071 159465 157284
6744 157284 178341 150471 139388 102632 125571 128940 132132 149893 141402 124845 160328 163172
6732 163172 117579 124253 152289 149666 195167 215082 153597 158882 228221 196950 177570 178750
6720 178750 153640 183995 192559 209624 203117 221722 233747 257805 199611 291803 358710 420801
6708 420801 457527 474564 468201 502139 539410 510898 553154 541914 498073 490573 441385 387606
6696 387606 369860 332244 292951 303512 284199 269311 274210 249432 213434 194764 198075 214931
6684 214931 208604 207937 176069 145351 140881 141636 158462 176464 160219 163740 110351 115384 78039
6671 78039 96420 168264 185918 124384 157362 174750 129699 186811 206374 176669 177332 170215
6659 170215 169631 153186 125071 144774 146719 158458 59347 65311 99229 107565 82562 43853 95322
6646 95322 120312 84609 115026 143043 123158 71024 91082 110022 85910 96418 127902 109256
6634 109256 97872 78775 81880 87206 115161 144217 124990 83819 81254 107894 136122 144268
6622 144268 149443 139791 130168 148929 121019 135238 167561 181741 128675 126851 146735 134108
6610 134108 177318 216632 211548 175153 184530 193874 215140 239656 255402 216654 199847 179757
6598 179757 195089 184218 166849 117578 121036 171987 154470 153978 174642 140507 149093 141509 117003
6585 117003 111562 155020 206686 175961 151296 131117 116242 146247 178677 158738 123381 138855
6573 138855 158481 111310 116932 158713 158667 150619 139097 196457 201833 180272 242454 213224 182141
6560 182141 186460 229219 220417 191190 193936 216501 198958 195022 196797 165128 220866 201388 164432
6547 164432 135494 161096 137996 140506 167039 201059 247925 234384 222739 228132 207789 210707
6535 210707 222408 286793 323594 313237 285344 292491 284985 249144 251515 225090 275802 254103
6523 254103 297545 291361 275078 258974 238342 238855 208336 168562 203920 224194 243353 295433
6511 295433 278398 235830 211429 199333 241983 249953 210985 233974 218587 187318 171174 176851
6499 176851 173328 155836 173111 177508 177800 169256 190986 248293 260185 208791 174806 175830 218214
6486 218214 234031 211886 218821 219621 235473 226275 241406 235946 179554 153896 135527 137727 143383
6473 143383 201507 199681 186725 168789 121572 162171 251435 244354 209559 201762 182380 170992
6461 170992 183326 196473 223232 206910 229123 192643 215792 240152 249987 269745 235432 259065
6449 259065 235442 253627 312960 296287 283428 259587 257217 272658 293382 326922 304929 286582
6437 286582 287036 275358 281990 307910 290163 270809 278586 285513 298615 289765 292640 344585 314043
6424 314043 272648 313487 335650 329136 317591 244623 242611 311339 360775 391668 343534 321626
6412 321626 309220 327895 323691 352880 376365 362219 364409 364317 412297 378049 332356 353730 394367
6399 394367 393848 399079 410381 423290 370877 384009 420814 473434 502829 516223 475294 502528
6387 502528 506179 503599 522419 544960 562357 487803 485530 518146 570795 560390 536816 573631
6375 573631 541257 508028 543867 594428 587130 541245 536049 523261 488803 496955 509538 510713
6363 510713 467078 527801 500758 476683 459338 450666 495726 515648 551409 517153 505033 571801
6351 571801 595915 533838 547864 569780 591344 617144 616592 639675 631940 641818 666623 639784
6339 639784 645641 666190 687710 711720 697693 715793 743163 800607 836127 843434 808431 804799
6327 804799 840397 826603 792541 809512 824953 809729 846937 905771 919638 870912 810632 833797
6315 833797 856936 857328 851772 805829 833868 794894 819403 795888 793634 843527 840519 911536 937130
6302 937130 901329 885475 890974 903818 855819 874666 876974 877007 852709 799538 826092 870934 875659
6289 875659 852903 805113 793056 782250 794253 770544 740618 767728 768187 751770 775182 789347
6277 789347 808920 778819 782803 817643 785255 783340 763326 780493 774225 780717 791868 751720
6265 751720 771490 784523 813806 830815 808482 844978 837674 859702 869607 877052 892022 874842
6253 874842 913245 916729 899569 938098 977720 981878 993513 993574 956198 950122 975623 989946 1043622
6240 1043622 1076066 1045274 1050653 1082571 1099401 1128596 1110599 1137221 1232613 1234108 1127162 1133160
6228 1133160 1156196 1095534 1072153 1088079 1092587 1146760 1136453 1155398 1174906 1168533 1192777 1192174
6216 1192174 1180091 1165347 1204700 1212428 1232464 1238028 1271574 1240747 1228626 1271886 1272708 1294290
6204 1294290 1302159 1321893 1336023 1357429 1380991 1366317 1334939 1332312 1393440 1417491 1439693 1505360
6192 1505360 1511790 1532778 1551800 1484001 1456547 1505695 1516939 1517829 1546018 1515320 1534420 1591590
6180 1591590 1639814 1594098 1574495 1589652 1643599 1683539 1675721 1706540 1701211 1724099 1764978 1719822
6168 1719822 1716411 1755461 1774716 1839493 1853980 1875921 1913047 1939263 1973467 1991133 2003886 2035584
6156 2035584 2070677 2060699 2064421 2113076 2147926 2123672 2184354 2263471 2279917 2226106 2254407 2262283
6144 2262283 2262019 2290771 2357483 2415458 2445396 2449352 2485287 2554519 2593058 2634806 2649132 2706885
6132 2706885 2718912 2739643 2779463 2827901 2848601 2896332 2923861 2989142 3085789 3178246 3299191
6121 3299191 3328983 3342914 3383147 3441475 3532772 3569130 3595079 3680502 3760880 3825251 3880598
6110 3880598 3920586 4007769 4064656 4130911 4133062 4184203 4275604 4326330 4389596 4435412 4582382
6099 4582382 4686979 4746000 4814813 4883247 4960513 5037239 5116589 5252903 5337847 5411700 5532031
6088 5532031 5598777 5758440 5942143 6123175 6344662 6483281 6694931 6876390 7087230 7345512
6078 7345512 7594199 7878619 8206328 8603276 9067417 9641293 10245229 10961599 11854686 12935393
6068 12935393 14258669 15879477 17764643 19715892 21675032 23506905 24815902 25358443
6060 25358443 25356601 25682059 26717256 27987816 28866306 29623695 30134376 30133997 29670922 29318496
6050 29318496 29102283 28403723 27232808 26132632 25774892 25826209 25456677 24611507 23341186
6041 23341186 21495438 19167261 16917817 15274380 14076186 13163885 12456104 12006707 11686299
6032 11686299 11408427 11269315 11228162 11208107 11285805 11365644 11538137 11753946 12038509 12351464
6022 12351464 12857150 13513665 14298514 15194187 16213045 17595650 19454472 21761052 24203491
6013 24203491 26644023 29037049 31158736 32340849 32460376 32407944 33216257 34714027 36036117
6004 36036117 36944532 37692571 37998672 37476501 36747996 36324369 35692848 34325663 32559150
5995 32559150 31428061 31183124 30981980 30043067 28524621 26414854 23488788 20137550 17316796
5986 17316796 15241025 13679294 12553917 11653185 10940377 10342684 9857817 9397985 9013172
5977 9013172 8669180 8342834 8019996 7738151 7462644 7239690 6980696 6837752 6729812 6600988
5967 6600988 6478819 6397917 6352820 6313945 6399080 6439185 6493901 6500725 6512187 6540130 6549954 6589879
5955 6589879 6683747 6746401 6878483 6996767 7080686 7288914 7477474 7624108 7609563 7694935
5945 7694935 7779369 7599535 7380621 7211197 7162024 7128635 7130986 7268229 7434609 7679251
5935 7679251 8087573 8554396 9215984 9907263 10546509 11138568 11520219 11705137 11689193 11652362
5925 11652362 11791725 11855314 11662253 11352619 10799614 10006883 9373930 8906030 8568607 8306636
5915 8306636 8115143 7973527 7769029 7502988 7159728 6758604 6420593 6184691 5920105 5763822
5905 5763822 5621210 5482352 5408256 5400025 5439129 5532394 5667488 5897345 6170621 6375727
5895 6375727 6492686 6467382 6433183 6524175 6517685 6421580 6297775 6119443 5933894 5771608 5702846
5884 5702846 5687441 5664873 5627001 5601719 5591265 5528220 5400453 5262648 5120834 4965195 4864891
5873 4864891 4747577 4659679 4662257 4634717 4605949 4624874 4657651 4689472 4662589 4798341 4881733
5862 4881733 4894630 4925708 4963493 5079806 5085019 5093418 5140647 5129729 5086892 5092583 5134231 5159830
5850 5159830 5089078 4995631 4951240 4992967 5058527 4990214 4844799 4769472 4556679 4334699 4214650
5839 4214650 4107825 4008749 3946441 3949025 4016893 4044914 4099705 4207481 4282304 4321055 4400293
5828 4400293 4523480 4602722 4725743 4869081 5065434 5271396 5490879 5752432 5944998 6023954
5818 6023954 5993648 5926119 5896198 5942291 5980968 5906400 5814535 5706921 5482924 5271055 5141527
5807 5141527 5109591 5021702 4940243 4946962 4941361 4999050 5038839 5058064 5073889 5089181 5120043 5093700
5795 5093700 5103548 5098910 5168437 5233292 5296895 5404803 5527423 5650791 5734522 5845751 5894686
5784 5894686 5927073 5960948 5992870 6004514 5944004 5890274 5898689 5871219 5862049 5886010 5950638 6022613
5772 6022613 6126356 6229683 6371928 6478541 6595042 6741910 6870322 6981004 7119816 7237541
5762 7237541 7418626 7621389 7854951 8126310 8458195 8816814 9288002 9828994 10471549 11301826
5752 11301826 12224239 13406297 14734363 16218007 17703661 19173336 20653678 22246751
5744 22246751 23862117 25116612 25586237 25250493 24576383 24233572 24520594 25519966 26594425
5735 26594425 26837595 26308462 25982864 25741804 24479300 22298797 20150210 18623307 17759580
5726 17759580 17439112 17563138 18070419 18964919 20088889 21289840 22530278 23927542 25434694
5717 25434694 26795322 27592436 27411867 26539612 25689026 25426350 25834422 26772952 27274900
5708 27274900 26831575 26191302 25858720 25087953 23157261 20688360 18627929 17251195 16474235
5699 16474235 16233966 16358921 16750540 17229404 17838596 18600442 19463059 20276849 20664597
5690 20664597 20439157 19753498 19136899 18871041 19079361 19689439 20042277 19783950 19267377
5681 19267377 19047648 18585566 17266129 15653920 14303656 13360970 12866497 12799285 13009955
5672 13009955 13381288 14057629 14853481 15630421 16462884 17452762 18539275 19360398 19509230
5663 19509230 18954125 18126998 17577460 17524039 17974158 18543505 18504130 17760427 17151075 16762783
5653 16762783 15571329 13578959 11489979 9814645 8532847 7627590 6947565 6354399 5871886
5644 5871886 5537670 5212070 4953248 4692692 4473937 4292466 4079529 3929042 3828265 3672581
5634 3672581 3596163 3546570 3478543 3430118 3347855 3207609 3134798 3032869 2941599 2914907 2871995
5623 2871995 2828114 2801190 2799562 2700562 2606960 2590249 2531944 2522073 2459032 2484108 2482238 2364744
5611 2364744 2335239 2263525 2216848 2220728 2170233 2139457 2110821 2166891 2150840 2153160 2201497 2140055
5599 2140055 2113860 2136593 2177992 2192989 2230538 2317500 2368438 2402928 2516037 2546960 2569609
5588 2569609 2582007 2607411 2630431 2578205 2581674 2570552 2472559 2460541 2408726 2367705 2370240 2409719
5576 2409719 2423257 2474289 2496505 2559617 2539646 2608577 2589700 2544150 2622740 2675300 2705802
5565 2705802 2786008 2795683 2704331 2667039 2648419 2610671 2630435 2666386 2630395 2566649 2601614 2598595
5553 2598595 2493981 2463723 2439672 2397444 2405026 2472196 2564260 2587783 2643524 2723083 2751484
5542 2751484 2782257 2841747 2861557 2901625 2906609 2869098 2823291 2734732 2689358 2606629 2519215 2424335
5530 2424335 2403699 2367613 2300094 2353372 2342367 2337991 2337485 2385895 2402870 2442433 2404800 2381608
5518 2381608 2417682 2421782 2449177 2448537 2503753 2486182 2444041 2401802 2367585 2353594 2305508 2260182
5506 2260182 2309202 2245466 2234891 2280251 2210184 2136571 2089668 1990649 2000731 1997110 2022312 2031865
5494 2031865 2056337 2072620 2042306 1978667 1962300 1986415 1955422 1913588 1928491 1939906 1890042
5483 1890042 1784445 1778833 1740463 1711589 1639195 1594415 1575848 1639829 1613783 1565226 1578678
5472 1578678 1564768 1573532 1605472 1550378 1546082 1591948 1584182 1604257 1559875 1579350 1595991 1630366
5460 1630366 1582321 1557084 1585343 1565944 1605418 1606455 1615700 1642233 1693423 1714699 1698342 1749974
5448 1749974 1743934 1730100 1759360 1783501 1780799 1841800 1845191 1833332 1889145 1869743 1822142 1889816
5436 1889816 1942301 1978591 1993869 2044936 2068946 2081321 2094925 2117034 2129550 2180841 2194902
5425 2194902 2263889 2346392 2424372 2577471 2754954 2818457 2919347 3042847 3131576 3221413 3258594
5414 3258594 3273777 3279113 3255018 3285463 3315221 3279109 3165277 3043366 2956305 2866194 2693574
5403 2693574 2534004 2413825 2339553 2367966 2274437 2228997 2223164 2183954 2205829 2157681 2167500
5392 2167500 2153890 2168009 2216058 2193877 2224525 2274762 2301623 2330837 2330474 2309155 2307676 2310043
5380 2310043 2282935 2280628 2309331 2269249 2243460 2247351 2247237 2213558 2262927 2244752 2258807 2287931
5368 2287931 2249992 2185942 2190390 2211321 2211880 2197837 2213385 2248672 2268850 2254968 2303183 2320320
5356 2320320 2378303 2426453 2430118 2427280 2427594 2446528 2525096 2573359 2607571 2618827 2600411 2525632
5344 2525632 2514061 2545585 2538101 2512460 2519187 2559303 2616672 2645348 2624174 2645520 2652308 2626514
5332 2626514 2607423 2588439 2518260 2503145 2452294 2460965 2442222 2475208 2495719 2445507 2472789 2515653
5320 2515653 2526392 2499165 2428916 2446050 2388242 2403933 2424431 2389917 2430502 2440130 2409906 2399210
5308 2399210 2358540 2369729 2365068 2345183 2297315 2272896 2233334 2174152 2188924 2186614 2139959 2085365
5296 2085365 2097420 2125293 2151991 2231541 2258840 2264157 2295374 2314871 2323679 2344869 2367415 2402129
5284 2402129 2398954 2384042 2378409 2388534 2400010 2358731 2352556 2372331 2355847 2354041 2407167 2413269
5272 2413269 2427449 2475561 2456516 2456684 2432808 2462569 2513963 2502081 2510901 2513945 2563111 2527532
5260 2527532 2540502 2585432 2603971 2581603 2601293 2651427 2678390 2644107 2614818 2650102 2734997
5249 2734997 2752063 2734638 2744280 2741349 2757599 2763065 2766344 2835254 2846519 2887251 2926056 2950392
5237 2950392 2965770 2998492 3022304 3028121 3039888 3078467 3146725 3205030 3201522 3273108 3354065 3328634
5225 3328634 3370550 3435287 3464207 3508875 3566209 3584101 3570409 3546648 3610610 3679863 3676645 3675295
5213 3675295 3703977 3771085 3818869 3846649 3893862 3924603 4004097 4016393 4066781 4106650 4171603
5202 4171603 4227362 4262827 4242772 4281744 4388761 4469851 4560417 4635035 4685562 4746865 4776838
5191 4776838 4871617 4951213 5016676 5123163 5213206 5288577 5354537 5414935 5506382 5618849 5703304
5180 5703304 5824165 5902480 6034326 6158414 6271034 6328581 6459345 6576508 6700822 6809013
5170 6809013 6899196 7036027 7206913 7339447 7476858 7628357 7850696 8064444 8291329 8591740
5160 8591740 8870869 9176984 9549428 10038132 10581296 11197788 11830779 12487291 13092137 13764998
5150 13764998 14301529 14659440 14952094 15393101 16194325 17199161 18156909 19162467 20195155
5141 20195155 21057450 21769721 22341598 22868346 23132947 23366668 23937854 24934963 26370241
5132 26370241 27509860 28107730 28778952 29383287 29574941 29931267 30477544 30917934 31301123
5123 31301123 31849653 32419931 32989589 33464354 33655841 33722376 33585596 33499022 33957958 34584135
5113 34584135 34773513 34659069 34613782 34250378 33337721 32731542 32605870 32555454 32072422 31568429
5103 31568429 31454472 31161491 30507043 29941404 29604514 29053025 28383459 27972802 27540683
5094 27540683 27113703 26541117 25597785 24654656 23816942 23111139 22933898 22943982 22512778 22116630
5084 22116630 21998120 21349074 20286068 19265061 18233722 17239109 16387880 15811348 15586270
5075 15586270 15472390 15126946 14736390 14414646 13841897 13065598 12379616 11819899 11373339
5066 11373339 11061027 10780900 10557205 10457199 10444214 10520120 10562962 10507191 10480495 10512967
5056 10512967 10557843 10611862 10662864 10646839 10589771 10608930 10657832 10692342 10573708 10419687 10377246
5045 10377246 10425227 10383066 10290811 10297552 10272038 10219940 10264565 10449246 10703168 10901989 11062078
5034 11062078 11237527 11663632 12089360 12306467 12375702 12390595 12461355 12454196 12477772 12522788 12543681
5023 12543681 12438613 12338879 12216254 11906840 11471855 11003157 10584947 10348869 10122284 9769806
5013 9769806 9523591 9227196 8812915 8386132 8053154 7844121 7799172 7774178 7798584 7748242
5003 7748242 7643016 7610479 7493035 7286485 7117912 6981527 6927028 6884988 6753306 6608826
4993 6608826 6472164 6391503 6326155 6237363 6155335 6095965 6015114 5948445 5794916 5625261 5476999
4982 5476999 5318763 5209341 5169391 5107331 5037077 5028505 5012378 4906991 4800530 4685201 4637950
4971 4637950 4607620 4543667 4489244 4469712 4488107 4435278 4366985 4351295 4388912 4430360 4438922 4425973
4959 4425973 4421938 4465953 4524026 4462369 4421147 4452004 4489439 4584889 4617396 4609825 4631199 4623467
4947 4623467 4600448 4617691 4691425 4750970 4830991 4841007 4866851 4892538 4864006 4900730 4977408
4936 4977408 5003954 5126108 5210901 5344620 5388706 5456495 5556356 5672878 5883963 6062849
4926 6062849 6304495 6578257 6866469 7116405 7380532 7598259 7811868 7893571 7888299 7857328
4916 7857328 7733125 7582136 7365257 6962558 6568750 6189308 5892202 5709840 5512892 5448801
4906 5448801 5365868 5288359 5249339 5256664 5265951 5193295 5192751 5240187 5276713 5329003 5331961 5333505 5425454
4893 5425454 5504118 5587794 5637631 5697262 5827474 6044056 6192147 6364310 6510840 6708349
4883 6708349 6950148 7243278 7594586 7836211 7805463 7741175 7803655 7902506 7821831 7676847
4873 7676847 7333382 7020949 6862346 6773886 6829273 6947432 7122981 7424146 7520824 7385173
4863 7385173 7221129 7245931 7322093 7158679 6917965 6493053 6018539 5713960 5510369 5270145
4853 5270145 5087592 4985633 4929094 4863194 4808006 4764787 4700181 4593746 4563983 4514114 4521947
4842 4521947 4446941 4450424 4472415 4532801 4534667 4489806 4540449 4613789 4651068 4730098 4847169 4865655
4830 4865655 4939404 5034842 5163388 5312618 5399781 5463434 5555820 5668430 5774440 5866641 5834714
4819 5834714 5758287 5734481 5725694 5740430 5841888 5941531 6083955 6299274 6524252 6783746 6965338
4808 6965338 7074574 7166073 7296064 7478872 7709986 7907129 7872775 7917203 8066944 8181151
4798 8181151 8328749 8399033 8493240 8664292 8797057 8883473 8956980 9068592 9239826 9544437
4788 9544437 9864321 9985978 9994975 10025370 10080745 10277874 10515032 10548875 10467338 10477777 10465703
4777 10465703 10313696 10065184 9931799 9952540 9937118 9835226 9789255 9813474 9855169 9821301
4767 9821301 9796195 9824773 9821965 9800739 9748892 9772499 9924344 10005711 9839549 9706575 9735104
4756 9735104 9632808 9552180 9471299 9409955 9389356 9386536 9461667 9536476 9663642 9788991 9950737
4745 9950737 10153087 10339171 10620104 10968993 11347146 11709162 12066083 12506468 13096481 13718505
4735 13718505 14455447 15420044 16484042 17861669 19467053 21059324 22688379 24307069
4727 24307069 25946470 27254540 27546100 27086768 26682643 26857625 27860916 29439375 30106436
4718 30106436 29975710 30499252 31243823 30856663 30013655 29988056 30811149 32274855 34415184
4709 34415184 36948968 39648153 42090164 43636707 44590327 45212835 45136593 44759202 44681733
4700 44681733 44396747 44342999 45423772 45451604 43101976 40808776 39254156 36698240 33694074
4691 33694074 31697965 30757915 30467429 30686243 31191098 31956155 32402142 31746358 30302239
4682 30302239 28924343 28216468 28532544 29341850 29046079 27651986 26844445 26213834 23823745
4673 23823745 20614785 18038390 16036493 14554172 13451028 12673367 12057029 11572584 11140784
4664 11140784 10851726 10585555 10311511 10114143 9925099 9745330 9645446 9525524 9415266 9323133
4654 9323133 9240724 9178977 9040392 8991249 8871583 8770706 8720922 8653706 8570693 8514125 8482319
4643 8482319 8427658 8404266 8463696 8510304 8597164 8739968 8776698 8793960 8945610 9116198 9216101
4632 9216101 9371538 9443525 9454154 9558076 9545782 9526701 9572871 9571549 9648640 9635507 9613147
4621 9613147 9599389 9567352 9591135 9607658 9722124 9825048 9970621 10155199 10331371 10512373
4611 10512373 10684943 10853680 10991098 11131379 11263986 11380737 11461342 11513207 11570893 11722214
4601 11722214 11832347 11908555 12012013 12221694 12361131 12507874 12786922 13060715 13387019 13657236
4591 13657236 13986175 14336064 14684285 14995716 15301766 15550356 15776569 16086913 16456562
4582 16456562 16869780 17474508 18179699 19005529 19989633 21110930 22492940 24231414 26230118
4573 26230118 28569781 30935964 33241126 35540104 37623060 38970583 39367696 39262900
4565 39262900 39589048 40970325 43092184 45054180 46438803 47686316 48837415 48965664
4557 48965664 48126511 46721131 45040729 43634542 43176903 44040784 45699347 47115043 47708662
4548 47708662 48165531 48289678 46916222 44075736 41124271 39098133 38360181 38789271 39409207
4539 39409207 39692399 39992563 40175381 39607430 38224737 36338618 34143551 31988373 30451562
4530 30451562 29695245 29427603 28919302 27834453 26777867 25586014 23674091 21314162 19210446
4521 19210446 17522713 16283041 15426937 14818850 14449713 14144998 13957484 13849620 13725152
4512 13725152 13465935 13170494 12977412 12787518 12577928 12313933 12003121 11587694 11144792
4503 11144792 10794300 10474531 10217731 10006984 9818856 9682157 9607868 9517521 9437715 9462387
4493 9462387 9485390 9570622 9646268 9749700 9831690 9995418 10308420 10651024 10974821 11299044
4483 11299044 11582851 11909071 12111744 12188254 12212953 12363270 12635582 13015642 13330308 13477503
4473 13477503 13544309 13605853 13349570 12899848 12541877 12423820 12540945 12791630 12884385 12953802
4463 12953802 13219679 13310075 13178949 13135599 13217207 13331981 13474011 13762060 14135265 14482491
4453 14482491 14719342 14914059 15051142 15008202 14724396 14270425 13795967 13464671 13300899 13213752
4443 13213752 13069171 12943662 12911337 12760874 12473668 12334539 12331706 12485854 12666713 12947829
4433 12947829 13368253 13928118 14661945 15494507 16293225 16769822 17012065 16966365 16787110 16675407
4423 16675407 16600768 16431054 16164788 15539301 14698056 13859846 13179036 12671251 12266025 11995736
4413 11995736 11782011 11723364 11669724 11618771 11599295 11501667 11343524 11231685 11093454 10993851
4403 10993851 10944585 10964895 10958850 10986418 10998175 11016601 11030937 11034913 11108457 11157906 11204875 11260368
4391 11260368 11368237 11486204 11637864 11792563 11983097 12169007 12397099 12634936 12934858
4382 12934858 13189514 13449322 13686527 13951988 14141687 14200549 14284513 14396163 14523972 14764155
4372 14764155 14930070 14897631 14834328 14833703 14621951 14386089 14173841 14114209 14037442 13937944 13936089
4361 13936089 13956347 13975765 14093187 14138683 14191672 14291617 14452576 14519228 14641949 14762895
4351 14762895 14825985 14891949 14947843 15017184 15125661 15234253 15369912 15529731 15709822 15856755
4341 15856755 15992504 16139594 16312593 16458311 16633131 16812684 16999580 17249783 17592493
4332 17592493 17876255 18115259 18392760 18730314 18949971 19135136 19450953 19789406 20147979
4323 20147979 20506524 20873697 21273986 21746545 22340484 22915955 23587465 24409771 25201391
4314 25201391 26093449 27068597 28108380 29261918 30457061 31736460 33016114 34253351
4306 34253351 35282936 36046463 36526855 36917201 37398949 37896220 38341239 38608671 38774281
4297 38774281 38788212 38552900 38091481 37709324 37462399 37419600 37577740 37918450 38478897 39177127
4287 39177127 39929526 40734007 41616334 42624599 43713115 44945988 46214766 47617518 49077667
4278 49077667 50642054 52437884 54420941 56511247 58611529 60852278 63419062 66117399
4270 66117399 69023153 72094859 75508443 79369647 83789436 88721150 94367667 100782300
4262 100782300 108204617 116737851 126589705 138106929 151759256 167885144 186402417
4255 186402417 206150120 225596277 243714656 259907796 272635413 280673040 283780990
4248 283780990 282354555 276066299 264593324 248851440 230035517 209060064 187151014
4241 187151014 165832666 146702145 129911881 115873631 104474095 95537567 88665621
4234 88665621 83261091 79008264 75617233 72707805 70153964 67826640 65645745 63424936
4226 63424936 61393789 59418136 57468932 55512237 53608263 51627038 49760581 47988155
4218 47988155 46460296 45070758 43867719 42879843 42059580 41349504 40783615 40277564 39874405
4209 39874405 39594425 39351066 39183966 39199216 39279607 39438275 39662678 39909992 40203299 40424174
4199 40424174 40667247 40931286 41221468 41505211 41890834 42447601 43132555 43893103 44848059
4190 44848059 45991234 47335480 48792723 50509829 52385236 54472714 56737528 59331382
4182 59331382 62235865 65799015 70156312 75707320 82446508 90754916 100581904 112583270
4174 112583270 127085839 145297355 167285282 193786280 223630295 255628816 282282308
4167 282282308 296961902 302852622 304759714 301947225 293418016 268646205 233489528 195046683
4159 195046683 159038160 132402346 112149143 97243099 85575881 76388801 68765567
4152 68765567 62723376 57463618 53171732 49211114 45852143 42717843 40094270 37634823
4144 37634823 35554219 33570866 32011895 30559069 29317552 28077893 26982721 25804886
4136 25804886 24845335 23848116 22950442 22023798 21219379 20452900 19863500 19252180 18738871
4127 18738871 18157347 17616360 16977101 16349747 15642571 14963371 14298975 13729469 13125027
4118 13125027 12606430 12076791 11613890 11184210 10821722 10479223 10081495 9784564 9529259
4109 9529259 9214854 9013557 8836554 8705761 8609427 8513803 8401201 8343376 8267289 8160905
4099 8160905 8047010 8008953 7881808 7742512 7613513 7418230 7320176 7163655 6972425 6869195
4089 6869195 6781319 6709128 6643799 6661207 6667016 6679579 6657681 6644971 6580930 6510363 6410452 6316473
4077 6316473 6214039 6125485 5958971 5819054 5758440 5652032 5536198 5473593 5394647 5333339
4067 5333339 5264993 5222183 5203391 5145938 5129977 5067660 5053492 4983875 4965297 4977613 4977444 4879420
4055 4879420 4857368 4812232 4794916 4819183 4818811 4904143 4892989 4835833 4858763 4945421 5073482 5191058
4043 5191058 5311536 5470943 5602366 5679340 5726040 5615616 5457976 5222081 4945101 4601449
4033 4601449 4328690 4127913 3961500 3771722 3580652 3477042 3448028 3403589 3390914 3363160
4023 3363160 3257371 3229385 3188689 3054534 2991697 2995561 2977828 2880215 2844579 2762618 2706582
4012 2706582 2696696 2646248 2634596 2667623 2680152 2671911 2696905 2655237 2614812 2669894 2708075 2742549
4000 2742549 2714786 2796046 2760920 2750368 2754307 2789308 2781984 2790998 2780238 2780692 2729959 2759685
3988 2759685 2754749 2730419 2669708 2665592 2675146 2642455 2629468 2604306 2578395 2538991 2524571 2542536
3976 2542536 2560007 2572160 2604672 2621651 2636247 2721629 2748082 2801748 2897081 2940826 3010757
3965 3010757 3120295 3173350 3220089 3230581 3225075 3210582 3202288 3153920 3084081 2957457 2812071
3954 2812071 2640482 2526506 2417061 2328254 2299885 2191323 2124084 2120704 2081640 1966358 1936194
3943 1936194 1967356 1908493 1882298 1879810 1844605 1832223 1819071 1814099 1811299 1807740 1778863 1759783
3931 1759783 1798387 1779304 1664293 1603727 1572875 1580917 1609607 1592911 1585869 1612315 1565356 1550482
3919 1550482 1599741 1625780 1649316 1654617 1530136 1588654 1527117 1473481 1512012 1512900 1470686 1470119
3907 1470119 1449232 1461596 1467444 1486597 1441126 1442670 1405141 1432899 1480478 1519658 1573334 1568628
3895 1568628 1531254 1570871 1577692 1617551 1600794 1618556 1661855 1660517 1707586 1733651 1827236 1909788
3883 1909788 1973030 2051976 2159649 2343581 2506624 2668305 2709396 2752400 2781797 2763299 2685545
3872 2685545 2566201 2431818 2184948 1975558 1811332 1668404 1552492 1508601 1482333 1437473
3862 1437473 1360583 1319079 1265048 1238484 1200967 1178278 1211278 1207383 1174324 1105591 1074731 1091932
3850 1091932 1084690 1028771 1078025 1056219 1052619 998041 986272 1012193 1035532 1075446 1089457 1073704
3838 1073704 1044475 1087866 1079682 1118328 1062819 1084459 1115145 1073300 1041161 1060920 1067726 1112068
3826 1112068 1079543 1040504 1074756 1030665 1010968 1070594 1099542 1124209 1151015 1160030 1077451 1018496
3814 1018496 1030575 1035440 1089898 1066086 1063885 1134861 1096318 1078085 1084502 1113183 1052078 1055088
3802 1055088 1079268 1093958 1103210 1118167 1136290 1102063 1051339 1000876 1047249 1059775 1074351 1083683
3790 1083683 1099471 1110968 1126800 1087582 1094893 1135422 1119861 1114779 1101155 1075021 1042478 1076314
3778 1076314 1074618 1094339 1089800 1105847 1112019 1142764 1128795 1133307 1120873 1161410 1135239 1085085
3766 1085085 1094299 1129892 1160001 1136463 1132500 1113013 1106063 1121975 1151833 1177525 1153056 1129463
3754 1129463 1128802 1144465 1229677 1219552 1175020 1232252 1226889 1203380 1182301 1200748 1178752 1193158
3742 1193158 1190403 1173893 1200387 1203482 1210242 1173671 1172520 1166797 1163166 1134342 1129658 1155421 1175076
3729 1175076 1178890 1195379 1235724 1265162 1274793 1211389 1219193 1290099 1276233 1250031 1278853 1315097
3717 1315097 1336948 1354763 1348787 1353875 1375814 1391470 1384103 1415074 1448149 1451167 1357099 1367921
3705 1367921 1351684 1346778 1381734 1394207 1372509 1361633 1359625 1379683 1416332 1390179 1428070 1432433
3693 1432433 1434708 1443435 1424434 1444645 1466770 1438628 1475228 1491136 1478802 1519280 1535269 1516782
3681 1516782 1503905 1544163 1530872 1543787 1542893 1517418 1508731 1532798 1588237 1580002 1575362 1589383
3669 1589383 1538985 1502597 1481535 1520829 1489164 1473677 1485001 1524859 1530727 1519500 1507524 1505005
3657 1505005 1477057 1454253 1535973 1537110 1473492 1511004 1575446 1563064 1548422 1553494 1591419 1635839
3645 1635839 1600873 1597473 1657277 1638961 1578481 1604015 1609374 1606784 1667380 1675765 1627306 1617345
3633 1617345 1604020 1568305 1626060 1643520 1649421 1627937 1651104 1607704 1585540 1613604 1620121 1617104
3621 1617104 1575527 1581676 1599020 1639122 1682628 1634707 1605698 1608144 1579259 1583575 1629364 1611043
3609 1611043 1586456 1572144 1580920 1621543 1606030 1595968 1604719 1589943 1592785 1607887 1613001 1618600
3597 1618600 1625541 1643560 1636673 1668230 1693018 1639923 1683081 1732191 1745517 1713379 1692548 1773186
3585 1773186 1764897 1755590 1713739 1706017 1700002 1717379 1743398 1736119 1743937 1747603 1768155 1728096 1700861
3572 1700861 1747352 1793352 1755149 1744647 1797085 1845715 1834305 1854696 1874287 1839778 1862149
3561 1862149 1879206 1929354 1902412 1904282 1951493 1938749 1945948 1966140 2039987 2045553 2011947 1992762
3549 1992762 1992654 2050314 2093300 2087694 2066597 2031785 2000884 1972274 2020821 2069894 2051313 2042472
3537 2042472 2015763 2049397 2010045 2034579 2078279 2079794 2025295 1974345 2017898 2029462 2045654 2067612
3525 2067612 2056283 2038828 2065747 2095285 2125844 2114553 2133362 2122978 2138580 2159267 2141737
3514 2141737 2197163 2276951 2250716 2266002 2252615 2255485 2287376 2321698 2335132 2332241 2291053 2295252
3502 2295252 2301175 2291219 2326891 2304831 2327722 2320571 2314265 2377809 2424756 2371954 2327950 2358669
3490 2358669 2357981 2370696 2393340 2414429 2416897 2415375 2440691 2489224 2516000 2510029 2513273 2547179 2596048
3477 2596048 2604577 2664055 2668064 2698818 2707016 2675128 2728204 2709029 2689308 2683091 2741011 2779005
3465 2779005 2832096 2906011 2847793 2801851 2830707 2851551 2841536 2899950 2962104 2944949 2985815
3454 2985815 2969971 3003442 3085433 3170228 3230886 3236003 3277005 3332155 3371487 3387683 3433314 3478154
3442 3478154 3544445 3591680 3678498 3778039 3887405 3932136 3998400 4097682 4174186 4298564 4402550
3431 4402550 4448964 4513643 4614275 4710944 4874174 5098365 5325625 5495872 5636924 5713315
3421 5713315 5646576 5716544 5889577 5941913 5928563 5888890 5805762 5728338 5660346 5636385 5706879
3410 5706879 5772463 5784790 5856809 5890716 5828602 5753546 5710766 5661257 5639649 5726084 5842629
3399 5842629 5957182 6125199 6364487 6706327 7164477 7577202 7955243 8395781 8695546 8627639
3389 8627639 8520330 8576941 8762697 8711130 8440442 8274655 7828727 7207250 6746444 6452755
3379 6452755 6209926 6112885 6086884 6050658 6068355 6041380 6009329 6052166 6046824 6102682 6154441
3368 6154441 6209885 6290817 6380511 6511952 6685790 6920079 7171824 7366200 7576673 7745180
3358 7745180 7816557 7833465 7825213 7936344 7939139 7888347 7910675 7765386 7651850 7640222 7622889
3347 7622889 7735633 7910740 8088229 8274937 8591558 8950538 9288953 9573437 9813753 10018272
3337 10018272 10230344 10247080 10048264 9758913 9469526 9317718 9225257 9142080 9082020 9132891
3327 9132891 9145487 9198707 9188408 9272189 9415609 9547877 9708865 9943362 10177053 10500303
3317 10500303 10845588 11120259 11468006 11894833 12348855 12811949 13393701 14022519 14784539
3308 14784539 15450530 15919013 16275779 16771812 17122039 17197290 16967429 16460315 15996422 15755961
3298 15755961 15532098 15266141 15027127 14699549 14481589 14371533 14366402 14443906 14601848 14768069
3288 14768069 15129789 15508125 15871464 16299591 16763330 17246782 17694543 18307715 18912454
3279 18912454 19701516 20603645 21713523 22932923 24156033 25365583 26662202 28044012
3271 28044012 29408734 30515818 31092062 31416048 31949162 32400906 32501557 32465326 32059532
3262 32059532 31447685 30708545 29716871 28459432 26949404 25344170 23691462 22067910 20642645
3253 20642645 19441741 18420909 17493788 16731177 16147638 15536994 15039013 14633031 14211157
3244 14211157 13902105 13702842 13476201 13332097 13213035 13074788 13065669 12821344 12413710 12093710
3234 12093710 11826733 11505406 11025047 10513825 9940054 9419987 8994184 8663533 8413033
3225 8413033 8199922 8051984 7921248 7699354 7531111 7396517 7204028 7050723 6934281 6730978
3215 6730978 6537447 6404627 6216922 6037008 5860967 5676069 5582424 5525011 5443785 5313934
3205 5313934 5204130 5161243 5071687 4986495 4915679 4876156 4849041 4830530 4784367 4707311 4712219
3194 4712219 4723079 4658743 4629214 4618378 4586157 4524421 4473422 4419619 4346079 4283318 4261928
3183 4261928 4197862 4125007 4006254 3962503 3916011 3826189 3827454 3780139 3681361 3650925 3639216
3172 3639216 3625915 3578230 3538065 3474252 3373524 3384494 3394440 3408505 3395752 3350687 3362476
3161 3362476 3341775 3303810 3302142 3241544 3184452 3211519 3177150 3138861 3094071 3048471 3059355 2994197
3149 2994197 2928736 2945078 2931813 2913414 2871519 2879254 2779581 2779222 2757858 2727913 2735239 2735585 2675092
3136 2675092 2647300 2625045 2636137 2622400 2598086 2573063 2585958 2594177 2573874 2572998 2574586 2549356
3124 2549356 2486355 2469039 2462408 2415220 2368572 2416586 2444805 2382081 2321307 2361436 2363507 2374111
3112 2374111 2326737 2306017 2315723 2303835 2277773 2284714 2291551 2298099 2297134 2286753 2282683 2240888 2240159
3099 2240159 2222053 2245137 2239285 2192577 2194099 2177553 2205209 2183884 2177828 2232268 2235952 2186124
3087 2186124 2161526 2199116 2207764 2169283 2190002 2158118 2143213 2148998 2139445 2105977 2136626 2122378
3075 2122378 2089348 2075870 2048223 2031690 2047703 2092774 2121540 2066948 2080199 2059430 2093115
3064 2093115 2091795 2033101 2029865 2031410 2018040 2013552 2045313 2075936 2085692 2052021 2061986 2091785 2090633
3051 2090633 2086297 2048821 2035542 2042469 2074781 2080912 2109239 2136266 2129502 2105647 2063278 2084794
3039 2084794 2080012 2085702 2061481 2017130 2079702 2092231 2121446 2132123 2162822 2175254 2231491 2262240
3027 2262240 2229049 2218795 2293566 2318476 2318958 2372678 2368645 2418354 2467301 2468421 2524990 2531345
3015 2531345 2538762 2562691 2540844 2513473 2493555 2579654 2628607 2623096 2643514 2695659 2687276 2668564
3003 2668564 2732428 2754274 2707040 2799445 2818888 2839077 2866532 2903200 2960268 2995000 3007474
2992 3007474 3047591 3086121 3151867 3154864 3232002 3298713 3371798 3430733 3474461 3522252 3506592 3467139
2980 3467139 3443544 3440067 3384862 3401305 3410815 3452529 3533549 3526719 3533262 3560551 3659644 3682763
2968 3682763 3750495 3791361 3852000 3959405 4043647 4143423 4217127 4281548 4343032 4430754 4592512
2957 4592512 4781137 4901094 5040043 5195057 5364893 5539780 5671610 5824100 6024219 6148993
2947 6148993 6235042 6299194 6385518 6374520 6403055 6408328 6414884 6493957 6564918 6569338 6600305 6682486
2935 6682486 6752312 6775992 6817972 7004821 7129741 7295714 7436860 7640074 7854505 8065233
2925 8065233 8310996 8631584 9015874 9349122 9757921 10128823 10460271 10652980 10660903 10561693
2915 10561693 10310524 9878007 9377827 8875321 8483765 8179470 7915234 7762585 7613656
2906 7613656 7545202 7508596 7454667 7462004 7472546 7474090 7479904 7512946 7486014 7548420 7646707 7675541
2894 7675541 7712593 7734952 7752873 7720564 7715181 7678075 7536208 7441403 7246194 7023662 6806965
2883 6806965 6596934 6411152 6158119 5950850 5706527 5569283 5484732 5371901 5269991 5181749
2873 5181749 5081872 5001586 4832386 4689706 4607204 4482550 4350687 4234979 4097526 3930057
2863 3930057 3787288 3614500 3512322 3442448 3278148 3171916 3077596 2978836 2925916 2880523
2853 2880523 2785758 2710869 2653923 2597089 2559768 2491817 2433608 2340285 2329336 2288170 2266520
2842 2266520 2210458 2135628 2078032 2034897 2003560 2013810 1943611 1831097 1839235 1793203 1684887
2831 1684887 1679489 1691972 1695610 1634541 1574243 1563862 1559160 1523760 1487465 1486568 1476300 1452694
2819 1452694 1418687 1388801 1375046 1312111 1305523 1272094 1214409 1179145 1146699 1140982 1161808 1160657
2807 1160657 1149590 1114514 1056718 1012840 1046110 1080993 1050165 1035996 1011704 986076 1003059
2796 1003059 970989 937379 910690 875968 811551 778191 784631 783341 802224 786882 730396 753592
2784 753592 736554 716923 713537 679208 686925 708611 679868 632518 654866 656655 656434 643179 664854
2771 664854 611785 599256 596780 546525 542325 589584 575050 556623 549862 540725 547005 533466 487449
2758 487449 513769 525996 498205 479488 427051 430488 472500 397182 352620 404733 450376 430891
2746 430891 380106 353836 372207 367112 356883 354156 378386 363191 349909 302593 315676 374314
2734 374314 372966 338366 298048 294392 321213 288593 319140 295624 256562 298364 343386 334465
2722 334465 312372 286192 293100 293319 305824 272471 260891 284505 294346 268736 210958 265815
2710 265815 244289 220557 221620 222556 240591 244259 244246 258759 245222 185497 173574 221650 216092
2697 216092 249853 203042 168163 176129 210930 189316 197886 218797 176996 234224 248399 212840
2685 212840 208578 200205 197220 190748 176386 166048 193190 194950 200118 194811 250444 284531 267270
2672 267270 215031 190952 192581 189990 225153 248378 214527 156746 171998 200735 197967 196920
2660 196920 146203 160495 123363 132121 182008 166806 163552 141307 101656 106387 108807 155855
2648 155855 149285 125609 141131 137860 121612 92273 160303 123311 75167 126493 148457 152718
2636 152718 171761 160023 144871 171508 182236 148444 203166 196285 173976 115336 147589 167257
2624 167257 95645 111786 150210 103518 108844 114437 111859 102747 122395 140400 144044 131423 93771
2611 93771 108706 95068 74805 23505 51235 69390 94607 112330 100238 172534 173284 140739
2599 140739 138420 168926 149013 110325 78957 46727 48528 69634 96764 95306 84198 76201
2587 76201 94746 121747 90908 70011 88792 98329 67916 90745 123821 109639 115990 71362
2575 71362 50136 66603 70216 49947 51244 27290 6137 39311 63524 51063 57172 59469 31521
2562 31521 44254 107751 94954 95420 92929 40649 34824 58313 98278 131408 70567 80929 83814
2549 83814 84217 69291 54077 32864 43812 66164 61246 37617 25930 1420 12948 6197 28389
2536 28389 -63977 -62040 -37179 -10385 -2513 35320 98797 68338 107543 20163 9311 40750
2524 40750 66138 31224 26428 25484 26734 83985 69719 44271 42190 7244 -20444 -27501 12389
2511 12389 13932 32300 6763 2119 22772 48691 33852 62061 46648 18730 4868 53670
2499 53670 35378 -18611 -7058 -1832 40532 41059 1697 -29322 -1623 41814 23219 -12045
2487 -12045 -35133 -38011 -17466 -41064 -36162 3424 25586 19466 66895 57861 25517 -63791 -57005
2474 -57005 -27752 -55010 -35675 -22856 -52220 -28045 2297 -38651 -49937 -55835 -29521 -2161
2462 -2161 23751 21708 14921 12273 22639 47775 26719 -7436 -55536 -77276 -9152 2177 -11318
2449 -11318 -78576 -42204 23755 -17683 -41946 -20748 14849 -5791 -38812 -23856 -30189 -11200
2437 -11200 -20680 13384 19613 27200 22874 -6120 -6898 42801 30561 54889 15153 -2021 34948
2424 34948 9625 31664 21364 16284 -25892 -46415 -59634 4325 33103 -2699 -3626 -32563
2412 -32563 -24168 -3163 2232 -3176 1681 3672 40072 61052 46217 30457 -6308 8346 17558
2399 17558 15066 -11433 -20077 2973 8310 21241 16669 32593 67986 40507 59210 47150 24475
2386 24475 25741 68606 65773 57596 34892 24929 24967 37396 2567 28097 29889 -1976 9238
2373 9238 -5344 -10141 3978 -331 15579 31715 49723 35135 8180 13119 15911 10279 -5012
2360 -5012 -12054 -28512 -25573 -29503 6620 -32720 -18225 17086 10321 38894 39737 47838 6689
2347 6689 33900 654 -16609 39180 17963 -51441 12812 15841 12393 55815 52278 33130 56831
2334 56831 32264 42514 70654 89848 68344 29013 44467 35026 74384 -3653 18698 -2721
2322 -2721 -13460 5983 24871 24068 30049 24776 33629 17821 46821 91229 32782 41719 40929 42840
2308 42840 19980 3227 57514 78998 113288 133026 116286 118227 51592 44301 20652 57984
2296 57984 91445 40451 71371 56586 60201 72963 34888 50015 108457 149000 170122 97108
2284 97108 142351 152339 97840 101063 96711 96763 63142 112648 77291 83579 104148 113801 94963
2271 94963 90533 120692 102296 102370 130145 111393 98208 140065 109932 116100 114803 126406 196674
2258 196674 201255 153697 164026 157283 159056 152685 158902 223323 239217 207083 167753 153768 167749
2245 167749 170245 204426 183398 125112 123345 116882 180664 260296 250098 227313 245146 249801
2233 249801 210352 177439 207570 231537 200957 226112 209969 225765 221347 237907 239185 277313
2221 277313 295999 280123 256466 261646 281682 310592 339590 272219 310251 276777 316381 270806
2209 270806 239837 283073 325375 318467 345033 366535 369383 350931 299728 326574 333834 417494
2197 417494 451947 417037 395067 395828 378939 455454 445565 454304 523816 573415 577414 594454 645657
2184 645657 653430 619016 593197 616132 655937 580760 663901 735648 763703 756389 737347 751005
2172 751005 751024 754253 819677 815053 820648 840576 838415 853874 849070 856523 953686 933318 939585 975858
2158 975858 1027311 1027502 1059466 1165444 1180706 1219613 1276287 1304767 1347815 1410771 1422936 1472011
2146 1472011 1541058 1604019 1683384 1796790 1974824 2052006 2153322 2289575 2423954 2650712
2136 2650712 2875462 3101633 3337059 3636503 3922404 4272123 4657528 5174941 5972603 7013035
2126 7013035 8203283 9428058 10777591 12939552 15918643 18545815 19091183 19376929 17953058
2117 17953058 15071477 11733184 8868551 7051571 5763539 4884430 4198867 3754818 3369999
2108 3369999 3129876 2893082 2748147 2584901 2419218 2214919 2040814 1807887 1710575 1590859
2098 1590859 1462631 1370020 1314221 1260910 1239201 1148705 1128174 1028666 1005705 909219 873502
2087 873502 811464 796076 793414 803829 778815 745143 719017 689319 693098 658036 618954 543572
2075 543572 473526 500408 486929 492816 445784 421180 405383 416318 336809 289424 269717 270080
2063 270080 265208 286496 306817 248091 275467 253476 255655 281099 319764 273886 248106 281456
2051 281456 276502 214564 220001 219729 187603 199408 201485 176886 101936 110748 158766 198930 138523
2038 138523 182049 208542 188378 177136 218328 185079 139663 155450 181166 144556 170835 155053
2026 155053 141002 131463 101113 119296 197324 122718 125517 149105 96314 111671 126716 111600
2014 111600 130259 116303 115781 165391 131750 89850 84371 124112 138354 123818 110591 107669
2002 107669 110006 154248 135766 104962 62697 53176 103401 98756 99815 71406 26787 25066 12507
1989 12507 15423 -5736 12314 54798 20907 -4662 -11916 -4125 18140 16393 -23328 -64678 9446
1976 9446 29419 61361 32426 12224 -16037 5314 43791 33767 -19120 -16859 -15930 -16654 -9422
1963 -9422 -36010 -42477 -52542 -49276 -4980 -20550 -14517 -39939 17573 14703 10104 -4455 -33459
1950 -33459 -22457 -49467 -54337 -23343 63233 38548 5344 -6094 -28823 -33495 18271 20924
1938 20924 -5321 36252 21399 8726 7159 30322 23373 21358 -22864 -42210 -63956 972
1926 972 54833 45343 17101 -28600 -3299 -23304 -56035 -9566 19511 27176 21475 713 35238
1913 35238 31526 36684 90484 46633 17818 18030 -15422 -9925 24720 39672 17333 -3372 16436
1900 16436 -3909 -33951 -50024 -57659 -9076 -41730 -69916 -25528 151 -2902 -39833 -27102
1888 -27102 -3326 -11091 -38079 -54340 -29647 5072 -12802 -33048 -44115 -39913 16112 -21287
1876 -21287 -476 -20024 -29768 -22794 9067 49768 -20939 2398 19780 1535 25226 -23054
1864 -23054 34418 25713 27866 31536 -13181 25045 31913 31926 61869 62571 23049 28047 49779 105047
1850 105047 32247 33660 78570 30022 18929 31446 20545 8516 13983 20646 5439 -55862
1838 -55862 -73445 -34038 -31665 -53657 -34027 -25897 -17746 -65360 -28147 -30815 -4681 -33640 -19224
1825 -19224 -57742 -31063 -6787 -26838 -29499 -47114 -2254 -47467 -25176 -19043 -46526 -37672
1813 -37672 -47539 -71059 -61110 -48809 -10346 9317 -15704 25324 27046 -3122 -69987 -62290 -34308
1800 -34308 -46701 -46031 -14450 -34013 -12064 -49587 -52982 -26848 -25870 -42589 -40046 1669 14779
1787 14779 -24151 -43315 -57761 -55436 -55305 -60016 -35791 -25387 6554 4517 -3390 -36571 -43819
1774 -43819 -45947 8572 -25617 -16727 6848 -14881 -40469 -31371 -30996 -50737 -56901 -64608 -59987
1761 -59987 -51391 -54161 -23738 -19685 -25517 31364 19069 -13436 16845 -46917 -46136 -54900 -69081
1748 -69081 -58547 -85952 -37988 -30743 1873 13939 -27428 3383 -38647 -20916 -32910 -21092
1736 -21092 -3854 -19088 -37914 -23440 -6974 -18626 -41420 -49475 -9415 -50299 -16213 15116
1724 15116 -37197 14857 42684 -29273 -35717 -19190 -41354 -45870 -52736 -39686 -35912 -39748 -9461
1711 -9461 9224 -30845 -56101 -48669 -764 4825 -734 -7015 -45584 -84902 -89738 -78265 -69833
1698 -69833 -65981 -47541 -59728 -51551 -71373 -73091 -54961 -7574 -32563 -22466 -6458 -25959
1686 -25959 -11198 -53366 -8542 22879 25631 26042 -50858 -28328 -38478 -18124 -6367 -52728
1674 -52728 2545 2680 -19537 -18453 -36778 -43719 -55228 -31033 -7237 -40745 -32344 -91525 -79913
1661 -79913 -70678 -54653 -70019 -66893 -26648 7690 -10196 -33656 -41082 -50918 -101208 -75374 -25005
1648 -25005 -2709 -30664 -50146 -43826 -5212 -27228 -50129 -9136 27112 -8396 -34683 -31078
1636 -31078 -91367 -58187 -53396 -33407 -11518 24380 28630 -44727 -18994 13643 3301 -48485
1624 -48485 -44080 -13242 -19190 -6568 -9874 1090 -27621 -14280 -14656 -55773 -28913 -24836 22218
1611 22218 62767 60779 -17959 -29586 18813 21258 -29863 -24256 -31484 -56505 -26321 -29087 -47112
1598 -47112 -40455 -51805 -48801 -14316 7032 -1847 21116 -33382 -22057 -39672 -54711 -43180
1586 -43180 -39892 -17962 -2035 5922 -20087 -8257 3871 -23889 -43812 -65706 -58939 -2541
1574 -2541 3895 40238 25807 -39193 -36524 -27360 -44687 -18375 -44233 -8303 -14428 -41798 -31908
1561 -31908 -47263 -15496 -33166 -62334 -64567 -65547 -915 -34739 -19512 19909 -4888 13239
1549 13239 -9664 -76906 -38146 -35512 9191 -4114 1215 12213 25660 67813 76272 -3400
1537 -3400 -33775 5725 16661 -52964 -46056 -7567 -14139 -120703 -86558 -109629 -83329 -18550
1525 -18550 -44287 -34891 -41784 17673 37985 22656 -24366 -46964 -69844 -33471 -17951 6496
1513 6496 5316 6041 18007 -13237 -38125 -5174 -48509 -48301 -10458 25756 -8379 -38249 -26700
1500 -26700 -44522 -61785 -84020 -77941 -39859 -72502 -56098 -13122 14246 -25459 -37293 -45627
1488 -45627 -32376 -34075 -18988 -23179 -49545 -80588 -61446 -13337 -87013 -56162 -24988 -30020
1476 -30020 4852 -47185 -57224 -48505 -25019 -43253 -31431 -46351 -101646 -26010 39984 48137
1464 48137 -1259 -4446 13072 -14645 -11865 -29665 -43694 -4585 -768 -32864 -57596 -37875
1452 -37875 -27593 -54684 -71082 -75609 -36522 -31537 -51089 -9814 6671 27161 -9653 34445
1440 34445 92507 9625 -30570 -37756 -16375 -4825 -34774 -5630 -20068 7431 12980 -16847
1428 -16847 18946 36615 38767 -35078 -59950 -1596 -9223 25612 -8409 5778 -16200 -12259
1416 -12259 -550 -16911 -44133 -60303 -36343 -9445 -28608 1981 4719 -25886 -36664 -22403
1404 -22403 1646 46075 50889 -15210 -4842 -2692 -40904 -44429 4529 -31732 505 -20945
1392 -20945 -33786 -39442 -39755 -64522 -59280 -50048 7091 25780 13172 -15727 5697 -14397 -19443
1379 -19443 -23582 -19259 -38579 -32617 34277 44067 32455 -16639 -19689 -38970 -33891 -26027 7963
1366 7963 11017 -40111 -33391 -58370 -71138 -42715 -48563 792 -21694 -49815 -31916 -12948 1788
1353 1788 -14233 -46024 -22649 23831 -52137 -74579 -122145 -107833 -2394 -37605 -44842 -59844
1341 -59844 -27655 41527 36204 -27722 -66049 -84624 -43615 -64394 -65026 -82089 -77700 -20124 -83574
1328 -83574 -64400 -51068 -30165 -5026 -26787 -66864 -87596 -53929 -24585 -30861 -31105 -45631
1316 -45631 -23304 -36100 -64633 -42926 -41715 -3240 14270 -15331 -28740 -41174 -75127 -45264
1304 -45264 -37588 3442 -8197 -58843 -62454 -47015 -16223 -25299 -42276 -62243 -58711 -69787 -95217
1291 -95217 -20509 7252 3800 -21777 -15175 4031 -22872 9440 -13845 -34449 -52712 -54377
1279 -54377 -11928 -6357 14051 -8221 -8798 -7101 -5579 -23795 5409 -19021 -27032 -16898 -22734
1266 -22734 24673 3565 -26953 -34403 -22309 -38768 -36912 -25302 40358 -13802 -13533 7292 -10069
1253 -10069 -23586 -16728 9683 -23397 -32930 -11336 -25312 -44719 -52351 -25488 -21442 -17815 -39665
1240 -39665 -47364 -35775 -28181 -35165 -31888 -803 -19593 31811 20076 23263 41427 10134 12651
1227 12651 50690 57503 52476 13665 -39179 -44794 -4914 682 -15469 -23386 -10449 -17922 -37115
1214 -37115 -68433 -55149 -32757 -35226 -12992 30154 10186 24700 43184 -2084 7316 13840
1202 13840 18382 19533 31280 2214 66393 32989 -3865 -24519 -41881 10807 -21725 -43204
1190 -43204 -66958 -19758 -10883 -31558 -13292 -31348 22470 12040 -13752 -83994 -32558 -11244
1178 -11244 -15875 -43075 -47599 -17768 19804 32084 -1482 -13116 15299 50769 -2378 -6596
1166 -6596 -1518 -42537 -10624 -30483 -38472 -18503 -31862 -1603 29985 636 -39272 -29182
1154 -29182 -24799 23448 -1398 18390 7076 14771 19330 -35051 -30001 -16615 -25206 -15773 -25596
1141 -25596 -4176 -20337 31056 -1900 -35716 -35345 -7362 -5740 -2983 38491 38499 -26037 -48318
1128 -48318 -46297 1027 1280 -32199 -42929 -23990 -11018 -16237 -8687 -13106 -23334 -32806 -16712
1115 -16712 3417 11614 13432 -14262 262 17851 21508 -10477 -41170 -29475 -39034 -41480 9545
1102 9545 -2964 -87927 -87696 -75807 -14634 15865 21387 9963 17257 -1614 -28624 -25485 -55947
1089 -55947 -35917 25919 30812 32676 5768 -18681 -50729 -34603 -23111 -47897 18200 36036
1077 36036 -12222 -29423 797 22252 -34571 -87496 -51151 24431 3335 -31900 -25260 -28534
1065 -28534 -40138 9154 -46609 -6408 -30763 -39290 47189 -60017 -60223 23166 -19739 -32128
1053 -32128 -18076 -21296 -42013 -2123 -23943 -17311 -62934 -76200 -62907 -40445 -24664 -45088
1041 -45088 -31525 -66307 -41657 -46893 -13731 -4740 -8629 -15913 -14780 12053 -7971 23642 7088
1028 7088 -11108 2139 15120 33996 48628 82272 87451 1806 65819 59086 53106 78742 43730
1015 43730 3990 -14418 -7867 -3371 -12343 -27578 16717 56404 8344 12354 -18663 -86798 -13552
1002 -13552 -46757 -44221 -64126 -46656 -13147 -7306 -16193 17186 -10886 -11000 26485 -2961 -37647
989 -37647 3686 63825 83186 -8537 -54794 -27879 1517 25313 15938 -3659 -31107 -68197
977 -68197 -24261 -20130 -31449 -50752 29185 39527 -808 -4266 -13130 -14407 19445 -3768 -4844
964 -4844 32299 26903 12865 -16164 -81568 -73754 -20620 23295 20518 5753 -22459 -52162 -32352
951 -32352 16885 30240 -496 14187 1504 -8693 -22347 -14808 17429 26661 8425 14294 -2274
938 -2274 31921 23763 21172 22941 15875 22031 2685 18740 45888 -1788 53 19985 -62309
925 -62309 -91345 -39489 -56776 37702 86926 41352 21335 1708 -27152 -13937 -26237 -48760
913 -48760 17313 44832 3744 9386 -3374 -26571 14278 63957 46160 33236 74230 56359
901 56359 11489 43677 42736 31627 26067 22850 15137 1877 -1430 57885 29372 13104 -13880
888 -13880 -37834 -21354 -37665 -31576 6880 14963 -26812 1603 12759 8511 -12704 -11553 11378
875 11378 -5960 -76 -11086 -12966 17144 3984 66828 55014 76800 88516 63194 -8833
863 -8833 2505 26794 55750 35288 35844 6843 -21174 -1589 9211 37970 254 32495 25847
850 25847 -24614 -4147 21690 9 52510 61420 39400 24527 32583 -22476 -1760 50616
838 50616 50584 27930 13378 -18108 -36577 -15884 18563 11191 -11204 -1499 -46054 -34666 -9400
825 -9400 -16918 -6032 15861 -565 9873 30542 52219 49284 38096 51676 66318 58979 37819
812 37819 26398 -58564 -59467 -35519 11661 15056 -6350 -9825 42643 -12605 -19216 -11374 -62276
799 -62276 -60671 -47930 39522 -26463 -17373 33445 2920 37480 68797 -5136 -18372 26897
787 26897 -35436 -16697 6579 3285 6510 4775 -15238 41825 41595 -18014 17224 38445 14575
774 14575 25460 59157 10342 -2743 10645 -4749 42755 9010 -10834 63492 61652 72995
762 72995 715 24416 23422 27913 47756 31879 46688 63214 68223 14459 16507 22781 -12469
749 -12469 10772 -11757 -11720 -25026 -18033 -5335 -21166 -17775 8654 24958 3793 29212 14037
736 14037 14685 -1758 -31905 -16216 -7773 38793 26534 29358 24314 23373 19842 -3251 -15154 23130
722 23130 -15764 -28174 -14310 26333 55114 19023 28836 2826 19277 17981 22649 38558 -22152
709 -22152 -3663 30298 43969 22364 23211 20274 -660 6254 36997 37217 46037 4053 -669 -12162
695 -12162 -30562 10085 20769 42203 27112 -32349 7403 -12232 27609 65313 23478 65925
683 65925 7608 29776 57449 31209 17344 1206 -21409 54337 31418 30941 20155 53165
671 53165 30801 -8316 -45686 -35604 23079 29756 73877 72141 28279 67592 23137 -24921
659 -24921 3592 14646 39550 45531 33734 -10844 1368 -7758 338 26858 -4521 27103 -36163
646 -36163 -19727 14053 -8082 -12865 5156 -33841 -19685 68255 43300 21466 28092 22207 83199
633 83199 52736 -17743 18847 25091 17863 26302 60 27455 56048 24127 14361 20572 26468
620 26468 17110 3547 6856 5352 16591 -9660 -1414 33137 56983 67658 29177 -24238 2930
607 2930 53798 16201 31490 9109 35388 49286 27964 4336 -2836 -14698 31561 68089
595 68089 66486 26249 15721 14570 25951 -37195 -18795 12498 25791 51991 43755 10267 -1465
582 -1465 41636 38955 50850 3319 44438 16780 -2067 -13848 6949 36407 27418 60658 30999
569 30999 14999 60207 44487 62809 146353 155259 73925 50196 9125 8565 -4301 39367 24191
556 24191 2771 47356 -17907 -7991 3067 24170 10895 34896 8702 20650 64115 33683
544 33683 35375 3215 15109 21826 13479 43168 58947 42058 -13714 -29474 -25297 -8675 -4148
531 -4148 55819 -11582 -18929 -980 9479 21530 29024 26239 36559 -5950 18384 45608 24238
518 24238 8170 -2813 -10450 -6931 16943 46748 42406 56477 32661 13665 67175 68955 37103
505 37103 51053 50936 63394 35544 19311 30843 37717 1142 -40761 7723 82601 112124 25824
492 25824 47913 44438 9223 13391 29564 13163 956 44045 41146 -12010 31079 76683 93231
479 93231 73744 42849 -11283 12440 12953 51787 32091 12231 30604 13622 42663 82174
467 82174 63249 32003 11109 36019 17459 18652 23940 42218 38879 11204 -8514 36709 71479
454 71479 50091 80362 16943 -3082 17982 30396 12415 73268 89218 51153 11147 -33713
442 -33713 12030 31342 36883 50825 44877 127831 112663 26318 39292 72507 53484 16202
430 16202 34564 44700 10417 -12832 -27935 21367 70494 -52007 -15309 60782 113546 103549
418 103549 85036 64932 35827 80700 109402 71622 57350 31997 -7954 -15970 -17839 -26819
406 -26819 23274 37346 8331 -44599 -55653 42889 29762 441 19221 9235 -35077 8895
394 8895 13692 -7948 6916 33576 10437 -41 -15250 12530 26955 36070 42107 5675 -4894
381 -4894 -34912 -39103 15558 20335 3317 13818 5970 10018 8816 -10989 -8995 51502 52779 42444
367 42444 8764 18951 -19868 16740 89541 35366 53319 43305 21335 41353 35987 24236
355 24236 -244 30424 48135 31331 24541 16604 8189 -17156 5637 10925 32509 38457 -5208
342 -5208 -2396 63598 -16145 1469 -17862 945 12160 21231 54426 15344 -3068 -15846 -26947
329 -26947 -35550 12548 44427 20268 -23614 -34541 -48578 -23041 -48015 -33249 -11977 -18586
317 -18586 -9739 8804 23098 74385 25854 -38843 29189 17252 50956 34007 -10914 -26277
305 -26277 -8641 16033 55638 85471 97787 29270 961 7545 34574 -30179 -40938 -10243
293 -10243 -64695 -23520 -2392 -2011 -15005 -4219 -26992 -2259 -9004 12207 -2123 1227 48543
280 48543 47616 18915 11879 5522 74727 27086 4670 48652 -6806 -43558 -29507 -6215 1711
267 1711 1664 10259 22318 20230 46874 67245 54026 26769 16326 9221 10910 -81397 -22643 14699
253 14699 41763 77558 24725 22585 9892 25057 10493 34866 33648 1293 33520 26790 19217
240 19217 51613 24134 -33715 -56731 9494 41647 19406 -3943 -1636 41410 44490 4711
228 4711 2185 86 -31796 -6156 -6723 -14364 -6135 -25286 -33193 -8004 8253 -3633 -43339 -20376
214 -20376 51557 33118 -16350 20995 27185 3496 31438 40465 29290 36424 51146 48873 36778
201 36778 10906 36925 2014 10127 -1237 -13187 -19484 15382 43658 70224 56007 13718
189 13718 -9946 -27433 -9482 -27728 -5174 -13348 -16319 -1076 67351 79140 31735 1709
177 1709 -9098 -4957 2708 26912 32395 9210 5615 21513 60564 67940 43794 15464 46573
164 46573 46302 13221 35424 39406 38952 16326 -9372 29116 37218 1475 21430 -12101 34881
151 34881 6705 -58 -1362 15661 30594 46697 65124 78797 91454 73389 22603 5119
139 5119 21793 11101 3482 -6882 40482 10841 -6418 -36273 -7452 -23687 -51888 -3376
127 -3376 4565 -2645 20413 34205 10111 31615 29145 -2147 4581 3271 35329 1517 737 12037
113 12037 21122 43595 12197 13043 60109 24340 -4373 -39147 -15264 -10051 -13215 12388 34561
100 34561 24616 39871 36975 63697 65442 60192 35707 34920 33928 38960 41441 30521 23457 1061
86 1061 -16483 -33392 -6748 9762 -12436 -16902 5627 36070 35142 2435 -12562 -41240 -24707
73 -24707 -23128 17015 2761 -14844 -18170 25103 38088 13642 17286 29069 12779 46580 28854
60 28854 31418 23124 55319 38295 19556 23215 19812 15311 -5120 -5873 25180 58826 57376 23895
46 23895 -4527 -1619 -5001 23942 32980 32991 13552 11993 9720 36071 28118 32083 51656 36426
32 36426 39356 61760 42266 29509 9549 15738 14398 1286 2605 18065 -32852 -11672 21929
19 21929 5676 9395 22615 2931 -13522 6467 533 51209 45408 47581 41154 27739 22635
6 22635 -2985 15574 18621 46550 17830 29200
0 29200
$$ Imaginary data points
##PAGE= N=2
##DATA TABLE= (X++(I..I)), XYDATA
16383 -927023 -902506 -849711 -831351 -851280 -785707 -804509 -850039 -815202 -776173 -753358 -723741
16372 -723741 -684513 -703333 -679987 -654587 -636109 -631828 -615825 -575727 -529642 -487659 -433034 -456926
16360 -456926 -438382 -439234 -458270 -429026 -438660 -390647 -376679 -360656 -303529 -287525 -307461 -294985
16348 -294985 -267664 -247112 -238937 -191879 -132504 -130526 -135784 -156227 -116626 -110037 -128886 -76462
16336 -76462 -50393 -43148 -39204 -29616 -8546 -12790 8042 44029 60351 71983 92882 131006
16324 131006 133416 131291 133044 164526 202023 190532 209066 247591 249093 295610 325393 315266
16312 315266 304664 301071 339122 385289 383005 377389 409825 391391 398244 422678 454110 515043
16300 515043 534057 493900 498274 516084 536880 547446 583180 579797 625319 585170 605125 638787
16288 638787 676387 686096 663335 669498 679969 683554 727198 751362 785300 809479 828636 840199
16276 840199 821450 859136 850303 864862 847527 855625 862567 850649 830641 910649 908416 906067
16264 906067 909428 943240 942672 953028 1007683 1000193 966776 1011194 1031163 1050909 1045680 1041539 1069972
16251 1069972 1085798 1112858 1104810 1088868 1129076 1159285 1156537 1205159 1212307 1221771 1151272 1157655
16239 1157655 1198427 1193247 1189319 1233821 1236912 1243660 1245478 1278916 1275601 1251904 1260306 1265057 1261171
16226 1261171 1280996 1348532 1383832 1376131 1312730 1355991 1368401 1366586 1383699 1369724 1346631 1389095
16214 1389095 1436677 1454428 1496568 1459276 1434956 1430941 1418230 1466071 1490974 1494290 1488735 1480421
16202 1480421 1501342 1506170 1487201 1504631 1500054 1515445 1539209 1571405 1563784 1597882 1587223 1582357
16190 1582357 1599804 1595576 1622190 1619744 1617510 1651307 1622784 1572358 1599161 1640436 1648029 1635773
16178 1635773 1650054 1629196 1619004 1650621 1640737 1647579 1668215 1681237 1698448 1704650 1684182 1705564
16166 1705564 1719468 1709016 1721291 1711415 1666648 1658717 1702245 1676742 1709560 1742157 1781799 1769343
16154 1769343 1787562 1815307 1803177 1766177 1765490 1766017 1778191 1791527 1754832 1787652 1789518 1791742
16142 1791742 1750799 1795231 1792639 1791175 1835428 1820109 1758696 1760203 1782856 1774317 1782028 1834779
16130 1834779 1840950 1802851 1838092 1837509 1826829 1858322 1858312 1893499 1898605 1871813 1875123 1823557 1850816
16117 1850816 1869223 1917244 1871922 1858274 1881302 1892852 1889226 1924277 1914730 1901852 1904330 1890622
16105 1890622 1877075 1863032 1855921 1888683 1899930 1852390 1882297 1877557 1922502 1944992 1929867 1916529
16093 1916529 1884796 1900406 1917884 1921362 1912524 1941065 1893501 1885404 1868394 1854856 1836093 1904648
16081 1904648 1907241 1847767 1899766 1917114 1889992 1882455 1896256 1889827 1927758 1920039 1880399 1846352
16069 1846352 1893206 1878045 1849442 1897806 1903135 1909010 1954833 1932082 1921612 1940691 1965448 1942708
16057 1942708 1914506 1877585 1891353 1888615 1890074 1894545 1872211 1880787 1949063 1971748 1978827 1977255
16045 1977255 1910850 1884414 1847722 1880739 1924979 1889705 1868742 1893603 1911597 1923914 1942741
16034 1942741 1957763 1944894 1960423 1922501 1872629 1909566 1936569 1920165 1909599 1897512 1945805
16023 1945805 1930826 1927093 1924599 1941436 1936662 1868390 1909739 1904397 1933518 1926884 1943760 1921944
16011 1921944 1881093 1896797 1926912 1912315 1956394 1979203 1957219 1955066 1932551 1925959 1939160 1955082
15999 1955082 1950069 1949926 1953457 1935264 1961976 1943903 1913162 1969556 1992023 1937591 1941762 1971860
15987 1971860 1936325 1908432 1901430 1886094 1889261 1927811 1933789 1948115 1921389 1950673 1925016 1937163
15975 1937163 1955518 1916639 1954090 1968833 1966677 1974847 1959833 1934428 1920365 1931589 1938732 1922907
15963 1922907 1960647 1944390 1916409 1911223 1888192 1899033 1959753 1949711 1900680 1902369 1896431 1935624
15951 1935624 1952832 1927830 1932352 1938178 1929665 1958494 1978958 1945705 1926612 1934819 1925912 1977078
15939 1977078 1989525 1983712 1941205 1933101 1943375 1952560 1940697 1971435 1940542 1954566 1969082 1932412
15927 1932412 1934742 1912936 1931653 1958809 1944075 1897731 1921959 1944134 1954541 1971357 1965289 1964071
15915 1964071 1988028 1946638 1934131 1997526 1968271 1915019 1957854 1958136 1921201 1909961 1911333 1890862
15903 1890862 1923528 1963626 1993337 1984710 1982004 1969636 1980408 1998567 1954720 1973858 1979119 1991305
15891 1991305 1961600 1960270 1980213 1983326 1982218 1966192 1989338 1999141 2048914 2023082 1967761 1977554
15879 1977554 1972818 1962530 1965316 1992818 1984801 1973827 1983088 1976007 1959986 1977456 1999363 1940389
15867 1940389 1900418 1937135 1977235 1953947 1946692 1935021 1955068 1995573 1958824 1961994 1974829 1980881
15855 1980881 1982320 1974818 1942587 1940783 1963095 1952854 1958432 1959877 1989786 1970676 1914890 1936868
15843 1936868 1994602 1986377 2012704 2000756 1993230 1966603 1979294 1940618 1957390 1956641 1989430 2005170
15831 2005170 2015667 2062873 2047884 2006635 1971201 2017714 1979154 2008876 1968444 1929809 1941627
15820 1941627 1947700 1998051 1986074 1963762 1939093 1947476 1948377 1996775 2016848 1940308 1966082 1983234
15808 1983234 1954091 1940861 1990661 2011097 1972593 1980991 1987711 2008184 2021201 2012589 2022306 1960395
15796 1960395 1969188 1957750 1950420 1997783 2001263 1964708 1986443 1947002 1971085 1989741 1961444 1975934
15784 1975934 1974548 1987635 1991805 1981335 2028489 1993722 1939312 1963738 2018927 2023723 2023623 1969529
15772 1969529 1900176 1987164 1991967 2016254 2060343 2026143 2000062 1935522 1943557 1964142 1995578 2006151
15760 2006151 1988404 1959719 1963138 1982694 2030344 2032389 2004501 2006110 1978815 2031397 1998456 1975009
15748 1975009 1973851 2002455 1980940 1984691 2015274 2042427 1991825 1999758 2054789 2050467 2042147 1992967
15736 1992967 2046668 2049042 2032592 2061170 2017437 2018028 2038761 2036841 2034370 1974283 1982616 2026560
15724 2026560 2023273 2048011 1985997 1998389 1981884 1948920 1957782 1973274 2017520 2044792 2055579 2033460
15712 2033460 2019224 1982697 1945502 1964897 1919044 1927893 1977699 2009018 1998739 1939070 1993288
15701 1993288 1956762 1953040 1997658 2014256 2022061 2012601 2029911 2018027 1992450 2007036 2020312 2005977
15689 2005977 1997609 1948593 1937798 1977715 1949459 1982421 1952625 1917738 1973978 1991105 1990293 1952051
15677 1952051 1989488 1996227 2026292 2039224 2025364 2002767 1997338 2026221 2021253 1972591 1958948 1986258
15665 1986258 2006378 2018809 1987337 1992327 2027476 2012889 2012093 2017452 2024219 2013833 1978271 1994815
15653 1994815 2014868 2055857 1999213 1950925 1937188 1985929 1998989 2004826 2037253 2043750 2030833 2073364
15641 2073364 2081091 2023233 2006204 2012618 1989292 2010873 2019528 2028705 2039715 2053672 2030530 1999920
15629 1999920 2029860 2020007 2015472 1992434 2027381 2038002 2006840 2020895 2049095 2035337 2023344 2008056
15617 2008056 2004023 2048846 2011181 1987316 1993171 2008315 2020039 1996850 2047309 2014311 2064624 2013338
15605 2013338 2006881 2010970 2013296 2007541 1966260 1989169 2001236 2042952 2020554 2050306 2008197 1997306
15593 1997306 2004574 2039177 2000995 2000450 1998059 2003050 2019799 2021525 2022648 1985940 1939429 1970402 2036127
15580 2036127 2017771 2002954 2003524 2043942 2050849 2056478 2034518 1988801 2039124 2133273 2107459 2075285
15568 2075285 2059786 2073200 2045499 2072486 2096271 2075463 2042684 2029783 2030225 1994754 1983730 1982030
15556 1982030 2019255 2020071 1998563 2017894 2005716 2016853 1987378 2047306 2042993 2012356 1974223 2032402
15544 2032402 2076833 2005739 2009433 2017325 2001293 1978068 1966202 1932980 2010128 2041401 2050049 2030529
15532 2030529 2048401 2023925 2041471 2053081 2021717 2066818 2042837 2018404 2024606 2011896 1998896
15521 1998896 2005489 2049885 1981919 2001061 2043934 2008446 1996961 1986819 2015637 1983489 1975348 1993761
15509 1993761 2026295 2013808 2000141 2020938 2025990 2041513 2058502 2078110 2086439 2133982 2077174 2080031
15497 2080031 2039126 1981582 2035919 2051069 2074659 2060241 2098615 2076628 2033958 2046420 2008840
15486 2008840 2055563 2045895 2070925 2105018 2113604 2114179 2088077 2031109 2045844 2071425 2082285 2035296
15474 2035296 2037005 2043784 2066156 2062930 2043615 2067625 2071342 2108091 2106664 2086220 2001387 2040580
15462 2040580 2074801 2066994 2024518 2051215 2065458 2083406 2086487 2085822 2066033 2014280 2063903 2078614
15450 2078614 2044356 2102180 2097754 2093175 2077695 2057914 2072471 2062745 2061775 2077739 2104265 2077544
15438 2077544 2074482 2067122 2022526 2018997 2068197 2116171 2073290 2063844 2058704 2074527 2076562 2063400
15426 2063400 2106654 2116475 2090222 2107230 2176615 2135931 2088741 2071987 2036086 2041618 2052858 2089635
15414 2089635 2098666 2080526 2079696 2116116 2104748 2084608 2094427 2076988 2024309 2040497 2080149 2127769
15402 2127769 2145177 2142614 2152139 2087504 2069561 2078854 2071147 2070968 2083713 2055173 2044548 2076241
15390 2076241 2033134 2042054 2069021 2086489 2093031 2052323 2087047 2081250 2073988 2091383 2052052 2066000
15378 2066000 2095516 2112614 2085191 2117943 2105625 2045326 2076859 2065505 2116676 2108568 2061273
15367 2061273 2059977 2048641 2092981 2061481 2060514 2091567 2083098 2089381 2048809 2071404 2119914 2122246
15355 2122246 2088622 2060212 2060001 2080861 2076473 2063658 2096833 2137200 2140797 2108295 2031976 2027311
15343 2027311 2081526 2097994 2066886 2095827 2078132 2095445 2104610 2079724 2062625 2054653 2027108 1999691
15331 1999691 2019928 2047017 2121717 2129366 2061813 2103822 2091724 2089087 2069361 2073387 2067788 2086393
15319 2086393 2119572 2092785 2069319 2107907 2135936 2114323 2126647 2110082 2100199 2081208 2128233
15308 2128233 2162139 2152506 2134999 2106060 2088101 2125957 2108753 2089423 2087333 2063139 2122418 2107511
15296 2107511 2085330 2136204 2129087 2087277 2069493 2081182 2107958 2088780 2090473 2055627 2059950 2045569
15284 2045569 2049156 2130975 2089123 2106421 2141652 2099233 2046110 2103712 2104968 2114366 2110758 2102094
15272 2102094 2181203 2145926 2096923 2129486 2107326 2113264 2120795 2098471 2084659 2124020 2124554 2117516
15260 2117516 2134527 2121986 2133234 2153267 2161242 2100742 2074655 2117195 2079565 2118863 2108482
15249 2108482 2090016 2113461 2117605 2111341 2112098 2122057 2141542 2112314 2137542 2122194 2085649 2086858
15237 2086858 2068741 2052725 2067241 2090571 2101086 2165842 2136558 2147168 2146985 2131343 2103804 2074826
15225 2074826 2075790 2038834 2049439 2070644 2103790 2101499 2081828 2067988 2056056 2051328 2060721 2106177
15213 2106177 2141371 2159641 2078037 2071689 2108824 2072869 2060191 2067571 2070679 2119845 2165804 2176795
15201 2176795 2159582 2147547 2097137 2113894 2141342 2134108 2116521 2089474 2129975 2178886 2135243
15190 2135243 2106029 2130235 2109572 2137502 2136874 2139210 2172920 2148977 2060105 2069262 2124285 2104477
15178 2104477 2095013 2184356 2224440 2200305 2206298 2152218 2163129 2103179 2116120 2159144 2160004 2153429
15166 2153429 2124122 2104535 2114423 2141145 2144837 2102974 2079649 2102555 2083831 2085735 2088569 2064546
15154 2064546 2078736 2082477 2093838 2116065 2124192 2123759 2095696 2082921 2108356 2076324 2054072 2156575
15142 2156575 2136632 2088593 2056986 2046767 2068033 2124849 2104244 2100529 2169484 2167094 2156672 2194052
15130 2194052 2179653 2155280 2120007 2115468 2149974 2169957 2138305 2129168 2092421 2109822 2124143 2121220
15118 2121220 2117325 2154532 2130370 2108127 2127199 2153307 2197083 2172499 2175480 2152028 2144368 2130935
15106 2130935 2166715 2137517 2198125 2194524 2180877 2170938 2166961 2124030 2140867 2125870 2126571 2111512
15094 2111512 2155870 2188264 2115072 2143535 2127717 2129834 2180372 2114676 2124357 2120494 2131800 2154931
15082 2154931 2137429 2097654 2158063 2175021 2133208 2141878 2103968 2130501 2126126 2119177 2118408 2136803
15070 2136803 2173479 2199470 2173016 2102126 2145575 2123732 2105152 2162778 2118982 2169972 2159461
15059 2159461 2124696 2127237 2163724 2152731 2211028 2213346 2160787 2121906 2133857 2124027 2155792 2168207
15047 2168207 2131037 2139941 2133492 2169117 2140338 2103724 2155174 2186547 2157414 2132885 2161584 2133426
15035 2133426 2194993 2221081 2206401 2177019 2134728 2200548 2195666 2152099 2175690 2189521 2162940
15024 2162940 2106493 2116328 2149559 2167021 2156019 2134419 2128879 2101155 2096194 2079890 2065418 2114589
15012 2114589 2160800 2188362 2173904 2160843 2144641 2171280 2143986 2096311 2138793 2190392 2181976
15001 2181976 2203982 2196074 2163617 2196878 2178938 2189177 2202287 2193996 2171246 2157237 2161943 2177331
14989 2177331 2166324 2159816 2167020 2132282 2134575 2161272 2164677 2181234 2215490 2170025 2167803 2147626
$$ [...]
##END NTUPLES=NMR SPECTRUM
##END=
