##TITLE=1H_TG-2347-XY
 DMSO
 8 sc, 
 18.02.2022
##JCAMPDX= 6.0         $$ Bruker NMR JCAMP-DX V2.0
##DATA TYPE= NMR SPECTRUM
##DATA CLASS= NTUPLES
##ORIGIN= UXNMR, Bruker Analytische Messtechnik GmbH
##OWNER= root
$$ XWIN-NMR		Version 3.5
$$ Fri Feb 18 12:06:46 2022 Russian Standard Time (UT+4h)  she@DPX200
##.OBSERVE FREQUENCY= 200.131346
##.OBSERVE NUCLEUS= ^1H
##.ACQUISITION MODE= SIMULTANEOUS
##.ACQUISITION SCHEME= undefined
##.AVERAGES= 8
##.DIGITISER RES= 18
##SPECTROMETER/DATA SYSTEM= spect
##.PULSE SEQUENCE= zg30
##.SOLVENT NAME= DMSO
##.SHIFT REFERENCE= (INTERNAL, DMSO, 0, 15.7094)
##AUDIT TRAIL= $$ (NUMBER, WHEN, WHO, WHERE, WHAT)
$$ ##TITLE= Audit trail, XWIN-NMR		Version 3.5
$$ ##JCAMPDX= 5.01
$$ ##ORIGIN= Bruker BioSpin GmbH
$$ ##OWNER= she
$$ F:/spectra/data/she/nmr/H-F/1/pdata/1/auditp.txt
$$ ##AUDIT TRAIL=  $$ (NUMBER, WHEN, WHO, WHERE, WHAT)
(   1,<2022-02-18 12:05:26.21 +0400>,<she>,<DPX200>,
      <created by zg, POWCHK disabled, PULCHK disabled
       configuration hash MD5:
       00 E9 B6 7A A2 85 ED C7 34 08 36 98 17 FE 4E 26
       data hash MD5: 16K
       FB E0 0F 33 A3 3C A2 E2 8F F8 32 06 8C 91 41 96>)
(   2,<2022-02-18 12:05:29.01 +0400>,<she>,<DPX200>,
      <Start of raw data processing
       efp BC_mod = 2 LB = 0.24 FT_mod = 6 PKNL = 1 PHC0 = -16749.21 PHC1 = 11.60078 SI = 16K 
       data hash MD5: 16K
       5E 8D F8 5A 0C D4 77 6C 4B 26 BB F7 23 AB 39 F9>)
(   3,<2022-02-18 12:05:46.01 +0400>,<she>,<DPX200>,
      <pk PHC0 = 157.7856 PHC1 = -0.4 
       data hash MD5: 16K
       D2 11 E9 D4 1E 6D 99 FC 7A 38 3E 2A 8C CE 41 C3>)
(   4,<2022-02-18 12:05:49.73 +0400>,<she>,<DPX200>,
      <abs ABSG = 5 
       data hash MD5: 16K
       6C AD EF 4D E1 D5 DD 85 12 1F E5 3A EC F9 7D CD>)
$$ ##END=
$$ 
$$ hash MD5
$$ E5 DE DA 11 69 1C DE D9 B4 B4 DC 15 48 92 35 52
##$RELAX= 
##$RELAX= 
##$RELAX= 
##$RELAX= 
##$RELAX= 
##$RELAX= 
$$ Bruker specific parameters
$$ --------------------------
##$DU= <F:/spectra>
##$EXPNO= 1
##$NAME= <H-F>
##$PROCNO= 1
##$TYPE= <nmr>
##$USER= <she>
##$AMP= (0..31)
100 100 100 100 100 100 100 100 100 100 100 100 100 100 100 100 100 100 
100 100 100 100 100 100 100 100 100 100 100 100 100 100 
##$AQSEQ= 0
##$AQ_mod= 1
##$AUNM= <au_zg>
##$AUTOPOS= <>
##$BF1= 200.13
##$BF2= 200.13
##$BF3= 200.13
##$BF4= 200.13
##$BF5= 200.13
##$BF6= 200.13
##$BF7= 200.13
##$BF8= 200.13
##$BYTORDA= 1
##$CFDGTYP= 0
##$CFRGTYP= 5
##$CHEMSTR= <none>
##$CNST= (0..31)
1 1 145 1 1 1 1 1 1 1 1 1 1 1 1 1 1 1 1 1 1 1 1 1 1 1 1 1 1 1 1 1 
##$CPDPRG= <>
##$CPDPRG1= <>
##$CPDPRG2= <>
##$CPDPRG3= <>
##$CPDPRG4= <mlev>
##$CPDPRG5= <mlev>
##$CPDPRG6= <mlev>
##$CPDPRG7= <mlev>
##$CPDPRG8= <mlev>
##$CPDPRGB= <>
##$CPDPRGT= <>
##$D= (0..31)
0 1.2 0 0 0 0 0 0 0 0.06 0 0.03 0 0 0 0 0.0002 0 0 0 0 0 0 0 0 0 0 0 0 
0 0 0 
##$DATE= 1645171525
##$DBL= (0..7)
120 120 120 120 120 120 120 120 
##$DBP= (0..7)
150 150 150 150 150 150 150 150 
##$DBP07= 0
##$DBPNAM0= <>
##$DBPNAM1= <>
##$DBPNAM2= <>
##$DBPNAM3= <>
##$DBPNAM4= <>
$$ [...]
##$SUBNAM2= <"">
##$SUBNAM3= <"">
##$SUBNAM4= <"">
##$SUBNAM5= <"">
##$SUBNAM6= <"">
##$SUBNAM7= <"">
##$SUBNAM8= <"">
##$SUBNAM9= <"">
##$SW= 18.0517287032376
##$SWIBOX= (0..15)
0 0 2 0 0 0 0 0 0 0 0 0 0 0 0 0 
##$SW_h= 3612.71676300578
##$TD= 16384
##$TD0= 1
##$TE= 0
##$TE2= 300
##$TE3= 300
##$TEG= 300
##$TL= (0..7)
0 120 120 120 120 120 120 120 
##$TP= (0..7)
150 150 150 150 150 150 150 150 
##$TP07= 0
##$TPNAME0= <>
##$TPNAME1= <>
##$TPNAME2= <>
##$TPNAME3= <>
##$TPNAME4= <>
##$TPNAME5= <>
##$TPNAME6= <>
##$TPNAME7= <>
##$TPOAL= (0..7)
0.5 0.5 0.5 0.5 0.5 0.5 0.5 0.5 
##$TPOFFS= (0..7)
0 0 0 0 0 0 0 0 
##$TUNHIN= 0
##$TUNHOUT= 0
##$TUNXOUT= 0
##$USERA1= <user>
##$USERA2= <user>
##$USERA3= <user>
##$USERA4= <user>
##$USERA5= <user>
##$V9= 5
##$VALIST= <valist>
##$VCLIST= <CCCCCCCCCCCCCCC>
##$VD= 0
##$VDLIST= <DDDDDDDDDDDDDDD>
##$VPLIST= <PPPPPPPPPPPPPPP>
##$VTLIST= <TTTTTTTTTTTTTTT>
##$WBST= 1024
##$WBSW= 4
##$XGAIN= (0..3)
0 0 0 0 
##$XL= 0
##$YL= 0
##$YMAX_a= 107055
##$YMIN_a= -96780
##$ZGOPTNS= <>
##$ZL1= 120
##$ZL2= 120
##$ZL3= 120
##$ZL4= 120
##$ABSF1= 15.70942
##$ABSF2= -2.342429
##$ABSG= 5
##$ABSL= 3
##$ALPHA= 0
##$AQORDER= 0
##$ASSFAC= 0
##$ASSFACI= 0
##$ASSFACX= 0
##$ASSWID= 0
##$AUNMP= <proc_1d>
##$AZFE= 0.1
##$AZFW= 0.1
##$BCFW= 0
##$BC_mod= 2
##$BYTORDP= 0
##$COROFFS= 0
##$CY= -3
##$DATMOD= 1
##$DC= 0
##$DFILT= <>
##$DTYPP= 0
##$F1P= 0
##$F2P= 0
##$FCOR= 1
##$FTSIZE= 16384
##$FT_mod= 6
##$GAMMA= 0
##$GB= 0
##$INTBC= 1
##$INTSCL= 0
##$ISEN= 128
##$LB= 0.24
##$LEV0= 0
##$LPBIN= 0
##$MAXI= 10000
##$MC2= 0
##$MEAN= 0
##$ME_mod= 0
##$MI= 1.114404
##$NCOEF= 0
##$NC_proc= -9
##$NLEV= 6
##$NOISF1= 3.799351
##$NOISF2= 2.8
##$NSP= 0
##$NTH_PI= 0
##$NZP= 0
##$OFFSET= 15.70942
##$PC= 1
##$PHC0= -16591.43
##$PHC1= 11.20078
##$PH_mod= 1
##$PKNL= yes
##$PPARMOD= 0
##$PSCAL= 0
##$PSIGN= 0
##$REVERSE= no
##$SF= 200.130008431007
##$SI= 16384
##$SIGF1= 3
##$SIGF2= 2
##$SINO= 5.538805
##$SIOLD= 16384
##$SREGLST= <1H.CDCl3>
##$SSB= 0
##$STSI= 16384
##$STSR= 0
##$SW_p= 3612.71676300578
##$SYMM= 0
##$S_DEV= 0
##$TDeff= 16384
##$TDoff= 0
##$TI= <>
##$TILT= no
##$TM1= 0
##$TM2= 0
##$TOPLEV= 0
##$USERP1= <user>
##$USERP2= <user>
##$USERP3= <user>
##$USERP4= <user>
##$USERP5= <user>
##$WDW= 1
##$XDIM= 16384
##$YMAX_p= 519022773
##$YMIN_p= -6369607
$$ End of Bruker specific parameters
$$ ---------------------------------
##NTUPLES= NMR SPECTRUM
##VAR_NAME=  FREQUENCY,     SPECTRUM/REAL,   SPECTRUM/IMAG
##SYMBOL=    X,             R,               I
##VAR_TYPE=  INDEPENDENT,   DEPENDENT,       DEPENDENT
##VAR_FORM=  AFFN,          ASDF,            ASDF
##VAR_DIM=   16384,         16384,           16384
##UNITS=     HZ,            ARBITRARY UNITS, ARBITRARY UNITS
##FACTOR=    0.220516191357247, 1,           1
##FIRST=     3143.92639790529, 0,            0
##LAST=      -468.790365100488, 0,           0
##MIN=       -468.790365100488, -6369607,    0
##MAX=       3143.92639790529, 519022773,    0
$$ Real data points
##PAGE= N=1
##DATA TABLE= (X++(R..R)), XYDATA
$$ [...]
14193d21772k12699l97029O37720Q0843M7709M30704k55769J24153L9665L8147
$$ -421772 -634471 -1031500 -393780 -312937 -265228 165476 -90293 33860 73525 111672
14183A11672j210321K25272O39542O07037k01134m97259M14687o46236O63096
$$ 111672 -1098649 -873377 -233835 373202 172068 -325191 89496 -556740 106356
14174A06356R0129J70916l32528o87182m34743N97579J34034n303L22759K5481
$$ 106356 196485 367401 34873 -652309 -1087052 -489473 -355439 -360742 -37983 -12502
14164a2502O1648o9870r6471q61547J53776K76382K34442n27113K01382J29263
$$ -12502 49146 -20724 -117195 -978742 -824966 -548584 -314142 -841255 -639873 -510610
14154e10610l65437Q02341J55896N3064J00318N67507o52959n53633k68274j033516
$$ -510610 -876047 -73706 82190 135254 235572 803079 150120 -403513 -671787 -1705303
14144a705303N50146Q96019P59709k85285k67887n35667l31275J49866j3073O50117
$$ -1705303 -1155157 -259138 500571 215286 -52601 -588268 -919543 -769677 -782750 -132633
14134a32633J96342p7951L29561p0901k12071j03567m52420R2218k28404N5273
$$ -132633 63709 -14242 315319 244418 32347 -71220 -523640 -431422 -659826 -604553
14124f04553M14184r556N638O96991r0573J2669l75709k04871p82773J69681L92337
$$ -604553 -190369 -199925 -194287 502704 412131 424800 49091 -155780 -938553 -768872 -376535
14113c76535N3161K85570N42441j41544m26550n27424j55320r0206N78413R66329
$$ -376535 -323374 -37804 504637 363093 -63457 -590881 -746201 -836407 -257994 708335
14103G08335m82403m31447l39393N27760o72235K03394l52703L71381k40507j98263
$$ 708335 225932 -205515 -544908 -17148 -689383 -485989 -838692 -467311 -707818 -906081
14093i06081K31405q67709L07707O2909J63645N14353N76542m43202l90526L62352
$$ -906081 -674676 -1542385 -1234678 -1171769 -1008124 -493771 82771 -360431 -750957 -388605
14083c88605r20995O30611l7915N77831m00681J23943O44658j26685J16996k91663
$$ -388605 -1309600 -678989 -716904 -139073 -539754 -415811 228847 102162 219158 -72505
14073g2505n98207M97163L13708J31473K0577M90718o7146o21479j19212m16046
$$ -72505 -670712 -173549 140159 271632 292209 782927 715781 94302 -24910 -440956
14063d40956J11883M80495j6652k92328M31082l33570K97670k33406k32421m40738
$$ -440956 -329073 151422 134770 -157558 273524 -60046 237624 4218 -228203 -668941
14053f68941O49215N03666j58262j666898J7412R42574n78060l50024J52223O03245
$$ -668941 -19726 483940 325678 -1341220 -1323808 -381234 -959294 -1309318 -1157095 -553850
14043e53850M96650j52086K16995k0869l87602M90775o80700M5166j06943n02080
$$ -553850 -57200 -209286 7709 -13160 -400762 90013 -590687 -545521 -652464 -1154544
14033a154544r99219Q08483Q54614j11064K46577L62751k72431J95773j9951j163975
$$ -1154544 -2153763 -1345280 -490666 -601730 -355153 7598 -264833 -69060 -89011 -1252986
14023a252986J13476J99742N40033n59734L06523K57209k36866P05056k31755
$$ -1252986 -1139510 -939768 -399735 -959469 -652946 -395737 -632603 72453 -159302
14014a59302k99895j27080o13466N46451P45777j04271n7492J40961k23633N1464
$$ -159302 -459197 -586277 -1199743 -653292 92485 -11786 -69278 71683 -151950 -100486
14004a00486K94134Q6132o82331O3563N02625j64431m608K40953R9502l86411
$$ -100486 193648 279780 -402551 -338988 163637 -794 -5402 235551 335053 -51358
13994e1358o4287j36518M4263L72140L4551n07948k32N4018j37459N91165m27705
$$ -51358 -115645 -252163 -207900 164240 198791 -309157 -309389 -255371 -392830 198335 -229370
13983b29370M68369k92704q95613m53831N37971j56634L68059L65763j68944R0422
$$ -229370 238999 -53705 -949318 -1403149 -865178 -1021812 -653753 -287990 -456934 -366512
13973c66512o149j70732K20425k66553M86787j84089r2894m86652l02493O85270
$$ -366512 -372661 -543393 -322968 -589521 -102734 -286823 -379717 -866369 -1168862 -483592
13963d83592K95761o07470n0705N60277K51914j28083n16699R08649q0613j36369
$$ -483592 -187831 -795301 -846006 -285729 -33815 -161898 -678597 230052 149439 13070
13953A3070j12850K90653M69806j222761l00254k88747J79131J040653j090674
$$ 13070 -99780 190873 660679 -562082 -862336 -1151083 -971952 68701 -1021973
13944a021973N53284J020389p17737r83669N05656K65668N85711K98068K979r39049
$$ -1021973 -468689 551700 -166037 -1149706 -644050 -378382 207329 505397 508376 -430673
13934d30673j57116O84145N3368k30363L09226r42886L27163M80070L2648l73063
$$ -430673 -587789 96356 149724 -80639 228587 -714299 -387136 92934 125582 -247481
13924b47481J81425k64963l28104J52993O38108P5181p42684j7244o37993J055893
$$ -247481 -66056 -331019 -659123 -506130 131978 207159 -535525 -552769 -1190762 -134869
13914a34869Q88092k90438o1823q74589n73495L93272P43274j93382k71351J197
$$ -134869 753223 462785 400962 -473627 -1047122 -653850 89424 -103958 -375309 -374112
13904c74112K00866m15258k06176n39376M20197r6051P77614J49070o54913O98728
$$ -374112 -173246 -588504 -794680 -1334056 -913859 -1009910 -232296 -83226 -738139 -39411
13894c9411l24397l65652m2827p87941K23884L52315m51771O17848O94379J00869
$$ -39411 -363808 -729460 -772287 -1560228 -1336344 -984029 -1435800 -817952 -123573 -22704
13884b2704j31912L35505L81786j290832K8094L44390k375Q9103p34645L95359
$$ -22704 -154616 180889 562675 -728157 -700063 -355673 -358048 -268945 -1003590 -608231
13874f08231N65497N1285k67934K39869r28947K67571m22043L36723m7346K66010
$$ -608231 -42734 8551 -259383 -19514 -948461 -680890 -1102933 -766210 -813556 -547546
13864e47546J006297k31527n13160m35249J83100O66893r0105J43311m72602L26321
$$ -547546 458751 227224 -285936 -721185 -538085 128808 38703 182014 -290588 35733
13854C5733L59242P8340j114837J48633N04776k37628k98421m51608R4654N16551
$$ 35733 394975 473315 -641522 -492889 11887 -225741 -524162 -975770 -881116 -364565
13844c64565j38923N25585L55261k65740l83685m6429N30474q8737l30084r1897
$$ -364565 -503488 22097 377358 111618 -272067 -318496 211978 123241 -206843 -298740
13834b98740K46047L33414p39979L70123Q38719l08281j41121k08191j27463p43832
$$ -298740 -52693 280721 -459258 -89135 749584 441303 300182 91991 -35472 -779304
13824g79304O289j42772n79628R20821M50112l01715k34723L67637r19778M5783
$$ -779304 -773015 -915787 -1495415 -574594 -124482 -426197 -660920 -293283 -1213061 -1167278
13814a167278L11966O63886L96289J89570Q3166r12785j22778n83940O07247k3651
$$ -1167278 -855312 -191426 204863 394433 477599 -435186 -557964 -1141904 -534657 -558308
13804e58308j18191j50608N53616M51160J2465p91068j25380K96673O30906K80689
$$ -558308 -676499 -827107 -273491 177669 190134 -600934 -726314 -429641 201265 481954
13794D81954o37897k66850J82292K91388L00277m86464K47997l62991N53482n45918
$$ 481954 -155943 -422793 -240501 50887 351164 -135300 112697 -250294 303188 -242730
13784b42730l8843P88993m85994N56562j73733r29249r9977M1290O38545O08388
$$ -242730 -281573 507420 21426 577988 404255 -524994 -624971 -583681 54864 663252
13774F63252m85945k54413k46218l78629l78270J087601o4417k16873l41759J55839
$$ 663252 177307 -77106 -323324 -701953 -1080223 7378 -57039 -273912 -615671 -459832
13764d59832N825M00999K42181k31552J66031m29735L39816j91112P9268q01130
$$ -459832 -454007 -53008 189173 -42379 123652 -306083 33733 -157379 -78111 -879241
13754h79241J15187N48539J87099n8910L18425j83741k95047k9285j7926L46623
$$ -879241 -764054 -215515 -28416 -87326 231099 47358 -247689 -276974 -294900 51723
13744E1723O82229l83071P26924m50377q15376M96969Q8477p11816n60216M81226
$$ 51723 733952 350881 1077805 627428 -187948 309021 397498 -314318 -874534 -393308
13734c93308l40514K18540m3381J164999M77681n97160m23171j87231q39073n26335
$$ -393308 -733822 -515282 -558663 606336 1084017 486857 63686 -123545 -962618 -1488953
13724a488953Q30847l94362j40043L83900O462o4300n20577K18906n76696m0922
$$ -1488953 -658106 -1052468 -1192511 -808611 -802149 -866449 -1387026 -1168120 -1744816 -1785738
13714a785738R42913P20726R83461p23862j063762P01141Q4637k139q18074k00628
$$ -1785738 -842825 -122099 861362 137500 -926262 -225121 -140484 -142623 -960697 -1161325
13704a161325N21340J98781l52204L21514L82169o91303k38536J62217M82215
$$ -1161325 -639985 -441204 -793408 -471894 -89725 -781028 -1019564 -857347 -375132
13695c75132k5917J59905k35533M87854J4719J011286j66585j060131J34294J46298
$$ -375132 -401049 -241144 -476677 11177 25896 1037182 870597 -189534 -55240 91058
13685I1058L83479q31575j94645o06202L93426K34831j41138o55012M35640Q84966
$$ 91058 474537 -357038 -551683 -1157885 -764459 -529628 -670766 -1325778 -890138 -5172
13675e172M03625q0639l73675L92267l72636K0577j48646q28636P34497N3878
$$ -5172 398453 317814 -55861 336406 -36230 -15653 -164299 -992935 -258438 -204560
13665b04560o51525J63399Q2449K93179k30249J97318J07146K775p8300M64089
$$ -204560 -856085 -692686 -610237 -317058 -547307 -349989 -242843 -240068 -318368 145721
13655A45721j31464k49784K00557M25478r03330o11923R30953K54671n58311N00510
$$ 145721 14257 -235527 -34970 390508 -512822 -1124745 -193792 60879 -497432 3078
13645C078n21607l37744M63592n17910J124299p58m32116L69536q9510J65343
$$ 3078 -518529 -856273 -392681 -910591 213708 212950 -219166 150370 60860 226203
13635B26203j63691l42317l89904j10041N22902k04286o09313L57428l5489M05149
$$ 226203 62512 -279805 -669709 -779750 -256848 -461134 -1070447 -713019 -748508 -343359
13625c43359k15657l19053J91259k26120J57525j71232J101745K2199l9560n04961
$$ -343359 -559016 -878069 -686810 -912930 -755405 -926637 175108 197307 157747 -347214
13615c47214n49838k1505M72137J92540J57601m39647m34323L3858J61686m12782
$$ -347214 -897052 -918557 -446420 -253880 -96279 -535926 -970249 -936391 -774705 -1187487
13605a187487N06899O09131k4226M33548l43267p68607M32012K96536k96227K03859
$$ -1187487 -680588 -71457 -95683 337865 -5402 -774009 -341997 -45461 -341688 -137829
13595a37829k57535N78389n63250L96310p4258l89019k52804M25236j82096j25146
$$ -137829 -395364 183025 -380225 16085 -58173 -447192 -699996 -274760 -456856 -582002
13585e82002m65232p48029J78289M15489L10350K01281O84421k16214o00547L59826
$$ -582002 -1047234 -1795263 -1616974 -1201485 -891135 -689854 -5433 -221647 -822194 -462368
13575d62368R1267j82179j51091q5233K31589M31914j12469N31391m18906M2188
$$ -462368 -371101 -553280 -704371 -789604 -558015 -126101 -238570 292821 -126085 -83897
13565h3897K70694m90155M7641m076j63591K10499n2571n8699l74569n56559k88698
$$ -83897 186797 -303358 -255717 -259793 -423384 -212885 -265456 -324155 -698724 -1255283 -1543981
13554a543981M62827Q42848K93087n610k63051j91919k0935J84567j60302n20959
$$ -1543981 -1081154 -238306 54781 49171 -213880 -405799 -426734 -242167 -402469 -923428
13544i23428n92758N11088k4698M38008J61011l80023O1168p0189J15664M17774
$$ -923428 -1516186 -1005098 -1029796 -591788 -430777 -810800 -749632 -819821 -704157 -286383
13534b86383J037318n09953j391963P86064n16319K75796K68930m73867R00679
$$ -286383 750935 240982 -1150981 -364917 -881236 -605440 -336510 -810377 90302
13525I0302N41509l95790M23651n46099k12129n51250L38391k35608L83633L15154
$$ 90302 631811 236021 659672 113573 -98556 -649806 -311415 -547023 -163390 151764
13515A51764q4809Q36509j64219n15291k88674N50326K83295j267916M65721j031522
$$ 151764 66955 903464 739245 223954 -64720 485606 768901 -499015 -33294 -1064816
13505a064816M01655m56228J83635J999408r25501p97008j88045K44480m2557
$$ -1064816 -663161 -1119389 -935754 1063654 138153 -658855 -846900 -602420 -644977
13496f44977j24440J82461M94850k81736R1556P39047N78594p74477p43741Q7966
$$ -644977 -769417 -586956 -92106 -373842 -282286 456761 1035355 260878 -482863 -394897
13486c94897k20732K5146k0217l75838R85889k96543k90853q10411O38251K7471
$$ -394897 -615629 -590483 -610700 -986538 -649 -297192 -588045 -1398456 -760205 -732734
13476g32734N51609k98014J58939p4558o96372j84760L17778M64481M8071l69531
$$ -732734 -181125 -479139 -320200 -394758 -1091130 -1275890 -958112 -493631 -445560 -815091
13466h15091k89511K84912K03238K26799K04395J96962o73775l94175K35086m34343
$$ -815091 -1104602 -819690 -616452 -389653 -185258 11704 -662071 -1056246 -821160 -1255503
13456a255503N44876m05306M01345k05373J02125N28875J06317n01542j74689
$$ -1255503 -710627 -1115933 -714588 -919961 -817836 -288961 -182644 -684186 -858875
13447h58875p7549n38307k88224K07519K07943m00074J384674L25567M8992p32072
$$ -858875 -936424 -1474731 -1762955 -1555436 -1347493 -1747567 -362893 -37326 11666 -720406
13437g20406l8854J190823j084251j85143K01126M70864L65439m86777m37579
$$ -720406 -759260 431563 -652688 -837831 -636705 -165841 199598 -287179 -724758
13428g24758l81088O50202k10981k53994L1298J15469N6844K89100M1558L63054
$$ -724758 -1105846 -455644 -666625 -920619 -889321 -773852 -717008 -427908 -386350 -23296
13418b3296k43258j88409L97094l56577m0447J45524k01946m64125R9904J313584
$$ -23296 -266554 -454963 -57869 -414446 -454893 -309369 -511315 -975440 -875536 438048
13408D38048m62287l74644K84148j81777l77427J63349l76135L91062J94657k62744
$$ 438048 -24239 -398883 -114735 -296512 -673939 -510590 -886725 -495663 -301006 -563750
13398e63750N73157k93396m77624L48068n3880K10603l60405j3822N0499P90744
$$ -563750 9407 -283989 -761613 -413545 -467425 -256822 -617227 -631049 -580550 210194
13388B10194l09636n25437K23782M06811K97633k42027m32219J48111o26136Q7435
$$ 210194 -99442 -624879 -401097 5714 303347 61320 -370899 -222788 -848924 -761489
13378g61489K44156l30658P43939o05557L83809k12376n63090j47252j53108N70186
$$ -761489 -517333 -847991 -104052 -709609 -325800 -538176 -1101266 -1248518 -1401626 -831440
13368h31440k72743K57406N7254M77762K35946K48840L49548L09660M27845q99653
$$ -831440 -1104183 -846777 -789523 -311761 -75815 173025 522573 832233 1260078 360425
13358C60425n80606L24994J93634m06534j63663n61108k8609L07486o6625M26307
$$ 360425 -220181 104813 298447 -108087 -271750 -832858 -861467 -553981 -620606 -194299
13348a94299l85577J83976O01249L895P330L74246n10283m75798N25807q9663
$$ -194299 -579876 -395900 205349 209244 216574 590820 80537 -395261 130546 40883
13338D0883q03807O8954O292M40230K0385l87866k8194k13762j31316M88572K39720
$$ 40883 -762924 -693970 -687678 -247448 -227063 -614929 -643123 -856885 -988201 -499629 -259909
13327b59909l14004N60681p76112Q094J13079q6192n00866M11172j64863L51662
$$ -259909 -573913 -13232 -789344 -781250 -668171 -754363 -1255229 -844057 -1008920 -657258
13317f57258J72461K6971K31384l15022j36269L64152m23090j12355p877k14519
$$ -657258 -484797 -457826 -226442 -541464 -677733 -313581 -736671 -849026 -856903 -1071422
13307a071422o23000K00955k09744N15739R39847l76480j000445M22901j8561
$$ -1071422 -1694422 -1493467 -1703211 -1187472 -247625 -624105 -1624550 -1201649 -1220210
13298a220210Q30840J08645K09276l7948q10519m46355J94663K37031M08052L47505
$$ -1220210 -389370 -280725 -71449 -109397 -919916 -1366271 -1171608 -934577 -526525 -179020
13288a79020l23566O07613K1630M55845r05202o82658M22636L7037p0924J056026
$$ -179020 -502586 105027 126657 582502 -322700 -1005358 -582722 -545685 -616609 439417
13278D39417m36245L01420k89914m78718l79837K29800M94557l80502n07276N47239
$$ 439417 3172 304592 14678 -464040 -843877 -614077 -119520 -500022 -1007298 -460059
13268d60059k8219K54988j30353M10390J84151l43565k08061M92106j251736r51129
$$ -460059 -488278 -233290 -363643 46747 230898 -112667 -320728 171378 -1080358 -2031487
13258b031487J060157M05134N78067l39519o1117L65184J9665L04004k2358j94913
$$ -2031487 -971330 -566196 11871 -327648 -388765 -23581 -3916 300088 277730 82817
13248H2817K82438r73320j115060N27136P48605q4022r9943j89771q8941n99108
$$ 82817 365255 -608065 -1723125 -1195989 -447384 -531406 -631349 -821120 -910061 -1509169
13238a509169O11907P51238m2902k58423L38058J08013K71922M16079r07904M53590
$$ -1509169 -897262 -146024 -188926 -447349 -109291 -1278 270644 686723 -221181 232409
13228B32409l81963n61082l8604K26094M23670j63691m55022J46036M18480K56723
$$ 232409 -149554 -710636 -749240 -523146 -99476 -263167 -718189 -572153 -153673 103050
13218A03050k33197O2668O57273N4202l93910r40197O15551j08348n60132M97525
$$ 103050 -130147 -67479 589794 643996 250086 -690111 -74560 -182908 -743040 -245515
13208b45515M21939p68814L11361J74619R1231m25511m27999K04655Q46460m5066
$$ -245515 176424 -592390 -281029 -106410 -15179 -440690 -868689 -664034 182426 137360
13198A37360L23679j83080j022413m39874n9567M94887L76066q76945M01023M07487
$$ 137360 461039 277959 -744454 -1184328 -1243895 -749008 -372942 -1249887 -848864 -441377
13188d41377m81506L330N52176K58364K71885l08942K74093J9411o34683J50983
$$ -441377 -922883 -919553 -367377 -109013 162872 -146070 128023 147434 -487249 -336266
13178c36266k85956P70313m35128J05927q72087J07561N90875M73749o53372L22145
$$ -336266 -622222 148091 -287037 -181110 -1053197 -945636 -354761 118988 -534384 -212239
13168b12239j85218K28097K63890n71865O5973R13109L37627q73701j76672J29088
$$ -212239 -397457 -169360 94530 -477335 -411362 501747 839374 -34327 -210999 -81911
13158h1911l64914O35576j67287l2145o51423l16126N17342L02649J49500r9781
$$ -81911 -446825 188751 21464 -10681 -662104 -978230 -460888 -158239 -8739 -108520
13148a08520K28342o592l09862k39586j15203r51P63114r8350j043721n01405
$$ -108520 119822 113230 -196632 -436218 -551421 -552372 210742 112392 -931329 -1432734
13138a432734P40319J10348N40616j80844L80598q1111p58647m8086N51845m33383
$$ -1432734 -692415 -582067 -41451 -222295 158303 77192 -681455 -729541 -177696 -611079
13128f11079j16918J020260q8811r46870K35689j43159J95069L78970k32215n02604
$$ -611079 -727997 292263 203452 -743418 -507729 -650888 -455819 -76849 -309064 -811668
13118h11668m25596K07716J08409J22789o42185K98335J42l48309P12017O62150
$$ -811668 -1237264 -1029548 -921139 -798350 -1440535 -1142200 -1142058 -1490367 -778350 -116200
13108a16200j31038j73732n30964L0487R19170N2226P76796J92518o49469m18502
$$ -116200 -247238 -420970 -951934 -921447 -2277 49949 826745 1019263 369794 -48708
13098d8708q75650m75279N37784l38247L42869P87258r9707L95669P4912l00192
$$ -48708 -924358 -1399637 -861853 -1200100 -857231 -69973 -169680 225989 300901 709
13088G09Q1350n80513K68129L71337l41006j08785m86110j66337M96851J38222
$$ 709 82059 -498454 -230325 141012 -199994 -308779 -794889 -961226 -464375 -326153
13078c26153j8535k3773m4241j59926k66046P56004J50752j21766K32316m69040
$$ -326153 -344688 -368461 -412702 -572628 -838674 -82670 68082 -53684 178632 -290408
13068b90408j63081N21681k8221J62456R8872m11193N35834o37116k81583M16702
$$ -290408 -453489 68192 39971 202427 301299 -109894 425940 -211176 -492759 -76057
13058g6057R0814j67375M9862k70990l4175j51898O45614M97847p16497N83222
$$ -76057 14757 -152618 -102756 -373746 -407921 -559819 85795 583642 -132855 450367
13048D50367j234010l76402n6634O92569M84797K21053m31866l56866k931J58978
$$ 450367 -783643 -1160045 -1216679 -524110 -39313 181740 -250126 -606992 -609923 -450945
13038d50945O56171j73955J19335R9936L58813o88642n24932J12401j59014J82078
$$ -450945 205226 31271 150606 250542 609355 -79287 -604219 -491818 -650832 -468754
13028d68754N5829j23485L74319M61865J25555R05322o18577q92525l69252j055745
$$ -468754 -412925 -536410 -162091 299774 425329 1330651 712074 -180451 -549703 -1605448
13018a605448K50827R70607J66946J40033j34200l75578r6346l86474O11933l4829
$$ -1605448 -1354621 -384014 -217068 -77035 -211235 -586813 -683159 -1069633 -457700 -492529
13008d92529j13993n38916N14950L61322o3350K29195j75194N14871q31283o1204
$$ -492529 -606522 -1145438 -630488 -269166 -332516 -103321 -278515 236356 -594927 -656131
12998f56131J78795L63859r3656j63221k09081J20483P61410j086104k94903Q688
$$ -656131 -477336 -113477 -207133 -370354 -579435 -458952 302458 -783646 -1078549 -1069861
12988a069861J134429n69149J42267j03212L46501K34167k4492J11497r77706
$$ -1069861 64568 -504581 -362314 -465526 -119025 115142 90650 202147 -775559
12979g75559O24074P96624j76545p01627n22116q9065K8080M02087N64959o96205
$$ -775559 -151485 645139 468594 -233033 -755149 -844214 -816134 -414047 150912 -545293
12969e45293L35524N28433o56445j078492L72157j35027M24409o99230M09173
$$ -545293 -209769 318664 -337781 -1416273 -1044116 -1179143 -754734 -1453964 -1044791
12960a044791L83249j19385R35209K31546j06175j55197k12259m51095j36320
$$ -1044791 -661542 -780927 154282 385828 279653 124456 -87803 -538898 -675218
12951f75218L70326j72311k41175L17039j97556l5690N4586L33017N77836m20885
$$ -675218 -304892 -477203 -718378 -401339 -598895 -634585 -579999 -246982 330854 -90031
12941i0031o44660n614j98345P7517O01287L53125Q7649m70062O91122m79753
$$ -90031 -734691 -740305 -938650 -861133 -259846 93279 180928 -289134 401988 -77765
12931g7765j584875J72036N94472M38765L08120O5694n09432N73055J03799j37067
$$ -77765 -1662640 -1490604 -896132 -457367 -149247 -83553 -592985 -19930 83869 -53198
12921e3198n40495j534k72898L29564P70147k71895k89257N52338M63387m27961
$$ -53198 -593693 -595227 -868125 -538561 231586 -40309 -329566 222772 686159 258198
12911B58198K41482K74388m58387o64821k06072J25572L25785m51888l07446k84785
$$ 258198 499680 774068 315681 -349140 -555212 -429640 -103855 -555743 -863189 -1147974
12901a147974J182579K93187n70121O78588p88697j514600J144274J156544K78139
$$ -1147974 34605 327792 -242329 436259 -352438 -1867038 -722764 433780 711919
12892G11919r48858l30232M60633j67955m05058L80836j40278k13045O19299Q11062
$$ 711919 -236939 -567171 -106538 -274493 -679551 -298715 -438993 -652038 -32739 778323
12882G78323M6850q95828p24473l59765N46081Q6829M62798l90965L56073j27257
$$ 778323 825173 -70655 -795128 -1154893 -608812 -521983 -59185 -450150 -94077 -221334
12872b21334q90439M21875O8346J06856O16161n02198j41295p9009m3436O6366
$$ -221334 -1111773 -689898 -621552 -514696 101465 -400733 -542028 -621037 -664473 -598107
12862e98107O74081l13624K61086j64739l66198J96220R51693p78061q8987J93329
$$ -598107 75974 -237650 23436 -141303 -507501 -311281 640412 -137649 -226636 -33307
12852c3307J79303q7171o67423M18400n8430O3610p5049J7458m7916O45875J74146
$$ -33307 145996 58825 -608598 -190198 -248628 -185018 -260067 -242609 -290525 355350 529496
12841E29496j33044l01036n23917j51622J69790K39873R41793L28930j443069
$$ 529496 396452 95416 -428501 -580123 -410333 -170460 771333 1100263 -342806
12832c42806k94648j95812k25463M32685k64538M21104L74110L89350l96633M71159
$$ -342806 -637454 -833266 -1058729 -626044 -890582 -469478 -95368 293982 -102651 368508
12822C68508M29494n86289n00543J82152o30655J425516p9111j245175K07349
$$ 368508 798002 211713 -288830 -106678 -737333 688183 609072 -636103 -428754
12813d28754N438m99748K94866P46175J69199r34360J98396O57463k19294M8781
$$ -428754 -423316 -923064 -628198 117977 287176 -647184 -448788 208675 -10619 38162
12803C8162j2720k23580p59370L38189M48706L68145j159370M01175m29152M73733
$$ 38162 25442 -198138 -957508 -619319 -170613 197532 -961838 -560663 -989815 -516082
12793e16082R83371k72367n88897l97982O74271m89927Q3976J51744k27026p809
$$ -516082 467289 194922 -393975 -791957 -117686 -607613 -523637 -371893 -598919 -606728
12783f06728J88507N92399p11605j24508o61587l49754J058409k28129J68904
$$ -606728 -418221 174178 -537427 -661935 -1323522 -1673276 -614867 -842996 -674092
12774f74092N201J65764k48102O71388l56103J11144M34751r14779N39332J46163
$$ -674092 -668891 -503127 -751229 -79841 -435944 -324800 109951 -804828 -265496 -119333
12764a19333L07193o57767j19845L41855l51123K11040O5481p169L94088j43677
$$ -119333 187860 -469907 -589752 -247897 -599020 -387980 -322499 -329668 64420 -79257
12754g9257l90128P5119p6447R0077m60256P30509J51829j35664Q04430k16299
$$ -79257 -469385 -394266 -470713 -380636 -840892 -110383 41446 -94218 710212 493913
12744D93913k47918M53467K79828j83429m32029K0153n81847m70290M15484M2433
$$ 493913 245995 699462 979290 795861 363832 383985 -197862 -668152 -252668 -210235
12734b10235M11358N61483m12373k46598K42303L94168j14029o93153j41747M36272
$$ -210235 201123 762606 350233 103635 345938 740106 626077 -67076 -208823 227449
12724B27449k16394J81467l91971M67066J93221J24269o65767J14704n3738j022697
$$ 227449 11055 192522 -199449 267617 460838 585107 -80660 34044 -19694 -1042391
12714a042391O37361P28061p94605o11965J253853L58438J62319m63775M36952
$$ -1042391 -405030 323031 -471574 -1083539 170314 528752 691071 227296 664248
12705F64248l04921l79145j04186J7430J43301j37452J94683O64192r82786q04489
$$ 664248 359327 -19818 -124004 -106574 36727 -100725 93958 758150 -224636 -1029125
12695a029125L19175R27824q2913l39031l81910L518R75368l57869n23287R55500
$$ -1029125 -709950 217874 134961 -204070 -585980 -582462 392906 35037 -488250 467250
12685D67250l30806j70666o8970l97636N99900P49222j2264j01717o81148K41272
$$ 467250 136444 -34222 -103192 -500828 99072 848294 836030 734313 53165 294437
12675B94437J1956n05005m2824M48448M13909q21314J47902K56882p03964K48615
$$ 294437 306393 -198612 -241436 207012 620921 -200393 -52491 204391 -499573 -250958
12665b50958M35911k65443N31267k86929o31260M48122L41384n29709j63522K32295
$$ -250958 184953 -80490 450777 163848 -467412 -19290 322094 -207615 -371137 -138842
12655a38842r6554p58140N46395K48992L84569J83040o92841N098l28627R17281
$$ -138842 -235396 -993536 -447141 -198149 186420 369460 -323381 -318283 -646910 270371
12645B70371l4609l77546j83243J70131Q36402l8987K30126p95564J757l23945
$$ 270371 235762 -141784 -325027 -154896 681506 642519 872645 77081 78838 -245107
12635b45107J09609j91015l07965k65919k86348Q8767N78997k63081J129983j091544
$$ -245107 -135498 -326513 -634478 -900397 -1186745 -1097978 -518981 -782062 347921 -743623
12625g43623j63000J284014o130l35215l52532l57037J26859P08558n03601k16082
$$ -743623 -906623 377391 371261 36046 -316486 -673523 -546664 161894 -341707 -557789
12615e57789N3766l90678L65007J544331r41785l95017J83971Q54196J8542l96170
$$ -557789 -504023 -894701 -529694 1014637 72852 -322165 -138194 716002 734544 338374
12605C38374o91006Q291m3512q0560R6950k13472Q64161o94117l13768K37801
$$ 338374 -352632 -344341 -387853 -468413 -371463 -584935 279226 -414891 -728659 -490858
12595d90858N00221J081338k11625k00303o30571o5918o99L02680p90944Q31819
$$ -490858 9363 1090701 879076 678773 48202 -17716 -18415 284265 -506679 325140
12585C25140M00587o74592O12868l29443k88079q48454M2735N3624k39410P94412
$$ 325140 725727 51135 664003 334560 46481 -801973 -759238 -705614 -945024 -150612
12575a50612K53569k47515M52458j9701k86240o98414k42725N83625O79133k94276
$$ -150612 102957 -144558 307900 288199 1959 -696455 -939180 -355555 323578 29302
12565B9302O09227k88390J79287j58607n11422L43251M9883P6007m20231m59575
$$ 29302 638529 350139 529426 370819 -140603 202648 252531 328538 -91693 -551268
12555e51268K16825K61237k02080O6263l22664l06280Q8880M5130J5983O64243
$$ -551268 -334443 -73206 -275286 -209023 -531687 -837967 -749087 -703957 -687974 -23731
12545b3731R18965k01743p01358m63728k64246N69509J1011M05887N4350J35087
$$ -23731 895234 693491 -7867 -471595 -735841 -166332 -155321 250566 304916 440003
12535D40003K94507k91778m00750M0332N14451m6996o06069K06642j49047j60565
$$ 440003 734510 442732 41982 82314 596765 549769 -56300 150342 1295 -159270
12525a59270r3972l8630k0984k30885J076447J02770q94727K43425L81305m434
$$ -159270 -253242 -291872 -312856 -543741 532706 635476 -259251 -15826 365479 361045
12515C61045L50019o79269L22010O3113j030960j61629K9808N62627K82799n52004
$$ 361045 711064 31795 353805 416918 -614042 -775671 -745863 -183236 99563 -452441
12505d52441o22899P36054Q24536k80311r0686m45424J84370N55363m92337J81026
$$ -452441 -1075340 -339286 485250 204939 114253 -331171 -146801 408562 -83775 97251
12495I7251M18238O29087n26286j212940m05358N81003J73024j85905O2541L80979
$$ 97251 515489 1144576 618290 -594650 -1000008 -419005 -245981 -431886 -369345 11634
12485A1634k56410j02372K89927q67770Q49056L54798j02459l426l52838L95862
$$ 11634 -244776 -347148 -57221 -924991 -75935 278863 176404 172978 -179860 216002
12475B16002J01744Q45172n44291n87715L45765j85393o00684P1525J38925l74001
$$ 216002 317746 1162918 618627 30912 376677 191284 -409400 -337875 -198950 -572951
12465e72951N25322Q13504k2301j102785K44857K35197q40729j79758L63127L28770
$$ -572951 -47629 765875 743574 -359211 -114354 120843 -719886 -899644 -536517 -207747
12455b07747N98616L37280l97543J33137q4758j98663L41100K00275q44728l10900
$$ -207747 390869 728149 330606 463743 378985 180322 521422 721697 -123031 -433931
12445d33931R64602P16323m04609n30644n32469K26720l68361L36658P75768j89191
$$ -433931 530671 1246994 842385 311741 -220728 5992 -362369 -25711 750057 560866
12435E60866n49013N31450l23268n80052L09697l83904M84554K81876k68142k77695
$$ 560866 11853 543303 220035 -360017 -50320 -434224 50330 332206 64064 -213631
12425b13631J287560l46503o0265q56245r4576L28538j30746P737M00211K8355
$$ -213631 1073929 727426 667161 -189084 -283660 44878 -85868 -78131 322080 350435
12415C50435K47882K06444l29720j22714k00900N5339Q85704L39441j18822j36109
$$ 350435 598317 804761 475041 352327 151427 206766 1092470 1431911 1313089 1176980
12405A176980m88599L42478n07202N4444k8649L22779K70463q29339n36113Q58003
$$ 1176980 688381 1030859 523657 578101 549452 872231 1142694 313355 -222758 635245
12395F35245j6212q40405J77083j59167J05884L01131P74671j63673J96802L94364
$$ 635245 619033 -221372 -44289 -203456 -97572 203559 978230 814557 1011359 1405723
12385A405723j69947m32090K60968M62319k63768j15657l28941o35271m14855
$$ 1405723 1235776 803686 1064654 1526973 1263205 1147548 818607 183336 -231519
12376b31519J104660j56029P122j58590M22231j88414J28219M41463o95420j17216
$$ -231519 873141 717112 724234 565644 987875 799461 927680 1369143 673723 556507
12366E56507l66401k69059L82516l85812K34358Q63561n71876o37401K44426M54898
$$ 556507 190106 -78953 303563 -82249 152109 1015670 443794 -193607 50819 505717
12356E05717j36038q1696p54756M75583l49104m14096N27903R91003m63364l92721
$$ 505717 369679 287983 -466773 8810 -340294 -754390 -226487 764516 301152 -91569
12346i1569L34926j91929J45151J71288J72867O50389J70865n06374l64439q76266
$$ -91569 243357 51428 196579 367867 540734 1191123 1361988 855614 491175 -385091
12336c85091M87069J81241K60382o05414l25093R0328J289954l19428l9660P81220
$$ -385091 101978 283219 543601 -61813 -386906 -296578 993376 673948 634288 1415508
12326A415508k95936j21954k57754l0089m18041N40695O9467p51842m27182N86119
$$ 1415508 1119572 997618 739864 709775 291734 832429 901896 150054 -277128 308991
12316C08991q27160N96098J299731m88680p45000L01089J68791J0689m65771m6055
$$ 308991 -518169 77929 1377660 888980 143980 445069 613860 624549 158778 112723
12306A12723J089950p4398j180775k50709O89673L23834M2399n00891O71057L45738
$$ 112723 1202673 1128275 -52500 -303209 386464 710298 752697 251806 922863 1268601
12296A268601K97926j194695l81475L26299m09452R35695K3916m4426O83142r1106
$$ 1268601 1566527 371832 -9643 316656 -92796 842899 866815 822389 1505531 1414425
12286A414425l06658l14990l72465n5520l72264K72045n6091k94033o2877K03338
$$ 1414425 1107767 792777 420312 364792 -7472 264573 208482 -85551 -148428 54910
12276E4910k53886L66729k16548n67919m81484K4694O58708O57459Q97297m88117
$$ 54910 -198976 167753 -48795 -616714 -1098198 -1073504 -414796 242663 1139960 651843
12266F51843K99645K13854Q01174o12629o53786q96025q84657Q61228R52540o97283
$$ 651843 951488 1165342 1966516 1353887 700101 -195924 -1080581 -219353 733187 35904
12256C5904O6461L21723R12266j05063M69828p99299m72576k46279k92183J60507
$$ 35904 102365 424088 1336354 1231291 1701119 901820 429244 182965 -109218 51289
12246E1289J9946P2140M99193N50786L18462o72067J30508m18127k17461M91598
$$ 51289 71235 143375 642568 1193354 1511816 839749 970257 552130 334669 826267
12236H26267k883O7343p02924o1327n07179P21811P78426J66644j357305R24927
$$ 826267 823384 890727 187803 126476 -380703 341108 1119534 1286178 -71127 853800
12226H53800j10951M01490K93088k11599o09120l82905k43667J317458J80036
$$ 853800 742849 1144339 1437427 1225828 616708 233803 -9864 1307594 1487630
12217A487630n63577L95031o5072o55052q6263J52850Q1432n33377M43724n89759
$$ 1487630 924053 1319084 1254012 598960 512697 665547 746979 213602 657326 67567
12207F7567j38565O65090k73820Q71668J98339k46837k28571m40222Q0585k55276
$$ 67567 -70998 594092 320272 1191940 1390279 1143442 914871 474649 555234 299958
12197B99958k06666K3388K84227N13705m5705Q2822j12409l99891P45833K69393
$$ 299958 93292 116680 400907 914612 868907 951729 839320 439429 1185262 1454655
12187A454655n49575K40339l5091K0941M82442n71760K23928m20816k34900M80495
$$ 1454655 905080 1145419 1110328 1131269 1613711 1041951 1265879 845063 610163 1090658
12177A090658k70533r57530O24731R1906r7692p07171K02224Q17741o90028P32693
$$ 1090658 820125 -137405 487326 579232 481540 -225631 -23407 794334 104306 836999
12167H36999K18992l40127L83014k75453L51054M64624p28568m17623R458M81492
$$ 836999 1055991 715864 1098878 823425 1174479 1639103 910535 492912 502370 983862
12157I83862L58258j76670j064427O29826J20159j62344j14239J91340l09836
$$ 983862 1342120 1165450 101023 730849 851008 688664 574425 765765 455929
12148D55929O32322k8323j77946l52932k83187O58410O89283m55020l61054N99886
$$ 455929 1088251 1059928 881982 529050 245863 904273 1593556 1138536 777482 1377368
12138A377368n23114l49096Q53810k44060K7535L93909J15124l23304O01082J57862
$$ 1377368 854254 505158 1358968 1114908 1142443 1536352 1651476 1328172 1929254 2087116
12128B087116L53427m79320o03407K70603j26474L73071m49307l92451n083j81144
$$ 2087116 2440543 1961223 1357816 1628419 1501945 1875016 1425709 1033258 1028175 847031
12118H47031M48452Q00241j87467o98502M6191k37800p16390L11791N68634O02302
$$ 847031 1295483 2095724 1908257 1209755 1255946 1018146 301756 613547 1182181 1784483
12108A784483M80779j089929n13118M78659J01713R9224J029921m42769l04826
$$ 1784483 2265262 1175333 662215 1140874 1242587 1341811 2371732 1928963 1624137
12099A624137p69943N69670P36330J20906J59344l51138j83359M0536j5842j39188
$$ 1624137 854194 1423864 2160194 2281100 2440444 2089306 1905947 1946483 1930641 1791453
12089A791453J00699m88501j3597l8360R0324j18252m08971O62660l95872J59273
$$ 1791453 1892152 1403651 1390054 1351694 1442018 1323766 914795 1577455 1181583 1340856
12079A340856J23924k6176l59159k83972M92187l856L13941o58468L63553P60109
$$ 1340856 1464780 1438604 1079445 795473 1287660 1283804 1597745 939277 1302830 2062939
12069B062939L20623k35339l18416J03130l58019N3148J29487K18084l86719J99427
$$ 2062939 2383562 2148223 1829807 1932937 1574918 1628066 1757553 1975637 1588918 1788345
12059A788345P25265r10105l66798L49051O01511K94743l05723r57467Q7815k52554
$$ 1788345 2513610 1603505 1236707 1585758 2187269 2482012 2176289 1218822 1306637 1054083
12049A054083P47252o94031L02145K86820L03769l70674n1764j4047j48290m06789
$$ 1054083 1801335 1107304 1409449 1696269 2000038 1629364 1577600 1563553 1415263 1008474
12039A008474J69765K73306p68430J23327K94994M4392p0701j69621j96545P23242
$$ 1008474 1178239 1451545 683115 806442 1101436 1145828 1075127 905506 708961 1432203
12029A432203L19N12781K04348o28956J403683P3941j226308n34779J64573n4982
$$ 1432203 1432522 1945303 2149651 1520695 2924378 2998319 1772011 1237232 1401805 1346823
12019A346823k4873O97050P57622m37655k71013M80354J63315n32212l23303m95982
$$ 1346823 1321950 2019000 2776622 2338967 2067954 2548308 2711623 2179411 1856108 1360126
12009A360126j59763O88912J0272r40618J10251P43635O5183k59643L68404M13902
$$ 1360126 1200363 1889275 1899547 958929 1069180 1812815 1877998 1618355 1986759 2400661
11999B400661n035k32658o0489M44304J92292l29082K14604l36712K36382N00962
$$ 2400661 2395626 2162968 2102479 2546783 2739075 2409993 2624597 2287885 2524267 3025229
11989C025229j202560R460K21433n06630J46929J40627o52555J011832Q61554
$$ 3025229 1822669 1832129 2053562 1546932 1693861 1834488 1181933 2193765 3055319
11980C055319M91527m72651o48644p61415m23138N51686R78997N1536L05054j523312
$$ 3055319 3546846 3074195 2425551 1664136 1240998 1792684 2771681 2823217 3128271 1604959
11970A604959j033054M92619O26112J136644M47147m65048j03192J69789m46657
$$ 1604959 571905 1064524 1690636 2827280 3274427 2809379 2706187 2875976 2429319
11961B429319l1854k3939l39854M92809N80632o60238n50902l58477L76462J17664
$$ 2429319 2397465 2373526 2033672 2526481 3107113 2446875 1895973 1537496 1913958 2031622
11951B031622N24415R43733l67366l52180m42814K87532j31704R39112Q7186J22614
$$ 2031622 2556037 3499770 3132404 2780224 2337410 2624942 2493238 3432350 3519536 3642150
11941C642150p4015m51760p75172n28552P55777K04385q0575M78980k88730j29345
$$ 3642150 3568135 3116375 2341203 1812651 2568428 2772813 2692238 3171218 2882488 2753143
11931B753143p17958l64417Q65501M38848j052024m12366Q71679K83867K91281
$$ 2753143 2035185 1670768 2536269 2975117 1923093 1510727 2382406 2666273 2957554
11922B957554j68654R42122Q1550p98998J92115Q99631o13780l57071k6092n19355
$$ 2957554 2788900 3731022 3812572 3013574 3205689 4105320 3491540 3134469 3108377 2589022
11912B589022Q03559n32898p77328L94888L09031N90855k63678l44504q5507L91001
$$ 2589022 3392581 2859683 2082355 2477243 2786274 3377129 3113451 2768947 2683440 3074441
11902C074441k45057o29840M33124j12028k64485R15852p67020n47783J78438
$$ 3074441 2829384 2199544 2632668 2520640 2256155 3172007 2404987 1857204 2035642
11893B035642J5766K56204Q03272r9766l5114j72325k00635o03665R52447K65323
$$ 2035642 2051408 2307612 3110884 3011118 2976004 2803679 2603044 1999379 2951826 3217149
11883C217149o61143M33168j49381l67151L14425q59031r0660J415572l59484
$$ 3217149 2556006 2989174 2839793 2472642 2787067 1928036 1837376 3252948 2893464
11874B893464P85291p18090Q04646p780K76150j76581p99946M98124k8219k04778
$$ 2893464 3678755 2960665 3765311 3757531 4033681 3857100 3057154 3555278 3527059 3322281
11864C322281J64749L92300n59841m10781M95148M90348K19732m20519q5252R1483
$$ 3322281 3487030 3879330 3319489 2908708 3403856 3894204 4113936 3693417 3608165 3699648
11854C699648p42038Q17407M95273L08821p35410P8776O05163l81152n11784Q18942
$$ 3699648 2957610 3775017 4270290 4579111 3843701 3922477 4527640 4146488 3634704 4453646
11844D453646P2257j041264j64762K77163J52481r838k28357K20587J0130J04382
$$ 4453646 4525903 3484639 3319877 3597040 3749521 3739683 3511326 3731913 3742043 3846425
11834C846425r3539O22943l70309K27105R99860l47329n72287N2005P89953K35367
$$ 3846425 3752886 4375829 4005520 4232625 5232485 4885156 4312869 4364874 5154827 5390194
11824E390194j10252M44801o9327K47951r29771o08314j18613N16306L59725l13897
$$ 5390194 5279942 5724743 5655416 5903367 4973596 4365282 4246669 4762975 5122700 4808803
11814D808803N41719K31719L49359q68905l23282l65863J20755J63342M48347
$$ 4808803 5350522 5582241 5931600 5062695 4739413 4373550 4494305 4657647 5105994
11805E105994J60417p4553j221275L42977N52554K4543q2048P38996N22251l56929
$$ 5105994 5266411 5191858 3970583 4313560 4866114 4890657 4808609 5547605 6069856 5712927
11795E712927m87146N18889m76416N6513L72181l6374k2550K43066J85980L70884
$$ 5712927 5225781 5744670 5268254 5324767 5696948 5660574 5638024 5881090 6067070 6437954
11785F437954p3500m84511o91676K99405O79504o70136M5255l49877K88614J07762
$$ 6437954 6364454 5879943 5188267 5487672 6167176 5497040 5542295 5192418 5481032 5588794
11775E588794K84343k61076r73280K35234P00552n64181M81735M19978J06919
$$ 5588794 5873137 5612061 4638781 4874015 5574567 5010386 5492121 5912099 6019018
11766F019018J29596n62846m18592J3362j05621R01411q489m5656J51253P79491
$$ 6019018 6148614 5585768 5167176 5180538 5074917 5976328 5967839 5922183 6073436 6852927
11756F852927O11036q60066o08627q6828r6749J269127n51588q36665Q17521P4409
$$ 6852927 7463963 6603897 5995270 5908442 5811693 7080820 6529232 5692567 6510088 6584497
11746F584497o14514K34587L24364L22815M13027K04186p32748k80947O33537
$$ 6584497 5969983 6204570 6528934 6851749 7264776 7468962 6736214 6455267 7088804
11737G088804J84503M12925N3929K35792L83271m19582o53471J15239j75374n53232
$$ 7088804 7273307 7686232 7740161 7975953 8359224 7939642 7286171 7401410 7226036 6672804
11727F672804k34478O87299J194193J40306n82644J08962K79700r05416K12458
$$ 6672804 6438326 7125625 8319818 8460124 7877480 7986442 8266142 7360726 7573184
11718G573184m7563N07979R7103n48674J287864j46398p72458l18058M45938m92341
$$ 7573184 7525621 8033600 8130703 7582029 8869893 8723495 7951037 7632979 8078917 7586576
11708G586576k21799O25420M6698o52480M85079K15468J90696J089871K19662
$$ 7586576 7364777 7990197 8036895 7384415 7869494 8084962 8275658 9365529 9585191
11699I585191p15798l51013j98053K35086n06495O94777M8848k29621P06629J40207
$$ 9585191 8869393 8518380 8320327 8555413 8048918 8743695 8792543 8562922 9269551 9409758
11689I409758J899O3409N82966O37416m96878p28085l09728R77420j95148J60248
$$ 9409758 9411657 9475066 10058032 10695448 10198570 9470485 9160757 10138177 9943029 10103277
11679A0103277q497j33800N16231K97790p94925o79602J137539L85740J5652P7440
$$ 10103277 10094780 9960980 10477211 10775001 9980076 9300474 10438013 10823753 10839405 10916845
11669A0916845n19864R75473L47631k42003k12212N401K56936j143246J224525
$$ 10916845 10396981 11372454 11720085 11478082 11265870 11271271 11528207 10384961 11609486
11660A1609486p2364k83840l083R23158m1438n36844J126933K76191M17195n2723
$$ 11609486 11537122 11253282 11250199 12173357 12131919 11595075 12722008 12998199 13415394 13362671
11650A3362671q40177m54310P0638L77306M0474K64103N90473j96988R56551m61329
$$ 13362671 12522494 12068184 12138822 12516128 12556602 12820705 13411178 13214190 14170741 13709412
11640A3709412l20614o6903j038295P49838O98841M05964k6427Q2259L54214K77848
$$ 13709412 13388798 13321895 12283600 13033438 13732279 14138243 14111816 14194075 14548289 14826137
11630A4826137l62497L64304j08864K25179o06672P56612L8554K3039K2997N60817
$$ 14826137 14463640 14827944 14719080 14944259 14337587 15094199 15132753 15155792 15178789 15739606
11620A5739606j92387M88423P31395j131590J323924J13814n67200O91571n34160
$$ 15739606 15547219 16035642 16767037 15635447 16959371 17073185 16505985 17197556 16663396
11611A6663396q55238R94695M53193m95559J72816N12017n5169j52222M92972
$$ 16663396 15808158 16802853 17256046 16760487 16933303 17445320 17390151 17237929 17730901
11602A7730901P54504k23551J07068j3673K07696m2988J89223P6049Q51969L88596
$$ 17730901 18485405 18261854 18368922 18355249 18562945 18519957 18709180 18785229 19637198 20025794
11592B0025794l08233J52050N65339P9598k08805K51301n48278O28716J3591P51396
$$ 20025794 19717561 19869611 20434950 20514548 20305743 20557044 20008766 20637482 20651073 21402469
11582B1402469O07672j83502k523J7802o55549K59727M42128L09963J059375j72372
$$ 21402469 22010141 21826639 21824116 21841918 21186369 21446096 21888224 22198187 23257562 23085190
11572B3085190j78946J67673P59437O91842K69827k32869l89814J118440O30247
$$ 23085190 22906244 23073917 23833354 24525196 24795023 24562154 24172340 25290780 25921027
11563B5921027n27302J16136R9750R28770j21177J71003j90806M80223M89617
$$ 25921027 25393725 25509861 25609611 26538381 26417204 26588207 26397401 26877624 27367241
11554B7367241J04634M23190K82069l99983N61314J257163l20652L22424R41768
$$ 27367241 27471875 27895065 28177134 27777151 28338465 29595628 29274976 29597400 30539168
11545C0539168n31555L22339O53566K35986M96722M57182m19957j36382L18850
$$ 30539168 30007613 30329952 30983518 31219504 31716226 32173408 31753451 31617069 31935919
11536C1935919Q98166P42028N54186J79018j90075P27898j54489L34489Q32097
$$ 31935919 32834085 33576113 34130299 34309317 34119242 34847140 34692651 35027140 35859237
11527C5859237K26839J024985k55770Q1403Q07520j83234J089318R26509M10917
$$ 35859237 36086076 37111061 36855291 36936694 37744214 37560980 38650298 39576807 39987724
11518C9987724J77077L1900L21508R56461Q13868O86930Q53996O27572p6671Q66764
$$ 39987724 40164801 40196701 40518209 41474670 42288538 42975468 43829464 44457036 44380365 45247129
11508D5247129l84053J182398o14761l00882J373193m3785O12401P17003P69853
$$ 45247129 44863076 46045474 45430713 45129831 46503024 46459239 47071640 47788643 48558496
11499D8558496N49030O59898R54816Q03625N4037L5906J048337J444733J012595
$$ 48558496 49107526 49767424 50722240 51525865 51579902 51615808 52664145 54108878 55121473
11490E5121473K19278J482032O72699N69894N20138R40116O90806K91435J104060
$$ 55121473 55340751 56822783 57495482 58065376 58585514 59525630 60216436 60507871 61611931
11481F1611931J014778M45296M79113R30795Q37813J587256R19630J163746K56454
$$ 61611931 62626709 63072005 63551118 64481913 65319726 66906982 67826612 68990358 69246812
11472F9246812J018555J540567N61102P04978K477623J373670O51272J037364
$$ 69246812 70265367 71805934 72367036 73072014 75549637 76923307 77574579 78611943
11464G8611943J41265J232752J111576J226574J527205J515151J942746Q42692
$$ 78611943 78753208 79985960 81097536 82324110 83851315 85366466 87309212 88151904
11456H8151904J283724J598179O45565J482589K035559O85377J766765K087841
$$ 88151904 89435628 91033807 91679372 93161961 95197520 95882897 97649662 99737503
11448I9737503J785266J918876R05455J712619K025451J337705K986039J054943
$$ 99737503 101522769 103441645 104347100 106059719 108085170 109422875 112408914 113463857
11440A13463857J806221K257165J365419L103303J606568J382494K158788K894356
$$ 113463857 115270078 117527243 118892662 121995965 123602533 124985027 127143815 130038171
11432A30038171K081623K074047K610458J711593K598457K358967K836703K523194
$$ 130038171 132119794 134193841 136804299 138515892 141114349 143473316 146310019 148833213
11424A48833213L154139K972420K543753K784663K652358K615334L215109L233564
$$ 148833213 151987352 154959772 157503525 160288188 162940546 165555880 168770989 172004553
11416A72004553K960552L296524L356217L402671L123509M301341L833091M916050
$$ 172004553 174965105 178261629 181617846 185020517 188144026 192445367 196278458 201194508
11408B01194508L903480L363764L259375M683624M065880M127316N478052M300278
$$ 201194508 205097988 208461752 211721127 216404751 220470631 224597947 230075999 234376277
11400B34376277M313657M685925M703740M421303N775568M961881N209766L797974
$$ 234376277 238689934 243375859 248079599 252500902 258276470 263238351 268448117 272246091
11392B72246091N207029O095008N700121N911040N269158N925425O183304O299060
$$ 272246091 277453120 283548128 289248249 295159289 300428447 306353872 312537176 318836236
11384C18836236N819952O100561O179293O443171O009227O003237O494808O677834
$$ 318836236 324656188 330756749 336936042 343379213 349388440 355391677 361886485 368564319
11376C68564319P017894O182326O369734O044236N814855P624179P257445O451636
$$ 368564319 375582213 381764539 388134273 394178509 399993364 407617543 414874988 421326624
11368D21326624O627974O405271N923293N828921N933441O054595N915920O118251
$$ 421326624 427954598 434359869 440283162 446112083 452045524 458100119 464016039 470134290
11360D70134290N666570M427793M274771M507476M621302M015898K915082L395092
$$ 470134290 475800860 480228653 484503424 489010900 493632202 497648100 500563182 503958274
11352E03958274L553693K791046J258695K571349K711584M66792P22369R78033
$$ 503958274 507511967 510303013 511561708 514133057 516844641 517311433 518033802 519011835
11344E19011835J0938q79481j071841k85768j805335k774993k811004k782435
$$ 519011835 519022773 518143292 517071451 516785683 514980348 512205355 509394351 506611916
11336E06611916k529609k984297l431516l949956m891075n750580m298503m848181
$$ 506611916 504082307 501098010 497666494 493716538 488825463 483074883 478776380 473928199
11328D73928199l782221n585580p186329n428698o408404o184420o070437o002044
$$ 473928199 470145978 464560398 457374069 451945371 445536967 439352547 433282110 427280066
11320D27280066o559844n759834o468109o718670n828452o224172o803612o978806
$$ 427280066 420720222 414960388 408492279 401773609 395945157 389720985 382917373 375938567
11312C75938567o618741o870661o807222n636922o790875n640415n846786n997616
$$ 375938567 369319826 362449165 355641943 350005021 343214146 337573731 331726945 325729329
11304C25729329o304529n422869o202059o024771n011559n399920n487207n252222
$$ 325729329 319424800 314001931 307799872 301775101 296763542 291363622 285876415 280624193
11296B80624193n938777n776752m207929m971530m230676m599535m983669m886114
$$ 280624193 274685416 268908664 264700735 259729205 255498529 250898994 245915325 241029211
11288B41029211m563825n121066l743960m465241m292292l999499l568470l489817
$$ 241029211 236465386 231344320 227600360 223135119 218842827 214843328 211274858 207785041
11280B07785041l893776l521928l834291m350662l558271k803088l226843l310972
$$ 207785041 203891265 200369337 196535046 192184384 188626113 185823025 182596182 179285210
11272A79285210k958152l119292k798839l123493l592963k729077l443832j899852
$$ 179285210 176327058 173207766 170408927 167285434 163692471 160963394 157519562 155619710
11264A55619710k240910k680128l244189k767445k687686l176074j188311j737974
$$ 155619710 153378800 150698672 147454483 144687038 141999352 138823278 137634967 135896993
11256A35896993k486298l487254j716244j448641k436359j669912j791519k276843
$$ 135896993 133410695 129923441 128207197 126758556 124322197 122652285 120860766 118583923
11248A18583923j271122j843729k076301k409285j437969k013063j699268k394089
$$ 118583923 117312801 115469072 113392771 110983486 109545517 107532454 105833186 103439097
11240A03439097o00850j554465j505172j671658j527259j554739k130814j084229
$$ 103439097 102838247 101283782 99778610 98106952 96579693 95024954 92894140 91809911
11232I1809911j328530p05485j484818q76781j676925j491500j227889k349696
$$ 91809911 90481381 89775896 88291078 87414297 85737372 84245872 83017983 80668287
11224H0668287q54388k05647j152561m31074j579690j361401l74273j279107j249627
$$ 80668287 79813899 79608252 78455691 78024617 76444927 75083526 74709253 73430146 72180519
11215G2180519j142758q65722q50962j318379p10040q21563j316343j015955n90172
$$ 72180519 71037761 70172039 69321077 68002698 67292658 66471095 65154752 64138797 63548625
11206F3548625o14887j233908q35267j202991k98476m58699r7419l54384j407050
$$ 63548625 62933738 61699830 60864563 59661572 59363096 58904397 58806978 58452594 57045544
11197E7045544p13043r78698q8061r77051m50037j390616N16976r84315o53850
$$ 57045544 56332501 55353803 55265742 54288691 53838654 52448038 52965014 51980699 51326849
11188E1326849j143888l47804l17231j939837m29011k8168l79726k66788j35556
$$ 51326849 50182961 49835157 49517926 47578089 47149078 47120910 46741184 46474396 46338840
11179D6338840j222561p06188k28449j490747K52162j60470r10713N91616j428721
$$ 46338840 45116279 44410091 44181642 42690895 42943057 42782587 41871874 42463490 41034769
11170D1034769j304628r6091J32835n76826o9594j141221k36339M0061q10743
$$ 41034769 39730141 39634050 39766885 39190059 39120465 37979244 37742905 37782966 36972223
11161C6972223j17713n48467j088856o88450o04202K6772N02590o09168j48211
$$ 36972223 36854510 36306043 35217187 34528737 33924535 33951307 34453897 33844729 33696518
11152C3696518q17373n8135j22190o93086p77615r62714L91407l51746l56337
$$ 33696518 32879145 32821010 32698820 32005734 31228119 30265405 30656812 30305066 29948729
11143B9948729j47346L25673j06008p25562j48825l72195J6224p89954l82788
$$ 29948729 29801383 30127056 30021048 29295486 29146661 28774466 28790690 28000736 27617948
11134B7617948r8591j61816m34853Q720r36437j29971J69697l63702k8818j28717
$$ 27617948 27519357 27357541 26922688 26931408 25994971 25865000 26034697 25670995 25642177 25513460
11124B5513460n59928j87746o95308n21946K38115M14726j188189J36284J94640
$$ 25513460 24953532 24765786 24070478 23548532 23786647 24201373 23013184 23149468 23344108
11115B3344108o32962m59632n27161K82809n88874Q8467j89132P99177r32969
$$ 23344108 22711146 22251514 21724353 22007162 21418288 21506755 21317623 22116800 21183831
11106B1183831k14956m40213l93572K48200j93799o00248j52650m9651K37918
$$ 21183831 20968875 20528662 20135090 20383290 20189491 19589243 19436593 19386942 19624860
11097A9624860o80655J3019k52164o15276M35505M4203p84476k09176J17520k41396
$$ 19624860 18944205 18957224 18705060 18089784 18525289 18569492 17785016 17575840 17693360 17451964
11087A7451964m94077K58438M12452j34516k31971l82292p2687j13496N80669
$$ 17451964 16957887 17216325 17628777 17494261 17262290 16879998 16807311 16693815 17274484
11078A7274484p47526j17765p1244j269301O74975M79795k82562m62380j207620
$$ 17274484 16526958 16409193 16337949 15068648 15743623 16223418 15940856 15478476 14270856
11069A4270856J67980O08025O22175q3883k34032L5230o72624k26256O68125p22501
$$ 14270856 14438836 15046861 15669036 15585153 15351121 15386351 14713727 14487471 15155596 14433095
11059A4433095K78739J92451k46280o31314l33207P6278k33485N66535M96869
$$ 14433095 14711834 14904285 14658005 14026691 13693484 13769762 13536277 14102812 14599681
11050A4599681k27243j489441K81148O45560k44534r97513J54208p10933N9975
$$ 14599681 14372438 12882997 13164145 13809705 13565171 12567658 12721866 12010933 12070908
11041A2070908K30795K81553J77475K210n61906K7855n7222n55753P5884j15731
$$ 12070908 12301703 12583256 12760731 12762941 12201035 12228890 12171668 11615915 11691799 11576068
11031A1576068K29409o1690J82362q0385n31951l26736k0179K94059K375o61755
$$ 11576068 11805477 11743787 11926149 11845764 11313813 10987077 10966898 11260957 11263332 10601577
11021A0601577m4930l03924j27887q7513L78284l5327m43552N36368n84362J20025
$$ 10601577 10556647 10252723 10124836 10037323 10415607 10380280 9936728 10473096 9888734 10008759
11011A0008759j20578n82999M25299r7765q68420M6277j83649r34933L24887Q26392
$$ 10008759 9888181 9305182 9730481 9632716 8764296 8810573 8626924 7691991 8016878 8843270
11001H843270K99560j77013J15973m54460j23187P01195L62109j37165M7092p48102
$$ 8843270 9142830 8965817 9081790 8627330 8504143 9205338 9567447 9430282 9477374 8729272
10991H729272k18873o81027n22879N15083N18135J65882M56581j66072J3592n64528
$$ 8729272 8510399 7829372 7306493 7821576 8339711 8505593 8962174 8796102 8809694 8245166
10981H245166J55447p88656p70963l75615Q19300M93478K49904q29187J1551l01529
$$ 8245166 8400613 7611957 6840994 6465379 7284679 7778157 8028061 7198874 7210425 6908896
10971F908896P7145k58394J9427O73987J95345k4158L364L37399q25608K47725
$$ 6908896 6986041 6727647 6747074 7421061 7616406 7592248 7595612 7933011 7107403 7355128
10961G355128K67379k31646j491347Q05905M90728l88491m81746O5571N50379
$$ 7355128 7622507 7390861 5899514 6705419 7196147 6807656 6325910 6391481 6941860
10952F941860l00083L06564K88506n38922l18027k19737o24173J08486N69824
$$ 6941860 6641777 6948341 7236847 6697925 6379898 6160161 5535988 5644474 6214298
10943F214298k70058J87160m41308Q31667L65779o57706J68002p12165k51843
$$ 6214298 5944240 6131400 5690092 6521759 6887538 6229832 6397834 5685669 5433826
10934E433826l62051l55410M00836K95369M77430O72501r01984k68721L31556
$$ 5433826 5071775 4716365 5117201 5412570 5890000 6562501 5660517 5391796 5723352
10925E723352j28274N31597n86474j76576l72030n4849j89565n787J45846O32161
$$ 5723352 5595078 6126675 5540201 5363625 4991595 4936746 4747181 4741394 4887240 5519401
10915E519401q59077K70954N2355N9676O9650K91520j100380J24610L53995k06657
$$ 5519401 4660324 4931278 4983633 5043309 5112959 5404479 4304099 4428709 4782704 4576047
10905D576047j04216Q08401m51945o57556M37565k33027J04053k52427N91449
$$ 4576047 4471831 5280232 4828287 4170731 4608296 4375269 4479322 4226895 4818344
10896D818344K15576L51324r94588m78973o63346P69293L92502K41263l68858
$$ 4818344 5033920 5385244 4390656 3911683 3248337 4017630 4410132 4651395 4282537
10887D282537k61710L43706M33464K58082l16764n86533O77580J09953p10202
$$ 4282537 4020827 4364533 4797997 5056079 4739315 4152782 4830362 4940315 4230113
10878D230113l71841o95978n36689Q08137N68066P18839k21314o57461K19598
$$ 4230113 3858272 3162294 2625605 3433742 4001808 4720647 4499333 3841872 4061470
10869D061470l93364J24560n9752K2503K72182O61630k12509o61315L06139k02919
$$ 4061470 3668106 3792666 3732914 3755417 4027599 4689229 4476720 3815405 4121544 3918625
10859C918625n9911L04508L54612K01010j15378q32622n05489M73650J64483q35780
$$ 3918625 3858714 4163222 4517834 4718844 4603466 3770844 3265355 3739005 3903488 3067708
10849C067708j11180r5303k71750O68162K69048l46501M11552n1757R0723J12508
$$ 3067708 2956528 2861225 2589475 3257637 3526685 3180184 3591736 3539979 3630702 3743210
10839C743210K29022J89394l06860m03007M42990K57859m57044j91278n75844
$$ 3743210 3972232 4161626 3854766 3451759 3894749 4152608 3695564 3504286 2928442
10830B928442j97675J46591o20929k65067J96918L83311O46474J50703k8389o02948
$$ 2928442 2730767 2877358 2256429 1991362 2188280 2571591 3218065 3368768 3340379 2737431
10820B737431M15511q31432M08838P04850l49833N35597J63753q60672m66790
$$ 2737431 3152942 2321510 2730348 3435198 3085365 3620962 3784715 2924043 2457253
10811B457253L22038J44584K38460o28436M32475l87K31761M96898j427033K48706
$$ 2457253 2779291 2923875 3162335 2533899 2966374 2965987 3197748 3694646 2267613 2516319
10801B516319P08764m76705J030599K01199n26106m77463l28062m02996k02097
$$ 2516319 3225083 2748378 3778977 3980176 3454070 2976607 2648545 2245549 2043452
10792B043452J22986l88316N70184M0597M407q0999j22658K77643L51470q7539
$$ 2043452 2166438 1778122 2348306 2388903 2393310 2312311 2189653 2467296 2818766 2731227
10782B731227k04670k23565j79297L19635k71909l31316O01934j56526J84972
$$ 2731227 2526557 2302992 2123695 2443330 2171421 1840105 2442039 2285513 2470485
10773B470485Q76913m14184m62246n11741J56512J075597M1546p44901J3221J17631
$$ 2470485 3347398 2933214 2470968 1959227 2115739 3191336 3232882 2487981 2501202 2618833
10763B618833q08231L68615k13449J16722N99432k10670j382313N48408M00384
$$ 2618833 1810602 2179217 1965768 2082490 2681922 2471252 1088939 1637347 2037731
10754B037731n05435O69370n6448m34196L84079l18868J69883n06988j55747L8660
$$ 2037731 1532296 2201666 2145218 1711022 2095101 1776233 1946116 1439128 1283381 1322041
10744A322041J01266K52853q3271j019823Q9739J775381j06216j086557K00276
$$ 1322041 1423307 1676160 1592889 573066 662805 2438186 2331970 1245413 1445689
10735A445689O35838Q9824k50891l74050j194462Q75075L92453q86512P74160
$$ 1445689 2081527 2171351 1920460 1546410 351948 1227023 1619476 732964 1507124
10726A507124O78092L69737m54770P432o64578K51425j08330m34035Q09168k44803
$$ 1507124 2185216 2554953 2100183 2107615 1443037 1694462 1586132 1152097 1961265 1716462
10716A716462p93797M14205R8597R83771k70882j85256J96642k95096l30692L48748
$$ 1716462 922665 1336870 1435467 2419238 2148356 1963100 2159742 1864646 1533954 1882702
10706A882702l40333p09155j17405K48950N64581R0198L8092Q46694m37370o43520
$$ 1882702 1542369 833214 715809 964759 1529340 1619538 1657630 2504324 2066954 1423434
10696A423434J79983P36416J47854p34484k22468L00321m57012o3253Q0746o49217
$$ 1423434 1603417 2339833 2487687 1753203 1530735 1831056 1374044 1310791 1391537 742320
10686G42320J73523J12706M83900N81085n19941m0345J48538n11096o20756J473806
$$ 742320 915843 1028549 1512449 2093534 1573593 1533248 1681786 1170690 549934 2023740
10676B023740L17880o29935l28969k02026K87069m86178n71542N18603N04232
$$ 2023740 2341620 1711685 1382716 1180690 1467759 981581 410039 928642 1432874
10667A432874Q43386j188931l96657K86969K36584K71777k24419k91103l78959
$$ 1432874 2276260 1087329 690672 977641 1214225 1486002 1261583 970480 591521
10658E91521O6265n36348l2642K57696L27378O96407j21079m87526M80845o6932
$$ 591521 657786 121438 88796 346492 673870 1370277 1249198 761672 1242517 1175585
10648A175585N5633q07546L09714O6316N11M70949j54071J51009K06507k93900
$$ 1175585 1231218 423672 733386 799702 800213 1271162 1117091 1268100 1474607 1180707
10638A180707L36011n63621n4707L5295m78913n57703J65808J253736j65939n52971
$$ 1180707 1516718 953097 898390 933685 454772 -102931 62877 1316613 1150674 597703
10628E97703O90941l97757n97941M77594l99867l97155Q83979O3881K8018P2397
$$ 597703 1288644 890887 292946 770540 370673 -26482 857497 921378 949396 1021793
10618A021793q21390J052483J94770m89171j92486n86862k2881K8563K33049N07566
$$ 1021793 200403 1252886 1447656 958485 765999 179137 156256 184819 417868 925434
10608I25434N75643r30688L44822n862n50919L4984O9733J72806Q0741K06131
$$ 925434 1501077 570389 915211 909349 358430 393414 463147 635953 716694 922825
10598I22825J65669R4692l7282l89819J86681N00417k12938k30371K741m43261
$$ 922825 1088494 1183186 1145904 756085 942766 1443183 1230245 999874 1002615 559354
10588E59354j22939K41299l73863L77362M08540o40804O57506j18453l09178o61527
$$ 559354 436415 677714 303851 681213 1089753 448949 1106455 988002 678824 17297
10578A7297k76091P0907N26937K78662n93231m65699M25663P43187O79987k77524
$$ 17297 -258794 -187887 339050 617712 24481 -441218 -15555 727632 1407619 1130095
10568A130095K988o81148o98773p1265L68035N71391j94870L8572j71218K05598
$$ 1130095 1133083 451935 -246838 -318103 49932 621323 426453 465025 293807 499405
10558D99405o8496L8996K77357p5691k5377P327O32061L49953l85351k25223m2959
$$ 499405 430909 469905 747262 671571 646194 653521 1285582 1635535 1250184 1024961 982002
10547I82002l42584N9028m38903k93103K8951n00778O52851J64399Q61273o26486
$$ 982002 639418 698446 259543 -33560 -4609 -505387 147464 311863 1173136 546650
10537E46650j87481m51912L19301j34245P7889m50034p07822K70177J306078j39066
$$ 546650 359169 -92743 226558 92313 170202 -279832 -987654 -717477 588601 449535
10527D49535n77691K07635l28658N77373L83391j12806L57540K23753r30615m93359
$$ 449535 -128156 79479 -249179 328194 711585 598779 956319 1180072 249457 -243902
10517b43902K77773J74442N98099k73592k81217K48062j027113o4835Q18394O0294
$$ -243902 33871 208313 806412 532820 251603 499665 -527448 -592283 226111 286405
10507B86405M8635n72681O99664L87238q2354k94573J92519k04211p9199k54316
$$ 286405 335040 -237641 462023 849261 766907 472334 664853 460642 381443 127127
10497A27127J51512j17363l79721N41484j19984p4584K92319O1956l20963P80056
$$ 127127 278639 161276 -218445 323039 203055 128471 420790 482746 161783 941839
10487I41839j79566j67549J00852o2183k0437k57264l08112l69154n22210M80950
$$ 941839 762273 594724 695576 633393 612956 355692 47580 -321574 -843784 -362834
10477c62834P89524j73532K49465n72637k80317J79982L29881o78934j67648J075190
$$ -362834 426690 253158 502623 -70014 -350331 -170349 159532 -519402 -687050 388140
10467C88140p19295N91433j19329p81364M52498L42917L66646P87448j00544m71389
$$ 388140 -331155 260278 140949 -640415 -187917 155000 521646 1309094 1208550 737161
10457G37161m71968P1339k02406j87006L07171P03169R9643p95116p24426K79872
$$ 737161 265193 336532 134126 -52880 254291 957460 1057103 261987 -462439 -182567
10447a82567N55910J30583j26482j12821L06389R82887m11486k8000n94331m18838
$$ -182567 373343 503926 377444 264623 571012 1553899 1142413 1114413 520082 101244
10437A01244m94421j13730M59791J36563J08611m70016M17604M49070M5456j14994
$$ 101244 -393177 -506907 -47116 89447 198058 -271958 145646 594716 640172 525178
10427E25178q45213J80416R83589p23357n41136R57585m43951m1479N98282n49398
$$ 525178 -320035 -139619 843970 120613 -420523 537062 93111 51632 649914 100516
10417A00516k842r8438O07356k74234k56527M9422J4498N86518j36514p53115
$$ 100516 97674 -764 606592 332358 75831 125253 139751 726269 589755 -163360
10407a63360j26935L8917R64444n76972n20917O00715N546L71948o04883Q88728
$$ -163360 -290295 -251378 713066 136094 -384823 215892 221438 593386 -11497 877231
10397H77231j14196j085405k9192M91902K10343k87747O140K53931j4434m09609
$$ 877231 763035 -322370 -351562 140340 350683 62936 69076 323007 308573 -101036
10387a01036J68091J97740j28243K33724k80823q00429Q71011j59116l59901N43210
$$ -101036 67055 264795 136552 370276 89453 -710976 160035 919 -358982 184228
10377A84228M67033l67756p005l03979m04106L29623L48568j0855k31457J43064
$$ 184228 651261 283505 276500 -27479 -431585 -101962 246606 235751 4294 147358
10367A47358j11054j02967L73395j10278m48121j32593P42730o56438K38448N93664
$$ 147358 36304 -66663 306732 196454 -251667 -384260 358470 -297968 -59520 534144
10357E34144m70990M19536j62077l81380L59809K17793J50344j2374j66829K51045
$$ 534144 63154 482690 320613 -60767 299042 516835 667179 654805 487976 739021
10347G39021m45534m57029L83597O56046o30521l27581J36663o23545o48521J402351
$$ 739021 293487 -163542 220055 876101 245580 -82001 54662 -568883 -1217404 184947
10337A84947j17916q49137n46317R08558J81951m0909P33307n6921o79028p7099
$$ 184947 67031 -782106 -1328423 -419865 -237914 -278823 454484 397563 -281465 -358564
10327c58564L61179j80249J39575n69712K60619j63608m1332J051960j145212
$$ -358564 2615 -177634 -38059 -607771 -347152 -510760 -552092 499868 -645344
10318f45344R92401o868l95923k19134q78368O24892k42275K88575P64654P158
$$ -645344 347057 340189 -55734 -274868 -1153236 -528344 -770619 -482044 282610 289768
10308B89768r97482M15727J074952j17189j035736J2532N39340K39292p53677
$$ 289768 -707714 -291987 782965 665776 -369960 -357428 181912 421204 -332473
10299c32473K61613P48441p90400j85870M57560r90352Q52364j04065m88146o86434
$$ -332473 -70860 677581 -112819 -298689 158871 -831481 20883 -83182 -571328 -1257762
10289a257762m59078P25842K38800n56412R9098M68798J49499L03162K3595l18758
$$ -1257762 -1716840 -990998 -752198 -1308610 -1209512 -740714 -591215 -288053 -264458 -583216
10279e83216m19288j9984O5482k69775L98728M76472N49459k73161J55864l25293
$$ -583216 -1002504 -1022488 -957006 -1226781 -828053 -351581 197878 -75283 80581 -244712
10269b44712o66181J124827L00605n45988o43628j75107J363188P94811j11177
$$ -244712 -910893 213934 514539 -31449 -675077 -850184 513004 1307815 1196638
10260A196638p14277j60748Q90592o83019j28471K36038r82015k02422N11004
$$ 1196638 482361 321613 1212205 529186 400715 636753 -345262 -547684 -36680
10251c6680M67971R1009n28762o94347l47951L77956L73445p76027M89785J381880
$$ -36680 431291 522300 -6462 -700809 -1048760 -670804 -297359 -1073386 -583601 798279
10241G98279l42008K66202m11252m51771L30581l646j091337l15497R17583K22024
$$ 798279 456271 722473 311221 -140550 190031 186385 -904952 -1220449 -302866 -80842
10231h0842J9381j57932q67576J31456R28419J67114k95664K04837j05334r4412
$$ -80842 -61461 -219393 -1086969 -955513 -27094 140020 -155644 49193 -56141 -150553
10221a50553m25644R28647q0643Q00177l45312p74519k94626n95462Q93623K21507
$$ -150553 -576197 352450 271807 1071984 726672 -47847 -342473 -937935 -44312 177195
10211A77195L35994j101021j64154O54896K04509K80990n39303j6384L05742l86415
$$ 177195 513189 -587832 -751986 -97090 107419 388409 -150894 -167278 138464 -247951
10201b47951L02567k5361j82411O94495o61854L00466O35171Q8099k48906R63873
$$ -247951 54616 29255 -153156 541339 -120515 179951 815122 903221 654315 1618188
10191A618188l60357q30209j57458J12241O15597l53570k93613j19732m79698
$$ 1618188 1257831 427622 270164 382405 998002 644432 350819 231087 -248611
10182b48611q6177K73126j99227J521380k25477r20429o8821O83889j12765L31623
$$ -248611 -334788 -61662 -260889 1260491 1035014 114585 45764 729653 616888 948511
10172I48511K33930K52210l76961j4237l84227J43473m74231K23778K97684j046285
$$ 948511 1182441 1434651 1057690 1043453 659226 802699 328468 552246 849930 -196355
10162a96355K49192j20836K09708N16701P63989J27554j078588l0947R13050k58688
$$ -196355 52837 -67999 141709 658410 1422399 1549953 471365 440418 1353468 1094780
10152A094780j71770j04616J31810p7181j73500R5228N06513n99472k36835k2549
$$ 1094780 923010 818394 950204 873023 699523 794751 1301264 701792 464957 442408
10142D42408L67554L53982k45273M68940r8741P3158l83788o71967J224648K86446
$$ 442408 809962 1163944 918671 1387611 1288870 1362028 978240 306273 1530921 1817367
10132A817367j09356N5563O7735j71309k86108O3903J64659k74282p25722P80660
$$ 1817367 1708011 1763574 1831309 1660000 1373892 1437795 1602454 1328172 602450 1383110
10122A383110M77754l2592K65643M43269m09826k8972r9418j83321N5006L44890
$$ 1383110 1860864 1828272 2093915 2537184 2127358 2098386 1998968 1815647 1870653 2215543
10112B215543L16454M21960j44795N3462R3248J14421k87327j49397J304353M69832
$$ 2215543 2531997 2953957 2809162 2862624 2955872 3070293 2782966 2633569 3937922 4407754
10102D407754o52374O0315P19827n76667M27542j22168K58908n30491M11743J024105
$$ 4407754 3755380 3815695 4535522 3958855 4386397 4264229 4523137 3992646 4404389 5428494
10092E428494r4307N44097K37928L45854j86802j88746l22438K29826k23242K85687
$$ 5428494 5334187 5878284 6116212 6462066 6275264 6086518 5764080 5993906 5770664 6056351
10082F056351N48487K36872L31428j141992l48871J023563j01815j069671l95621
$$ 6056351 6604838 6841710 7173138 6031146 5682275 6705838 6604023 5534352 5138731
10073E138731Q58493N46164J7481n27058J62516N0504Q2613O77192j97203j96166
$$ 5138731 5997224 6543388 6560869 6033811 6196327 6246831 6329444 7006636 6809433 6613267
10063F613267n9567j76192j10395J064390n85630o25253Q85522J191454o46972
$$ 6613267 6553700 6377508 6267113 7331503 6745873 6120620 7006142 8197596 7550624
10054G550624l22273K49006o97717O6728K15645M22156n55737L1955J035247k91393
$$ 7550624 7228351 7477357 6779640 6846368 7062013 7484169 6928432 6960387 7995634 7704241
10044G704241k0697o49324m78277K86453J80244l59755J34203L4519J7062l8667
$$ 7704241 7683544 7034220 6555943 6842396 7022640 6662885 6797088 6831607 6848669 6810002
10034F810002N34547p1558j393338K6474L94765M09127m18250n32908N8543M33754
$$ 6810002 7344549 7272991 5879653 5906127 6300892 6710019 6291769 5758861 5817404 6251158
10024F251158k13561k10487K53603L62210n01784O6551l38685l01403K42860k18629
$$ 6251158 6037597 5827110 6080713 6442923 5941139 6007690 5669005 5367602 5610462 5391833
10014E391833o87765L7192J11258J197382o7807p81209o18845P87335n97447k37087
$$ 5391833 4704068 4741260 4852518 6049900 5982093 5200884 4582039 5369374 4771927 4534840
10004D534840K58182n01692K95031K75389L94586l95103n72718l548L33850J72006
$$ 4534840 4793022 4291330 4586361 4861750 5256336 4861233 4288515 4284967 4618817 4790823
9994D790823l83298k94570O23517r31097L22215k4802k99423r09612n14169N66285
$$ 4790823 4407525 4112955 4736472 3805375 4127590 4102788 3803365 2893753 2379584 2945869
9984B945869L2058M02499n05650l72470P91980l7051P33599J017934l61654n21305
$$ 2945869 2977927 3380426 2874776 2502306 3294286 3257235 3990834 5008768 4647114 4125809
9974D125809k5340m75273m52892P87972n8850J01901l27966j65008j053947m19740
$$ 4125809 4100469 3625196 3172304 3960276 3901426 4003327 3675361 3510353 2456406 2036666
9964B036666M84614l6236L36762L1992K02641o63820O75451l42068o23816j5063
$$ 2036666 2521280 2485044 2821806 2853798 3056439 2392619 3068070 2726002 2102186 2087123
9954B087123k02389L01148Q78886J60011m69088q01905n79878k83541J124481
$$ 2087123 1884734 2185882 3064768 3224779 2755691 1953786 1373908 1090367 2214848
9945B214848m11360L5372P86540n70082J0052j02486M02319P6324l31332k5103
$$ 2214848 1803488 1838860 2625400 2055318 2065370 1962884 2365203 2441527 2110195 2085092
9935B085092J85897K5338k52096l43265J86748J054822K59961j822886m0365k33874
$$ 2085092 2270989 2296327 2044231 1700966 1887714 2942536 3202497 1379611 1339246 1105372
9925A105372o62502N37413N06170J23150J60865M59730n07824K29535J98469K36790
$$ 1105372 442870 980283 1486453 1609603 1770468 2230198 1722374 1951909 2150378 2387168
9915B387168L57572j13238p62680n21822J175924j75758K61959L06695J2091N6011
$$ 2387168 2744740 2631502 1868822 1347000 2522924 2347166 2609125 2915820 2927911 2983922
9905B983922p10388K25922o8234J85256M84812r78595k47978J288365Q56596J74391
$$ 2983922 2273534 2499456 2431222 2616478 3101290 2122695 1874717 3163082 4019678 4194069
9895D194069N10259Q67780l98704l22474J48662m5719j47128N51686K53483j70619
$$ 4194069 4704328 5572108 5173404 4850930 4999592 4953873 4806745 5358431 5611914 5441295
9885E441295o88952N18016O84874n50694P55012K57577j34761p53575J99090O74812
$$ 5441295 4752343 5270359 5955233 5404539 6159551 6417128 6282367 5528792 5727882 6402694
9875F402694o61955l60909L72983J35628l05863R7837J21534m2814k0673q3126
$$ 6402694 5740739 5379830 5752813 5888441 5582578 5680415 5801949 5759135 5738462 5655336
9865E655336L66645K62496N24909L97973p76605o91596m01666N99114K24191Q83150
$$ 5655336 6021981 6284477 6809386 7207359 6430754 5739158 5337492 5936606 6160797 7043947
9855G043947J9966l68183J40561m74323J27925P30739O28778o40730l35463J05905
$$ 7043947 7063913 6695730 6836291 6361968 6489893 7220632 7849410 7208680 6873217 6979122
9845F979122L40685k54704J86909l59467m9737K93582J94094K81698r6465j2987
$$ 6979122 7319807 7065103 7252012 6892545 6842808 7136390 7330484 7612182 7515717 7502730
9835G502730K9584m08128J8802L22690l96192m17302k57325k29871m2552L13752
$$ 7502730 7532314 7124186 7142988 7465678 7069486 6652184 6394859 6164988 6122436 6436188
9825F436188k50309N6687J095942l62180l19075j094710m64000Q9328O4270n39879
$$ 6436188 6185879 6242566 7338508 6976328 6657253 5562543 5098543 5187871 5252141 4712262
9815D712262m12568P06550K92107q46344j41063O84225n30276P29557q66736q6542
$$ 4712262 4299694 5006244 5298351 4452007 4310944 4995169 4464893 5194450 4327714 4241172
9805D241172Q84015j22820j92004k65271q22095M76853j16140k04004N1186k25930
$$ 4241172 5125187 5002367 4810363 4545092 3722997 4199850 4083710 3879706 3930892 3704962
9795C704962N766K33093N20340k97324n98067R30868o69125r8013o4305l72339
$$ 3704962 3710728 3943821 4464161 4166837 3568770 4499638 3830513 3732500 3668195 3295856
9785C295856M42230j13024n87293j96886P31983J24888p80990k80252M17377p8781
$$ 3295856 3738086 3625062 3037769 2840883 3572866 3697754 2916764 2636512 3053889 2975108
9775B975108o63245J63492O6460j087251O88132J44090k17572L61997q0019L35701
$$ 2975108 2311863 2475355 2541815 1454564 2142696 2286786 2069214 2431211 2351192 2686893
9765B686893K32093n12379N66233q09420R57877l18235K81810J05649m37129r53608
$$ 2686893 2918986 2406607 2972840 2163420 3121297 2803062 3084872 3190521 2753392 1799784
9755A799784l10377J70293j69321N46715P34885l90696j00171L47066m47527m79348
$$ 1799784 1489407 1659700 1490379 2037094 2771979 2381283 2281112 2628178 2180651 1701303
9745A701303L24177k51791N6884J48422m51288k02611l98006P04481N81725M32622
$$ 1701303 2025480 1773689 1830573 1978995 1527707 1325096 927090 1631571 2213296 2645918
9735B645918j229140j063512N10648N56807m11640j03278m9080k52371l98042
$$ 2645918 1416778 353266 863914 1420721 1009081 905803 856723 604352 206310
9726B06310n3460J05148J77346J362607N26626j513792j6018m7296r097r66639
$$ 206310 152850 257998 435344 1797951 2324577 810785 794767 747471 738374 -228265
9716b28265M55545R7203Q1130n4338l95367r8155J48253j06108N90027O05409
$$ -228265 227280 324483 405613 351275 -44092 -142247 6006 -100102 489925 1095334
9706A095334r55061o73282O28188k61392L64924J0504j40343j13063l75059Q24024
$$ 1095334 140273 -533009 95179 -166213 198711 209215 68872 -44191 -419250 404774
9696D04774l33363n20773M94889L7949l41143k62209J74903M12407N75595L88443
$$ 404774 71411 -449362 45527 83476 -257667 -519876 -344973 67434 643029 1031472
9686A031472m4229j77276o95494N88286O02665p54202m72548o35213J57511P3309
$$ 1031472 987243 809967 114473 702759 1305424 551222 78674 -556539 -399028 -325719
9676c25719k17153J111580k6063m90654l88876Q1265k70647P27625n28211M46597
$$ -325719 -542872 568708 542645 51991 -336885 -255620 -526267 201358 -326853 119744
9666A19744j60931q69152L65593N91343l03905l94723N04181M25926m56165j886
$$ 119744 -41187 -910339 -544746 46597 -257308 -652031 -147850 278076 -178089 -179975
9656a79975m63532l73966J242122n16406N32k08624k50370N98281M00564k32941
$$ -179975 -643507 -1017473 224649 -291757 -291225 -499849 -750219 -151938 248626 15685
9646A5685K40853K97539j21822l9611j70232m72522m02351o55593K98436N00238
$$ 15685 256538 554077 432255 392644 222412 -250110 -652461 -1308054 -1009618 -509380
9636e09380M16899L10737j63754k58423k75902N74395j23826m86874j6051L88860
$$ -509380 -92481 218256 54502 -203921 -479823 94572 -29254 -516128 -532179 -143319
9626a43319L84344N78047q87543q03969l5216L77779N43914m10947J73341J63647
$$ -143319 241025 819072 -68471 -872440 -907656 -529877 14037 -396910 -223569 -59922
9616e9922j50889k30894K26080J11176O79129p72422k71439Q53909p09831K02903
$$ -59922 -210811 -441705 -215625 -104449 574680 -197742 -469181 384728 -325103 -122200
9606a22200m88931J4308l2458K79000m51626j20021J29946m32310J89796N16476
$$ -122200 -611131 -596823 -629281 -350281 -801907 -921928 -791982 -1224292 -1034496 -518020
9596e18020j80771l62697J68632L48211P23222p40117J1565L52047Q476l64160
$$ -518020 -698791 -1061488 -892856 -544645 178577 -561540 -549975 -197928 -189452 -553612
9586e53612n95478P07729J45997K35432R2828j051514n93636O82662N02634q51625
$$ -553612 -1149090 -441361 -295364 -59932 32896 -1018618 -1612254 -929592 -426958 -1278583
9576a278583M58423L19539p82065N05032R01792k24251o70787L09305J16153J9716
$$ -1278583 -820160 -500621 -1282686 -777654 124138 -100113 -770900 -461595 -345442 -325726
9566c25726o92307K67271Q3046j58880L00200j96725N25782O76638N56127k27774
$$ -325726 -1018033 -750762 -667716 -826596 -526396 -723121 -197339 479299 1035426 807652
9556H07652n36415j122800M9899Q11585o5216p9447j1048k08630m44526N5013
$$ 807652 271237 -851563 -801664 9921 -55295 -134742 -145790 -354420 -798946 -743933
9546g43933j4616Q64607j09296j91727J49833o87288J69742l4599j61296M1893
$$ -743933 -758549 106058 -3238 -194965 -45132 -732420 -562678 -597277 -758573 -716680
9536g16680m9661n18986R11158m35370P04967j15611K08941m04500n55438K61483
$$ -716680 -766341 -1285327 -374169 -809539 -104572 -220183 -11242 -415742 -971180 -709697
9526g09697p3952M00876L5401m60886K8655O46777j91290L09847q79314r03819
$$ -709697 -783649 -382773 -347372 -808258 -779603 -132826 -324116 -14269 -893583 -1797402
9516a797402O64033R86168k51904k80653l82342j41149O17806k69499N71352L06172
$$ -1797402 -1133369 -147201 -399105 -679758 -1062100 -1203249 -585443 -854942 -283590 22582
9506B2582k75745r01523n27435J365024l12194K04191M74755k61312n14200J61435
$$ 22582 -253163 -1154686 -1682121 -317097 -629291 -425100 49655 -211657 -725857 -564422
9496e64422O4795l14251O5705M07175M69160k06607j107706j30725L14236P69467
$$ -564422 -499627 -813878 -748173 -340998 128162 -78445 -1186151 -1316876 -1002640 -233173
9486b33173K76523L55514k18627m05565n985Q37343p4967k31865l45014K2924
$$ -233173 43350 398864 180237 -225328 -231313 606030 531063 299198 -45816 -22892
9476b2892J81830k02762M06669n52940k62291O29232p4239q0854l02441m7536
$$ -22892 158938 -43824 362845 -190095 -452386 176846 102607 21753 -280688 -328224
9466c28224m44869j80426M89621L82788P25505o06379j86520j19562K88069K26477
$$ -328224 -773093 -953519 -463898 -81110 644395 38016 -148504 -268066 20003 246480
9456B46480r1306p69526q9558R12565N40064q5045n98154j49033J75778l45967
$$ 246480 155174 -614352 -703910 208655 748719 663674 65520 -83513 92265 -253702
9446b53702M96483m7143q01608m28248k06904o24226J50164J169703j42770l75924
$$ -253702 242781 195638 -605970 -1034218 -1241122 -1865348 -1715184 -545481 -688251 -1064175
9436a064175J403940J8240m62394O45032L37528l02218o60273j156335J89546
$$ -1064175 339765 358005 -104389 540643 878171 575953 -84320 -1240655 -1051109
9427a051109J92391j4106j40650K91998P96815L26681j116566n820P01162j67316
$$ -1051109 -858718 -872824 -1013474 -721476 75339 402020 -714546 -720366 -19204 -186520
9417a86520q0347Q9798m97146M57469J45983n2827K31349p77240L52249J91001
$$ -186520 -266867 -177069 -674215 -216746 -70763 -123590 107759 -669481 -317232 -126231
9407a26231k37002L52994p07257m5618Q33184K91155r65999L54365J02532j081931
$$ -126231 -363233 -10239 -717496 -763114 70070 361225 -604774 -250409 -147877 -1229808
9397a229808O25041j37310j13960J72647L44331o1582m02775M40074n76114m06599
$$ -1229808 -604767 -742077 -856037 -683390 -339059 -400641 -803416 -363342 -939456 -1346055
9387a346055K15793K16402J6884m15213J46750l45235M40106Q06979o45822K22700
$$ -1346055 -1130262 -913860 -896976 -1312189 -1165439 -1510674 -1070568 -263589 -909411 -686711
9377f86711J53851N17273l19015l42402R71039p18308P90178R5756k68487k10496
$$ -686711 -532860 -15587 -334602 -677004 294035 -424273 365905 461661 193174 -17322
9367a7322Q277j21800L92351K62244o95887n31217M40861K98246K18237j297286
$$ -17322 -9045 -130845 261506 523750 -172137 -703354 -262493 35753 253990 -1043296
9357a043296j83522N55023K18963J5023M07646l53830j080967J78212J141792
$$ -1043296 -1226818 -671795 -452832 -437809 -30163 -383993 -1464960 -1286748 -144956
9348a44956M30813J36243j111466K71778M96204J19174l39470n4238N94941P4354
$$ -144956 285857 422100 -689366 -417588 78616 197790 -141680 -195918 399023 473377
9338D73377j03752l26746q20337j03052M86531m05605L29701O2354K97541l49985
$$ 473377 369625 42879 -777458 -880510 -393979 -799584 -469883 -407529 -109988 -459973
9328d59973m6263m27020J6521Q24138J17932J32025K84784m66590j14123M6833
$$ -459973 -506236 -933256 -916735 -92597 25335 157360 442144 -24446 -138569 -91736
9318i1736O31010J59530R1752n1337q42470R8176j45046P93359j48574m60116
$$ -91736 539274 698804 790556 739219 -103251 -5075 -150121 643238 494664 34548
9308C4548p2177J46064J9288n36263K80772N50917j90630j82180J32104l77819
$$ 34548 -37629 108435 127723 -408540 -127768 423149 232519 50339 182443 -195376
9298a95376K04757q1771M10704O80559l97347r85415M10100m39301J27064K82496
$$ -195376 9381 -72390 338314 1018873 621526 -363889 46211 -393090 -266026 16470
9288A6470K76543L67910j06166o20736P47505k35392m63231r9485o3910M39313
$$ 16470 293013 660923 554757 -65979 681526 446134 -17097 -116582 -180492 258821
9278B58821K90562n64617j27234O76110j07677l58549Q65428J82779r077Q30947
$$ 258821 549383 -15234 -142468 533642 425965 67416 932844 1115623 1106546 1937493
9268A937493j144356j22698o16275M24298J458771o29897k94410K46516m56415
$$ 1937493 793137 670439 54164 478462 1937233 1307336 1012926 1259442 803027
9259H03027Q05132o59552N07094J07118k53661K28037P30759o07503j144696K70161
$$ 803027 1608159 948607 1455701 1562819 1309158 1537195 2267954 1660451 515755 785916
9249G85916p8277L7212M00740J53600l42547J11383m88252q81305Q02152Q23602
$$ 785916 707639 744851 1145591 1299191 956644 1068027 579775 -301530 500622 1324224
9239A324224m79093N40722m06874j25211k53903K95442m83935k26674O1659k64989
$$ 1324224 845131 1385853 978979 853768 599865 895307 411372 184698 246357 -18632
9229a8632m73100Q39577J42769l45471M75661O38494L8571j93208o83428K90140
$$ -18632 -491732 347845 490614 145143 620804 1259298 1297869 1104661 421233 711373
9219G11373o22874J383735L48039q70674K90914M53160M28210j72945o70999j44532
$$ 711373 88499 1472234 1820273 949599 1240513 1693673 2121883 1948938 1277939 1133407
9209A133407j77986M42052P4359n28280Q49864k56317J61406m5353N8555L08989
$$ 1133407 955421 1397473 1471832 943552 1793416 1537099 1698505 1653152 1711707 2020696
9199B020696M46533k58167P07104m87108n82820K53845J46409n90407P95710N85974
$$ 2020696 2467229 2209062 2916166 2429058 1846238 2100083 2246492 1656085 2451795 3037769
9189C037769p90870M77705q0390k75700n7944N71622Q6344L59995J203097n0235
$$ 3037769 2246899 2724604 2644214 2368514 2310570 2882192 2968536 3328531 4531628 4481393
9179D481393m74984K51702J29772l25501N828l19212M94980M09583l91081M80422
$$ 4481393 4006409 4258111 4387883 4062382 4068210 3748998 4243978 4653561 4262480 4742902
9169D742902N59942J85216Q6101J03550M31504m61363q243K19388O80492J82316
$$ 4742902 5302844 5488060 5574161 5677711 6109215 5647852 5639609 5858997 6539489 6721805
9159F721805L33230k27653K28530Q66890M01308L4217P98357P77828N07458j12083
$$ 6721805 7055035 6827382 7055912 7922802 8324110 8358327 9156684 9934512 10441970 10329887
9149A0329887K77149K61026O95545J053833J023029M39361J089317J469886J16955
$$ 10329887 10607036 10868062 11563607 12617440 13640469 14079830 15169147 16639033 16755988
9140A6755988K987O59774J340607O10724P39226J878525K211422J622370K547842
$$ 16755988 16758975 17418749 18759356 19370080 20109306 21987831 24199253 25821623 28369465
9131B8369465J858147L543107M558310M454116M209171K679371n27315j704623
$$ 28369465 30227612 33770719 38329029 42783145 46992316 49671687 49144372 47439749
9123D7439749j463958l309825k239189j498230p53110n99089O18489K76568J44414
$$ 47439749 45975791 42665966 40426777 38928547 38175437 37576348 38194837 38471405 38615819
9114C8615819J5767j26996Q33547J584065L13320Q99889K431875L708008K832414
$$ 38615819 38631586 38504590 39338137 40922202 41235522 42135411 44567286 48275294 51107708
9105E1107708M825716M555652K066722j278126l678778k932665k081254j518561
$$ 51107708 55933424 60489076 62555798 61277672 57598894 54666229 52584975 51066414
9097E1066414j79084J328785M26358N04042R05019K84330J81277L57993J183742
$$ 51066414 50887330 52216115 52642473 53146515 54051534 54335864 54517141 54875134 56058876
9088E6058876L495843K727965M127114J777717L9850j747223n430502o386869
$$ 56058876 59554719 62282684 66409798 68187515 68227365 66480142 61049640 54662771
9080E4662771m452808l287154k216441j189559J04123K18173k08985J201129K79326
$$ 54662771 50209963 46922809 44706368 43516809 43620932 43839105 43630120 44831249 45110575
9071D5110575J20726L40754Q03780J402272M67821J754044K531506L400340K344494
$$ 45110575 45231301 45572055 46375835 47778107 48245928 49999972 52531478 55931818 58276312
9062E8276312J752793j512909n837016o698676n340424l842277l591673l206581
$$ 58276312 60029105 58516196 52679180 45980504 40640080 36797803 33206130 29999549
9054B9999549k843007k034748p32972o76408n08554o56622k80354j126883o28943
$$ 29999549 27156542 25121794 24388822 23712414 23203860 22547238 22266884 21140001 20511058
9045B0511058r31778j215959j380794j152670q92243o5356m62316j029748j011568
$$ 20511058 19579280 18363321 16982527 15829857 14937614 14872258 14409942 13380194 12368626
9036A2368626o19399J73146r18611j091354l58312r22619j94492J32338o44308
$$ 12368626 11749227 11922373 11003762 9912408 9554096 8631477 8436985 8569323 7925015
9027G925015L79575n63670n34648N5370J72905j99586k10923k01533q4537k63312
$$ 7925015 8304590 7740920 7206272 7261642 7434547 7234961 7024038 6822505 6737968 6474656
9017F474656O4103k72426k18773J5043m71809O36592j89425l67610j30862l38584
$$ 6474656 6538759 6266333 6047560 6062603 5590794 6227386 6037961 5670351 5539489 5200905
9007E200905j70356k50144j17126j15833r90841m48037N20080O13573p5873n08409
$$ 5200905 5030549 4780405 4663279 4547446 3556605 3108568 3628648 4242221 4166348 3657939
8997C657939N6420n64411M92334o2084n36183j39237K40089m20283k99948K0959
$$ 3657939 3714359 3149948 3642282 3580198 3044015 2904778 3144867 2724584 2424636 2445595
8987B445595n4234R80266O26539o13402m08080K6645L48817K15506L57116j29257
$$ 2445595 2391361 3371627 3998166 3384764 2976684 3003329 3352146 3567652 3924768 3795511
8977C795511r7093o98507k60209J18512k84721J100837j25073m5159L06401J58808
$$ 3795511 3698418 2999911 2739702 2858214 2573493 3674330 3549257 3504098 3810499 3969307
8967C969307J0671j029921q3592K42380K77135q97100l22680N12313r5977J14923
$$ 3969307 3979978 2950057 2866465 3108845 3385980 2488880 2166200 2678513 2582536 2697459
8957B697459j52561l93399L84188J87766J34497O86288n73946N57286J66863K21370
$$ 2697459 2544898 2151499 2535687 2723453 2857950 3544238 2970292 3527578 3694441 3915811
8947C915811P40232j59475l84811o12481K55350m8328k45880L48689j07629L6936
$$ 3915811 4656043 4496568 4111757 3499276 3754626 3706298 3460418 3809107 3701478 3738414
8937C738414M9002k68176o30918L10788K62360k51508j05619r520k47478k69141
$$ 3738414 3787416 3519240 2888322 3199110 3461470 3209962 3104343 3094823 2847345 2578204
8927B578204O26562R616n20419P4842J015037m41617j93209o06065J83349J07761
$$ 2578204 3204766 3214382 2693963 2768805 3783842 3342225 3149016 2542951 2726300 2834061
8917B834061K61751n11432K28620K06575L41750Q71410p34646j15176M59763Q41
$$ 2834061 3095812 2584380 2813000 3019575 3361325 4232735 3498089 3382913 3842676 3843517
8907C843517j03779l36542O43630m07274M38681J000460o21675j299177R7153
$$ 3843517 3739738 3403196 4046826 3639552 4078233 5078693 4457018 3157841 3254994
8898C254994k26473l88509q07430l34278L63919j5622N35091j19772M02199k74423
$$ 3254994 3028521 2640012 1832582 1498304 1862223 1846601 2381692 2261920 2664119 2389696
8888B389696P66835J0113O9405O85598j120865n99385N02345j29480K15640q64429
$$ 2389696 3156531 3166644 3236049 3921647 2800782 2201397 2703742 2574262 2789902 1925473
8878A925473o49171L90047p38577L85350P99960Q00053q4572j273029q27449n95702
$$ 1925473 1276302 1666349 927772 1313122 2113082 2913135 2828563 1555534 728085 132383
8868A32383O43147O77184K46796k39777O62571J36569P20372m09983l60729L02407
$$ 132383 775530 1452714 1699510 1459733 2122304 2258873 2979245 2569262 2208533 2510940
8858B510940N62558n51996l52819L66023J45352l75806j35529o05263N63719Q9965
$$ 2510940 3073498 2521502 2168683 2534706 2680058 2304252 2168723 1563460 2127179 2217144
8848B217144q8640M1904m95309J069884o76018m43384K68468R00282J61551k56055
$$ 2217144 2128504 2170408 1675099 2744983 2068965 1625581 1894049 2794331 2955882 2699827
8838B699827l39045N23375n59890j76833L72794p55352k93091Q5249M26975L03864
$$ 2699827 2360782 2884157 2324267 2147434 2520228 1764876 1471785 1557034 1984009 2287873
8828B287873j26985k64022J23553o64823P52262L46034l78353k06292M43951L13228
$$ 2287873 2160888 1896866 2020419 1355596 2107858 2453892 2075539 1869247 2313198 2626426
8818B626426M51944N41804J63638k90751K74025L10449n98426k90881L91128K82381
$$ 2626426 3078370 3620174 3783812 3493061 3767086 4077535 3479109 3188228 3579356 3861737
8808C861737Q7137q2380m55103K58621M89635M27683o11812M2797N42793m06116
$$ 3861737 3948874 3866494 3411391 3670012 4159647 4587330 3975518 4018315 4561108 4154992
8798D154992M17545N55738k8894l87680j15966n76246R17784K08522n2327L41532
$$ 4154992 4572537 5128275 5099381 4711701 4595735 4019489 4937273 5145795 5093468 5435000
8788E435000J31783m48215K8149k8102j84740J22516O09332N01785n73986j98441
$$ 5435000 5566783 5118568 5146717 5118615 4933875 5056391 5665723 6167508 5593522 5395081
8778E395081j44688J209052M08644L08528l3207l17653N21864O38534J172562
$$ 5395081 5250393 6459445 6868089 7176617 7143410 6825757 7347621 7986155 9158717
8769I158717q8477j320735O77147O42416L17665J020797O92964l3542k05057Q06168
$$ 9158717 9070240 7749505 8426652 9069068 9386733 10407530 11100494 11066952 10861895 11668063
8759A1668063P52181j099941L63192R87423N54813l84527J56912J551366J308373
$$ 11668063 12420244 11320303 11683495 12670918 13225731 12841204 12998116 14549482 15857855
8750A5857855Q14973O09571J005104M54555Q70128J070562R31194M10576J406692
$$ 15857855 16672828 17282399 18287503 18742058 19612186 20682748 21613942 22024518 23431210
8741B3431210R28060J413046J818333J403462L446381K252991M770935M131079
$$ 23431210 24359270 25772316 27590649 28994111 32440492 34693483 39464418 43595497
8733D3595497M297958M874752L623343M13068k865954m848922n207901l181875
$$ 43595497 47893455 52768207 56391550 56804618 53938664 49089742 43881841 40699966
8725D0699966k043639j552146P0402O3298j24676k51336j421851j328556q51297
$$ 40699966 38656327 37104181 37174583 37237881 37113205 36861869 35440018 34111462 33260165
8716C3260165j222130j308430k03640K23770M50294Q11609J348156J058838N06018
$$ 33260165 32038035 30729605 30525965 30749735 31200029 32011638 33359794 34418632 34924650
8707C4924650J167170J334608K041162Q89156J294763L188194L153490K223981
$$ 34924650 36091820 37426428 39467590 40356746 41651509 44839703 47993193 50217174
8699E0217174L129047M023290M342635M591078M837505P089187N661459N675958
$$ 50217174 53346221 57369511 61712146 66303224 71140729 78229916 83891375 89567333
8691H9567333K781911k467691m909695o961214q124489p534795o200458m002575
$$ 89567333 92349244 89881553 84971858 78010644 69886155 62351360 56150902 52148327
8683E2148327l529763k616622k071229k350382k638961k787050k258764j579881
$$ 52148327 48618564 46001942 43930713 41580331 38941370 36154320 33895556 32315675
8675C2315675j238756N7332l0326m24651p33094q57522K40252N55423M38187R6149
$$ 32315675 31076919 31134251 31103925 30679274 29946180 29088658 29328910 29884333 30322520 30418669
8665C0418669P55199J245654R81976J305500J138057P44720K58380N78489J121853
$$ 30418669 31173868 32419522 33401498 34706998 35845055 36589775 36848155 37426644 38548497
8656C8548497L81638J782153L174588L094063K249507P63997j059647l436891
$$ 38548497 38930135 40712288 43886876 46980939 49230446 49994443 48934796 45497905
8648D5497905m260165n490710m053690l735257k267794k225718j707242k047045
$$ 45497905 41237740 35747030 31693340 27958083 25690289 23464571 21757329 19710284
8640A9710284j425434j55854J86294M72269q87701o76814k105937p3135M49593
$$ 19710284 18284850 18128996 18315290 18787559 17899858 17223044 15117107 15043972 15493565
8631A5493565j42130j227677o71438q30794O944p09831r79967r1547m96396n81285
$$ 15493565 15351435 14123758 13452320 12621526 12628470 11918639 10938672 10847125 10350729 9769444
8621I769444k84521P89435o36160q45335n02116m09955p6446k23748q328K95107
$$ 9769444 9484923 10274358 9638198 8792863 8290747 7880792 7804346 7580598 7572270 7867377
8611G867377r97370K20284m80937j66530K42144n33423l04486K89212P7626j065266
$$ 7867377 6870007 7090291 6609354 6442824 6684968 6151545 5847059 6136271 6213897 5148631
8601E148631L19349j26527l21151n83170l1867n74518O40060N15293m38573n42828
$$ 5148631 5467980 5341453 5020302 4437132 4405265 3830747 4470807 4986100 4547527 4004699
8591D004699L9036k30047j584086L57767Q48190L18245J4642o23248L21715l96917
$$ 4004699 4043735 3813688 2229602 2587369 3435559 3753804 3768446 3145198 3466913 3069996
8581C069996l39149N3374p66192L67775N35615O74662q04368N7286M3860N2407
$$ 3069996 2730847 2784221 2018029 2385804 2921419 3596081 2791713 2848999 2892859 2945266
8571B945266P46633j744192j043254O46244k90945k22245l02401J73426J301797
$$ 2945266 3691899 1947707 904453 1550697 1259752 1037507 735106 908532 2210329
8562B210329j38978n824J80776k39263j314410m87609L59850j73707O53096N80204
$$ 2210329 2071351 2065527 2246303 2007040 692630 205021 564871 391164 1044260 1624464
8552A624464N24093p38750m3801j96787p12798m54000J626086m49712m80826N03309
$$ 1624464 2148557 1409807 1366006 1169219 456421 2421 1628507 1178795 697969 1201278
8542A201278q9536K20204Q46706j122213k65838j25580m82417m55130J26201J070668
$$ 1201278 1111742 1331946 2178652 1056439 790601 665021 182604 -272526 -146325 924343
8532I24343m26206l01676P81654L5685n43244R8015K16148J4406K97379p04720
$$ 924343 498137 196461 978115 1013800 470556 568571 784719 799125 1096504 391784
$$ [...]
##END NTUPLES=NMR SPECTRUM
##END=
