##TITLE=1H_TG-2347-x
 DMSO
 8 sc, 
 18.02.2022
##JCAMPDX= 6.0         $$ Bruker NMR JCAMP-DX V2.0
##DATA TYPE= NMR SPECTRUM
##DATA CLASS= NTUPLES
##ORIGIN= UXNMR, Bruker Analytische Messtechnik GmbH
##OWNER= root
$$ XWIN-NMR		Version 3.5
$$ Fri Feb 18 10:23:08 2022 Russian Standard Time (UT+4h)  she@DPX200
##.OBSERVE FREQUENCY= 200.131346
##.OBSERVE NUCLEUS= ^1H
##.ACQUISITION MODE= SIMULTANEOUS
##.ACQUISITION SCHEME= undefined
##.AVERAGES= 8
##.DIGITISER RES= 18
##SPECTROMETER/DATA SYSTEM= spect
##.PULSE SEQUENCE= zg30
##.SOLVENT NAME= DMSO
##.SHIFT REFERENCE= (INTERNAL, DMSO, 0, 15.7008)
##AUDIT TRAIL= $$ (NUMBER, WHEN, WHO, WHERE, WHAT)
$$ ##TITLE= Audit trail, XWIN-NMR		Version 3.5
$$ ##JCAMPDX= 5.01
$$ ##ORIGIN= Bruker BioSpin GmbH
$$ ##OWNER= she
$$ F:/spectra/data/she/nmr/H-F/1/pdata/1/auditp.txt
$$ ##AUDIT TRAIL=  $$ (NUMBER, WHEN, WHO, WHERE, WHAT)
(   1,<2022-02-18 10:22:02.79 +0400>,<she>,<DPX200>,
      <created by zg, POWCHK disabled, PULCHK disabled
       configuration hash MD5:
       00 E9 B6 7A A2 85 ED C7 34 08 36 98 17 FE 4E 26
       data hash MD5: 16K
       9A EF 1D 8B 03 8E 6F 79 D3 53 A6 5C D1 94 A9 4B>)
(   2,<2022-02-18 10:22:05.43 +0400>,<she>,<DPX200>,
      <Start of raw data processing
       efp BC_mod = 2 LB = 0.24 FT_mod = 6 PKNL = 1 PHC0 = -16231.46 PHC1 = 13.40078 SI = 16K 
       data hash MD5: 16K
       07 B3 6D 3B 81 8C 5B 0B 6C 68 50 D6 78 D1 D9 D0>)
(   3,<2022-02-18 10:22:26.76 +0400>,<she>,<DPX200>,
      <pk PHC0 = -1.277901 PHC1 = 1.6 
       data hash MD5: 16K
       28 DF D6 7A 8F CF E3 A6 25 E3 6A 33 81 00 16 36>)
(   4,<2022-02-18 10:22:32.35 +0400>,<she>,<DPX200>,
      <abs ABSG = 5 
       data hash MD5: 16K
       9D 02 CE 5F 9C 34 33 30 F3 0B 5F 71 AD 13 8F 69>)
$$ ##END=
$$ 
$$ hash MD5
$$ 40 CA CA 86 66 8D 3D B7 11 78 E6 DD 9C D6 3C 34
##$RELAX= 
##$RELAX= 
##$RELAX= 
##$RELAX= 
##$RELAX= 
##$RELAX= 
$$ Bruker specific parameters
$$ --------------------------
##$DU= <F:/spectra>
##$EXPNO= 1
##$NAME= <H-F>
##$PROCNO= 1
##$TYPE= <nmr>
##$USER= <she>
##$AMP= (0..31)
100 100 100 100 100 100 100 100 100 100 100 100 100 100 100 100 100 100 
100 100 100 100 100 100 100 100 100 100 100 100 100 100 
##$AQSEQ= 0
##$AQ_mod= 1
##$AUNM= <au_zg>
##$AUTOPOS= <>
##$BF1= 200.13
##$BF2= 200.13
##$BF3= 200.13
##$BF4= 200.13
##$BF5= 200.13
##$BF6= 200.13
##$BF7= 200.13
##$BF8= 200.13
##$BYTORDA= 1
##$CFDGTYP= 0
##$CFRGTYP= 5
##$CHEMSTR= <none>
##$CNST= (0..31)
1 1 145 1 1 1 1 1 1 1 1 1 1 1 1 1 1 1 1 1 1 1 1 1 1 1 1 1 1 1 1 1 
##$CPDPRG= <>
##$CPDPRG1= <>
##$CPDPRG2= <>
##$CPDPRG3= <>
##$CPDPRG4= <mlev>
##$CPDPRG5= <mlev>
##$CPDPRG6= <mlev>
##$CPDPRG7= <mlev>
##$CPDPRG8= <mlev>
##$CPDPRGB= <>
##$CPDPRGT= <>
##$D= (0..31)
0 1.2 0 0 0 0 0 0 0 0.06 0 0.03 0 0 0 0 0.0002 0 0 0 0 0 0 0 0 0 0 0 0 
0 0 0 
##$DATE= 1645165322
##$DBL= (0..7)
120 120 120 120 120 120 120 120 
##$DBP= (0..7)
150 150 150 150 150 150 150 150 
##$DBP07= 0
##$DBPNAM0= <>
##$DBPNAM1= <>
##$DBPNAM2= <>
##$DBPNAM3= <>
##$DBPNAM4= <>
$$ [...]
##$SUBNAM2= <"">
##$SUBNAM3= <"">
##$SUBNAM4= <"">
##$SUBNAM5= <"">
##$SUBNAM6= <"">
##$SUBNAM7= <"">
##$SUBNAM8= <"">
##$SUBNAM9= <"">
##$SW= 18.0517287032376
##$SWIBOX= (0..15)
0 0 2 0 0 0 0 0 0 0 0 0 0 0 0 0 
##$SW_h= 3612.71676300578
##$TD= 16384
##$TD0= 1
##$TE= 0
##$TE2= 300
##$TE3= 300
##$TEG= 300
##$TL= (0..7)
0 120 120 120 120 120 120 120 
##$TP= (0..7)
150 150 150 150 150 150 150 150 
##$TP07= 0
##$TPNAME0= <>
##$TPNAME1= <>
##$TPNAME2= <>
##$TPNAME3= <>
##$TPNAME4= <>
##$TPNAME5= <>
##$TPNAME6= <>
##$TPNAME7= <>
##$TPOAL= (0..7)
0.5 0.5 0.5 0.5 0.5 0.5 0.5 0.5 
##$TPOFFS= (0..7)
0 0 0 0 0 0 0 0 
##$TUNHIN= 0
##$TUNHOUT= 0
##$TUNXOUT= 0
##$USERA1= <user>
##$USERA2= <user>
##$USERA3= <user>
##$USERA4= <user>
##$USERA5= <user>
##$V9= 5
##$VALIST= <valist>
##$VCLIST= <CCCCCCCCCCCCCCC>
##$VD= 0
##$VDLIST= <DDDDDDDDDDDDDDD>
##$VPLIST= <PPPPPPPPPPPPPPP>
##$VTLIST= <TTTTTTTTTTTTTTT>
##$WBST= 1024
##$WBSW= 4
##$XGAIN= (0..3)
0 0 0 0 
##$XL= 0
##$YL= 0
##$YMAX_a= 89077
##$YMIN_a= -167706
##$ZGOPTNS= <>
##$ZL1= 120
##$ZL2= 120
##$ZL3= 120
##$ZL4= 120
##$ABSF1= 15.70079
##$ABSF2= -2.351059
##$ABSG= 5
##$ABSL= 3
##$ALPHA= 0
##$AQORDER= 0
##$ASSFAC= 0
##$ASSFACI= 0
##$ASSFACX= 0
##$ASSWID= 0
##$AUNMP= <proc_1d>
##$AZFE= 0.1
##$AZFW= 0.1
##$BCFW= 0
##$BC_mod= 2
##$BYTORDP= 0
##$COROFFS= 0
##$CY= -3
##$DATMOD= 1
##$DC= 0
##$DFILT= <>
##$DTYPP= 0
##$F1P= 0
##$F2P= 0
##$FCOR= 1
##$FTSIZE= 16384
##$FT_mod= 6
##$GAMMA= 0
##$GB= 0
##$INTBC= 1
##$INTSCL= 0
##$ISEN= 128
##$LB= 0.24
##$LEV0= 0
##$LPBIN= 0
##$MAXI= 10000
##$MC2= 0
##$MEAN= 0
##$ME_mod= 0
##$MI= 1.114404
##$NCOEF= 0
##$NC_proc= -9
##$NLEV= 6
##$NOISF1= 3.799351
##$NOISF2= 2.8
##$NSP= 0
##$NTH_PI= 0
##$NZP= 0
##$OFFSET= 15.70079
##$PC= 1
##$PHC0= -16232.74
##$PHC1= 15.00078
##$PH_mod= 1
##$PKNL= yes
##$PPARMOD= 0
##$PSCAL= 0
##$PSIGN= 0
##$REVERSE= no
##$SF= 200.130010159228
##$SI= 16384
##$SIGF1= 3
##$SIGF2= 2
##$SINO= 5.538805
##$SIOLD= 16384
##$SREGLST= <1H.CDCl3>
##$SSB= 0
##$STSI= 16384
##$STSR= 0
##$SW_p= 3612.71676300578
##$SYMM= 0
##$S_DEV= 0
##$TDeff= 16384
##$TDoff= 0
##$TI= <>
##$TILT= no
##$TM1= 0
##$TM2= 0
##$TOPLEV= 0
##$USERP1= <user>
##$USERP2= <user>
##$USERP3= <user>
##$USERP4= <user>
##$USERP5= <user>
##$WDW= 1
##$XDIM= 16384
##$YMAX_p= 499403539
##$YMIN_p= -2907096
$$ End of Bruker specific parameters
$$ ---------------------------------
##NTUPLES= NMR SPECTRUM
##VAR_NAME=  FREQUENCY,     SPECTRUM/REAL,   SPECTRUM/IMAG
##SYMBOL=    X,             R,               I
##VAR_TYPE=  INDEPENDENT,   DEPENDENT,       DEPENDENT
##VAR_FORM=  AFFN,          ASDF,            ASDF
##VAR_DIM=   16384,         16384,           16384
##UNITS=     HZ,            ARBITRARY UNITS, ARBITRARY UNITS
##FACTOR=    0.220516191357247, 1,           1
##FIRST=     3142.19934331528, 0,            0
##LAST=      -470.517419690498, 0,           0
##MIN=       -470.517419690498, -2907096,    0
##MAX=       3142.19934331528, 499403539,    0
$$ Real data points
##PAGE= N=1
##DATA TABLE= (X++(R..R)), XYDATA
$$ [...]
10667 -371059 533973 637873 212791 -185133 -509501 -468897 -51764 547344 152124 -1261506
10657 -1261506 -565392 -99128 -92827 477738 46751 177264 295488 586243 855460 1130180
10647 1130180 406071 -4966 373187 334339 314666 312565 135712 -177083 -354301 -226785
10637 -226785 -741236 -620321 -554387 -379815 363809 419324 -2327 -570754 -913316 -1063445
10627 -1063445 -1171194 -508608 12321 284096 1027120 1026049 1087599 341105 439125 78499
10617 78499 928248 1094588 555320 189405 38815 511488 1007864 29093 280876 210043
10607 210043 856466 841762 662965 393804 -248935 292637 204229 181404 -449738 -609653
10597 -609653 -488660 148128 736220 468031 264780 126850 -126267 425520 186885 -201659
10587 -201659 -812189 424127 429103 572068 1087935 490342 821659 558753 247915 348873
10577 348873 -484 559827 703649 342059 172658 382221 130235 -470431 -477967 477822
10567 477822 346405 327072 -483723 -514596 1018970 477310 -430260 190757 294797 557362
10557 557362 730647 976442 453417 166045 117007 712416 523439 217141 -80568 726451
10547 726451 1371151 937733 1331928 857766 456426 192333 306494 487482 1008392 788555
10537 788555 167353 678611 638980 807217 876294 829274 616697 985864 1391485 1346645
10527 1346645 1832827 1015313 1139972 1030012 1763054 1412111 1469988 1275341 1244220 871651
10517 871651 1316027 1249253 -94368 513199 526641 422943 269695 679976 1240323 917627
10507 917627 884329 1060603 1050519 942990 971442 543603 931340 824743 98575 122295
10497 122295 977939 367816 433718 799012 830744 1273454 1948840 1280633 550652 393129
10487 393129 998997 1130134 66895 133330 826086 634558 829704 340940 -43788 -244552
10477 -244552 676122 1376670 -40337 313353 1081795 784352 971463 793972 1349716
10468 1349716 1478379 1427836 2104225 2367956 2183852 1252024 1908808 1403388 2246245 2431510
10458 2431510 1596398 1680728 1025254 1810667 2389911 1594635 2504663 2784670 2213727 1925144
10448 1925144 1742056 1873871 1639229 1109765 788813 2040474 2727870 1779265 1379498
10439 1379498 1909816 2307496 1747681 1782794 1351475 1194978 677228 1203383 1268038 1358044
10429 1358044 2004348 1238484 896953 1781879 2033872 2074666 1582845 2152430 1725684 1619569
10419 1619569 2357756 2515375 3156042 2798720 2933235 2752505 1758763 2472843 2524269 3227897
10409 3227897 3201338 2800168 2558109 2391338 2839186 2556256 2832309 2874258 3061800 3158152
10399 3158152 2530701 2297549 2428053 3075641 3174770 3316434 3280386 2419360 2964040 3289805
10389 3289805 3795456 4065669 4340156 4629277 5500477 5156359 4953491 4737106 5475906
10380 5475906 5734936 5209948 5018456 5030009 5698511 5584862 5533644 4933175 5865166 5418870
10370 5418870 4889422 5859672 6216928 6593516 7866786 8308257 8326891 8050655 8008677 9179999
10360 9179999 9168949 9430273 9606215 8980358 8704074 8974081 10207809 10691579 11021880
10351 11021880 10550404 9562704 10522979 11439353 11867075 12411283 12334119 11898461 11829160 11495102
10341 11495102 12077981 12215152 12890342 12513046 11519673 12146423 12596261 13453611 12983189
10332 12983189 13234888 12847029 12776144 13112529 12706462 13148910 12592630 13657679 13518888
10323 13518888 13563687 13409622 13760645 14469323 15615950 15490100 16158013 15983465 15323226
10314 15323226 15651450 16009118 16370404 16477751 16302538 16599634 16110739 16700257 16903387
10305 16903387 17235443 17658426 17061358 16675286 16606258 16491855 16879761 17128514 17210790 17049603
10295 17049603 16712251 16483709 17123331 17021076 17133992 16913996 16570313 17051518 16758718
10286 16758718 16657968 16690623 16711451 15854664 16194891 15523236 15310019 14665713 15240108 16186442
10276 16186442 15123172 14697526 14809941 14372280 14664347 14659548 14512350 13972362 14198504
10267 14198504 14431815 13866083 13308781 13631978 13812927 13575172 13416017 12865282 13020386
10258 13020386 13577320 13783798 14177718 13419691 13152107 12868025 13000419 13121744 12672458
10249 12672458 12078051 12181528 11566673 11146296 10395675 10408402 10063151 10128972 10345960 10477954
10239 10477954 9636602 9128660 8639596 8403071 8387641 8674419 8718997 8232244 8268012 8400498
10229 8400498 7902918 7842203 6840185 7234826 7225498 6727697 5967437 5747974 6353614 6017827
10219 6017827 5138303 4565690 5496554 5181067 4955719 4652697 5030478 4452048 4088126
10210 4088126 3353628 3324060 3865891 3914235 3043990 3307006 3577468 4113868 4098755 3550654
10200 3550654 3002695 3271921 3920706 3542931 2498468 1735345 2491657 2615443 2445200
10191 2445200 3340477 3219170 1723225 1337676 1674474 1689092 1392866 1159415 883588
10182 883588 1236839 2065888 2203975 2052813 2450595 2156594 1363508 1567997 1700964 1758905
10172 1758905 1891821 1480148 2183595 2156901 1042625 1131169 1447723 1539238 1367010 1006966
10162 1006966 785396 1199979 1286753 1238926 1190607 1000457 538192 757616 483508 768543
10152 768543 1399419 2439962 2582308 1639690 885026 585590 643994 734274 1611003 1961964
10142 1961964 1673978 1188372 916894 844463 846730 1611339 2138062 1238872 1231290 2048718
10132 2048718 2740108 2664839 1928010 1489742 1100285 1454851 513287 1061738 290591 209186
10122 209186 764015 413238 446999 651468 736257 917371 801169 1859782 1476046 1151917
10112 1151917 1646884 1815850 2100905 922857 1028406 1942166 1494614 1080161 836617
10103 836617 1113731 29884 185224 632888 279430 1111782 940893 1479185 1592258
10094 1592258 461954 477827 1426185 1453236 1132631 163237 487419 146856 73532 803999
10084 803999 1622326 837868 946844 874571 1274994 1071059 1136040 1104812 264700 332293
10074 332293 84648 929868 832668 961390 1033822 638883 1123059 1470295 1270130 500235
10064 500235 1127219 646650 943956 740428 181568 155189 1085490 1099069 754664 1238439
10054 1238439 827825 694226 651195 787016 814685 936472 1386831 1115905 1544445 1355184
10044 1355184 1781108 1201461 1044739 1911544 1767796 2353989 1885334 2686617 1761258
10035 1761258 1638500 1632791 1472082 1648596 2403342 2648793 1869700 1792722 2338113 2748584
10025 2748584 2427887 3157889 3424533 2477758 2401738 2938142 2605281 2956764 3117336 2890879
10015 2890879 3272761 2929397 2047133 2640070 3614014 3675700 4313604 3988143 2991619 2689731
10005 2689731 2721280 3341138 3913843 4604688 4666160 4807564 5024989 4922620 4607908 5255552
9995 5255552 5827854 6549464 6459451 6230104 6444882 6537918 6535659 6743154 6563280 6296594
9985 6296594 6418031 7088724 7614194 7957982 8622130 9313775 9923998 9451776 8869363 8885837
9975 8885837 8981006 10043549 11073578 10638400 10977200 11441431 11975823 12346192 12269439 12175542
9965 12175542 11360556 10575043 11886160 12756979 12490994 12787380 13009084 13014766 13165883 14141638
9955 14141638 14515981 14307241 13706272 13989111 13690980 13652148 14373875 14327433 14506118 14518157
9945 14518157 14659854 15095363 15041820 14656656 14660134 15470636 15469965 14783578 14852843 15537818 16353560
9934 16353560 15815950 15770561 15918300 16233989 15467667 15283766 15756540 17101403 17061000 16670819
9924 16670819 16940526 17180587 17470781 18212288 17973946 18176970 17674163 18237230 18490378
9915 18490378 17769904 18511510 19088909 18293650 18306140 17747481 18158497 17896012 17057627 17703650
9905 17703650 16890809 16273172 16344101 16250763 15279822 14903967 14874946 14832507 14468526 14149023
9895 14149023 14371400 14395582 14320470 13215951 13572310 13746831 12961787 12667684 11781366 11392035
9885 11392035 11236682 11297559 11760428 12046034 12044649 12573087 12432291 11530156 11374484 12696205
9875 12696205 12208311 11571756 11266274 10996012 10415248 10852615 10797038 10366902 10120090 10821118
9865 10821118 10397570 9780035 9769394 10578532 10172722 10021820 9394107 9214184 9732424 9800769
9855 9800769 9166797 8072570 7047862 6866094 7970543 7142114 6978715 7503535 7392303
9846 7392303 7510793 7513525 6639200 6241752 5631422 5218088 5480657 5212352 5480545 6042808
9836 6042808 5301142 4838776 4232467 4156653 4673602 4533054 4087868 4147257 4569972 4666589
9826 4666589 4360381 4494898 3364881 2999533 3048228 3133403 3319079 2911857 2871511 2907342
9816 2907342 3314962 3272239 2430770 2303176 3018596 3206588 2751264 2453373 3253747 2896319
9806 2896319 2208264 2301052 2418852 2497628 2435763 2317352 1771768 1146412 1890928 1274032
9796 1274032 1410281 1955968 2355831 1535496 1314092 1870648 1630523 1486253 1423189 1921781
9786 1921781 1180157 1090625 1252855 1685747 1495303 1724991 1769512 1237672 2052896 1758950
9776 1758950 1429548 1242020 1414651 1271573 905367 1541762 994320 626251 1120394 217798
9766 217798 243680 364862 899894 778613 -135074 43829 -828399 -385693 350050 691704
9756 691704 666918 1422845 842464 328648 375183 698809 346293 750257 417867 100109
9746 100109 570038 628261 891954 214996 272107 542698 415017 79987 153760 562033
9736 562033 33642 -231586 -846853 -190671 905435 635626 256332 -189377 -179619 -386972
9726 -386972 151548 -147594 -206275 -671428 121126 1548795 969794 453597 1362804 964806
9716 964806 918561 446038 255811 584665 191738 -394875 -569633 36541 214800 590878
9706 590878 1276249 841428 894057 1113410 122075 453802 862734 686812 368836 194482
9696 194482 722813 1185641 829023 1183365 900963 449025 760370 319727 -8954 -500788
9686 -500788 108021 -104822 317920 766561 -850931 -503715 224221 357405 135694 -92229
9676 -92229 92978 1016595 1491868 987391 533257 573300 98868 679857 1221757 670475
9666 670475 360721 -85607 -836432 -645651 -778172 177809 529354 809446 58094 685892
9656 685892 1330058 1284100 926273 -42353 -578507 -108759 57580 -655700 -606866 -339503
9646 -339503 -94405 474086 339412 -209913 129952 -251032 -370855 -122338 -168079 -207926
9636 -207926 67335 312163 72102 610785 518148 -188725 -528506 274473 440518 59171
9626 59171 211056 126932 -205196 -395951 -1003776 -905976 543442 -800993 -711531 -871454
9616 -871454 -199148 -136006 379792 751485 765578 739327 1029849 823497 335753 393134
9606 393134 692545 -171775 -825053 -557282 489789 348996 789603 119503 -247249 1091771
9596 1091771 796430 -2674 -362255 152317 649537 159496 721687 1111023 952675 182471
9586 182471 268996 757489 -455457 -638889 -861796 -345774 -54066 -48301 -547816 -508480
9576 -508480 -488766 -140196 -166824 450886 491992 45026 -40251 210472 -523553 -675436
9566 -675436 583683 209999 -319189 -43875 -149299 -79327 -107923 -595193 -49243 346407
9556 346407 278920 982562 695883 -529283 -170460 -68451 -357985 230746 -340021 184012
9546 184012 1037923 446827 666381 425204 125487 -438325 -1150236 -892946 -573612 -1074121
9536 -1074121 -514531 -135599 -164553 -247025 -756854 -780431 -77158 347314 312587 620695
9526 620695 877761 473082 -357325 -249732 -346979 -159588 387477 237198 501723 63074
9516 63074 -177951 48037 -143140 92159 -375629 91222 321434 491742 395414 484883
9506 484883 653927 594049 649654 -95896 215918 532740 170399 36934 -300177 446148
9496 446148 495022 996671 671858 587946 77321 123972 129834 -251792 436664 399594 -121876
9485 -121876 19155 -301578 -877926 -1601679 -278109 -665905 -714098 230927 -524503 -165393
9475 -165393 -122569 -157594 214690 550760 793274 871941 556042 843777 139274 4388
9465 4388 106457 -63306 -500744 -188973 -243167 -346683 -274377 -361897 -259237 76455 -638326
9454 -638326 -917257 -451613 -613394 -436366 361083 683519 1177270 958728 441466 -598807
9444 -598807 204279 267203 -336683 707618 966507 754574 674300 106860 161031 392510
9434 392510 -225435 256583 453713 -188132 -158839 -270923 -212631 -146882 482059 740431
9424 740431 542141 15686 -756176 110117 214746 276204 432249 -443920 -481241 -363648
9414 -363648 22124 -239361 -990185 -664606 333239 254030 374055 1087770 783285 330934
9404 330934 149294 77821 497647 391595 353242 588863 -318909 -366469 -524403 99987
9394 99987 114930 496822 799243 -37772 171944 -97681 -218047 -85931 -534860 -61035
9384 -61035 194662 274988 548086 497212 -36872 214656 -382279 -1100422 -423634 247828
9374 247828 -114462 -371539 -699001 -680533 -962279 -282182 474195 431657 723687 261903
9364 261903 -9322 268138 -132546 -394904 -1123013 -405086 388349 -619253 243395 285501
9354 285501 655206 1075963 617783 651110 390323 -577856 366473 843413 450234 534188
9344 534188 988506 1624665 1295409 1096089 645386 390164 471018 191979 233270 926926
9334 926926 623131 -382091 129132 -856268 -196016 919148 44863 348626 846154
9325 846154 732345 279238 16342 -307632 701931 406399 -834 575569 716848 508336
9315 508336 -455963 -373362 402161 612940 111618 -525247 -452608 566120 1107841 421300
9305 421300 588524 555922 681043 629880 927553 1365425 1008468 596308 753118 1007695
9295 1007695 774279 1525391 1489265 1444459 1569175 831463 -184894 98274 -208451 -77447
9285 -77447 681262 1041954 610682 766924 1215708 203992 428766 958719 1165657 1026225
9275 1026225 1143886 961312 206771 707155 478486 393171 1459164 1311304 1053861 1269297
9265 1269297 987414 1078146 871049 1493604 1244914 1047080 1320274 1037301 522008 1347923
9255 1347923 1216410 1386395 1664074 1593770 1959918 1829794 3003372 2092994 2190353 2145864
9245 2145864 1697857 1858121 1438072 1499836 1145927 732997 853090 1169059 1515190 1333983
9235 1333983 1535262 1550938 1325035 1000052 1618419 2064214 2739902 2586985 1970453 2177447
9225 2177447 1994544 2009517 1902118 1858454 1734408 2421688 2378319 2156887 2659221 2200862
9215 2200862 2344408 3165946 2823420 2681009 3128863 3191825 3365405 2823489 2760972 2580245
9205 2580245 2629269 2595331 3363217 3265803 3072738 3760363 3535606 3920305 3616973 3230138
9195 3230138 3862814 3618735 3478864 3504000 3091750 3114641 3437689 3922772 3542130 3415479
9185 3415479 3958674 4183778 4601370 4015504 4698375 5182277 4491584 5389006 6062692 6245884
9175 6245884 6210540 5959288 6401852 7123428 7720580 8016435 8125515 8180189 8187049 8850776
9165 8850776 8656625 9307455 10435527 11182036 11684562 11530129 11171496 12031782 12345132
9156 12345132 12975045 14558216 15988661 16305679 16156002 16682012 17569047 18297245 18707118
9147 18707118 19681631 20892533 22381984 24573723 26697804 27922016 30147098 33487489
9139 33487489 36809819 40778193 44823646 49926732 54564410 56603964 55531816 52902952
9131 52902952 49691263 46567762 45370996 44313461 44009317 43325462 43648977 43920695 44027849
9122 44027849 43628120 43626917 43993850 44807244 47673487 49882406 52946123 57063152 61152510
9113 61152510 66111503 69814891 71244291 68627782 64451572 61027330 59288218 58947525
9105 58947525 59586060 60706167 62026856 62693145 62510357 62523988 61905221 62903927 64715006
9096 64715006 67463323 71285956 74826692 77326135 76442540 72801893 66964833 60126178
9088 60126178 56208204 52714617 50332370 49701005 49482330 50099468 51478989 51321798 52129189
9079 52129189 52487969 52770136 54099633 55303156 56540455 58892984 61557037 65002018
9071 65002018 66957539 66587152 63927637 58095856 50771274 44477993 39593846 35357892
9063 35357892 32956305 31123926 28514451 27191745 26122697 24594595 23705553 23699640 23351328
9054 23351328 22152874 21488383 20749415 19005796 18426890 17669972 17525027 17109309 15841310
9045 15841310 14870278 14472987 13908750 13285571 12705944 11628012 11310860 10319579 10316326 10364691
9035 10364691 9561144 9773063 9968240 10111981 8757154 7660318 8302186 8230987 8003359
9026 8003359 7386179 8220150 7755459 7242468 6602416 6353368 6583629 7562427 6824889 5714100
9016 5714100 5164021 4673912 4892096 5000186 4985353 4954266 4754410 5027363 4981743 4903504
9006 4903504 5588093 5067680 4131945 4317858 4286807 4276563 3350937 3477124 2952609 2874633
8996 2874633 2783674 3081801 4252371 4471697 4099580 4024570 3450381 3202471 3355580 3921231
8986 3921231 3458829 2811981 2652077 2160184 2659735 3519769 3942814 3474142 3042338 3006941
8976 3006941 3356042 3677809 3005105 2705470 3097318 3453048 3941939 3578656 3478528 3003076
8966 3003076 3456474 3150059 2477497 3469446 3179763 3348042 4297707 3782968 3320774 3155507
8956 3155507 2621939 3011376 3936924 4162394 2965313 2540040 3030112 2026324 3091931
8947 3091931 3113484 2786825 2745352 2846298 2485915 2710714 3294278 3667963 3435967 2723015
8937 2723015 2919335 2448039 2365771 3042732 2563872 2236945 2511131 3108719 3933514 3096736
8927 3096736 2991750 3227731 2546138 1995324 1493501 2193341 2213065 2399047 2295307 3558101
8917 3558101 4181491 4102080 3952151 3701183 3173634 2306604 1834941 2392953 2696259 2682536
8907 2682536 2154467 1970591 2269223 2306797 1803953 2121010 2671923 2604425 3011091 3579782
8897 3579782 3207083 1881310 2803591 2445481 1875685 2631268 3046946 3011978 2235378 3066307
8887 3066307 3112934 1709187 2008746 2673312 2507739 2006584 1532620 1828243 2438668 2716315
8877 2716315 2651759 2584418 2701711 2571438 2563099 2743872 1829874 1114305 1849721 3146141
8867 3146141 3809599 2891437 2290031 2251761 2553679 2207985 2345286 2783984 2279601 1587184
8857 1587184 1789384 1647569 2421381 2582079 3636140 2923378 2906105 3253373 2808883 2839161
8847 2839161 3278949 2820311 3514186 3744043 3404690 2802332 2494404 3184530 3236488 3415301
8837 3415301 3235504 3868566 4288783 3904383 4110114 4412323 3589722 4390173 3826829 3802074
8827 3802074 4285100 4677021 5277199 4898993 4410998 4803522 5351040 5487538 4646707 4418114
8817 4418114 4474144 4506223 4474937 4594963 4998110 5758117 4603098 5132010 6032322 5802578
8807 5802578 5508014 6026080 6100783 5729625 5477509 5117294 6189075 5628836 5042246 6028807
8797 6028807 6777735 6889622 7485543 6750527 6986071 7427390 7835911 7866676 8205044 8924652
8787 8924652 9130264 7912271 8711819 9888104 10470846 10318108 10751191 10996307 12123976
8778 12123976 12246060 12921929 13877958 13699236 13679244 13860370 16167307 16815422 18038312
8769 18038312 18784017 20305496 21337677 22213045 23288502 23674434 25175827 26673166 27552405
8760 27552405 29028390 31177524 33374001 36144287 39070684 42910407 47658181 53171508
8752 53171508 58802837 63974712 66115164 63167698 57718073 51568259 47829328 45115473
8744 45115473 43105990 42142288 41365366 40790186 40554924 40542793 38722728 36564051 35967577
8735 35967577 35458765 34767347 35189791 36534520 36951758 38263993 40151070 41364152 42593223
8726 42593223 43624660 45099834 46546010 48263662 50897813 54098568 58500870 62177400
8718 62177400 66040386 70780533 74642954 79642453 86035343 93437698 100011345 103998326
8710 103998326 104896297 99833684 92618252 83338105 75008945 67397759 62347580 58165995
8702 58165995 55119050 53328285 50654738 47302261 44955518 43058399 40842620 39884476
8694 39884476 38025325 37377170 36976099 36670464 35393263 34750805 34496283 35013398 35456567
8685 35456567 35767508 36903413 37652173 38986258 40331494 41022386 41943320 42403318 43321845
8676 43321845 43668244 45194272 47704613 49925596 53274760 56216798 56637220 54486134
8668 54486134 50280683 44768263 38671574 34181887 30747654 29196500 27474932 26088867
8660 26088867 24813919 23074132 22238070 22029969 20951723 19690911 19436478 18411796 17645245
8651 17645245 16914969 16217238 15273341 14269810 14048524 14274591 13863098 12627186 12055080
8642 12055080 12372001 11881929 11794419 11454553 11091140 10369135 9787394 10439647 10117890 9353454
8632 9353454 8975963 9140801 9260983 8671977 8134563 7904377 7246724 8157227 8663871 7635006
8622 7635006 7054950 7043143 6749649 6524088 6999077 6175296 5464847 5540031 5245583 5358760
8612 5358760 4484719 4325099 4892454 4718301 5496506 6612364 5610702 5083109 4525126
8603 4525126 3808693 4544506 4121355 3908911 3445542 3405612 3636048 4193003 4489626 4774397
8593 4774397 4661670 4035889 3594523 3001178 3269612 3001405 3297896 3451867 3477658 3994127
8583 3994127 2933188 2344722 2438895 2919636 2806138 2568807 2187280 2098474 2931236 2929378
8573 2929378 2396668 2332435 1873098 1230914 1773393 1807624 1647628 1677969 1971229 1832919
8563 1832919 1415860 1542010 1631092 1507838 1127266 2073161 1902002 2096053 1518504 1442610
8553 1442610 1521123 635911 1454607 1623045 1726700 2180638 1999339 1260574 767466 908622
8543 908622 765158 588240 592648 423413 330083 764096 244125 749958 580513 374428
8533 374428 1261412 895058 1714885 2177561 1025557 649440 1175881 1083519 722726 689097
8523 689097 1023550 344460 616544 933254 1254724 796104 491017 133021 3943 435574
8513 435574 378820 392524 510803 438018 301437 424125 743156 708556 873285 606010
8503 606010 157042 317648 339266 817369 326809 -346469 37262 578122 213105 135705
8493 135705 507368 471087 50380 -211839 630147 -608294 -888481 -182488 400045 338087
8483 338087 -187661 -230127 -100418 -406279 -505041 23733 255180 2258 -512980 -198311
8473 -198311 -416906 -55703 -811930 -306455 76093 320471 450002 80547 -362600 -377969
8463 -377969 -1357429 -529643 -100563 -704415 -1142047 -1188740 -443446 -169959 -459341 -165087
8453 -165087 278942 -249419 -1058247 -1046606 -779951 -411775 -384088 -166474 -228262 -1503769
8443 -1503769 -1100749 -725758 -59490 -565329 -415902 -506465 -280565 -353812 -520300 508952
8433 508952 1068834 -440016 -152087 -150253 -177545 -505359 -318485 146692 -479116 -2706
8423 -2706 -165300 -1020250 -319946 -733263 -997711 -713942 -773729 -951767 -363762 -94695
8413 -94695 -351259 -286843 -382401 -823409 -670592 -563967 -1028517 -974080 -54256 162912
8403 162912 335746 3886 -467260 -474560 -130291 367463 -278944 538254 43752 -543792
8393 -543792 -792744 -369139 -165144 34245 -379406 -415546 -579823 -140234 -1025746 -901505
8383 -901505 -947431 -187308 -458057 -144866 -36408 -499049 -130977 -640817 -420223 -785458
8373 -785458 -556884 -558583 671824 155427 165956 -10533 -336778 -430596 -770842 466310
8363 466310 -544542 -890917 -480035 -76195 170608 -328587 -612895 -619327 -421255 -168274
8353 -168274 -396494 -396370 -608982 -9992 -47619 62523 -421873 -355583 -19537 -18848 91308
8342 91308 610077 -216671 35803 557957 276904 541620 619595 -12409 110675 426395
8332 426395 -109622 -359678 -809092 -62657 -512954 -276629 -395979 211786 -103774 23648
8322 23648 -244307 -735085 -1121256 -372450 398429 343506 594152 380326 -405098 -790929
8312 -790929 -1382983 -689345 -398832 -188068 52805 -315166 143565 24296 39121 281283
8302 281283 -96247 249086 53373 110921 200279 -84212 -479775 -774029 -345216 -467856
8292 -467856 -451261 -981142 -242888 176853 -96810 29601 -571543 -821549 -698111 -237708
8282 -237708 -261333 -695394 -1020920 -1154238 -1183605 -487329 -176211 121154 83515 -598562
8272 -598562 -795082 -696594 -829479 -1055522 -473031 -732608 -831344 -1089378 -245793 -258153
8262 -258153 -540537 526908 -113148 -1258206 -1407103 -950341 -980801 -1335630 -1150897 -1273075
8252 -1273075 -1579585 -497488 -690706 -560184 -460198 -369833 155429 -412160 -35519 -37972
8242 -37972 -201235 -42660 -624256 -48613 -218223 -430476 -450977 -118537 93555 -422652
8232 -422652 72755 -924713 -915608 -668613 -509190 -402195 -1136594 -608847 -183390 -618468
8222 -618468 -778089 -1029142 34995 -73210 -360985 -488061 -975500 -770994 -237862 218187
8212 218187 595596 482617 408305 -230284 -648930 -217847 -710722 -1132016 -1150195 -637088
8202 -637088 -75899 -1205787 -736514 -883739 -251185 523184 -248854 573301 850308 640736
8192 640736 -2013039 -2907096 -2155692 -843388 -385448 -629043 -1072378 -1495912 -915707
8183 -915707 -237508 -920567 -1548395 -1134441 -1115141 -586052 327195 341217 145206 -313887
8173 -313887 -581606 -156912 342174 454568 -396288 -497511 -659048 -246449 -159961 -355568
8163 -355568 -620354 133995 -336218 -959622 -251094 326241 -746240 -254881 -47050 -1298156
8153 -1298156 -311435 95415 -1139345 -1562516 -293064 -569489 -412152 -826252 -1190989
8144 -1190989 -1293518 -299234 228408 128971 -365331 -1587847 -1511014 -941976 -794099 -725141
8134 -725141 -858328 -1045379 -951135 -805224 -417987 -675217 -796969 -1129558 -591846 -512017
8124 -512017 -769771 -901823 -1037550 -925912 -526679 -1236028 -1347548 -941640 -211282 -627406
8114 -627406 -1021635 -1023005 -1704695 -1652802 -319703 -1196215 -2185926 -1071121 -13160 -182214
8104 -182214 -229242 -615132 -1121956 -1189636 -1160692 -1270773 -1100840 -167470 -713923 -593081
8094 -593081 -619055 -617493 -325946 -730920 -524284 100384 -639992 -899963 -866305 -820743 -455064
8083 -455064 -284533 -641346 -820040 -1416941 -1145723 -1387553 -1829679 -1583701 -1203820 -1131061
8073 -1131061 -606066 -56749 539929 -350662 -216899 -716714 -1107889 -1073306 -444796 811812
8063 811812 733772 460036 -725657 -915371 -417183 -928266 -1179680 -1676011 -1547341 -1698430
8053 -1698430 -1561934 -1213795 -712034 -310284 -873745 -659511 -476564 -638428 -769114 -1654069
8043 -1654069 -2034289 -1269482 -810221 -411521 14241 -375055 -111823 -201432 -157311 -96327
8033 -96327 -353820 -754646 812185 956429 149096 221923 -516233 -696952 -756180 -659150
8023 -659150 -707286 -478982 -374308 -224626 -1723785 -1774319 -1556754 -1061052 -1297451 -1444139
8013 -1444139 -1602304 -1517372 -909546 -781716 -1410718 -1171822 -712545 -312307 -523824 -1575839
8003 -1575839 -1373285 -1208854 -1281248 -1340055 -1230731 -1107549 -630413 -945655 -979680 -1069341
7993 -1069341 -2328723 -1531457 -1443207 -961399 -895018 -872810 -1213050 -1063059 -943563 -153114
7983 -153114 -674950 -673833 -793418 -1552622 -742189 -720645 -712696 231126 -855833 -917593 48023
7972 48023 -885983 -1474015 -455476 -90722 -1301702 -969950 136054 -358448 -315442 61417
7962 61417 343986 192984 -1350251 -943422 -673968 -841724 -200173 -1021270 -1287394 -644273
7952 -644273 -1642592 -1183631 -933941 -1291162 -544720 -88085 713725 476674 -831656 18630
7942 18630 -383773 281036 -48988 -1066215 -718035 -501607 -1236656 -884601 -502084 -1049751
7932 -1049751 -858233 -579345 -662338 -525517 -1211480 -966791 -689296 -286378 -591454 -560772
7922 -560772 -963123 -412241 -579722 27921 -91571 -158802 -1147349 -950960 262394 -103731
7912 -103731 -412303 -595563 -1431527 -1212772 -677651 -932271 -823390 -1084709 -573474 -426383
7902 -426383 432634 -574071 -535013 -47752 -374194 -596290 -219278 216011 34307 -570888
7892 -570888 -457679 -1121854 -167506 -691194 -647832 -952948 -629693 -1474225 -1067331 -824877
7882 -824877 -682600 -121658 -135421 295910 327282 422355 -80857 -808782 -1012215 -157705
7872 -157705 39119 -470899 -663504 -363415 -535818 -69014 708884 989091 -49323 -304007
7862 -304007 -205059 -327065 -853082 -689266 -625030 135113 -401486 -490599 -155315 -851382
7852 -851382 -350107 -10559 -502189 -1034095 -836104 -1250870 -880527 -679840 -94529 302912
7842 302912 -403204 -1103977 -719117 -108912 -22426 -478071 -291906 -10711 -478769 -490898
7832 -490898 -652952 437136 135603 -204043 -40174 31927 663781 -112507 -551605 -450932
7822 -450932 -1039197 -497815 -177944 -259937 53737 423240 30363 -686754 -231602 -360693
7812 -360693 -45835 -466225 128209 26026 32385 18216 -132746 -787372 -1208474 -781827
7802 -781827 -670660 -324937 -929798 -99527 52124 21507 -663309 -1057490 -517598 -92945
7792 -92945 -841956 -518525 -477085 -88965 -124052 -220999 -913025 -803499 -578387 -606975 -487329
7781 -487329 -389194 -85723 -697640 -329776 27083 -162926 -632667 -713558 -1097463 -237150
7771 -237150 144633 -453296 -921256 -967987 -563627 -37607 -713116 -609965 -672451 -778056
7761 -778056 -366923 -649515 179434 538358 248047 607128 555726 564759 813213 405838
7751 405838 892533 660671 983531 718094 722754 823615 91606 225168 1202788 643633
7741 643633 625062 529668 706276 363649 491390 -47763 -615849 645731 944007 587298
7731 587298 141295 97072 162967 -256903 -66992 -313509 137040 350941 -650205 80505
7721 80505 -290694 -225661 222301 -278341 -623845 -124921 -121173 -248243 -598833 -648458 -746568
7710 -746568 -335624 -151965 -277307 185817 31207 -103334 -308919 -1422286 -361736
7701 -361736 -590952 1144 -426558 -108131 -438568 55606 673262 190576 -310223 9606
7691 9606 -723972 -983652 -787496 -213126 376260 45086 199925 542687 749699 298222
7681 298222 1067521 495168 351212 70763 -459825 389356 627515 594052 574440 53319
7671 53319 -948382 -195598 802645 809153 740351 -256235 -5884 513142 639863 799820
7661 799820 354904 433820 -364835 -696069 97636 390571 262362 -547011 -1118535 -504252
7651 -504252 -472193 -249435 242861 -57583 792404 627352 279022 -581441 27763 -466769
7641 -466769 -699175 -744882 -23819 48248 -37412 -706402 -1654666 -1447892 -369886 111887
7631 111887 472614 -871125 -1118362 -910027 -100696 168267 -12708 -399739 -784269 108631
7621 108631 671317 1295805 427984 -705679 -757015 -760423 -1018207 -491384 -341653 -956480
7611 -956480 -1480765 -877433 -584166 -65292 -48308 -11311 -928817 -775965 -10043 -870040
7601 -870040 304154 211743 -655798 -111075 -328619 -362542 -334183 59834 386436 -432696
7591 -432696 -221002 71220 224485 -398124 -285522 -462250 -901702 -641600 -287643 76658
7581 76658 -1000689 -909845 -785188 -539272 -397403 -99849 391620 279555 -122754 98753
7571 98753 -562668 -296760 -321839 -28995 -12555 59701 594054 -256971 -184004 -390170 -857136
7560 -857136 -322827 -395783 -109640 168258 108079 -577852 -643938 -363083 -913347 -748033
7550 -748033 -1131201 -803761 -796488 -875214 -296725 -170995 -64558 177131 286850 133101
7540 133101 613479 299502 398198 238455 -453536 -727080 499881 384707 -175155 -485305
7530 -485305 -320710 136335 -304716 -219356 -203521 -409562 -1056767 -730604 -871554 -738660
7520 -738660 26419 -93647 -462970 568326 47576 660215 177579 157743 481207 -313888
7510 -313888 -364561 -453273 -531797 312579 -364419 -396370 -105678 -397121 76606 -653791
7500 -653791 190030 511763 497050 767709 617822 -399945 -365453 214112 1226446 1437910
7490 1437910 661392 503589 255823 -674783 -283120 -162188 -417155 -207438 -173417 -163945
7480 -163945 518105 986967 301424 3278 771713 369556 134172 324653 931060 861397
7470 861397 1220800 689425 889022 693965 1256884 637119 111191 582079 -283089 352805
7460 352805 544263 637582 684402 415921 800512 306458 -70779 208376 433750 1045322
7450 1045322 1001609 1273865 1220758 1697320 212963 220656 288546 1195527 852384 -250147
7440 -250147 -553490 353427 1012033 967802 1523841 1445446 715653 812606 1039516 833766
7430 833766 1063580 1602269 1668455 1348699 1590896 1681487 2164006 1533578 1441115 1588850
7420 1588850 1942839 2275162 2208998 2302605 1950576 1761925 1515267 2225945 2522340 2545116
7410 2545116 2575691 2184373 2285500 2558999 3467603 2727217 2144181 1468230 2022541 3687953
7400 3687953 3683179 3742773 3717501 2691982 3016032 4016142 3894524 3203962 3407503 4426145
7390 4426145 4060742 4236795 4936431 6229533 6287528 6173332 6131865 5804056 5588154 5663938
7380 5663938 6835848 7470750 7327448 7142718 7607906 8748712 9321792 9852444 9856945 10107028
7370 10107028 10186876 10810080 11876643 13519709 14031032 14278212 15135578 15940340 16986041
7361 16986041 18142963 19946645 21317382 22886471 24496637 25960935 28308719 32128141
7353 32128141 35859555 39399420 43068626 47224337 52606504 58899025 67547463 78255115
7345 78255115 89327946 99864605 107619997 111345222 107654575 96482623 82460090 69300181
7337 69300181 58806080 50093378 43764624 38688899 34426086 31228241 28946358 27369533
7329 27369533 26055903 25017009 23400552 21208098 19418877 17790833 17400146 16133479
7321 16133479 14614023 14372326 13477303 13081588 11660732 11351594 10214614 10483451 9966727
7312 9966727 9078493 8642967 7758579 8132498 7882674 8258903 7669448 6922000 6825660 6557730
7302 6557730 6439861 5252363 4621601 4602363 4446437 4650073 5560176 6262525 5535231 4634247
7292 4634247 5638174 5485842 5219856 5182410 4766714 4459238 4055289 4269578 4599883 4131894
7282 4131894 4727558 3694829 3796427 3490253 2965275 3603888 3175821 3641357 3209033
7273 3209033 2787018 2986884 3021838 3108899 2698775 2251554 2615715 2558415 3274940 3817993
7263 3817993 3371102 2766165 2211057 1901586 2440048 2387185 2549958 1971836 2515108 2745007
7253 2745007 1384601 1420997 1666547 1595611 1302132 1262045 863644 1299928 1245499 430971
7243 430971 1225878 881743 745594 1575736 1147432 610784 1360043 1206452 2156783 2111211
7233 2111211 1341832 552648 855112 1183920 916440 1084941 1085402 1244289 632119 385289
7223 385289 1022729 956188 930826 1050156 1133876 807982 -355569 -243167 531318 640998
7213 640998 566550 446916 802908 742510 544570 1321156 833530 818330 888450 1189754
7203 1189754 439020 -271919 379736 799705 510818 1045012 448030 124642 767625 890829
7193 890829 1160717 830083 683093 715713 534257 612058 1266708 522956 963501 1760322
7183 1760322 1569020 1192813 1497769 1453450 1331722 1060045 1089152 1278083 1575898 1223153
7173 1223153 645816 765314 673465 538788 1135796 1164719 1357627 1517456 1808135 1529862
7163 1529862 1234392 1288965 1399615 1706272 1993682 2077381 1761572 1852910 1880504 1359132
7153 1359132 1398679 2378908 1888370 884864 1903272 2651596 2581818 2102305 1265606 2062269
7143 2062269 2565948 2864814 2872779 2967333 3239444 2932800 2831968 2174545 1214577 1572501
7133 1572501 1468134 2060949 1567049 1856301 2732856 1893475 1319318 2062504 1260449 1123309
7123 1123309 1008768 937020 1356601 1162060 717743 352416 497060 366777 -460763 -265523
7113 -265523 73188 -7402 762729 -193272 -262980 587306 207476 803464 1104088 1230914
7103 1230914 672675 364870 305930 626758 655328 497396 417227 90093 -109282 202148
7093 202148 665341 765619 236728 -356485 -197782 59755 -590294 -235867 619904 756267
7083 756267 357974 -84198 -180147 -521461 -401862 -955160 -145882 511870 428461 697161
7073 697161 806278 723272 905811 570264 928671 865871 1195368 816926 323171 28612
7063 28612 -7720 344364 120873 -72180 983207 1235222 -82331 -602061 254285 1091811
7053 1091811 951370 37590 -405827 209892 190941 -360248 -533369 -780313 200827 -10102
7043 -10102 174633 967027 775613 474702 575890 325802 720781 655984 1323476 82153
7033 82153 327177 1014823 351158 51395 130733 255135 307674 69688 -203102 38707
7023 38707 463171 426287 775054 724096 131918 337880 -143667 254690 -324873 -39362
7013 -39362 353888 956970 26208 -230100 -401625 -498853 -696028 -259131 129819 900529
7003 900529 596183 494738 350627 472362 -31696 -354837 -15334 187219 988142 1036566
6993 1036566 -16387 47130 -17690 222535 746627 263164 269894 -157787 -1098205 -385423
6983 -385423 -711910 -806565 -1172689 -725050 516551 732455 210028 -214355 519694 491511
6973 491511 745972 253326 187805 384261 -41861 -486767 -892771 -31560 342665 -155814
6963 -155814 -81039 -358873 312304 -35920 386586 187132 259185 -439943 -566583 -32978
6953 -32978 410783 526633 132567 648087 469723 -332118 -411437 177124 155390 50683
6943 50683 1198431 1426039 172811 -193518 288895 408705 523625 897842 206994 25813
6933 25813 602588 1009787 1618295 1180384 -191375 194769 347294 224914 751209 177318
6923 177318 -121152 -12389 872232 617719 -110317 -451513 -46239 373349 -294738 -519425
6913 -519425 -560199 160276 281972 -207735 -277789 57959 263482 477843 175558 381799
6903 381799 808171 737354 -167998 -555932 -18276 -361969 -311393 149561 273628 168913
6893 168913 72507 664272 1218237 446196 457272 913943 569322 478284 472088 369415 278878
6882 278878 535463 434648 206160 133838 631427 31595 166120 1036421 618461 45703
6872 45703 208940 365460 499197 753865 327245 353327 206986 -168240 -315874 388543
6862 388543 891581 1502443 286401 380807 1221264 659569 -493236 -155380 74004 1004916
6852 1004916 811826 718479 327287 180809 -94878 -675929 -110735 -667244 373432 340223
6842 340223 -321089 -222064 -21917 247525 216781 -171103 -258394 -616610 812081 1201578
6832 1201578 1177454 1424480 515018 115157 80513 79175 11609 1353943 820422 165994
6822 165994 512797 1455 866779 1141214 1292758 1274849 750945 632448 603723 687483
6812 687483 912016 622281 243340 -805168 -796814 398314 640447 317307 912490 531267
6802 531267 -147613 64432 -165583 149001 661576 331098 781998 1816248 1872585 1071054
6792 1071054 592386 650128 74892 265169 485946 -324447 238559 910610 1811452 1416871
6782 1416871 1510775 1052571 643465 491640 650009 736300 116442 639581 512412 1045395
6772 1045395 635503 169779 782950 792220 568289 808910 1345931 767150 677283 888838
6762 888838 700681 317326 79888 -420469 -75103 -429037 -247535 -164183 -108222 -112648
6752 -112648 -357538 80009 458995 545152 246687 -172580 -440668 -722516 -738836 53432
6742 53432 252135 -40116 309506 1129119 747592 1233717 516018 497871 114387 47830
6732 47830 269919 78687 949201 632893 -7780 -305978 -690321 267963 462808 56300
6722 56300 5678 -223019 -137230 173609 342398 98524 -310007 -439341 -329200 1671
6712 1671 639335 547783 -4695 841326 -123955 -19783 -266348 -670734 280957 951626
6702 951626 543813 323630 744749 1271158 1670204 880719 788171 369323 -262710 550448
6692 550448 926298 1351142 946652 -2903 1072693 950695 959590 903614 -247229 -19838
6682 -19838 924804 950166 937362 830420 909033 1155048 1275480 1295399 1390727 1094843 918430
6671 918430 -581755 -631881 841627 1221686 998775 1028013 726380 522394 970465 220139
6661 220139 740181 -50614 607060 903850 858894 1122093 1554091 1437259 1033932 689044
6651 689044 348333 213328 521857 621268 -132455 956393 887402 758808 1047384 772553
6641 772553 1117786 782758 212451 329857 701185 807756 -83338 -22310 672917 128181
6631 128181 -225197 -38450 786294 624481 115046 43904 379370 840976 803443 556051
6621 556051 -200300 -262086 -141097 -339571 -70895 474773 754900 1268308 164564 524477
6611 524477 951380 1554852 642058 1143372 1272621 1725403 816361 1181756 2062997 1541192
6601 1541192 1578148 1908214 1732591 962242 174006 -366270 -213204 897081 634949 613284
6591 613284 677860 821092 1161819 1041360 1312877 955632 915176 616337 897351 909698
6581 909698 1063749 709011 1009595 1154267 1315101 932718 -307304 1050166 1367715
6572 1367715 695795 789833 68718 384854 380350 975047 927098 937524 458556 682875
6562 682875 817644 690242 768911 1204434 894354 580014 860376 1152731 1601018 1261673
6552 1261673 688075 403135 -91794 -21424 -262495 584512 1725294 1043165 174433 223617
6542 223617 867735 1081497 1542900 1535370 998909 1020881 890885 1179570 900066 462122
6532 462122 1000127 1541153 957988 495881 1222730 815527 665915 914455 705408 1542656
6522 1542656 1623626 1170706 1299544 1841874 1476929 823703 406779 128962 433968 1352245
6512 1352245 964958 213729 -365146 171980 1065169 1411583 1117051 1095280 1066402 941816
6502 941816 1298281 553008 1184759 938455 913651 2095780 1074286 868209 907289 1093486
6492 1093486 1931441 1175007 1164873 1620793 1504785 1483910 1493970 808583 1357917 1092064
6482 1092064 773585 1581128 1981022 1473226 1217626 1195250 1258168 1097352 1216839 1704194
6472 1704194 2061076 1760684 1766053 1527449 1302239 1783205 1225052 159452 315629 -213980
6462 -213980 498791 1061959 380739 959708 1314417 2118668 1715201 1855937 1936515 2061367
6452 2061367 1598341 1600314 1493998 944290 648831 727502 1600569 1215617 1314476 1870319
6442 1870319 1488617 1086937 1564992 1125161 860105 616966 869492 1379556 1212909 1345049
6432 1345049 1265520 947542 942414 961516 1003939 1517527 1872638 1552489 1446431 1075943
6422 1075943 2003601 2262461 1412544 750879 863091 1095805 612343 1324517 1116250 1934751
6412 1934751 1601804 1874274 1874202 1871552 1938118 1730804 1561005 1546530 1496306 949313 1290500
6401 1290500 1313346 1126383 1148864 1774467 1724210 1517934 771030 1002585 1114418 1408722
6391 1408722 1811962 1101399 1417383 2047633 1842637 1354668 1796039 1750243 2039729 1837502
6381 1837502 1536259 1172098 860629 749856 500174 869725 984271 2143338 2118066 1922636
6371 1922636 1311888 2167727 2488337 2102896 1229525 1140751 1753167 1273012 1429454 1073621
6361 1073621 1586299 1396066 1519040 1678412 1207972 1989604 1602631 1358734 2037682 1874597
6351 1874597 1356269 1504371 2024521 3029933 2777659 2537631 2497092 2042058 1347519 1537276
6341 1537276 1438125 1811533 2474637 2018261 1834752 1932626 1716966 1667814 2391658 1644892
6331 1644892 2296583 1547574 1428576 1848165 1795966 2042943 2147672 1730256 1491880 1864425
6321 1864425 2200581 1982384 1617602 1903052 1187852 2017065 1905511 2522235 2862135 2224568
6311 2224568 3026917 3265312 3019790 3236788 2771757 2152633 2688236 2433672 1917173 2248034
6301 2248034 2727744 2879706 2403973 2286986 2798429 3283294 3049297 3078048 3642873 3048287
6291 3048287 2441028 1720181 1690322 2483738 3381722 3082268 3309442 3402155 3374005 2987822
6281 2987822 2178605 2650029 2152527 2301543 2302142 2711054 3387711 3233394 3932868 3768533
6271 3768533 3828923 3551004 3452123 3260526 2893615 2806493 2401547 2093331 3547023 3351979
6261 3351979 3141787 3792042 3849637 3722838 3264871 3147165 2980760 3738294 5053206 5530709
6251 5530709 4166701 4328825 4657089 3761960 3695850 4120160 4286335 4683429 3925846 3709706
6241 3709706 3672529 4095520 4555226 4858654 5303619 4875546 4628641 4144755 4908688 4942361
6231 4942361 4858489 5363647 5305801 4742413 5452247 5396131 4912042 5222212 5680488 6369546
6221 6369546 7027475 6743381 6111391 6716931 7181702 7127219 7328350 7352460 7763552 8045893
6211 8045893 8774450 9259655 10521013 12257275 12736774 15575138 17872673 18718208 19655938
6202 19655938 20303085 19073710 16816802 14365759 11800008 10391051 11022839 9691839
6194 9691839 8081070 7205689 6882695 7190626 7347053 7284523 8083166 8422350 8012581 7139291
6184 7139291 6716145 7163506 7964966 7607987 6856668 6367919 6361401 6115665 5936764 6575683
6174 6575683 6499299 6169402 6221753 6703793 6771835 7015125 6922706 6352818 6147437 6171187
6164 6171187 6747527 7015289 7238177 7029865 6491204 6545942 6236903 7025873 6914742 6589525
6154 6589525 6794320 6913558 6756087 7229443 7199031 5967248 5717833 6233542 7173759 7167374
6144 7167374 7311548 6745634 6953543 7747857 7267263 7301111 7298057 6757603 7004097 7602973
6134 7602973 7301754 7782496 7866648 7852875 7329701 7570638 7418150 7574195 7184374 7815017
6124 7815017 7746489 7879996 7664150 6938938 7361352 7324833 7199622 6998777 6146373 6665912
6114 6665912 7049415 6538628 6398422 6272981 6582858 6616181 7137222 7373375 7722364 7613934
6104 7613934 8005551 7641212 7207904 7339839 7008432 7666881 7924619 7579180 8253709 8524144
6094 8524144 8575595 8240335 8832063 8848316 8959398 8325237 8079347 8920976 8819437 8088547
6084 8088547 7281992 7684765 8130132 8055856 8042006 8748222 8705858 8656281 8337786 8171250
6074 8171250 8729330 8804912 8224214 8917552 8906045 7989884 7786906 7466382 8094119 8689086
6064 8689086 9460513 9057134 8952029 7845734 7903886 8604495 8501729 8215793 7940223 8261818
6054 8261818 8620149 9159076 8628459 8900094 8983507 8454986 7986807 8307263 9391255 9683039
6044 9683039 9690933 10082860 9926939 9265184 8803902 8898249 9516999 9652693 10478096 10516334
6034 10516334 10227454 10388569 10358888 11037771 10828347 10713500 10565678 10042977 10241076 11401661
6024 11401661 11835090 11616769 12431504 13403108 13353505 14322142 14226064 13825348 13717884 13533603
6014 13533603 13698502 13554031 14198761 14361183 14808518 15434088 16881512 16223848 16206419
6005 16206419 17069358 16463616 16549135 18014696 18759221 18501556 19089173 19913312 20402751
5996 20402751 21002257 22143939 21862864 22386166 23676286 23747509 23922580 24340350 25030258
5987 25030258 26099731 26451176 27114056 28269091 28043906 28634424 29215143 29942479 30898306
5978 30898306 30810365 31422235 31505430 32061965 33009140 33716569 33826556 34496643 34961186 36239126
5968 36239126 36476934 36247576 36902906 37892155 37793615 38110810 37912494 38575023 39671131
5959 39671131 39982220 39625658 39273763 39019989 39761836 40411883 40207784 40827142 42058495
5950 42058495 42642528 42568332 42866847 43053160 43401395 44922353 45464571 44925692 45879968
5941 45879968 46046778 45876263 45036973 45693932 46337328 45883276 45286468 46570595 47209695
5932 47209695 47669749 47544139 48371049 48047127 48501078 49853892 50400920 51415692 52468945
5923 52468945 53733078 53909348 54006596 55160065 54913288 55656283 56608537 57710136 57741032
5914 57741032 58132557 59501108 60703322 62596728 63560101 64899682 66104131 67342417
5906 67342417 69639612 71364685 75125296 77950027 79821553 83456950 88090200 92230675
5898 92230675 96038671 100599779 105111853 110714088 115212723 120049678 122671506 124363406
5890 124363406 124247234 122871839 120018364 116185497 112269302 108463073 104750482 101190574
5882 101190574 98449197 96138234 94219041 93580843 92566696 91843823 91055500 90915514 89967553
5873 89967553 89696117 89857266 88803350 86937898 85559517 84351054 83331951 81965976
5865 81965976 79315846 76651248 74932249 71489094 68819718 66533544 63799034 61838734
5857 61838734 60005334 58304412 56687300 55472991 53510662 52831462 51663428 50899531
5849 50899531 50140903 49086853 48091136 47619387 47572253 46802175 46078009 45646278 44752116
5840 44752116 44769310 45502344 45417351 44736372 43984990 43072959 42813981 42963884 43078206 42379700
5830 42379700 42012941 42676716 42883318 42869144 42195473 42099705 42963198 42444505 42473324 42359755
5820 42359755 43077978 42185141 42741125 43494200 43929704 43744304 44510147 44430460 43738241 43710463
5810 43710463 43075706 43985613 44817294 44853293 44910449 45798666 45694576 45251815 45149884 45681520
5800 45681520 45796891 46114461 46925482 47151582 47043524 47233128 48184829 48237588 48623557 49360669
5790 49360669 49674138 50492249 51287629 51409601 51282303 51790579 52647944 52862058 52747053
5781 52747053 53249179 54000722 55014419 55512070 56260713 56212588 57157295 58086024 58844636
5772 58844636 59531897 59866686 60736453 60603279 61302185 63093609 64067375 63945962 64647645
5763 64647645 66181558 66637138 67427881 68920811 70112277 70237507 71548770 71838471 73403893
5754 73403893 73826835 74872975 75632047 77259604 78752379 79540577 81060694 81974086 83497944
5745 83497944 85516844 87322130 88282699 90468643 91931844 91606972 93386455 95387026
5737 95387026 97130134 99094945 99706786 101460947 103702630 105923961 108434889 109797664
5729 109797664 112193441 114316716 116097659 118863342 119845125 121919579 124531811 127227842
5721 127227842 129018872 131651750 134469122 136648122 139062855 141103233 144728117 147415082
5713 147415082 149744484 152640616 155557646 158514649 161622959 164324255 166499000 170145132
5705 170145132 173053057 176496966 179775681 183428282 186915508 190994223 194814448 198346647
5697 198346647 201536624 205076558 208251780 213029167 216865920 220635638 224722162 229570996
5689 229570996 233134301 237163048 241574831 245801640 249492559 253346700 257380295 262177772
5681 262177772 266273816 269906566 274352644 278896819 282815279 287113478 291354345 295011111
5673 295011111 300116195 304134591 308839000 312880869 316814920 320806915 324670872 328418227
5665 328418227 333509493 336708431 341008985 344702390 348660741 352143661 355682798 359204882
5657 359204882 363132558 367141029 370911506 373836240 376943721 380541470 383173725 386080108
5649 386080108 389246560 392995516 395320746 397729289 400437604 403261214 405223533 407122976
5641 407122976 410392521 411767201 413430741 415425049 417325202 419597455 421258177 421817400
5633 421817400 422201279 422831403 423512005 423983042 425657989 427286372 426986032 426766653 426020150
5624 426020150 425457789 425371176 425297435 425287371 424431951 424346164 423243224 421953524 420735721
5615 420735721 419684671 418929059 416700611 415535234 414204652 411791669 409602796 407515118
5607 407515118 405864351 403597863 402290423 400531976 397361995 394798778 392238451 389946509
5599 389946509 387035629 383459177 380042993 377211752 373365806 370561257 367267932 363852882
5591 363852882 360480196 356831301 352544827 349091874 345873544 341474760 337603686 333655762
5583 333655762 328703918 325053863 320338218 316012704 312295690 307227315 303515366 299886265
5575 299886265 294158458 289473928 285464059 280516661 276598542 271507892 267762892 263391372
5567 263391372 258332392 254221324 249606778 245823438 242011197 238261530 233775766 229757130
5559 229757130 225641209 220650824 216765213 213053258 210009497 206710915 203722071 199784858
5551 199784858 196523768 192953081 189116123 186168681 182661613 180146719 176551705 174399797
5543 174399797 171220778 167681308 164359560 161978939 159585379 157299048 153945831 151382058
5535 151382058 149578350 147677044 144563692 141743452 139911144 137378006 135809787 133544081
5527 133544081 131315546 128716477 126327400 124679945 122564600 120284719 117529298 116042338
5519 116042338 114570107 112268307 110935887 109474888 108446599 106767801 104903019 103081743
5511 103081743 101193175 98986928 97817421 96106006 95302271 93710735 90994020 90001259
5503 90001259 89956842 88710501 87881190 86014813 84462177 82418894 81498133 80528294 80037900
5494 80037900 78301946 76620015 75470817 74272100 73630836 72836939 71550999 70438244
5486 70438244 69550010 68195254 68123232 66712295 65051578 63402113 63430945 62629218 60930562
5477 60930562 61407241 60874142 60423041 59633296 58198117 56796026 55815994 55285470 54898422
5468 54898422 54014485 52853591 52598513 51531119 50617335 50196631 49085001 48425434 48896608
5459 48896608 48525789 47913877 47661744 46408935 45342657 44375687 44004399 44147861 43533797
5450 43533797 43371628 42742414 42152055 41653918 42192234 41405543 40463875 40125152 40264677
5441 40264677 39498014 39073627 38691964 38037309 38179318 37253555 36061980 36052846 36951713 36518057
5431 36518057 35466170 34833984 33928408 33016865 33123678 32809133 33062376 32854983 31370169
5422 31370169 30542871 29709080 30293955 31038464 29908316 29223867 29673966 29286432 28764968
5413 28764968 28911016 28488438 28172212 27815364 27520184 27336876 25729977 25530936 25337920
5404 25337920 25332289 25272962 25091961 25167965 24923467 24682977 24288002 23100623 23552334 22741958
5394 22741958 22832016 22979963 22636962 22516070 22225767 21913785 21453547 21568419 21395770 20717056
5384 20717056 20930405 21098864 20465139 19110677 19547412 20363617 19408246 18705015 19005545
5375 19005545 19246712 19302594 19219474 18389074 18524328 18789803 18532916 18946447 18968105 17806319
5365 17806319 17620329 16994317 17312391 17433178 17570517 17129645 17071666 17459714 17121839 16625216
5355 16625216 16361641 15787192 15901834 15901215 15772245 15022343 15448637 15727517 15429040 14411898
5345 14411898 14537381 14792590 15520987 15964257 15646122 15760480 15106566 14906042 14662058
5336 14662058 14144886 14255343 14140905 14639836 14318119 14365903 13504339 14281501 13703940 13556799
5326 13556799 13903050 13464982 12503080 12808299 13215930 13194817 13533988 12579668 13441042 13745616
5316 13745616 13471131 13014467 12627702 12749612 12455677 12274596 12256189 11968001 12160053 11640541
5306 11640541 11424437 11230680 11704561 11532711 11774650 10987893 10840312 11334212 11365150 11048090
5296 11048090 10782812 10981054 10941038 11025190 11984870 10572871 10403285 11214656 10554192 10247386
5286 10247386 10796880 10159506 10706606 11070459 10099658 9896024 10377934 10112286 9782921
5277 9782921 9569890 10135301 11020163 10475736 9670561 9943718 9964048 9594388 10001439 9645051
5267 9645051 9215560 9860393 10147518 9370918 9464682 9873525 9234381 8639833 9612897 10040059
5257 10040059 9702544 9242617 9698829 9344733 8490760 8593453 10066685 8691609 8473969
5248 8473969 9042247 8392794 9251300 8888399 8191058 7870870 8356839 9055464 8887993 8336074
5238 8336074 8601202 8578693 8395454 8028446 7968611 8844571 9474329 8243614 7073110 6325948
5228 6325948 6848961 7851287 8418076 8173071 8710749 8360791 8829959 9475747 9089200
5219 9089200 8394485 7973294 7541358 7593660 7613673 6959897 7525541 7982352 7628930 8115986
5209 8115986 7682085 6991458 7488249 7269071 7111367 7242803 7168332 7214795 8130059 7938926
5199 7938926 7526606 7055384 8237250 7280932 7683401 7638108 7678144 7027502 6985730 6838361
5189 6838361 6890184 6563630 6633835 6833011 6661997 7490725 6801343 7026783 6705738 6532819
5179 6532819 6501465 6885355 7124416 7192420 6686344 7040986 7266993 5638385 6476558 6035790
5169 6035790 6050081 6142057 5989396 5900774 5644932 5295880 5219727 5711895 6243288 6877720
5159 6877720 6652930 5978737 5860839 6563204 6022498 5919758 6285049 6948255 6583362 7393104
5149 7393104 7513785 6761890 6441685 6611989 6363767 6380566 6193073 6002433 4539066 4831542
5139 4831542 4339230 4354629 5107605 5103729 4568552 4419424 4043898 4528524 5102227 5646652
5129 5646652 6152608 5814739 6226104 6419207 5770939 5434061 5311263 6167631 6274254 5590069
5119 5590069 5384401 5035055 5123619 5523550 5848155 6538389 6105012 5092743 5194734 4959241
5109 4959241 5048527 4664826 5130578 5319792 5623497 5690320 5362506 5826985 5867109 5482107
5099 5482107 5478457 5454333 5449420 5383062 5538937 5063617 5301404 5297908 5440486 5461326 5419560
5088 5419560 5986275 6686809 6142846 6060012 5124070 5281388 4957082 4655341 4936880 5230537
5078 5230537 5274219 6297436 5898101 5214099 4944994 4306638 4340570 4381803 5188551 4522270
5068 4522270 5489374 6336317 5737985 5279395 4962643 5132351 5429836 5029994 5277007 5198578
5058 5198578 4950809 4977975 5135018 5227292 5074160 5817486 5345473 5445963 6083484 5835008
5048 5835008 5572793 5765792 5261318 5589649 5499336 4848406 4743119 5207488 5326222 4241248
5038 4241248 5042298 5364151 6031117 7067450 6155647 5246771 5239620 5638695 6237212 6042654
5028 6042654 5361655 5589668 5585918 5293593 5591904 6045232 6577202 5705134 5729560 6304428
5018 6304428 6562217 6151943 6600488 7314035 7192121 7013214 7472759 6588311 6562259 6990141
5008 6990141 7211178 7936026 8376550 8798890 8469187 8509754 8471081 9042549 9515038 9479422
4998 9479422 9976139 9969841 10069046 10787523 11360702 11719671 11602013 11069953 12260812 13192499
4988 13192499 13733456 13911442 13442959 12756678 13060766 13832133 14086093 14546831 15160186
4979 15160186 14613150 14080284 15393333 14408929 14005154 14482216 15094409 15500768 15135325
4970 15135325 14599998 14791011 15214926 14294819 13993622 14442671 14558996 14766182 15257011
4961 15257011 14894686 14738122 15124523 15543533 16283995 17359464 17457162 15907676 16070719
4952 16070719 17050311 17993604 18804464 18316946 18381185 19676222 20187580 20087089 20861529
4943 20861529 20269373 20626213 21392637 21397657 21964973 22513289 23076052 22793463 23588865 23571644
4933 23571644 23580721 23186313 23173582 23607455 23709735 24213247 24615898 24754460 24190839 23059376
4923 23059376 23640304 23257883 22100393 22125131 22371555 21741902 21894883 22413503 21161827
4914 21161827 20731173 20753072 20451092 20228221 20358457 19724632 20688230 19723038 19790210 19730366
4904 19730366 19101189 19237025 18928462 18709469 19297923 19434671 19882753 20076075 19796849
4895 19796849 19607137 20023306 19590708 20149400 19751825 19194846 19293835 18818246 19526924 18668454
4885 18668454 19081364 20053148 19600513 18532161 19100857 18505344 18839064 18813269 18374800
4876 18374800 17725430 17233816 16431374 15914246 14948852 14588620 14610597 14681254 14565266 13760755
4866 13760755 14045544 13761507 13005610 12526473 12710285 13032768 12597832 12418663 12132160
4857 12132160 11255105 10170583 9916350 10236615 10207358 9097528 8662172 9061098 8920020
4848 8920020 8452087 8096532 7581760 8250507 8224970 7633133 7616467 8044581 7332327 6432843
4838 6432843 6414773 6668831 6959689 7073032 7172276 6354520 6538105 6853615 6259260 5799258
4828 5799258 5933156 6271128 6976675 6403463 6196540 6576107 5998381 5087471 5540726 5283956
4818 5283956 4984869 6000311 5891993 5582839 6312588 6854237 6487218 6597122 6610084 6103221
4808 6103221 5723111 5405624 6334747 5735220 6131566 5858591 5712167 6479476 6523316 5953002
4798 5953002 5738861 6840161 6957368 6590484 6245276 7157978 7923866 7866107 7819251 7246349
4788 7246349 8033777 7870366 8335666 8973397 8749077 8707893 9435291 9041320 8912460 9194913
4778 9194913 9819475 11299519 11156811 10594700 10163900 11084415 11623515 11283562 11864492
4769 11864492 12339701 12642216 12742234 13339478 13190329 13611480 14838536 14481349 13897406
4760 13897406 14344474 14249500 14195890 14501535 14783763 14952012 14460214 13871080 13378522 13551758
4750 13551758 14229741 14760162 14554703 14711077 14748421 14371302 14017567 15470598 16286681
4741 16286681 16710621 16204410 16318716 16581298 17217293 16612405 16903471 17865514 18782817
4732 18782817 18098906 19242556 19465407 19649737 20631327 21002333 21114581 21075655 20848312
4723 20848312 20583290 20750346 21147117 21216522 20505662 21575835 21127310 20289572 20273920 20962792
4713 20962792 21155128 21341339 20316411 20278597 19710868 18529673 18767827 18881172 19428634
4704 19428634 19819557 18911069 19248956 19187830 19280804 19620013 19886327 20282287 19511588 18709620
4694 18709620 18938459 18988882 19779041 19839584 19510432 19952619 19566255 19228231 19934431 19972318
4684 19972318 20013689 19554612 19708752 19540560 19747686 20193559 20333897 20090185 19980196 19372524
4674 19372524 18494494 18201548 17390425 17366368 17603604 17723421 17936188 17226233 16728771 16917915
4664 16917915 16963540 17211220 16458975 15420481 14542755 14441355 14760920 15176375 14698405
4655 14698405 13519582 12463234 12755324 12728483 12487324 12096937 12400653 11491167 10700676
4646 10700676 10575486 10877320 11709553 11038195 10074963 9917853 10240665 10615567 10775638
4637 10775638 10651388 9873690 9875540 9797539 10604743 10722834 10106685 9970927 9395865 9211853
4627 9211853 8712897 8658000 8610841 8397280 7853389 8125297 8201432 7796982 8018955 8641998
4617 8641998 8099810 7367906 7194136 6476200 6041919 6029388 6005966 6233842 6110201 6256177
4607 6256177 6073419 5327693 6361939 6291736 6341373 6054233 5023085 5390139 5678685 5597226
4597 5597226 5867012 5229235 4877726 4495168 3911627 4392450 4530713 4472847 4971795 4700374
4587 4700374 4233849 4598169 4545334 4573166 4213316 4709686 4103473 4073323 3682707 4052905
4577 4052905 4238723 4431540 4989704 3893354 4402679 4684227 4300740 4351123 5024757 4894581
4567 4894581 4517590 4914678 3812361 4091599 3963260 3703915 4538330 4738305 4551782
4558 4551782 4166667 4000813 3498213 3610410 3486095 3233787 3872341 3806269 3315072 3445403
4548 3445403 3875535 3760626 3667338 3504920 2962778 3576141 4344532 3636596 3419663 3835734
4538 3835734 3530224 3392727 3759804 3954616 4055273 3841862 4213412 4457567 4226317 5312071
4528 5312071 5843326 5220052 5250339 4748920 4781005 5193346 5458239 5624078 5850101 4982925
4518 4982925 5145392 5388529 4800186 4501551 4876875 5177237 4958215 5061015 4325865 4327632
4508 4327632 5074099 4842576 4518591 6005802 5894669 6209870 5610197 6022712 4814947
4499 4814947 5141152 5080196 5736566 6147130 5972315 5792068 5085405 5144417 5337608 4918656
4489 4918656 5672770 5859507 6241833 6567936 6189240 6583776 6321952 6528544 6632777 6477936
4479 6477936 7094614 7453128 7269931 7093804 6920250 7777300 7808347 7694837 7656902 8792974
4469 8792974 8941849 8367498 8113359 8832109 9864258 10520662 10242160 10638810 10825183
4460 10825183 11429443 11440628 11280815 11470743 11647293 11992755 12408618 11985372 12760346 13348165
4450 13348165 13780010 14540129 14890170 14844194 15525193 15681796 15262956 15547733 16873587
4441 16873587 17587460 18985622 18909853 19548998 20007560 20368737 20546902 21234788 21849180
4432 21849180 22626256 23506246 24210716 25183527 25402616 26211132 28111403 29419512 30175152
4423 30175152 30939280 32417501 33643477 34718373 36478897 38281499 40873166 42084718
4415 42084718 43649045 45560701 47491299 50135080 52548189 55251373 58966322 62072154
4407 62072154 65494067 70430587 75175440 80527512 87426955 94227945 103151640 113093546
4399 113093546 125377517 138692048 153736446 170170068 185932201 198713092 208823967
4392 208823967 217559136 227967880 242806661 261107926 282041304 303258728 319239303
4385 319239303 328714697 329735824 329180199 332144081 341725568 356711379 373760438 385862310
4377 385862310 386983662 374464194 355315573 336713819 323305798 316981746 314970019
4370 314970019 313010428 306830001 292580972 270648863 247071633 227500565 212837997
4363 212837997 202477490 193535559 184790340 173892886 158893298 143795779 129031240
4356 129031240 117210495 106713579 96577371 89310443 83744606 78455499 73014801 68669546
4348 68669546 65429167 61619439 58833856 56176507 54572006 52752168 50395581 47825938
4340 47825938 46112622 44184311 42886737 42010606 39668512 38893546 37928049 37326788 36311000
4331 36311000 34577347 33805849 32981237 32043487 30193859 29432052 27884210 27587803 27328610
4322 27328610 26474631 24989893 25408090 25448600 24778276 24385031 23298762 22928360 22137806
4313 22137806 22147643 21950551 21789988 21044562 19442436 19368078 19226795 19072287 18403877 18662512
4303 18662512 18145511 18315603 17918253 17182215 17053091 17447182 17089221 16335735 16113821
4294 16113821 16258018 15646553 15552684 15683486 14825784 14674069 14498850 14521895 14287253 14694791
4284 14694791 14761322 14008196 14386601 13569694 11979584 11728055 11706843 11527500 10958661 11212535
4274 11212535 11040856 10957518 10469113 10310232 9611846 9688013 10186430 10234844 10111457 10084228
4264 10084228 10615349 10848310 10531393 9713657 9557932 9826849 9315134 9550080 9385244
4255 9385244 8801317 8998604 9925387 10756937 10539691 9589116 8969290 8779981 9128287 9166981
4245 9166981 9497825 9503052 9741040 10313799 9189435 10159612 11541883 11782361 11422328 11277554
4235 11277554 12418527 12256274 11763206 11964794 12128410 11733544 11295677 10362033 10188470
4226 10188470 10710866 9815878 8831147 8484937 8762186 9266601 8824369 8759756 8362018 8189905
4216 8189905 7467255 7325859 8219580 7831985 7980518 8588053 7770401 8563031 9305229 8280772
4206 8280772 7508170 7290434 8438072 8318098 8475156 8965125 8534217 8660953 8547046
4197 8547046 7942418 7443712 7881380 8246376 8199615 7989976 8191882 8430584 8873362 8719290
4187 8719290 8815726 9895046 9465845 8225855 7839035 7613393 8484337 9341037 9389025 8459474
4177 8459474 9214928 9808969 9585017 9742877 9942158 9148748 9035441 9659178 9935976 9485078
4167 9485078 9542612 10071464 10000061 9993304 9446166 9492804 9150661 10120068 10059325 9912651 10715961
4156 10715961 11238870 11167099 11232022 10999547 11401766 11851424 11175330 11008773 11044005 10850302
4146 10850302 11664937 11920985 12097855 13009956 13319241 13277994 13374305 13864142 14410034 14560463
4136 14560463 15263730 15933866 16886409 17539325 17082935 17100747 17799075 18129817 18515748 18956325
4126 18956325 19832100 20058717 20105096 20284978 20966308 21751808 22670234 22999743 23334355 24206507
4116 24206507 24257895 24662669 24955755 26256892 28601668 29024753 29743305 31021078 32511500
4107 32511500 33451501 35266368 36435050 37322695 38515990 39173229 40048687 42618103 44232716
4098 44232716 45437735 47664987 49737960 51105094 53373920 56552997 58670435 62507386
4090 62507386 64950389 67916167 70855194 74275474 78212864 83214856 89237030 95004889
4082 95004889 101678798 109845101 118528824 128825545 140883261 154744475 170760697 188968196
4074 188968196 209951284 233519036 259559789 285486063 311927495 335729941 353621372
4067 353621372 359149023 348709256 323306298 291273951 261023055 235840974 215505155
4060 215505155 198686172 184893375 173689096 164659785 156420783 149765945 143361615 138013312
4052 138013312 135342163 132273458 130111034 128088727 125891521 125740053 125183064 125809522
4044 125809522 126785913 127805685 128982775 130543506 132265280 134525259 136696776 139028514
4036 139028514 141381044 143419373 144514244 146571214 148610414 150618338 152430336 155137187
4028 155137187 157450007 159432905 161707050 164437572 166183518 167765004 169246438 171639073
4020 171639073 174192073 176029572 177633504 179471921 180927986 183213784 184560195 186602356
4012 186602356 189934850 193652350 197318311 202535527 209055821 215729452 222528155 230729921
4004 230729921 241085664 253968754 271113697 293597791 323452754 366063531 413111546
3997 413111546 464797792 499403539 477040950 403086421 324308131 272892845 236752830
3990 236752830 210944606 190848993 174434732 160290119 148901795 139104522 132505303
3983 132505303 126443199 120423358 114419339 108717310 103607152 99123580 95382485 92019295
3975 92019295 87747591 84419978 82022797 79417232 76853287 74769905 72218154 70683298
3967 70683298 68110224 66914798 65363443 63927323 63627612 61722749 60515655 59704123
3959 59704123 58552555 56382399 55368003 54344468 53079074 51522549 49997565 49114172
3951 49114172 48082855 47391253 46605430 45879111 45623078 45243227 43724386 42847327 42500873
3942 42500873 41104576 41236454 40756515 40031380 39754546 39295453 39647246 39278425 38808119
3933 38808119 37653369 37781360 38030045 37391156 37499986 37618533 36469203 36708787 36336659
3924 36336659 36086470 35520933 34489463 33946001 34429131 34596826 33390208 33808422 34686150
3915 34686150 34297202 34421233 34676626 33849229 33025475 32192243 33176966 33127380 33272863 33379600
3905 33379600 33901233 33949664 32718002 33042171 32181891 32197253 33455963 33220021 32264541
3896 32264541 32050678 32778640 32320054 33556786 33843803 33955616 33397828 33489575 33833607
3887 33833607 33844522 34397806 35133319 34772066 35104055 35906927 36131503 36372971 36254317 36545688
3877 36545688 37374546 37701444 38352674 38587102 39049467 39646546 40544750 41505108 41881062
3868 41881062 43311297 43440097 43966099 44248586 44848395 46017076 46048277 46288089 46729872
3859 46729872 47282741 47928267 49068372 49564095 49885507 50857448 51807983 52184482 53135521
3850 53135521 53701546 53981976 54490511 55497507 55990975 56992154 57111722 58826727 60509174
3841 60509174 61400179 62510229 63904901 65009311 66898011 68083077 70204491 72656563
3833 72656563 73658405 75196480 77530695 80507242 82936745 86422734 89704474 93522574
3825 93522574 97590779 101815708 106139642 111398571 117263656 122813031 128041530 133854902
3817 133854902 140144855 147513102 154186945 162029072 169664660 177774542 185220942 193109364
3809 193109364 200555263 206838578 214307803 219664867 224537739 229084354 232716208 236065169
3801 236065169 238873521 240040197 240602155 240530544 239312829 238180577 234967682 232285042
3793 232285042 228644137 224094276 219244646 214374188 208720665 201848384 195965153 190282364
3785 190282364 182764906 176523263 169853091 162973315 155878399 149493120 142709405 136314470
3777 136314470 130505896 124540556 118902056 113076331 106924315 102264380 96981305 92512224
3769 92512224 89284903 85942206 82845152 79702558 77064406 73747343 71154705 69030723
3761 69030723 67879700 66350253 63619663 61943058 61095654 59852997 57954763 56775933
3753 56775933 55700038 54596482 55077606 54778505 53666152 52952041 51845802 50981191 49629506
3744 49629506 49459233 49465984 48100498 47361012 47121777 47110772 45950615 44566287 43756635
3735 43756635 43790863 42879106 42391734 42029247 41547925 40936382 40469104 39175173 38260607
3726 38260607 38632568 37624722 35825966 35519461 34100644 33900773 32897021 32132354 31591101
3717 31591101 31671212 31373892 30862332 30946221 30452896 29693938 29700631 29462956 28663553 28500921
3707 28500921 28366445 27910091 27537491 26864428 27401466 26800065 25304080 25327009 25268455 24870313
3697 24870313 25002489 24982225 25169360 24751825 24750395 24027084 23104621 23265854 22566727 23291980
3687 23291980 23707865 22964660 23323936 22706016 22938102 23028889 23588450 23345598 23859432 24787697
3677 24787697 24563640 25264644 25109341 25262839 25671128 25862628 25720620 26876714 27655666
3668 27655666 28436335 28722596 29830343 30360260 31108144 31206271 32054177 33163909 34566114
3659 34566114 35555914 36482888 36994509 38468599 39027606 39736085 40919775 42567067 43170789
3650 43170789 43281367 44416315 45960901 46404141 46847002 47437747 48833870 49410005 50432964
3641 50432964 50978749 51119598 51786257 51587730 51973381 51181497 51114801 51819652 51775506 51164616
3631 51164616 51396964 52320928 52735698 53351452 53504742 52856132 53003162 52956806 52878295 53074207
3621 53074207 53691784 54697919 55988044 56468920 57672396 58551095 60017956 61486558 62822674
3612 62822674 64742785 67099234 68976532 71454108 74323024 77084128 79387535 83203098
3604 83203098 86447796 89714179 93855596 97132040 100743072 104699522 108530416 112586121
3596 112586121 116844441 121432547 125031171 127727447 131661072 135882684 138533720 141114161
3588 141114161 144271894 145797187 147459736 149768294 151097622 152293987 153315587 153973721
3580 153973721 154959435 155907025 155515491 156183027 156008898 155544657 155425026 154991606 155048868
3571 155048868 155234582 154925600 154401251 154666791 155186838 153773317 154023741 154744100 154463934
3562 154463934 154390601 154623026 154835775 153794712 153194863 152663161 153190581 153180619 152953438 151810226
3552 151810226 151604316 151341208 150810306 149474332 147464126 145478933 144090998 141836263
3544 141836263 138876738 136028226 132945314 130057912 126829390 124320082 121255433 117560787
3536 117560787 114651436 111595506 108130803 104238180 100423198 97100845 94609527 91461646
3528 91461646 87181603 84078617 80957551 78058140 75605110 73172024 70981909 69560474
3520 69560474 67553258 65867549 64533723 63309174 61894729 60470723 60273294 58565861
3512 58565861 57892725 57835961 57295732 56454721 56867717 57232886 56547299 56200452 55710304 56129333
3502 56129333 55483039 54923102 55598317 55154002 54733481 53838492 53946578 54776905 54575007
3493 54575007 53773817 53495745 52500491 51393682 50788116 49601774 47157675 46332472 46421636
3484 46421636 44644393 43231545 42944026 42156699 40508342 39527280 38182399 36903681 36491483
3475 36491483 34649492 33460987 31706170 30835724 30268151 29904965 28054680 26381600 26577554
3466 26577554 25812149 25535029 24067080 23393166 23176665 22530443 22051867 21836340 21605837
3457 21605837 20148419 19484944 19456934 18918565 19019347 18693764 17874877 17860247 17601562 16855948
3447 16855948 16693662 15850524 15140159 15121515 14665627 14177914 14423870 14810798 15226577 14438903
3437 14438903 14468066 13877941 14061383 13969424 13549792 12859404 12565988 12062698 12332547 12228554
3427 12228554 10851540 11600257 12211439 10717851 10462283 10037240 9913615 10605901 10920072
3418 10920072 10915845 10316286 9192978 10356042 9726000 8794648 8850398 8683057 8771342 8459635
3408 8459635 9087039 9083271 8332373 7929598 7661104 7605960 7612820 7703581 7916230 7692596 7603378
3397 7603378 7141238 6632801 7145157 6938253 7562855 7914515 6870334 7168550 6234924
3388 6234924 5910121 6577497 5941326 5727766 6315442 6757506 5550697 5487726 6167503 6957499
3378 6957499 6288221 5978063 6331660 5950560 5865574 4899981 4721763 5197646 5180545 5432944
3368 5432944 6070814 5626988 4910156 4437264 4803277 4766764 5379480 4886865 5211884 4954589
3358 4954589 5145373 5599640 5788223 5319542 5723534 4917217 4315854 4519467 4217085 4736608
3348 4736608 5122743 4906356 5123985 4702047 4803930 4438719 3967550 3116788 4082551 4631160
3338 4631160 3768563 4488267 4144006 4153433 4092681 3740143 4111885 4344933 4911357 4890746
3328 4890746 4390893 4415513 4323694 3996327 3876963 4185282 4057163 4734139 4269521 3550610
3318 3550610 4623407 3970199 4293976 3749821 4877632 5112054 4610451 4299822 4250529
3309 4250529 5013809 5006834 5285148 4573963 4136758 3676590 4163125 4536318 4920597 4955443
3299 4955443 4289907 3961688 3693252 3680960 3745958 4480238 4573933 3821546 3410980 3669674
3289 3669674 4077069 4098262 5133766 4944648 5337011 4427961 4379324 4450788 4916887 4929560
3279 4929560 4645831 4650941 4282077 4954229 5333706 4296269 4808629 4816742 4063708 3953343
3269 3953343 5125412 5514766 5113966 4144041 4531721 4345608 3351781 3299693 3847033 3576317
3259 3576317 3313777 3712016 3526855 3443769 3444010 3646487 3588955 3635331 3732710 3573981 3393034
3248 3393034 3430774 2874017 3377983 3722190 3845592 4249117 4375977 3252847 3251167 3925868
3238 3925868 3062189 2925793 2610048 3433466 3570644 3236327 3585146 3910589 3891411 3733314
3228 3733314 4434201 3756638 3763377 3861754 4205344 3833168 3886548 4143981 4398905 4018871
3218 4018871 4792352 4849607 4635692 3334746 2861302 2963438 3211868 3775923 3746574 3322928
3208 3322928 3451690 3757060 3071271 3366994 3025818 3470909 2848375 3668127 3600281 3574938
3198 3574938 3758362 3866441 2800073 2951486 2333807 2158617 3092722 2791269 1809823
3189 1809823 1547348 2036077 2355049 2453063 2761989 2487934 2388128 2390585 2559239 2565521 1908370
3178 1908370 1664380 1809512 792611 655432 1141740 1573300 2642333 2314856 1735547
3169 1735547 1416988 2486361 2052778 1861707 2267587 2281005 1947582 2817887 3179201 3763307
3159 3763307 2734406 2747396 2504917 2008185 2915119 3041687 3891925 3896134 4134605 3590129
3149 3590129 3493358 3627961 3634601 4287759 4693065 4706009 4933149 5527267 4834990 6112946
3139 6112946 6262396 7221324 7550374 8635826 8552040 7139782 5468136 4471072 4288284
3130 4288284 3701571 3735673 4019590 3414777 2720713 3132678 3082172 2728238 3213770 3127265
3120 3127265 2142992 2389440 2271093 1960591 908705 1064794 1587796 1811267 1579771
3111 1579771 1161712 2464414 2517410 1687439 1729014 2038829 1066701 1483223 2011835 1458599
3101 1458599 1490626 1733542 1669362 1330341 1442190 829904 1006703 1175854 1728343 2304280
3091 2304280 1709547 1651529 2364576 1673270 2122585 1178449 1023302 1042152 720411 1165710
3081 1165710 762259 1518958 1597132 846824 877231 559906 527448 -84540 399595 1344016
3071 1344016 2142250 1511924 1403247 1287782 1252210 541484 556861 1426280 535012 777198
3061 777198 758879 711196 350447 501920 330505 869613 480160 442249 -22302 282660
3051 282660 1358837 1251867 1449404 923904 886729 917975 898311 1242343 634636 795058
3041 795058 74043 1024 319138 22045 460111 164083 -663161 -424596 829854 921775
3031 921775 1285486 1177481 598732 -65448 933020 1267309 504513 75984 193921 128628
3021 128628 439163 286477 240832 107341 134384 57832 176554 214688 401684 -52847
3011 -52847 -708207 292972 521504 -146363 -36240 289551 413425 1247402 1170496 566889
3001 566889 67890 13883 541561 1284562 1554019 857863 1221870 1567794 1485961 1682078
2991 1682078 1630737 1320232 801431 660346 633993 712932 478336 -408849 -41963 1335446
2981 1335446 1492102 1361743 1407777 1491676 828865 1427450 1829332 1063084 489846 182606
2971 182606 -475941 39555 -123004 -523969 506902 905637 467041 -409975 214752 786897
2961 786897 893828 965321 983854 639856 190602 368879 678015 466378 153800 766367
2951 766367 1481517 1258090 1547133 1266585 617384 505720 16210 494920 622881 293719
2941 293719 -124318 501801 1238858 1177038 744313 1336700 1284358 629564 700911 1408963
2931 1408963 1370483 986357 612664 425289 379826 867972 942222 501690 -58709 96942
2921 96942 -287637 -17709 289014 561771 477392 -80638 -696497 -1185700 -352589 -365465
2911 -365465 136535 498085 701092 502216 1367439 776599 433155 727442 431500 -14817
2901 -14817 29606 618122 335582 -265239 -160117 1826084 1414825 953676 1416688 1675206
2891 1675206 682499 546579 1398285 1166830 990563 539898 108322 914662 1274806 1040296
2881 1040296 1517379 1899320 1814705 953238 765932 -273420 -38097 555468 1285139 899693
2871 899693 409727 -370183 -433420 -291301 -178295 -181702 -920839 -243086 609936 896959
2861 896959 1116060 180193 970153 1374642 981824 899989 777861 1018810 649023 464819
2851 464819 1149622 1202951 726708 323087 642548 1540842 1146140 818224 174561 26864
2841 26864 478690 217100 -647160 55538 546659 855182 113644 -710870 -155754 539674
2831 539674 253708 86545 -372852 19093 -63310 531462 811923 1071633 1958365 173556
2821 173556 -43652 1010411 700434 942256 1062527 895700 908327 1047575 80646 -402259
2811 -402259 -212781 310548 310785 587858 778898 559979 -138236 -578961 -68622 342695
2801 342695 832999 1418617 1858550 1354484 895488 303760 1338937 481296 398301 889941
2791 889941 320686 638871 889982 347594 413045 169935 635619 1140308 793296 -137749
2781 -137749 129645 595893 584721 198855 32807 47314 -640169 -536553 -23176 56845
2771 56845 -346983 -594988 -272313 659195 -265261 -417184 -42902 -158021 730129 1290512
2761 1290512 818141 131863 190974 330586 354315 175137 487914 510829 1121906 834098
2751 834098 -232600 -47722 -416065 -267447 533485 601307 1184116 1250859 567301 186779
2741 186779 851127 1613417 804795 1023259 718232 -486494 -119106 249453 486169 482280
2731 482280 975269 956961 319437 446080 475671 757554 -248627 -482193 -234009 -302506
2721 -302506 -728660 -596548 -363576 330137 273960 255067 654553 323248 341992 517245
2711 517245 988310 1149335 835830 493894 -298833 -208171 1022532 501235 -193895 672853
2701 672853 1018363 826273 432567 -252650 -166097 263872 707916 351244 -453904 -190476
2691 -190476 392151 -141041 -123439 -402900 -362853 423540 185370 -26909 -466651 35312
2681 35312 360101 -600061 -197521 772969 22910 99192 948020 144450 -8000 -487833
2671 -487833 -113577 550940 -809511 -839923 -577087 -947728 -452407 260519 196451 -422724
2661 -422724 -769413 24852 101031 170395 38917 -251731 170968 -175964 -59012 -105296
2651 -105296 -437871 -677854 -605202 470922 774615 -197920 -116391 85068 -127085 -548527
2641 -548527 -369507 434099 15477 618492 693790 514378 374272 69991 437590 419251
2631 419251 -241602 -766702 -576340 -843889 -750114 -221546 -685302 -417405 255524 124115
2621 124115 -151330 -487210 -919519 -374861 -44581 405030 396897 28253 -58767 387122
2611 387122 167571 -382406 137982 760837 1195193 705834 -320572 -635912 -34596 442532
2601 442532 -244588 -22484 1262916 1326165 799349 589124 767013 1197647 1001049 318262
2591 318262 -562357 -887923 277416 586440 309890 526721 435746 -367877 -713501 13805
2581 13805 784534 776634 475302 -693677 -455129 1052940 1277437 413099 -291046 -951650
2571 -951650 -56297 243632 3369 -629808 287267 259009 206351 551896 655223 -309962
2561 -309962 -64219 -143704 -524143 -159996 -700029 -276138 -535583 -388661 -713494 -269507
2551 -269507 -108403 177356 -428669 -58951 511826 112923 -477225 -137606 318368 -657961
2541 -657961 -380815 -91577 477500 283368 745336 1046869 364971 460682 654532 173107
2531 173107 -443743 -453528 -246306 -27506 53590 102666 -357445 -196479 -507673 -279220
2521 -279220 105545 363506 596259 469391 844519 557768 203491 -74838 -514489 -105329
2511 -105329 155254 449328 578014 576404 1165433 -60917 -182581 349643 630320 75366
2501 75366 215948 73370 -628477 -459429 -15702 259640 43547 -164844 -678512 -541965
2491 -541965 -287261 171286 132741 -1183720 -1477225 -1048653 -598106 -53402 258524 468966
2481 468966 -241804 487948 251840 532230 349242 -588740 -615034 -622665 -710930 -154462
2471 -154462 -187753 -145710 -493661 -351374 -403041 -181184 -514706 -745853 -171439 423456
2461 423456 -28291 -16311 593109 205939 278305 742882 298933 75834 154862 -814686
2451 -814686 -716395 142879 238225 -269896 -310860 -683132 -638872 -24962 130231 -1279
2441 -1279 -70485 -77632 -265997 -886448 -31899 344565 -167194 232341 -176808 158164 -44989
2430 -44989 -232010 -72571 -136717 -495852 35510 -202060 -479266 555277 -699519 -214868
2420 -214868 307080 -254156 -787969 -1061972 -538883 85089 -358961 71834 -87182 235923
2410 235923 546806 343969 457651 921880 1053685 234224 829378 97559 -1039184 -716608
2400 -716608 -185332 -52422 63552 794993 550335 202721 375282 -621591 -454304 -416965
2390 -416965 -484859 -153226 779925 1433993 73602 -30017 -161645 -107926 244281 -288300
2380 -288300 338852 713248 1087762 1080231 498274 565342 256088 265013 272709 -213552 220498
2369 220498 298737 543971 552838 351558 -199203 82058 -439840 -415024 322040 484813
2359 484813 267865 -705968 -1089294 -430901 -697478 -965000 278614 524880 1059744 676219
2349 676219 730345 1052232 1120562 785287 1487448 752816 642250 731391 334609 56760
2339 56760 732097 384783 804731 837128 161830 -420389 -80975 509301 -96663 -369147
2329 -369147 351234 747803 526884 359816 114766 176440 392291 -205180 -365901 -8913
2319 -8913 -55406 -264178 -187038 298366 -666012 -861321 -373609 411175 517644 968336
2309 968336 874729 469773 515676 402151 637936 -43222 -565526 -242588 -250862 281380
2299 281380 307314 67363 897164 227659 228759 1051680 282484 403305 314853 599836
2289 599836 -473088 51396 151392 352944 35849 210040 535520 314094 31833 2282
2279 2282 1385089 800898 -480053 -1170234 -1131501 -410874 168743 1196847 1153174 21012
2269 21012 -128793 779654 1185883 593760 608484 1053002 133932 345266 859601 555981
2259 555981 581612 -103598 -169529 -562511 -289913 191275 -233160 -171082 -250660 -460299
2249 -460299 -146016 -191209 160154 71786 312320 152098 92577 -53317 -862669 -1131253
2239 -1131253 -512794 412810 648406 111067 -663551 -305060 -693542 -294424 -508511 -581728
2229 -581728 517776 512812 86311 -578041 -237864 302882 629363 364946 -596754 -692152
2219 -692152 53454 444426 -412089 -396751 -818128 -1009980 -277953 166609 217851 214476
2209 214476 819105 1507242 695409 -248894 56291 120579 -116931 303187 393406 -311067
2199 -311067 -408852 -1341927 -728294 -285704 -593449 -636050 300731 41806 308475 551249
2189 551249 10357 406762 57218 490404 633469 274230 56157 22629 -30822 -411948
2179 -411948 -710203 -822581 -1103215 -592049 -279416 215683 -420483 -746156 -541393 -414998
2169 -414998 -120403 582850 881145 531224 788034 182424 -181156 -96262 442398 578374
2159 578374 1026551 819479 455986 533060 -191644 -332733 -75212 -154762 220018 307392
2149 307392 787433 932295 162892 -467870 -430165 119782 208425 -449894 -505190 -754164
2139 -754164 -683370 -481879 -637815 -4761 515921 1072012 451630 -480426 -197695 354422
2129 354422 -438039 -117123 661889 108682 -109309 -242713 -134207 -179192 -36880 -406989
2119 -406989 -596367 -199698 -883318 -409848 451715 -82270 -783583 -942983 -602655 -440294
2109 -440294 -15557 -534423 -229503 -24018 467365 685701 173061 797722 41034 -616342
2099 -616342 -199945 -282547 -207043 212029 1334894 1556133 452243 -144992 180478 -425224
2089 -425224 -532172 -284169 -909792 -40107 786710 552449 743836 536343 75465 282864
2079 282864 75676 -712315 -1128982 -1581860 -1092762 -251608 -612059 -232340 -639517 -414331
2069 -414331 -44544 -244349 -180371 69595 360551 164998 -999114 -396180 167843 -305557
2059 -305557 -3140 -362752 -310509 -26821 -443276 -504851 -398692 -639353 -143315 -222648
2049 -222648 129590 217796 -274245 234484 110225 -52586 39134 -203694 196808 -633582
2039 -633582 -573270 400339 161608 448207 244426 -623276 -316857 138720 203543 228917
2029 228917 659277 740888 20418 311352 404244 96636 1128290 1323582 1138199 1002742
2019 1002742 1036071 774670 193990 -421824 -297527 266803 34409 -223675 347877 706587
2009 706587 -183180 48739 -191015 -268762 -252288 -610129 -468437 -957737 -888054 103803
1999 103803 -795811 -768938 -982641 -156949 -584674 -631014 107457 -84401 209425 38259
1989 38259 733283 517216 -555446 -719344 360651 -16131 -911469 -830892 -797734 -45665
1979 -45665 -690183 68688 437970 -107011 288038 477321 -21480 -175966 -286416 67420
1969 67420 764649 1154404 378178 -102842 257497 -496750 -1132374 136438 744366 155466
1959 155466 -115069 3645 286507 -110659 838045 863693 399876 -122417 -92108 830433
1949 830433 200726 -412476 -507481 -447706 -165428 -207144 144418 155304 -572446 -809125
1939 -809125 -1139483 -1183389 -528865 -544456 -411125 173078 -347797 -269230 141316 -427301
1929 -427301 -272669 -183109 14331 -981275 -917934 -876812 97827 210597 244273 150883 262617
1918 262617 489386 550765 42802 -563366 321965 314197 -970342 -524313 180840 8469
1908 8469 -703300 -1065641 -763341 -1098261 -1274388 -258360 130868 919574 1071580 1081131
1898 1081131 289515 524602 -108198 -596059 -762254 -639862 -162794 -464559 -975415 -267085
1888 -267085 356358 -202090 687350 280998 -345108 -827882 -939921 -730315 -640152 555347
1878 555347 611253 -396189 -133587 -185915 268918 -289163 -479399 -802925 -1258721 -594423
1868 -594423 -149240 -231801 -214798 -321785 -1369846 -153856 46538 612735 945412 388010
1858 388010 460024 144302 773963 212970 -254480 -231539 421146 -71626 172606 -298067
1848 -298067 596179 -125466 -323218 133274 709777 46936 -794802 -469226 241974 -219026
1838 -219026 -534918 -122277 -96237 268753 924092 76624 -75308 -157954 -913670 -202348
1828 -202348 238398 45359 103827 156932 157266 212284 355635 -20065 -257751 -399313 -696644
1817 -696644 -528061 -1102796 -676767 -277232 -53558 -375444 -439821 -416990 -692981 -825654
1807 -825654 -114372 -597969 -873733 -1079482 -168500 -188277 -172412 -390482 -271874 -470050
1797 -470050 -375633 71949 -139888 252657 302582 212063 -560585 -743019 -110301 343662
1787 343662 196134 494777 128328 693199 132320 36493 -301289 -923525 -368927 194920
1777 194920 -517666 -324895 -182686 219165 -159773 -29100 274613 -487976 -232339 -468234
1767 -468234 -1052981 -762151 -712774 -1267513 -1039499 -24407 104429 -446883 100900 -22454
1757 -22454 -237293 -781844 -525131 -160221 265199 581103 -510979 -753752 -1115499 -1300855
1747 -1300855 -369548 -66525 -190468 -666056 -433170 -74690 733715 552493 917803 9989
1737 9989 366682 524311 -125587 -601479 -577498 -1205748 -220530 -73378 -1027545 90286
1727 90286 1236153 908976 170143 405721 140198 -990992 -822106 -508379 -976759 -172648
1717 -172648 195168 748218 109701 -557287 -473702 -826757 -784184 -107614 237788 154127
1707 154127 -67199 396511 229454 -383737 329323 663766 216659 67392 -593534 -1143247
1697 -1143247 -1247232 -282164 275637 225993 -670737 -512134 -69953 114980 294786 472611
1687 472611 256551 -363800 -155724 -236287 -464420 -214772 -87900 -78628 -631906 -143148
1677 -143148 568045 255551 366496 -88096 -430368 -176023 -569846 -434622 -64481 -161140
1667 -161140 -263313 -468385 -674276 -1334699 -942084 27068 -61292 -493476 364938 300873
1657 300873 -104251 -470229 -297410 282370 108514 303206 -130363 -202579 627252 353776
1647 353776 -513196 -581562 68760 599966 684163 -230629 -601384 -544474 -5865 -443253
1637 -443253 -1155758 -726013 138942 -283513 -1405988 -848211 134019 -400008 -715754 -1013808
1627 -1013808 -794091 -600567 -1036511 -919619 -698852 -688669 -170211 211246 621475 1009405
1617 1009405 -19118 -925402 -1265214 -887447 -291091 40931 -864820 -878525 -525812 -606967
1607 -606967 -149788 628911 106530 329538 -603532 -660215 -437253 305509 550713 347779
1597 347779 23478 -235086 -278526 241706 -336656 -782285 -487284 132528 581074 -361204
1587 -361204 -299467 273008 178242 104417 137966 48315 -500055 -89885 263568 -140688 42064
1576 42064 -121548 930050 517518 465689 646049 1056778 849042 131335 -381045 156611
1566 156611 518134 -66261 6901 -283182 -76129 302792 667881 1409104 486067 -102151
1556 -102151 262048 495720 64326 686134 638283 358531 634024 300383 581103 522083
1546 522083 -325882 -318303 -99784 403157 86007 -613892 -306609 80575 -150554 -489490
1536 -489490 -507817 -818168 -1838912 -655484 -387841 -511228 -113379 -1275495 -353331
1527 -353331 -381990 -577773 -746588 -369282 -182737 -651565 -1239153 -267108 341141 586544
1517 586544 -234839 -1203584 -531554 -573552 -410576 -610730 -440081 318272 183590 -375759
1507 -375759 -161323 179868 75285 423232 -276400 -479438 -307302 -180228 -740730 -968510
1497 -968510 313555 -532488 -900732 -629225 -123030 1075504 773495 349637 -421976
1488 -421976 -1009902 -245005 623468 420866 245178 46601 -293987 -3773 -332135 -509397
1478 -509397 -712124 201261 816036 1188982 1242281 706833 681433 804587 384671 92017
1468 92017 -193224 21829 316836 304419 197739 -139763 -464097 -728704 -443086 -621138
1458 -621138 -255601 313545 -98677 -465123 -524114 109850 55775 85012 -388136 -190281
1448 -190281 20018 -12897 328219 35535 -157759 -66754 -294570 -724955 -411335 -560741
1438 -560741 -568647 -1444501 -1670504 -860235 -282736 -897334 -696242 237197 649169 600674
1428 600674 985040 80345 92963 -42917 -411402 -397658 124756 483224 -241769 -207283
1418 -207283 -745732 -663498 -421106 85499 -291154 364284 -213969 -13984 93477 -1228633
1408 -1228633 -1229255 -411691 502409 453329 -304681 282225 10819 -305564 -810362 -482881
1398 -482881 -88689 -295364 -335238 -267100 -444807 -184431 379890 -7583 -215912 -425119
1388 -425119 -151306 579891 498452 665024 443932 58276 948423 662197 418426 406501
1378 406501 -229094 -285469 60552 -350323 -360617 13928 21935 -254782 -23803 -536999
1368 -536999 -1067235 -906378 -109645 224003 73003 -530754 -1189995 -912734 -103629 574646
1358 574646 733236 375862 -290031 100171 944647 89343 -408762 59714 18275 71249
1348 71249 305969 -190421 292207 591469 675134 353114 58533 -641366 80838 -144893
1338 -144893 -215151 282602 691672 -279568 118524 494933 555916 188351 -124167 -421672
1328 -421672 -379945 197394 175752 299259 801046 433591 -312210 -218599 -116391 -430921
1318 -430921 -1431574 -975619 -69404 50386 139070 241905 -904122 -767026 -154658 703217
1308 703217 406203 746787 396641 -399206 -403146 -610751 -497152 537604 750985 246703
1298 246703 224126 978910 590063 37782 -306921 521898 106493 83530 509475 249861
1288 249861 144194 -171125 159482 -252074 -511898 236967 -293107 -204756 90169 140545
1278 140545 522854 -420852 -481988 -863207 -883183 -414932 -38966 468138 90571 226296
1268 226296 156796 366440 -327823 -226451 227345 410062 305488 103510 527467 283548
1258 283548 -183098 486689 466186 105998 970346 589303 988463 906461 516085 20303
1248 20303 -19482 152270 -515580 -162113 -229202 -390743 -187617 -100719 384930 -223527
1238 -223527 -18967 119926 -934107 -1363560 -1026965 117749 557200 598987 793590 98254
1228 98254 -202252 -805981 -1131797 -733760 254652 900873 862915 114883 156904 -379714
1218 -379714 -332969 69042 -104433 -312349 -329164 -414423 -47074 505474 109590 336563
1208 336563 105492 -261529 -954660 -914736 -561389 354788 -611516 43866 -422236 -651873
1198 -651873 64998 -198045 -236114 -59498 317144 575504 -471119 -161409 75586 576995
1188 576995 144733 368660 375124 -794427 -392906 10831 342651 143913 -164109 -122921
1178 -122921 -222079 -773242 -336895 49604 373299 -882516 -356879 -267695 -148860 387612
1168 387612 891218 705295 704833 224051 -57044 595744 365223 303062 227255 3535 71596
1157 71596 -167147 -56124 -360454 61445 -276348 -390071 -789680 -266704 795083 302627
1147 302627 -96861 541242 55115 61294 545392 486984 -859252 -884114 -44232 -215833
1137 -215833 44585 186245 748875 220053 120902 -308824 -964587 -56546 23009 -116200
1127 -116200 -229401 56063 371389 -218942 -475522 77104 -57420 -447378 -945842 -1054967
1117 -1054967 -133688 450376 415497 -259295 -581237 -42757 222429 74160 588931 789074
1107 789074 -51160 -1100409 -949418 -686057 -487407 -127050 -947797 -1133607 -687716 -300932
1097 -300932 160892 -173287 205452 -246558 102710 65013 -155769 -462900 -137075 811443
1087 811443 858747 194941 395230 186753 602806 991074 112001 360565 -70611 -341533
1077 -341533 96035 201222 336158 603197 830596 318198 -46382 -93706 -240709 -834808
1067 -834808 -1112360 -450456 33630 38978 -26827 -159196 -546972 140635 -103506 51676
1057 51676 -390306 -1109050 -1049977 -1081166 -313724 -543243 -446883 -43595 405840 53311
1047 53311 299171 365880 361514 201847 -69427 -651324 174504 -346105 -431799 -348638 -479114
1036 -479114 -720330 -747855 169015 416898 386990 239623 431269 -119739 -194235 569822
1026 569822 861258 892312 569912 385316 701482 -101777 79845 -17600 553018 980740
1016 980740 492005 372267 -404839 -658192 -193412 21294 53959 -52814 -565357 -148415
1006 -148415 369797 68213 189844 -311767 -901721 -330312 163116 -260113 423158 -129869
996 -129869 256535 366833 84034 614212 161779 -497253 -259049 -218013 102015 -3879
986 -3879 -562596 -616231 -149977 -60479 -318485 30115 -499674 -489838 -527450 -483461 -225187
975 -225187 -434635 -223804 -11251 11520 527651 -283113 -370091 139684 974394 1237315
965 1237315 214623 268847 -179741 474747 380161 181622 968671 710912 695469 194654
955 194654 90670 191589 -41528 -543432 482075 279441 328308 749306 -124276 -57073
945 -57073 -532781 -489764 -310480 41976 169260 124911 235364 732901 567599 1158177
935 1158177 964665 -422818 -414550 -154483 395555 439588 -165117 -333199 -543520 12642
925 12642 212616 -304296 -18393 134014 226533 968670 1116208 410855 -181246 -60417
915 -60417 239675 419140 24011 286206 650876 -239762 -244778 490497 989613 877991
905 877991 1067959 383395 -174707 325935 137611 -176538 229395 641689 187855 129796
895 129796 508366 289384 -822027 -1103607 -1129046 -127253 -311583 -349871 -123936 648869
885 648869 1053370 -99138 23539 -80738 -213399 -232129 -332914 -511732 5054 95609
875 95609 48550 -18329 332579 829593 516937 211151 433489 1169068 1038040 -322816
865 -322816 -437962 -565684 -558739 -181661 -186925 160412 294118 304671 227065 -97695 -308703
854 -308703 426410 903164 512987 42433 -289856 -585405 -605775 836188 -117800 -996929
844 -996929 -38801 276419 602971 -177172 -96030 765852 760101 185594 18258 143927
834 143927 -523536 384504 899117 -173766 -315444 -303816 -498744 -549783 -598059 -1137608
824 -1137608 -1240483 -1101481 -630694 -332913 -738835 278638 807056 628243 704834 577187
814 577187 -8431 671768 577049 247798 -343947 -425342 -594042 -607021 -37419 -490071
804 -490071 -246717 191449 168050 -10089 -187152 -209788 396575 -272247 -1025958 -1175526
794 -1175526 -454611 118610 542873 -539249 -508993 520564 802556 603128 49414 112733
784 112733 346349 11216 -430997 -924313 -260010 -219190 -170391 -140308 -114205 266881 -62987
773 -62987 345100 257440 221767 -409091 -903764 -823413 227969 -437032 -548289 -189437
763 -189437 302764 720035 559989 -437936 -933381 -197679 270718 -93452 -33482 128975
753 128975 -324453 -130358 -688345 -688011 43312 536462 595490 765589 293774 621319 1092015
742 1092015 268512 363560 880629 940844 86698 244789 -625438 -174446 295586 -801844
732 -801844 -274171 579807 200550 -499770 358749 691162 -151509 581222 1361095 1037054
722 1037054 465964 365507 992233 427749 807996 263787 331580 -340541 -209365 -572380
712 -572380 -273188 -500082 -350850 403130 404148 -22900 -148761 727036 1173259 401471
702 401471 -307849 470217 567106 69049 -400767 198343 -464893 -143719 184057 -149372
692 -149372 -146452 55215 -359407 -616384 -1050940 -934389 -11013 159319 -210779 -41339
682 -41339 36265 -235208 180432 598542 679147 -109991 572748 412080 128284 398888
672 398888 -521759 -32335 619096 896704 590088 57593 517814 56702 171260 -80635
662 -80635 -808380 -738083 -849142 -312469 636355 98118 -170093 542233 977779 -120964
652 -120964 -487581 -618043 383430 356607 -545007 -309705 -299148 -774430 -1016594 -192008
$$ [...]
##END NTUPLES=NMR SPECTRUM
##END=
