##TITLE=1H_TG-2346-B1
 CDCl3
 8 sc, 
 9.02.2022
##JCAMPDX= 6.0         $$ Bruker NMR JCAMP-DX V2.0
##DATA TYPE= NMR SPECTRUM
##DATA CLASS= NTUPLES
##ORIGIN= UXNMR, Bruker Analytische Messtechnik GmbH
##OWNER= root
$$ XWIN-NMR		Version 3.5
$$ Wed Feb  9 10:20:53 2022 Russian Standard Time (UT+4h)  she@DPX200
##.OBSERVE FREQUENCY= 200.131346
##.OBSERVE NUCLEUS= ^1H
##.ACQUISITION MODE= SIMULTANEOUS
##.ACQUISITION SCHEME= undefined
##.AVERAGES= 8
##.DIGITISER RES= 18
##SPECTROMETER/DATA SYSTEM= spect
##.PULSE SEQUENCE= zg30
##.SOLVENT NAME= CDCl3
##.SHIFT REFERENCE= (INTERNAL, CDCl3, 0, 15.7293)
##AUDIT TRAIL= $$ (NUMBER, WHEN, WHO, WHERE, WHAT)
$$ ##TITLE= Audit trail, XWIN-NMR		Version 3.5
$$ ##JCAMPDX= 5.01
$$ ##ORIGIN= Bruker BioSpin GmbH
$$ ##OWNER= she
$$ F:/spectra/data/she/nmr/H-F/1/pdata/1/auditp.txt
$$ ##AUDIT TRAIL=  $$ (NUMBER, WHEN, WHO, WHERE, WHAT)
(   1,<2022-02-09 10:14:40.21 +0400>,<she>,<DPX200>,
      <created by zg, POWCHK disabled, PULCHK disabled
       configuration hash MD5:
       00 E9 B6 7A A2 85 ED C7 34 08 36 98 17 FE 4E 26
       data hash MD5: 16K
       2F E0 AA 6B AB EE AE 7C 46 C3 C5 7B 87 77 E4 86>)
(   2,<2022-02-09 10:14:43.40 +0400>,<she>,<DPX200>,
      <Start of raw data processing
       efp BC_mod = 2 LB = 0.24 FT_mod = 6 PKNL = 1 PHC0 = -15873.04 PHC1 = 14.80078 SI = 16K 
       data hash MD5: 16K
       1F FD 65 94 CD 93 B8 80 62 92 E7 A1 16 AC 17 AF>)
(   3,<2022-02-09 10:15:04.45 +0400>,<she>,<DPX200>,
      <pk PHC0 = 2.924155 PHC1 = -4.8 
       data hash MD5: 16K
       BE 65 00 8A 61 DF 48 63 07 38 05 74 3D 57 67 89>)
(   4,<2022-02-09 10:15:08.39 +0400>,<she>,<DPX200>,
      <abs ABSG = 5 
       data hash MD5: 16K
       45 32 57 6E E4 67 A1 56 AD B2 01 6A 8E 9B 5C FF>)
$$ ##END=
$$ 
$$ hash MD5
$$ 71 98 BD CD A9 49 F4 0B 54 54 48 57 66 31 82 B8
##$RELAX= 
##$RELAX= 
##$RELAX= 
##$RELAX= 
##$RELAX= 
##$RELAX= 
$$ Bruker specific parameters
$$ --------------------------
##$DU= <F:/spectra>
##$EXPNO= 1
##$NAME= <H-F>
##$PROCNO= 1
##$TYPE= <nmr>
##$USER= <she>
##$AMP= (0..31)
100 100 100 100 100 100 100 100 100 100 100 100 100 100 100 100 100 100 
100 100 100 100 100 100 100 100 100 100 100 100 100 100 
##$AQSEQ= 0
##$AQ_mod= 1
##$AUNM= <au_zg>
##$AUTOPOS= <>
##$BF1= 200.13
##$BF2= 200.13
##$BF3= 200.13
##$BF4= 200.13
##$BF5= 200.13
##$BF6= 200.13
##$BF7= 200.13
##$BF8= 200.13
##$BYTORDA= 1
##$CFDGTYP= 0
##$CFRGTYP= 5
##$CHEMSTR= <none>
##$CNST= (0..31)
1 1 145 1 1 1 1 1 1 1 1 1 1 1 1 1 1 1 1 1 1 1 1 1 1 1 1 1 1 1 1 1 
##$CPDPRG= <>
##$CPDPRG1= <>
##$CPDPRG2= <>
##$CPDPRG3= <>
##$CPDPRG4= <mlev>
##$CPDPRG5= <mlev>
##$CPDPRG6= <mlev>
##$CPDPRG7= <mlev>
##$CPDPRG8= <mlev>
##$CPDPRGB= <>
##$CPDPRGT= <>
##$D= (0..31)
0 1.2 0 0 0 0 0 0 0 0.06 0 0.03 0 0 0 0 0.0002 0 0 0 0 0 0 0 0 0 0 0 0 
0 0 0 
##$DATE= 1644387279
##$DBL= (0..7)
120 120 120 120 120 120 120 120 
##$DBP= (0..7)
150 150 150 150 150 150 150 150 
##$DBP07= 0
##$DBPNAM0= <>
##$DBPNAM1= <>
##$DBPNAM2= <>
##$DBPNAM3= <>
##$DBPNAM4= <>
$$ [...]
##$SUBNAM2= <"">
##$SUBNAM3= <"">
##$SUBNAM4= <"">
##$SUBNAM5= <"">
##$SUBNAM6= <"">
##$SUBNAM7= <"">
##$SUBNAM8= <"">
##$SUBNAM9= <"">
##$SW= 18.0517287032376
##$SWIBOX= (0..15)
0 0 2 0 0 0 0 0 0 0 0 0 0 0 0 0 
##$SW_h= 3612.71676300578
##$TD= 16384
##$TD0= 1
##$TE= 0
##$TE2= 300
##$TE3= 300
##$TEG= 300
##$TL= (0..7)
0 120 120 120 120 120 120 120 
##$TP= (0..7)
150 150 150 150 150 150 150 150 
##$TP07= 0
##$TPNAME0= <>
##$TPNAME1= <>
##$TPNAME2= <>
##$TPNAME3= <>
##$TPNAME4= <>
##$TPNAME5= <>
##$TPNAME6= <>
##$TPNAME7= <>
##$TPOAL= (0..7)
0.5 0.5 0.5 0.5 0.5 0.5 0.5 0.5 
##$TPOFFS= (0..7)
0 0 0 0 0 0 0 0 
##$TUNHIN= 0
##$TUNHOUT= 0
##$TUNXOUT= 0
##$USERA1= <user>
##$USERA2= <user>
##$USERA3= <user>
##$USERA4= <user>
##$USERA5= <user>
##$V9= 5
##$VALIST= <valist>
##$VCLIST= <CCCCCCCCCCCCCCC>
##$VD= 0
##$VDLIST= <DDDDDDDDDDDDDDD>
##$VPLIST= <PPPPPPPPPPPPPPP>
##$VTLIST= <TTTTTTTTTTTTTTT>
##$WBST= 1024
##$WBSW= 4
##$XGAIN= (0..3)
0 0 0 0 
##$XL= 0
##$YL= 0
##$YMAX_a= 222681
##$YMIN_a= -409714
##$ZGOPTNS= <>
##$ZL1= 120
##$ZL2= 120
##$ZL3= 120
##$ZL4= 120
##$ABSF1= 15.71935
##$ABSF2= -2.3325
##$ABSG= 5
##$ABSL= 3
##$ALPHA= 0
##$AQORDER= 0
##$ASSFAC= 0
##$ASSFACI= 0
##$ASSFACX= 0
##$ASSWID= 0
##$AUNMP= <proc_1d>
##$AZFE= 0.1
##$AZFW= 0.1
##$BCFW= 0
##$BC_mod= 2
##$BYTORDP= 0
##$COROFFS= 0
##$CY= -3
##$DATMOD= 1
##$DC= 0
##$DFILT= <>
##$DTYPP= 0
##$F1P= 0
##$F2P= 0
##$FCOR= 1
##$FTSIZE= 16384
##$FT_mod= 6
##$GAMMA= 0
##$GB= 0
##$INTBC= 1
##$INTSCL= 0
##$ISEN= 128
##$LB= 0.24
##$LEV0= 0
##$LPBIN= 0
##$MAXI= 10000
##$MC2= 0
##$MEAN= 0
##$ME_mod= 0
##$MI= 1.114404
##$NCOEF= 0
##$NC_proc= -5
##$NLEV= 6
##$NOISF1= 3.799351
##$NOISF2= 2.8
##$NSP= 0
##$NTH_PI= 0
##$NZP= 0
##$OFFSET= 15.72926
##$PC= 1
##$PHC0= -15870.12
##$PHC1= 10.00078
##$PH_mod= 1
##$PKNL= yes
##$PPARMOD= 0
##$PSCAL= 0
##$PSIGN= 0
##$REVERSE= no
##$SF= 200.13000446222
##$SI= 16384
##$SIGF1= 3
##$SIGF2= 2
##$SINO= 5.538805
##$SIOLD= 16384
##$SREGLST= <1H.CDCl3>
##$SSB= 0
##$STSI= 16384
##$STSR= 0
##$SW_p= 3612.71676300578
##$SYMM= 0
##$S_DEV= 0
##$TDeff= 16384
##$TDoff= 0
##$TI= <>
##$TILT= no
##$TM1= 0
##$TM2= 0
##$TOPLEV= 0
##$USERP1= <user>
##$USERP2= <user>
##$USERP3= <user>
##$USERP4= <user>
##$USERP5= <user>
##$WDW= 1
##$XDIM= 16384
##$YMAX_p= 303003640
##$YMIN_p= -147828
$$ End of Bruker specific parameters
$$ ---------------------------------
##NTUPLES= NMR SPECTRUM
##VAR_NAME=  FREQUENCY,     SPECTRUM/REAL,   SPECTRUM/IMAG
##SYMBOL=    X,             R,               I
##VAR_TYPE=  INDEPENDENT,   DEPENDENT,       DEPENDENT
##VAR_FORM=  AFFN,          ASDF,            ASDF
##VAR_DIM=   16384,         16384,           16384
##UNITS=     HZ,            ARBITRARY UNITS, ARBITRARY UNITS
##FACTOR=    0.220516191357247, 1,           1
##FIRST=     3147.89696297345, 0,            0
##LAST=      -464.819800032334, 0,           0
##MIN=       -464.819800032334, -147828,     0
##MAX=       3147.89696297345, 303003640,    0
$$ Real data points
##PAGE= N=1
##DATA TABLE= (X++(R..R)), XYDATA
$$ [...]
9494 164073 165088 117411 145542 211817 199535 178928 195950 189974 209690 231837 256148 216472
9482 216472 155369 192740 165964 198307 203138 213369 239784 201458 191976 248937 221387 130970
9470 130970 199266 265455 263147 232867 197500 177179 212599 282624 276158 305534 323413 273374
9458 273374 227277 230571 315102 335192 362252 381901 405092 377954 365514 329215 347790 403321
9446 403321 424419 440562 433258 423006 422928 425086 386008 375020 415459 471996 504668 495665 472301
9433 472301 470436 429499 467584 488268 456360 527295 543129 575907 519138 460950 473522 527227
9421 527227 545137 530180 511396 531038 518698 545348 530403 504863 587045 536738 501128 521874
9409 521874 533090 499746 545146 529185 542781 559719 568828 638556 648940 605006 604230 642237
9397 642237 680368 652084 634910 634733 636975 715201 729071 724381 712535 734538 809971 849572
9385 849572 836903 768511 751116 776378 833769 831190 809445 819088 799487 790299 807572 807769 889091
9372 889091 898952 883378 899077 930892 989894 1031806 1021663 1017903 1091101 1065127 1046008 1073984
9360 1073984 1109588 1163868 1217127 1229598 1181756 1128552 1086882 1089739 1055044 1072645 1074542 1124405
9348 1124405 1178386 1192369 1246631 1239991 1241705 1242840 1222361 1214805 1217947 1309636 1370928 1388114
9336 1388114 1409745 1352436 1252477 1179165 1193062 1196119 1240543 1288150 1266215 1341239 1418633 1410220
9324 1410220 1346495 1322790 1367422 1335524 1307210 1301731 1331560 1384394 1354941 1300894 1272441 1214702
9312 1214702 1213229 1172027 1172318 1160630 1165799 1181686 1221110 1217880 1214901 1204877 1265286 1240999 1196911
9299 1196911 1216127 1254865 1238594 1236007 1266186 1249301 1207031 1128010 1095457 1063419 1022551 1003492
9287 1003492 1028179 1022989 981489 930673 953731 1010472 1007651 1032991 1056849 995913 969400 986884
9275 986884 971674 1009788 1023691 1035121 1067951 1030711 1047454 1037056 1071719 1037339 1006830 971813
9263 971813 946952 980596 1048041 1064408 1088840 1063188 1049476 1094965 1089280 1068673 1046996 1058929
9251 1058929 1070981 1073174 1093334 1071192 1020870 1006577 1015623 1018449 1046812 1108435 1100367 1101825
9239 1101825 1100907 1130748 1136521 1151254 1157593 1135744 1137979 1172389 1174202 1185128 1189034 1165265 1182385
9226 1182385 1228512 1208547 1190753 1207350 1205224 1217325 1222197 1243574 1270825 1253435 1215753 1227913
9214 1227913 1205175 1239416 1300177 1269778 1202512 1226198 1228031 1221589 1242629 1240839 1211384 1259790
9202 1259790 1259163 1277479 1300461 1288002 1318383 1316267 1389699 1355473 1350892 1398745 1392319 1408752
9190 1408752 1454973 1435396 1449665 1494761 1472495 1435754 1504600 1546375 1516876 1573074 1573677 1603227
9178 1603227 1584875 1630736 1681909 1666789 1675992 1685227 1665625 1693924 1699846 1729313 1752166 1783286
9166 1783286 1795379 1873867 1921042 1932810 2004972 2024465 2028075 2057807 2022180 2051488 2172356
9155 2172356 2262489 2301597 2345347 2385502 2457172 2546440 2583110 2614475 2643042 2722797 2808002
9144 2808002 2843916 2898396 2901952 2956643 3052747 3174412 3333766 3426336 3479008 3491777 3629116
9133 3629116 3720910 3837518 3940522 4087556 4170703 4266752 4435429 4539322 4652820 4864642
9123 4864642 5005688 5052923 5172295 5321181 5468120 5634897 5811653 6024073 6184873 6378351
9113 6378351 6568102 6737391 6958439 7196765 7530443 7895562 8178666 8569572 8997844 9384138
9103 9384138 9703769 9991241 10273056 10717887 11219118 11790941 12416590 13164042 14019358 14982704
9093 14982704 16136952 17532448 19226215 21141980 22958507 24437173 24968091 24482804
9085 24482804 23566705 22769288 22446601 22651815 23303270 24316275 25579606 27124642 28937199
9076 28937199 31059069 33685302 36934138 40364472 43412306 45226728 44869353 43218433
9068 43218433 41610849 40618768 40219062 39933791 39070310 38009389 37089414 36521416 36127666
9059 36127666 35850229 35897392 36463494 37444491 38670194 40188517 42332538 45312410 48813843
9050 48813843 52193980 54518751 54508345 52523624 49797641 46902192 44212875 42454747
9042 42454747 41928229 42183264 42669282 42697475 42019460 41227905 41115168 41977275 43820770
9033 43820770 46361548 49299520 51866883 53090374 52506596 49565640 45564913 42499642
9025 42499642 40568635 39125444 37485226 35472403 33678545 32595466 32172730 31994823
9017 31994823 31552461 30940059 30614258 30913305 31774692 33220912 35283466 37837945 39972082
9008 39972082 40463143 38756383 34551924 28951444 24128032 20673649 18254110 16534562
9000 16534562 15168613 14127904 13272677 12596188 12113264 11795804 11543275 11269547 10949246
8991 10949246 10422584 9727043 9069835 8465528 8017684 7575061 7216973 6863128 6477323
8982 6477323 6271360 6030964 5807825 5615003 5431197 5248005 5083604 4941513 4787551 4624424
8972 4624424 4542443 4428319 4344576 4266281 4164332 3999919 3870157 3799922 3734071 3669792 3589533
8961 3589533 3518071 3505390 3457600 3377398 3321254 3313020 3257800 3199526 3143703 3102299 3050331 2980935
8949 2980935 2977432 2906797 2829729 2773576 2701258 2668730 2605467 2545295 2533444 2506118 2533632 2494150
8937 2494150 2450702 2442877 2447312 2367703 2268875 2193519 2192456 2106478 2130458 2099785 2035485 2061847
8925 2061847 2052855 1992443 1916060 1884747 1870482 1881121 1873088 1828235 1768303 1765586 1733986 1805380
8913 1805380 1791945 1800817 1822942 1794946 1719173 1697760 1682839 1669570 1669592 1655918 1616265 1534785
8901 1534785 1478427 1469648 1436086 1434472 1402157 1333078 1361722 1368395 1386782 1294900 1299278 1308656
8889 1308656 1248061 1223439 1198841 1179947 1156087 1199467 1182963 1189237 1175130 1143142 1149146 1098698
8877 1098698 1070225 1085758 1082975 1136099 1137462 1113158 1087996 1112615 1083974 1092428 1112608 1087254
8865 1087254 1113809 1107338 1100321 1063908 1072039 1143366 1137907 1085132 1097070 1061163 1047072 1014483
8853 1014483 1041939 1057835 1026334 1008605 971527 1020009 1052168 1006023 935224 922040 943449
8842 943449 960800 984980 952213 982000 981965 971944 1017130 1061209 1084197 1095660 1074830 1069530
8830 1069530 1111061 1113494 1092418 1076621 1079420 1071838 1112155 1098652 1099047 1077342 1031594 1118150
8818 1118150 1137672 1142934 1038098 1017013 1051654 1034436 1008753 1001814 1013504 1006690 1028373 1050296
8806 1050296 1077690 1108222 1132477 1109859 1105380 1129228 1166513 1179790 1155312 1140104 1175142 1168971
8794 1168971 1210748 1209344 1211421 1179671 1160393 1179863 1222501 1234482 1246253 1238662 1231470 1226669
8782 1226669 1163316 1146610 1084245 1058233 1084680 1048709 1005102 1068416 1106569 1086002 1053522
8771 1053522 1095028 1149829 1155727 1092110 1124669 1205756 1204259 1210734 1235800 1199285 1210142 1186594
8759 1186594 1154588 1191785 1206001 1240530 1176885 1137330 1210127 1232157 1289836 1270308 1235337
8748 1235337 1259552 1250968 1272202 1295020 1328309 1334630 1365283 1375991 1456427 1469656 1526797 1523790
8736 1523790 1557656 1652972 1698463 1758064 1814874 1867360 1919402 2025684 2109552 2281691 2456863
8725 2456863 2663683 2903958 3170160 3437587 3847561 4379162 4985660 5818827 6909886
8716 6909886 8138874 9024743 9048772 7602174 5809561 4674640 4013988 3576212 3228014
8707 3228014 3008045 2859845 2684202 2542263 2509227 2424189 2377183 2301276 2258615 2255535 2286033
8696 2286033 2189654 2170706 2175319 2139123 2111511 2128201 2135188 2111388 2095056 2132909 2149486 2134936
8684 2134936 2135984 2189830 2212020 2230207 2195597 2200511 2227439 2200550 2256812 2258196 2272626 2292095
8672 2292095 2366211 2413275 2419783 2448301 2514642 2550294 2560221 2643402 2699410 2775905 2823655 2858981
8660 2858981 2883448 2932622 2980076 3016353 3097189 3158275 3196983 3305137 3414331 3518427 3598152
8649 3598152 3694729 3780033 3766088 3845883 3908318 3958462 4076938 4183850 4326868 4467946 4611651
8638 4611651 4738803 4891011 5065021 5213069 5383677 5569147 5738641 5909295 6158745 6299091
8628 6299091 6417110 6557093 6650756 6721980 6835796 6903941 7059157 7182526 7316800 7422644
8618 7422644 7642434 7837020 8071251 8349798 8650912 8868819 9107480 9375709 9645370 10017993
8608 10017993 10411862 10843417 11322370 11813989 12365167 12909748 13539418 14280999 15087328
8599 15087328 15770831 16356387 16861928 17467665 18305556 19238031 20413778 21759604 23388256
8590 23388256 25328327 27676418 30504415 33883169 37690497 41077866 43416890 44011557
8582 44011557 42372240 39008237 35493982 32827686 31210341 30821892 31203384 32153469 33407395
8573 33407395 34696333 35614240 35812262 35136654 33765917 31932907 30093027 28796613 28184704
8564 28184704 28045292 28421434 28957080 29506195 29948070 30420088 30997617 31796431 33078285
8555 33078285 34853645 37105279 39654938 42404310 45302041 48391711 52162868 56444368
8547 56444368 60617528 63992963 65805733 65442694 63602971 60951463 57759629 54100773
8539 54100773 50301684 47370208 45681758 44888290 44664057 44486555 43962668 43067615 41699576
8530 41699576 39935897 38009368 35994353 33768406 31455442 29382778 27677514 26452490
8522 26452490 25598239 24956563 24387908 24128404 24334571 24804336 25505125 26022356 26342509
8513 26342509 26413218 26296793 26475943 27271156 28705420 30690876 33018684 35198398 36416052
8504 36416052 36087771 34124938 30763549 27007764 23877263 21620810 20115757 19197236
8496 19197236 18876169 18978492 19465959 20000892 20338211 20179931 19293130 17638078 15586686
8487 15586686 13731363 12203571 10990925 10109884 9384137 8827347 8347929 7958065 7648192
8478 7648192 7348886 7099810 6937633 6703427 6436594 6105697 5754633 5469845 5192540 4999278
8468 4999278 4808847 4616663 4498275 4376644 4244562 4107392 3999253 3903023 3839419 3759678
8458 3759678 3641573 3565631 3425046 3335003 3257131 3184663 3067194 2953502 2892781 2839324 2743168
8447 2743168 2634424 2622949 2542589 2431133 2398439 2385224 2316848 2249596 2229550 2168750 2105611
8436 2105611 2077817 2073863 2010971 1946163 1908907 1894736 1892005 1847818 1827752 1779999 1761473 1715612
8424 1715612 1726940 1707777 1662880 1612142 1583241 1546309 1521535 1455680 1461167 1438619 1382716 1406129
8412 1406129 1342030 1341158 1311446 1330034 1280824 1259292 1230166 1190385 1186602 1118873 1074581 1104372
8400 1104372 1044447 993746 955452 991101 1001978 996348 1007047 888651 858145 910378 919661 908572
8388 908572 932569 931358 914808 843877 837929 854478 837909 787624 784041 766919 746069 790581
8376 790581 772179 762661 751940 693755 673854 624953 652355 627068 641962 695225 627732 690941
8364 690941 658380 605860 619800 608016 598990 640481 587867 569301 602635 603568 530402 467440
8352 467440 444152 448686 478559 442658 476746 530158 467627 463878 446544 496972 503363 464363
8340 464363 471967 460592 387128 364066 394932 407112 402687 392976 373633 368628 413325 358742
8328 358742 308193 332282 345476 356320 339122 315142 311502 270205 304066 330170 322067 307099
8316 307099 352552 325963 324091 325154 297312 267404 300918 284590 238006 293301 299999 263139
8304 263139 228407 274090 270004 288207 284725 239978 255503 296660 292903 312271 338760 271855
8292 271855 261960 252511 214412 198234 225772 236917 256996 232291 210929 212216 203855 234012
8280 234012 268244 210603 189188 203206 231989 234143 185956 181858 203822 165481 170414 218099
8268 218099 237712 222038 268345 256583 191884 194186 193102 233936 224532 200863 219165 218908 223829
8255 223829 230589 232436 286586 219981 187863 217349 239559 209916 193940 228528 205818 131371
8243 131371 143765 178646 203789 235517 236104 237925 233761 250778 229319 173808 146037 176731
8231 176731 197685 199879 193248 199176 188893 211998 217738 226751 212417 205015 198068 222145 214482
8218 214482 234494 267185 249187 249975 288301 240240 189293 203646 244008 230994 192839 240927
8206 240927 214088 273986 325822 307212 216886 264149 229549 265176 247215 289302 304363 355342
8194 355342 341914 712930 536944 -37937 76849 73898 191655 110065 106141 188514 130686
8183 130686 153005 229336 256128 273863 294437 261675 226196 274643 329551 282280 226284 247609
8171 247609 318400 315463 258090 299656 299454 295162 272086 270971 235052 230841 271451 283073 309348
8158 309348 264682 197014 245363 201430 138266 117742 153516 137866 149524 142963 124908 125733
8146 125733 175593 220400 168997 152076 167708 169766 199310 175709 169246 169153 133185 150969 107809
8133 107809 106361 147499 115473 117101 157384 128301 121811 134258 142126 97158 95497 75383 79448
8120 79448 54881 96654 65746 55152 55072 48298 71937 33081 50013 88246 88779 56522 14225
8107 14225 14145 55635 62847 47018 27523 35559 23053 17238 33089 42645 10269 -29992 27518
8094 27518 87282 30943 17271 -15688 -18285 1394 -5687 22612 43357 46358 7649 -38926
8082 -38926 -33030 19377 18511 40556 53697 5793 -31904 -3828 962 41015 47382 33967 36115
8069 36115 14558 -25357 8771 34559 65466 85297 123992 146119 161925 161391 104312 97852
8057 97852 78306 81927 76163 44083 -32095 387 -22407 -36810 -21198 -11290 2724 15702
8045 15702 5452 -6493 -16279 10286 34230 40525 29137 -47286 17582 52742 63847 62146
8033 62146 75666 35148 22934 33379 32861 71770 93129 113396 104851 100180 109408 117062 86915
8020 86915 98147 70926 70012 51797 25414 -8229 16439 19550 -32021 -42614 -13851 -1535
8008 -1535 -42690 -30836 -26630 -58599 -5 -12123 -5191 1518 -30220 -49783 -74316 -51758 -54288
7995 -54288 -32589 -33341 -19150 -12210 -31205 -69734 -39563 -33875 -9924 -30583 -70202 -5746 -4980
7982 -4980 -5933 14853 -25685 -41438 -65243 -98311 -68394 -49629 -65743 -61250 -25346 2306 -23468
7969 -23468 -52100 -72384 -25011 -15516 -14848 -38331 -46133 -53031 -72051 -52689 -24523 -24380 -93539
7956 -93539 -94742 -70663 -33112 -36481 -65560 -60879 -57350 -54944 -95682 -76887 -55110 -69459 -50624
7943 -50624 -83014 -80832 -71163 -75166 -14028 -28130 -59182 -51756 -54011 -44012 -32772 -4121 -24718
7930 -24718 -49190 -53777 -32002 -35761 -86320 -94902 -74168 -66849 -83296 -114773 -75581 -73863 -46072
7917 -46072 -41766 -20497 -10520 -30643 -57407 -41486 -40957 -75767 -74822 -34310 -47891 -32378 -41206
7904 -41206 -73835 -68945 -39816 -69913 -76579 -44412 -30502 -26920 -79897 -80963 -93223 -58207 -68954
7891 -68954 -42606 -56864 -57356 -51880 -62581 -69443 -54464 -37384 -35904 -19144 -36768 -38466 -75782
7878 -75782 -92812 -51357 -63348 -81242 -88263 -25296 10254 -48599 -34155 -56249 -136390 -147828
7866 -147828 -125071 -88896 -116657 -99949 -72473 -48562 -62430 -47345 -64303 -87228 -51519 -21482
7854 -21482 -47287 -39447 -38223 -74796 -48850 -29656 -29499 8303 17750 -28645 -40556 -27760 4674
7841 4674 -5492 -10790 -62736 -45197 2532 -31513 -51140 9401 8230 -24865 -67045 -46630
7829 -46630 -66992 -57556 -99131 -70593 -60079 -54741 -62491 -74011 -36132 -30725 -60241 -19471 -33859
7816 -33859 -10751 3858 -47749 1674 -10638 -34596 -47052 -37522 8172 9750 61259 79543
7804 79543 -119546 -79041 -49130 -58782 -33775 9547 22686 1664 -24067 -39648 -22180 -19814
7792 -19814 -6283 -33103 7547 -31301 -84247 -94157 -84557 -45836 -41907 -24037 -49946 -3658
7780 -3658 -55093 -53050 -49792 -68563 -49780 5524 -15190 -46270 -32636 -58066 -53331 -31680 -62323
7767 -62323 -55508 -31486 -39006 -67297 -39038 -58744 -62338 -3477 1869 -40900 853 -14670 -14871
7754 -14871 -13820 -64029 -63730 -44811 -26289 29627 70829 144316 91739 90744 145852 198552 233884
7741 233884 286214 307411 214463 185261 106894 55742 25846 16443 23688 16492 -25602 18269
7729 18269 -41883 -30329 -11669 -28946 -57652 -48335 -51686 -21452 -2292 17329 15792 -4774
7717 -4774 1368 10204 -4833 -25767 -45954 10614 -29274 -65959 -26793 -10728 -50945 -29915
7705 -29915 -45125 -21957 18275 -28433 -41929 12128 -1811 5702 -82027 -66704 -42274 -57555
7693 -57555 -50645 -10842 9075 -1627 -74045 -95732 -87995 -65810 -24494 -19478 11537 6187 -9430
7680 -9430 -12269 7520 -50656 -9223 198 10201 1991 -9024 -70347 -23373 -65342 -44572 38995
7667 38995 10892 5106 -18641 -13181 -30523 -58692 -22732 -29985 -50755 -17750 -10112 -32346 -85910
7654 -85910 -39151 -75945 -55154 -13792 -2235 11607 2531 -15558 -14401 13919 -53626 -11768
7642 -11768 34762 22041 -27749 -28010 -32118 -18626 -42872 -26838 -60043 -19507 -20670 -5515 -56196
7629 -56196 -40576 14001 -21146 -28399 28241 48114 -7648 8082 2506 -48775 -35473 24938
7617 24938 12541 3012 26069 -24764 -57165 8631 2814 -30965 -17970 -442 4561 42269
7605 42269 1021 -16924 -1958 -18584 -10524 -11403 -9378 3583 -6508 -28731 2717 29872 31570
7592 31570 -550 -23580 -83983 -39747 27186 37459 8197 -15218 20029 40284 18220 -49853
7580 -49853 -36170 -42164 -34234 -26596 26496 53688 47951 34864 10586 63350 74314 21601 -3006
7567 -3006 32739 -7184 -14551 34169 37372 65138 46287 42459 66588 83236 49752 58588 60285
7554 60285 49374 60239 50569 77110 96572 62872 87578 89882 62291 30176 106945 148407
7542 148407 116073 104580 58647 105777 124182 97731 104515 82920 112650 131901 145291 129923
7530 129923 154425 186965 155435 209855 198732 192592 198357 205535 213813 293592 319864 350561
7518 350561 374683 375508 401822 444869 454595 504323 533309 561125 552527 479416 477162 422603 344107
7505 344107 297449 278171 208124 203894 207886 194217 115025 105759 152216 191635 153278 176588
7493 176588 159457 156623 161475 131804 85809 51454 79379 99521 82674 72386 68809 94693
7481 94693 98944 68257 119231 151856 137750 113040 105065 141719 129153 128152 155147 151364 172057
7468 172057 201507 207319 222001 245847 219636 246454 268623 281155 243710 226198 221956 162697
7456 162697 153028 137721 123849 119986 104452 127141 127233 113543 99727 118450 110125 93437 86716
7443 86716 51545 82769 102826 113290 123884 139007 154271 103311 110010 121026 115002 89818
7431 89818 88357 82290 106457 124666 94441 60944 23206 -6067 36527 43639 59933 44562
7419 44562 -7050 34100 55772 68758 145269 139210 83541 109175 81674 61731 73678 99847
7407 99847 49405 40634 92465 60541 37056 54160 25874 54471 82453 69689 60487 40709
7395 40709 46944 112903 78050 33834 57696 50911 64453 52476 82539 87193 96437 68761 65280
7382 65280 37786 62063 105693 35397 7724 86067 71913 57257 33184 47280 59865 69718
7370 69718 123493 142605 138275 119528 95146 55492 60627 57868 85582 49761 19116 37058
7358 37058 31018 28710 32827 38931 60606 73279 58591 72973 83749 43722 89085 100182 91309
7345 91309 112702 122397 68206 92400 100599 116153 115209 88818 111431 125783 123476 136345 146953
7332 146953 101706 129670 102271 60461 73804 89943 94646 87021 100003 155468 123271 139940
7320 139940 157238 154752 125423 125496 125300 170531 123179 123255 143626 94225 111087 136230 162332
7307 162332 156234 192819 173521 140415 163381 188948 184794 224640 182960 144796 153461 136056
7295 136056 121835 156600 163760 151284 168888 177422 154322 168086 204256 189814 169859 228255
7283 228255 209267 219894 251742 233651 251824 280099 312364 297506 230934 195463 243022 259693
7271 259693 288337 244727 240567 261332 302832 304604 284030 300191 289389 318015 287193 312321
7259 312321 342669 351727 314227 334935 368606 372017 370157 354507 322605 321932 345885 401508 354912
7246 354912 370331 333780 363572 427890 421278 420417 440434 457991 478217 497519 516144 516433 482915
7233 482915 421722 413178 498621 472348 458234 472915 514331 524134 528692 498412 578117 579809
7221 579809 584224 578353 618737 637211 666708 714021 721602 729512 699562 756100 775313 756131
7209 756131 792567 836992 795210 798951 819310 845754 870371 890434 969421 969268 1000592 991457
7197 991457 1024478 1083596 1102645 1146424 1165871 1230218 1230283 1299689 1377906 1467580 1483719 1458201
7185 1458201 1482176 1514955 1560425 1565788 1659411 1722606 1745755 1704120 1756100 1775639 1834315 1925679
7173 1925679 1983541 2072425 2060988 2129644 2204711 2247544 2325241 2435927 2563857 2606267 2648957
7162 2648957 2772931 2863339 2924617 3027473 3148031 3194960 3336855 3444987 3520070 3645126
7152 3645126 3763311 3876591 4023332 4205119 4339135 4504193 4694834 4943387 5078136 5273631
7142 5273631 5505874 5777123 6119899 6368492 6663793 7033147 7405546 7777804 8230215 8658324
7132 8658324 9159106 9780605 10434153 11158089 12021700 13057208 14279791 15726275 17513870
7123 17513870 19584244 22031088 24937273 28503184 32932732 38330912 44798506 51992691
7115 51992691 58967874 64525064 67339741 66239281 61144691 53234599 44165503 35840393
7107 35840393 29159470 24183994 20689862 18219661 16293425 14771643 13557111 12514666
7099 12514666 11657696 10869713 10298020 9716359 9215830 8766749 8492096 8243148 8014401
7090 8014401 7818430 7702075 7603795 7497633 7437391 7459455 7478606 7506520 7611653 7797001
7080 7797001 8006150 8284357 8638210 9110374 9665906 10460159 11431902 12474956 13802377
7071 13802377 15555887 17738122 20305223 23195227 26089595 28309984 29353128 28790689
7063 28790689 26511687 23155272 19279095 15752339 12963806 10899962 9434089 8401187
7055 8401187 7596763 6967484 6374479 5971553 5547239 5185924 4854696 4552805 4280374 4030383
7045 4030383 3761680 3568567 3424740 3253762 3110612 3038330 2920223 2753520 2648215 2523314
7035 2523314 2431428 2353451 2260929 2165839 2067771 2052804 1934024 1847265 1820928 1754310 1735702
7024 1735702 1703320 1675811 1570283 1522334 1491837 1459889 1431031 1377140 1299413 1276717 1277992
7013 1277992 1247124 1229325 1224446 1163649 1144014 1137366 1096610 1077178 1036835 1034407 1030535 1016627
7001 1016627 952839 942464 912966 895931 920588 828220 793042 732208 717110 691140 661499
6990 661499 658522 698368 705257 633514 634631 627635 612874 599255 592718 561705 552831 552290 554446
6977 554446 531757 571393 577868 546584 516425 511834 503878 476052 493623 450983 395325 416378
6965 416378 439324 413729 396247 424290 396205 394777 379932 374446 404405 409595 379161 334693
6953 334693 366123 352397 352316 348853 366887 360670 384909 386707 364711 308385 314205 330948 318799
6940 318799 280371 295800 321962 297225 319012 373073 334666 308236 320882 300430 317788 326453
6928 326453 274270 298656 313629 299788 329752 370099 316309 267489 228421 213776 194517 216155
6916 216155 261788 227771 198603 195880 180142 187957 196591 205924 224039 222655 244638 259167 234577
6903 234577 252764 249701 217348 236292 217224 187261 215276 159578 175214 196456 164100 191778
6891 191778 173207 168142 130705 130933 166698 170139 117949 150851 169204 177708 155585 170819 211976
6878 211976 252825 221339 168584 250304 195095 153785 203166 215208 243177 244496 229784 226970
6866 226970 168417 146978 192237 227846 223703 186857 232956 259702 266036 281588 248449 173361
6854 173361 146022 130289 149669 144252 163248 169877 188209 177244 136108 127975 151784 185879
6842 185879 191186 134808 118412 110369 135302 103498 98616 78537 103727 120330 116176 127168
6830 127168 84524 128153 124424 140057 167379 129457 140370 66869 40230 78388 73008 119714
6818 119714 128975 121949 151624 165981 142597 136373 141557 156046 108897 136334 153447 118229
6806 118229 161268 198487 202178 105844 124400 160371 129533 111289 115162 132271 100137 142931
6794 142931 108239 79593 107968 130328 126483 116945 153021 114260 146921 181585 138633 129021
6782 129021 120776 105015 71145 112728 135013 127938 86746 112935 159539 165955 102498 116211
6770 116211 73732 83475 59646 60825 47795 65268 85501 57373 73417 61979 62022 65961 76413
6757 76413 59678 107489 127563 79113 91830 75373 93150 77588 95599 135921 166305 133579
6745 133579 92259 66396 95343 151518 105450 154983 176667 132872 154043 190325 174746 238430
6733 238430 229273 219209 156892 158013 162216 138627 158473 198086 176401 216093 191722 141684
6721 141684 168345 170621 173451 201393 216378 277891 328388 329378 394369 380282 429876 433617 387100
6708 387100 352749 293663 231958 176452 189201 177712 152392 141595 153992 130581 153343 160273
6696 160273 153465 113451 107029 80335 71177 107090 59305 59386 82465 84006 91000 131215 94512
6683 94512 65333 108933 111309 118877 122158 116216 112214 140295 127896 124299 112747 140112 199408
6670 199408 149827 118917 157013 150151 125281 142782 141659 173427 164885 165593 163263 158666 148427
6657 148427 111762 71920 111800 77993 58220 90855 91350 47437 38840 87542 106303 42697
6645 42697 45771 44258 43280 47544 37886 68845 48736 29780 39842 73498 51911 69864 67573
6632 67573 64722 71690 65291 44566 6330 59730 72621 92326 90602 49360 45967 31516 48263
6619 48263 78594 100948 69791 71101 81635 48178 79272 36956 31963 77133 82349 83101 76011
6606 76011 108806 98687 70012 109168 174914 153317 143845 106401 101358 83669 100380 115153
6594 115153 98107 104728 141488 172921 119955 90025 103804 74880 127066 134978 76152 101007
6582 101007 66680 94187 145622 87058 87124 119505 125657 168319 214044 205415 185878 190524 157564
6569 157564 194082 241055 207435 182709 193238 190660 202748 293719 319600 284480 305294 306135
6557 306135 337751 319988 318945 318633 303392 332490 317540 356340 384123 330889 365549 461217
6545 461217 501318 604500 743154 891149 1022980 1116671 1142017 1076230 916927 720385
6535 720385 564719 413445 353027 319166 272845 245572 242265 215263 223792 184843 143656 148228
6523 148228 147369 121991 139932 124459 127840 114066 72563 136993 121250 141825 142845 127929
6511 127929 127166 119436 74353 62154 67501 78186 111460 97553 56997 84750 56452 61581 77622
6498 77622 118389 52245 19966 18911 40802 79667 90336 105168 98989 122769 124610 150741
6486 150741 125108 95349 82383 65529 28651 63881 60015 39866 9113 -7911 22595 56401
6474 56401 76623 49965 39397 64005 87224 93109 65643 59271 49632 60692 43041 18834
6462 18834 28904 57632 97483 41439 62197 127144 108000 105975 108556 147478 82435 51270
6450 51270 103139 185379 152250 88525 61349 64773 33408 54875 108204 99240 106460 164077
6438 164077 188023 178302 172945 129571 98769 62310 71655 142536 183020 204283 165276 135812
6426 135812 180979 161602 213408 195988 181167 225908 205688 210021 158880 139975 182711 191275
6414 191275 190022 201858 194448 175560 202104 233897 197052 209965 178164 96308 87094 126968
6402 126968 157669 115797 139816 113738 125497 73017 126667 142286 83319 107582 155502 101782
6390 101782 94408 145254 170038 201769 238150 212158 184134 166214 162486 187837 164251 206067
6378 206067 231239 240564 235072 194333 247337 300442 272674 255436 198693 245465 234890 253658
6366 253658 225587 220860 271550 289517 288822 296530 299111 291251 247020 243004 232526 222040 245314
6353 245314 212338 194597 191849 231102 225109 188980 257727 294406 274200 273046 248613 261570
6341 261570 307075 310588 321655 318100 291093 269459 227088 269445 275561 251929 255095 254961 214578
6328 214578 225467 265434 255649 275314 330922 333805 325003 380248 388641 387120 416100 444216 427814
6315 427814 458734 479670 458431 488196 490446 397065 405749 421399 388763 367525 324616 329191
6303 329191 313596 337109 350491 341977 296831 303054 342975 297289 280074 257888 263084 297757
6291 297757 269422 334931 387529 377343 356221 364080 380281 319061 313733 317520 270938 287149
6279 287149 286574 291440 239301 230934 247462 278877 284958 280333 276931 253644 230719 225798 196802
6266 196802 210989 251493 254135 232612 255145 236686 218539 234754 254971 244358 216542 234604
6254 234604 241545 281276 321631 341902 328791 335651 332561 330743 324016 303520 324966 351131 302793
6241 302793 261084 291585 314643 307268 299840 316983 337639 306283 304246 295876 308532 350054
6229 350054 339574 320199 366816 354628 332328 381400 375993 373366 421851 410586 394913 427805
6217 427805 415097 367539 380155 345572 363345 436284 470699 408481 400472 456830 460020 471918
6205 471918 490774 484788 488684 520012 490513 457272 499498 530447 584585 549296 578135 633675
6193 633675 689593 694327 683950 701995 687393 667500 677150 664955 674687 667216 680590 730135
6181 730135 746256 719663 742746 759418 721854 786667 802094 850912 853904 857827 867266 868999
6169 868999 923570 926387 963227 950744 986406 1035270 1073269 1091526 1107475 1134792 1160589 1206279
6157 1206279 1221748 1262780 1278475 1275706 1259453 1318394 1335801 1337954 1385406 1450811 1474548 1502404
6145 1502404 1545238 1546760 1572367 1656571 1732928 1778989 1862729 1919833 1946502 2023510 2102369 2180049
6133 2180049 2249830 2323711 2354270 2345692 2401063 2515257 2556366 2624437 2752886 2904823 3024013
6122 3024013 3036084 3150589 3333117 3459485 3654657 3777549 3879685 4023103 4197596 4437519
6112 4437519 4696868 4910418 5188144 5531687 5879004 6270872 6792685 7435296 8182959 9031525
6102 9031525 10032456 11273169 12802908 14547974 16490103 18350638 19668842 20208503
6094 20208503 19842489 18597005 17034669 15755570 15144038 15249483 15899585 16921503 18216157
6085 18216157 19401336 20122724 20015698 18947128 17065990 14719849 12549870 10978002
6077 10978002 9867875 8952591 8299662 7772931 7357209 7087636 6949530 6792644 6680371
6068 6680371 6642600 6661918 6710309 6730086 6808582 6932261 7037714 7223557 7446788 7701279
6058 7701279 8045081 8427220 8865423 9437757 10114530 10907342 11951939 13187377 14693246
6049 14693246 16545498 18648168 21002370 23484803 25512507 26581465 26513845 25273827
6041 25273827 23255421 21159905 19800025 19332487 19631302 20580252 21996181 23618162 24842192
6032 24842192 25134222 24217838 22052233 19069351 15934845 13317401 11410077 10021520
6024 10021520 9003455 8237236 7612056 7105472 6746949 6393878 6145994 5985356 5754285
6015 5754285 5455348 5131724 4811495 4514397 4276800 4071938 3881689 3743613 3626010 3497575
6005 3497575 3382139 3309498 3233351 3189261 3117048 3054806 3041556 3028930 3002537 2928408 2864288
5994 2864288 2765392 2788074 2732120 2686013 2717427 2708803 2792190 2874031 2906571 2913932 2932271 2911563
5982 2911563 2778532 2732957 2599640 2498539 2472888 2413150 2357422 2344549 2308685 2305212 2288617
5971 2288617 2316933 2295276 2293061 2312243 2320261 2336064 2371224 2411557 2420190 2404906 2406743 2420296
5959 2420296 2452499 2447678 2496544 2600727 2616806 2688966 2820691 2863210 2876045 2925426 2921566
5948 2921566 2902252 2845972 2718096 2617307 2631279 2660292 2674566 2667888 2700932 2732870 2779121
5937 2779121 2716134 2714858 2780182 2803300 2828728 2910651 2952351 3050721 3086305 3096284 3143238 3218362
5925 3218362 3290358 3394910 3545119 3619276 3802990 3910651 3972044 4036508 4040326 4074184 4053738
5914 4053738 3988042 3942049 4029211 4082321 4103405 4208718 4336142 4466753 4679668 4891613
5904 4891613 5215981 5561857 5992873 6450891 7054247 7765072 8464743 9195403 9791813 9998139
5894 9998139 9903258 9392486 8616865 7792626 7186565 6761428 6426410 6246951 6106420 6094373
5884 6094373 6035767 6093693 6111122 6155561 6349731 6568956 6826253 7136863 7517549 7929117
5874 7929117 8493468 9150331 9941603 10911917 12069134 13515272 15222332 17279038 19485747
5865 19485747 21699080 23295592 23693102 23012005 21221413 18339063 15433595 13127525
5857 13127525 11510016 10384619 9584990 8976874 8473548 8190175 7909469 7751262 7668093
5848 7668093 7645646 7714946 7812741 8052182 8350573 8681699 9209873 9814236 10627164 11507408
5838 11507408 12636704 13991576 15695059 17721961 19886847 22109190 23655323 23961398
5830 23961398 23117102 21240136 18160027 15040228 12664648 10922284 9711455 8754589
5822 8754589 8090474 7625088 7119546 6764831 6482222 6295665 6087167 5929957 5844036 5775122
5812 5775122 5858978 5976677 6027522 6186087 6403922 6689126 7002480 7493038 8123415 8753883
5802 8753883 9465239 10194930 10625108 10613241 10270002 9581009 8532840 7462491 6586033
5793 6586033 6052611 5698257 5323447 5066793 4860078 4690130 4600584 4426265 4372698 4375200
5783 4375200 4327503 4253446 4274970 4353067 4307856 4358792 4441299 4520270 4575501 4661383 4781421
5772 4781421 4856663 4922835 5036853 5181019 5303710 5408541 5494263 5654010 5809884 5994364
5762 5994364 6269630 6559099 6887795 7332104 7890802 8502853 9210736 10092269 11168148
5753 11168148 12435537 13969500 15687863 17553701 19518850 21289796 22018282 21770593
5745 21770593 20951734 19411852 17104574 14804556 13000179 11704893 10900576 10356418 9857454
5736 9857454 9543656 9394364 9321754 9373772 9577371 9913816 10401954 10978127 11705147 12634969
5726 12634969 13815017 15295314 17026281 18883358 20951590 22747688 23578741 23429220
5718 23429220 22535529 20877191 18409547 15801862 13656140 12132579 11111016 10397328
5710 10397328 9885268 9553400 9414046 9371279 9462207 9640737 9951243 10434374 11060316 11859306
5700 11859306 12838254 14034103 15303313 16586799 17471148 17585397 17100610 16144722 14637988
5691 14637988 12805306 11202493 9975732 9095260 8445658 7961121 7623340 7350709 7180042
5682 7180042 7129381 7146849 7339435 7614305 7925432 8348942 8904370 9629703 10547627 11730189
5672 11730189 13012870 14458661 15842103 16829475 16968995 16426796 15395044 13716545 11567629
5663 11567629 9622507 8056991 6946970 6207818 5599579 5120601 4737681 4374845 4050893
5654 4050893 3808783 3555481 3375781 3195807 3069276 2964833 2770262 2673972 2550381 2416921
5644 2416921 2372370 2318610 2212912 2157190 2103811 2046268 1942302 1926801 1920088 1865247 1842863
5633 1842863 1796354 1750921 1678861 1630125 1579582 1554552 1547429 1559340 1541124 1508364 1446941 1465699
5621 1465699 1433336 1394884 1332588 1332976 1333123 1281816 1225582 1183631 1219001 1218108 1202203 1201060 1206801
5608 1206801 1222104 1191576 1191246 1207435 1166621 1156075 1118905 1092756 1135876 1134371 1140018 1146859
5596 1146859 1170807 1127937 1120702 1138663 1103980 1122206 1143431 1128061 1116654 1142838 1218099 1185933
5584 1185933 1222611 1223889 1255883 1285233 1249296 1294029 1297920 1306571 1303618 1329336 1371584 1416461
5572 1416461 1435269 1460060 1418885 1405495 1433160 1442084 1430091 1439933 1443176 1451755 1415037 1408956
5560 1408956 1368539 1386521 1444384 1441126 1377770 1383584 1441319 1411735 1435347 1363994 1293094 1332442
5548 1332442 1258487 1204347 1209636 1190705 1224417 1207507 1181094 1133048 1121310 1174896 1166965 1174125
5536 1174125 1232280 1245291 1185088 1186676 1195341 1184294 1149794 1148290 1102754 1098537 1072434 1024314
5524 1024314 1024744 1003335 981183 976981 1058259 1111544 1077679 1048947 1088554 1111994 1126907 1108427
5512 1108427 1097641 1136352 1152569 1127508 1149290 1128336 1125644 1103094 1142094 1190527 1255520 1263825
5500 1263825 1320602 1412359 1434735 1487886 1428489 1341731 1284332 1240004 1185519 1209488 1197301
5489 1197301 1197073 1198713 1226284 1273092 1322967 1343311 1373290 1393138 1398543 1429653 1361022 1341911
5477 1341911 1370641 1398876 1373125 1364041 1366809 1370384 1372820 1350898 1378768 1412692 1412229 1407650 1386355
5464 1386355 1384212 1369447 1357912 1380283 1410959 1400109 1422297 1402431 1434981 1481114 1468808 1492704
5452 1492704 1536881 1561273 1576736 1620400 1631785 1598796 1500334 1494480 1528494 1517327 1480405 1506011
5440 1506011 1545516 1628153 1634833 1656816 1706567 1717508 1680314 1623055 1533731 1508291 1447809 1417993
5428 1417993 1395564 1415362 1360010 1330566 1303554 1255807 1259840 1216267 1274302 1322724 1352138 1331279
5416 1331279 1317907 1308556 1338987 1272950 1280913 1295384 1290702 1311012 1291257 1213999 1214032 1190463 1185268
5403 1185268 1142257 1138294 1174829 1177665 1175030 1200377 1224560 1222531 1272294 1260462 1289858 1365097
5391 1365097 1389073 1408792 1442679 1465587 1543868 1500756 1429733 1423357 1401344 1397351 1355811 1330412
5379 1330412 1256047 1270619 1293461 1270096 1250365 1224269 1237809 1247141 1285202 1298086 1311207 1290770
5367 1290770 1311609 1304120 1257271 1230040 1249320 1234083 1210230 1189022 1186180 1250556 1220185 1159581
5355 1159581 1184904 1176946 1155145 1203560 1167462 1105568 1093837 1112394 1067065 1028422 1056207 1022120
5343 1022120 1037411 1062545 1038317 1102297 1119812 1095346 1061523 1035246 1082551 1114738 1099167
5332 1099167 1094325 1134831 1168093 1129850 1169359 1175287 1173112 1195748 1137822 1164447 1176149 1198851
5320 1198851 1187277 1203592 1207292 1206738 1211612 1198178 1168435 1200052 1206604 1209718 1225430 1193218 1232737
5307 1232737 1262863 1243481 1172547 1171104 1200108 1197797 1253887 1287633 1269284 1257965 1238186 1303050
5295 1303050 1328040 1296709 1253920 1232635 1258093 1281784 1316508 1295890 1289116 1362912 1375732 1350538
5283 1350538 1335937 1297078 1251546 1238587 1261163 1298634 1268964 1243121 1248526 1322461 1352423 1261575
5271 1261575 1277100 1339594 1342129 1384500 1435210 1460572 1426072 1397823 1383532 1397558 1367435 1307138
5259 1307138 1330423 1301038 1362799 1360794 1400827 1389109 1344851 1389065 1415985 1388283 1358484 1394832
5247 1394832 1392566 1393006 1431528 1433893 1450842 1466742 1509566 1520698 1522802 1576761 1621079 1587992
5235 1587992 1587422 1574458 1582027 1578703 1605607 1561183 1568175 1657244 1688151 1738457 1821913 1887223
5223 1887223 1914034 1910280 1992113 2087309 2073911 2111400 2124565 2130083 2120348 2115359 2149504 2196516
5211 2196516 2263557 2313513 2348822 2386597 2404791 2460908 2474925 2522932 2489045 2560559 2620513
5200 2620513 2662775 2675994 2704928 2768670 2786132 2843723 2883662 2937806 3013536 3102129 3198370
5189 3198370 3249869 3332960 3391726 3535530 3635680 3746881 3915046 4070302 4276768 4460227
5179 4460227 4690782 4852036 5069250 5315394 5549571 5822786 6091901 6471671 6883930 7330898
5169 7330898 7924063 8579264 9211243 9831626 10292714 10578534 10733926 10706013 10699008 10937097
5159 10937097 11410556 12093814 13010265 14126054 15325340 16353490 16909561 17233348 17346562
5150 17346562 17061067 16822775 17006858 17387870 17784371 18224852 18712132 19168432 19603323
5141 19603323 20145885 20770226 21389476 21882174 22327403 22847830 23125367 22992772 22693419
5132 22693419 22343832 21822080 21490313 21657096 22257568 22927540 23316376 23536080 23591267 23161829
5122 23161829 22453332 21846583 21182426 20297330 19476448 18922088 18376538 17890551 17552725
5113 17552725 17343460 17254547 17232362 17317729 17603842 17834205 17696516 17284303 16618371 15537773
5103 15537773 14410333 13597757 13186974 12973996 13010130 13201596 13378270 13404542 13238914 12886801
5093 12886801 12249380 11312883 10433947 9701529 9075214 8478462 8060244 7780335 7587719
5084 7587719 7543372 7500241 7491924 7487721 7502366 7634094 7852482 8139385 8537992 9024352 9544792
5073 9544792 10162682 10718465 11050852 11318922 11566432 11544498 11263279 10867501 10520393 10218636
5063 10218636 9902302 9688114 9686413 9822404 10000557 10069957 10179594 10343063 10426021 10670675
5053 10670675 11112127 11687805 12368505 13115028 13882631 14773138 15653074 16521817 17354609
5044 17354609 18243587 18976817 19154909 18980912 18963156 18906296 18590742 18355285 18217804 17878827
5034 17878827 17283200 16549460 15505420 14417075 13431317 12478513 11611158 10842694 10272937
5025 10272937 9772629 9301449 9105300 9155462 9284914 9463076 9611649 9774689 9652521 9333071
5015 9333071 8921011 8422336 7924852 7585732 7400755 7291652 7117789 7014158 6780012 6519589
5005 6519589 6346557 6224914 6039624 5789416 5584173 5326545 5028257 4833260 4821420 4780060
4995 4780060 4786294 4910925 4952322 4855244 4706865 4458407 4130380 3834598 3556251 3329882
4985 3329882 3195131 3064923 3009699 2951017 2921304 2843858 2788538 2704246 2627876 2601730 2570447
4974 2570447 2594554 2554688 2566042 2558986 2508434 2487512 2431696 2347223 2385003 2374592 2295835 2323354
4962 2323354 2358224 2415503 2340166 2331784 2337127 2335352 2371177 2401219 2404000 2380777 2347272 2347103 2355719
4949 2355719 2364905 2386617 2363364 2354789 2387380 2430370 2491213 2458910 2535914 2608348 2666504 2753193
4937 2753193 2801909 2871701 3002358 3100880 3231274 3459058 3661572 3913151 4251889 4654453
4927 4654453 5124296 5617884 6074021 6531890 6944352 7278590 7484741 7566934 7258186 6601306
4917 6601306 5850395 5154831 4566108 4159272 3859780 3697124 3594203 3491811 3453477 3419262
4907 3419262 3390702 3426225 3450804 3483736 3599703 3690512 3751812 3888648 4017707 4223487 4465881
4896 4465881 4648857 4857252 5014504 5075022 5128580 5258864 5557502 5914426 6254115 6618772
4886 6618772 6927921 7302073 7714327 8272874 9082704 9837541 10326918 10391054 9811077 8792406
4876 8792406 7828751 7180099 6775561 6624447 6612997 6745698 7106608 7667087 8364039 9097510
4866 9097510 9653905 9846956 9591702 8794137 7784882 6931778 6433818 6087312 5864729
4857 5864729 5616336 5361478 5043173 4786794 4699030 4607511 4581068 4519852 4370930 4164932
4847 4164932 4060235 3953569 3867220 3853647 3815582 3852105 3796159 3712065 3769560 3819893 3888199
4836 3888199 3978191 4028752 4160302 4319447 4459152 4654221 4924182 5219654 5574228 5968200
4826 5968200 6349667 6735998 7056341 7267088 7491485 7707624 8018537 8452490 8846937 9060812
4816 9060812 9152236 9325169 9233583 9041516 8863739 8743045 8612674 8474993 8344596 8277616
4806 8277616 8415703 8715370 9134255 9567675 10051047 10626576 11076269 11548685 12104988 12578687
4796 12578687 12798807 12709276 12550038 12221852 11559559 11000132 10580030 10341261 10172089 9984122
4786 9984122 9847523 9903129 9918689 9790653 9689909 9730137 9827136 9846384 9835023 9948100 10055498
4775 10055498 10005883 9757095 9415079 9001560 8495680 7995991 7655733 7484680 7386323 7417110
4765 7417110 7460955 7585377 7752491 8003487 8302093 8675715 9137776 9751886 10450767 11237706
4755 11237706 12252019 13445843 14949269 16596676 18368785 20355011 21894191 22384678
4747 22384678 22113064 21362675 19715682 17724329 16097629 15205668 14791822 14790158 15107911
4738 15107911 15764538 16641996 17888350 19499795 21534354 23881410 26668321 29823392
4730 29823392 32735053 34982479 36633846 37249465 35706680 32943173 29954041 26307448
4722 26307448 22613285 19642220 17655862 16384093 15576768 15147823 15016411 15265255 15785505
4713 15785505 16618725 17740980 19130151 20768025 22453873 23526489 23320911 22339170 20862460
4704 20862460 18244109 15289675 12849522 11032981 9753944 8761392 7972259 7430483 6996000
4695 6996000 6610567 6278328 5995672 5762368 5520910 5320098 5184158 5020612 4862939 4690280
4685 4690280 4543925 4380091 4304749 4153568 4039213 3964342 3847521 3816489 3719648 3639983
4675 3639983 3596251 3541776 3527919 3508152 3515297 3493754 3506516 3484646 3462497 3435540 3366589 3308602
4663 3308602 3275202 3229550 3212722 3210331 3209193 3224218 3191960 3243450 3279856 3306632 3319104 3299977
4651 3299977 3363392 3365426 3359582 3348288 3387974 3455534 3425764 3453326 3477454 3434899 3404955 3421341
4639 3421341 3430059 3454181 3489076 3565690 3624539 3740950 3731583 3741914 3763195 3797657 3867294 3872124
4627 3872124 3902621 3956760 3989664 3984753 3978542 3972237 4000761 4008698 3952341 4010272 4130436 4125236
4615 4125236 4163819 4228287 4340311 4475456 4539276 4598375 4691045 4702834 4791068 4851591 4901796
4604 4901796 4997856 5070917 5174350 5254018 5353862 5453878 5622549 5805448 5964498 6153350
4594 6153350 6281779 6555044 6826058 7119532 7471425 7866360 8288918 8775363 9358461 10022599
4584 10022599 10818051 11714903 12757003 14092713 15662851 17528805 19739357 22144671
4576 22144671 24581991 26549429 27590634 27729833 27033128 25698087 24062761 22911060
4568 22911060 22634997 23156485 24341358 26004266 27765875 29134550 29676549 29316130 28259459
4559 28259459 26520969 24904617 23886092 23727674 24223305 25020475 25653208 25695988 25106856
4550 25106856 23929672 22271424 20577220 19286312 18736112 18912606 19499815 20290806 21174483
4541 21174483 21613405 21353787 20432026 18837332 16669961 14386196 12491821 11063456 9989297
4532 9989297 9173463 8551132 8072375 7674420 7296878 7016008 6743325 6543425 6426915 6298338
4522 6298338 6191772 6044451 5886285 5805153 5703413 5572587 5498945 5389386 5339561 5320043
4512 5320043 5357486 5305298 5267861 5334830 5339026 5376816 5471901 5529731 5632163 5769082 5867051
4501 5867051 6048348 6199219 6354318 6547248 6761331 7000937 7406758 7906638 8556349 9339712
4491 9339712 10168044 11064387 11802459 12291471 12392317 12156030 11759575 11411997 11237918 11305033
4481 11305033 11738996 12279686 12523363 12380727 12036275 11394929 10386040 9524897 9097635
4472 9097635 8952781 9024575 9370483 9866403 10380810 10789592 11012234 11064594 10954684 10709274
4462 10709274 10397829 10289673 10298855 10343411 10376896 10305623 9921390 9325222 8546729 7640637
4452 7640637 6856755 6230406 5811815 5623891 5485539 5415904 5387348 5429929 5489160 5568412
4442 5568412 5540481 5447264 5248911 4961673 4677203 4420927 4152786 3961882 3723401 3515523
4432 3515523 3403165 3258902 3199065 3134983 3083593 3079065 3023923 2942370 2867890 2818372 2757643
4421 2757643 2686828 2670147 2637651 2693887 2669902 2716539 2771597 2803882 2808080 2830549 2828603 2830529
4409 2830529 2864820 2834951 2827709 2871052 2785223 2747520 2722050 2627095 2558575 2509158 2474629 2399061
4397 2399061 2369130 2353208 2258061 2229900 2205245 2176310 2197758 2226799 2251210 2283722 2310353
4386 2310353 2355842 2389794 2446453 2494413 2544745 2554987 2650587 2678017 2698460 2730013 2757349
4375 2757349 2844535 2923008 3091748 3252514 3480241 3690505 3892145 4161068 4245130 4153831
4365 4153831 3882426 3510067 3142381 2895177 2736635 2563658 2482641 2369889 2293848 2266261
4355 2266261 2236123 2194711 2184397 2139448 2117274 2034549 2045288 2010075 2022053 1983997 2004314
4344 2004314 2022931 2018395 2010414 1997270 2018175 1964133 1940157 1922527 1932897 1965190 1992006 2026962
4332 2026962 2024463 2076558 2105901 2159038 2189387 2199616 2240665 2267222 2286123 2309621 2355263 2406191
4320 2406191 2477933 2516204 2568929 2608831 2641823 2722685 2773380 2793520 2810093 2843110 2895499
4309 2895499 2812717 2753011 2783352 2763045 2712744 2725912 2734410 2682986 2647999 2578597 2565019 2575937
4297 2575937 2578419 2570879 2531371 2565655 2591796 2644220 2583909 2631371 2714442 2734381 2807754 2908115
4285 2908115 2985904 3072866 3192411 3290225 3373590 3362242 3327133 3330849 3315175 3341367 3393526
4274 3393526 3441414 3484534 3521672 3550688 3483868 3396100 3341771 3331171 3331348 3312091 3327906 3354012
4262 3354012 3427513 3503765 3536551 3636596 3760724 3863608 3963447 4036040 4193401 4319860
4252 4319860 4466980 4557028 4707003 4798849 4852706 4902048 4973857 5036371 5101910 5286974 5493539
4241 5493539 5634521 5825931 5972901 6085722 6203046 6343022 6417643 6517519 6630014 6758453
4231 6758453 6975965 7184320 7403446 7586472 7864495 8147532 8432758 8713832 8995437 9186904
4221 9186904 9310532 9357379 9378344 9455667 9631042 9849382 10075673 10407806 10760000 11132017
4211 11132017 11533975 11961076 12398649 12796889 13248257 13777597 14244233 14748926 15390694
4202 15390694 15955930 16672622 17451431 18214661 19004000 19780017 20454508 21026723 21463586
4193 21463586 21926532 22388944 22922932 23510519 24013629 24516231 24977186 25468222 26080873
4184 26080873 26868190 27810137 28913507 30145742 31473338 33069592 34772786 36579300
4176 36579300 38518592 40718399 43110949 45839434 49004051 52614822 56750852 61614078
4168 61614078 67452216 74358412 82293929 91453580 102126412 114835292 130254940 149213969
4160 149213969 172638990 201298540 234287195 266811306 292143293 303003640 292470257
4153 292470257 261424924 218145233 174324175 139629226 114730239 97037474 83950101
4146 83950101 73957380 65959814 59357341 53981301 49518680 45747917 42511441 39659078
4138 39659078 37088303 34684911 32475728 30483179 28695744 27039068 25548610 24232084
4130 24232084 23011911 21925223 20916867 20005889 19134569 18334885 17581819 16822782 16135160
4121 16135160 15430520 14780821 14247376 13801331 13241440 12784150 12406950 11955996 11559636
4112 11559636 11160435 10840803 10468628 10158449 9908119 9620941 9330302 9043063 8838808
4103 8838808 8641523 8381693 8212338 7982197 7851921 7741681 7618573 7439586 7311480 7266908
4093 7266908 7110104 6964626 6834270 6634292 6444436 6283969 6102987 5912080 5751765 5637114
4083 5637114 5518947 5354767 5197581 5070591 4983799 4882396 4791496 4697248 4558961 4420697
4073 4420697 4324386 4219542 4139234 4056252 3958613 3911982 3860496 3799775 3744111 3726582 3653033
4062 3653033 3541798 3496729 3474210 3387473 3339566 3302945 3298497 3260551 3199464 3185776 3135970
4051 3135970 3101103 3100608 3121302 3129515 3094545 3040968 3040870 3054789 3031187 3039373 3020842 3044906 3106319
4038 3106319 3178282 3226343 3264429 3337174 3442880 3574767 3697149 3834725 4038165 4228782
4028 4228782 4487560 4805505 5183656 5604553 5986183 6330941 6535635 6541270 6436813 6113471
4018 6113471 5651607 5121783 4607841 4205576 3869411 3617077 3420518 3238586 3084027 2961576
4008 2961576 2886707 2803570 2703728 2656039 2629444 2592993 2551784 2501431 2492318 2530444 2487181 2470244
3996 2470244 2476751 2512620 2536189 2590584 2576325 2620001 2678950 2725360 2804953 2904827 3101291
3985 3101291 3131354 3283709 3464419 3569281 3683195 3775567 3929734 4068557 4196485 4346709
3975 4346709 4449297 4583818 4707189 4727091 4709111 4728623 4696996 4674808 4607261 4486234 4364878
3964 4364878 4192027 4059041 3927062 3833121 3690720 3603344 3555842 3617475 3611648 3658888 3678284
3953 3678284 3712523 3772263 3835544 3828369 3806536 3744046 3615535 3476505 3294234 3094921 2953912
3942 2953912 2883066 2676430 2581652 2518814 2450759 2354199 2275406 2169275 2124174 2066528 2038315
3931 2038315 1924983 1802948 1740193 1675536 1583251 1538796 1520874 1439563 1416674 1341883 1325599
3920 1325599 1305907 1270017 1213985 1208373 1168815 1142894 1168156 1213631 1145456 1096953 1109307 1085981
3908 1085981 1072601 1047323 1004379 969719 979110 946644 921498 898126 937077 947261 939486 897999
3896 897999 891373 920952 887130 905955 938009 922596 905786 898258 917411 943876 962704 1012046
3884 1012046 1040977 1024141 1010250 1004880 1022753 1005741 1056609 1087636 1093560 1170622 1229266 1290432
3872 1290432 1314245 1417008 1499633 1630448 1809179 1979227 2079430 2135847 2157940 2087870
3862 2087870 1848395 1612683 1356139 1198094 1081893 1008693 949968 888483 890786 836633 797130
3851 797130 755467 734216 737579 724758 737359 713700 711503 737493 697097 715793 706931 673437
3839 673437 650446 666260 643865 614481 597792 619923 558385 523654 503681 562519 551079 557220
3827 557220 520924 529720 529051 519701 536587 503182 535550 560597 500580 506724 472965 453284 481546
3814 481546 475650 483337 509260 466884 462284 505540 508849 528423 542787 543356 603835 615224 601422
3801 601422 629472 606103 614859 654780 686066 706425 682818 628962 653761 612077 598259 546652
3789 546652 537780 489801 519895 574453 592194 565224 493629 517897 569312 559625 587606 593123
3777 593123 586704 578409 584982 604370 613227 612353 619568 598198 704905 725467 665545 629670 627656
3764 627656 615195 542198 546166 537931 541678 539925 602957 551136 519720 547212 579405 572268 543793
3751 543793 529269 562274 594598 592603 567267 647380 651452 602094 608720 592247 582162 574966
3739 574966 608386 560009 577018 653235 642564 626492 669662 662135 631698 611130 615296 646572
3727 646572 642903 598702 627882 597542 619342 647813 645188 650704 643668 699514 734722 747319
3715 747319 740593 753860 718072 743045 727024 738701 741434 682538 743451 812103 839848 889660
3703 889660 905554 869169 892060 893218 847512 820022 881963 875633 844434 908766 890451 800852
3691 800852 851792 882369 881267 934259 959319 943219 983794 983769 988055 997515 958653 941948 927294
3678 927294 889062 918664 960714 914696 949895 922786 941280 973641 982988 1018690 1019017 1004975
3666 1004975 1000063 958349 929902 957854 973626 995635 969874 927736 945781 934308 958544 953003
3654 953003 991480 940040 903614 930729 942734 905305 865681 946514 941571 973460 984898 959456
3642 959456 966274 1006858 1013087 1046133 1044449 1035225 1063874 1071710 1068124 1071815 1047154 993532 991570
3629 991570 973186 909066 893842 900523 878925 861386 872239 875371 905758 878124 886048 899279
3617 899279 886924 850436 842057 846463 824470 833308 866164 919413 912123 941721 935974 986489 965716
3604 965716 930127 951752 956367 897731 868571 897665 919924 918960 937714 925041 950934 971718
3592 971718 938162 935705 983800 1021716 1004977 986271 944414 957492 982985 949707 990979 1008627
3580 1008627 1014142 1001645 978782 965357 981433 1002257 934343 967818 1000494 995122 988887 1019832
3568 1019832 1029315 1033976 1046027 1066965 1057943 1022215 1023679 1042472 1085381 1152955 1129646 1138449
3556 1138449 1148982 1089877 1092194 1144412 1120562 1113729 1131706 1130663 1150960 1174465 1153969 1118357
3544 1118357 1095065 1093575 1134777 1130602 1148807 1159566 1167646 1168452 1185601 1174384 1237133 1240795 1229779
3531 1229779 1212926 1181353 1254104 1312896 1296537 1267603 1263605 1303561 1301699 1304490 1313335 1334340
3519 1334340 1375233 1423053 1451715 1396042 1400005 1452105 1449777 1473000 1495968 1524316 1580381 1570174
3507 1570174 1584522 1624288 1674305 1687210 1739139 1818684 1814154 1825206 1838000 1858199 1927861 1933354
3495 1933354 1959934 1945686 1925222 1957842 1925826 1979451 2050023 2090117 2097131 2082381 2153142 2194944
3483 2194944 2268260 2308476 2346856 2363906 2448106 2510963 2581428 2666930 2719302 2808089 2859588
3472 2859588 2888796 2975996 3106969 3223987 3298955 3415203 3503070 3592101 3671000 3754761 3837651
3461 3837651 3866979 3990183 4086779 4201836 4300019 4433846 4615822 4702842 4895849 5068043
3451 5068043 5251893 5456900 5694464 5919184 6181152 6493061 6898553 7299099 7784347 8363516
3441 8363516 8995640 9705191 10585201 11608511 12787043 14274639 16076273 18243953 20636815
3432 20636815 23205910 25436819 26622620 26480938 25159487 22499276 19394533 16843246
3424 16843246 15030526 13809648 12953991 12419817 12125363 11871152 11700237 11647485 11769109
3415 11769109 11974373 12204637 12580043 13138289 13893515 14838476 15969132 17283666 18798878
3406 18798878 20710455 22999085 25824781 29297790 33436262 38050723 43012297 47141126
3398 47141126 48842140 48022911 44783283 38793068 32057169 26647373 22722501 19983551
3390 19983551 17993081 16551371 15440363 14597762 13892403 13308386 12899921 12656955 12500651
3381 12500651 12440175 12511763 12748364 13175627 13773977 14399481 15099786 15897577 16745497 17619446
3371 17619446 18778119 20288600 22113979 24218471 25924418 26522468 25973982 24312269
3363 24312269 21477639 18217159 15555704 13622411 12245388 11192671 10381679 9689200
3355 9689200 9040393 8494808 8057566 7658841 7345537 7073085 6820285 6590781 6385637 6261458
3345 6261458 6139043 6040815 6018358 6001478 6015960 6053089 6124891 6165227 6216303 6266423 6372875
3334 6372875 6438502 6478672 6567859 6608922 6625578 6690578 6717825 6822972 6921950 6969193 6989419
3323 6989419 6849659 6610888 6359517 6186049 5968523 5842309 5743047 5668100 5607085 5618421
3313 5618421 5584496 5631566 5676020 5738019 5863416 5975332 6093097 6242708 6447878 6654262
3303 6654262 6909846 7091800 7222463 7295535 7342727 7281974 7140805 6984329 6831554 6723732
3293 6723732 6697250 6749133 6759251 6840602 6899945 6953918 6978036 6981031 7007567 7083797 7218102
3282 7218102 7327164 7517826 7715523 7944951 8238447 8584424 8969530 9363633 9681587 9937967
3272 9937967 10108252 10205862 10348577 10642211 10945683 11239299 11449010 11550760 11423810 11111292
3262 11111292 10805803 10688170 10759720 10894370 11074338 11369720 11702068 12027198 12389430 12784321
3252 12784321 13246395 13618532 14002226 14260533 14299880 13990249 13417513 12590852 11702036 10915798
3242 10915798 10142309 9483996 8855075 8371963 8013855 7672452 7387155 7114324 6859478
3233 6859478 6626334 6371447 6150576 6019582 5857000 5698084 5586410 5477767 5372677 5137116
3223 5137116 4949655 4845920 4762980 4658239 4573643 4545477 4523205 4486191 4467211 4410642 4192811
3212 4192811 4104876 3936133 3778651 3652134 3547832 3424069 3337526 3303854 3249591 3181209
3202 3181209 3122035 3079915 3031874 3015026 3046790 2972500 2916939 2896190 2863779 2867311 2836433 2840207
3190 2840207 2801183 2755951 2699703 2587180 2472564 2467709 2492458 2452797 2425056 2426844 2350961
3179 2350961 2283037 2231944 2211133 2099832 2055545 2063454 2067252 2025400 2064992 2018485 1948028 1943629
3167 1943629 1932088 1942508 1902756 1881727 1862975 1865365 1823726 1780617 1790483 1774595 1682538 1663281
3155 1663281 1631954 1608881 1634642 1584222 1532810 1561736 1549619 1472319 1463858 1514033 1539886 1550019
3143 1550019 1566759 1553277 1534908 1532135 1520925 1476905 1457228 1437368 1416947 1386207 1398464 1336950
3131 1336950 1313917 1342701 1335088 1328934 1360018 1254871 1278429 1259544 1177201 1187858 1174851 1174616
3119 1174616 1157178 1192104 1194905 1220518 1222269 1208324 1189386 1183545 1236563 1309733 1341916 1315730
3107 1315730 1270241 1247294 1218901 1202716 1158179 1069143 1057427 1032851 994813 984223 963987
3096 963987 1016235 1067858 1053521 987419 997238 1002203 973986 954402 975184 958158 915831 898264
3084 898264 931834 959947 990885 1003310 990265 1003646 1038090 1028965 1044304 1045933 1078341 1005277
3072 1005277 962481 923824 933934 926585 917858 915737 911469 885238 912189 950277 922403 908128
3060 908128 895653 865362 892334 896228 894929 868797 879287 864079 855058 846932 800625 772205
3048 772205 802677 860807 837077 924109 902003 861281 898958 910966 890954 904027 899359 910067
3036 910067 898105 912873 894240 862000 857288 860339 888084 919155 931561 925164 951514 996284
3024 996284 929789 965221 1026109 1036335 1013869 1102167 1130471 1117532 1153613 1192051 1280631 1370822
3012 1370822 1372236 1438066 1534891 1490420 1409734 1351678 1298390 1269717 1251647 1191502 1151351 1170808
3000 1170808 1145473 1131006 1140285 1135637 1159670 1205150 1265947 1269870 1258525 1291269 1278131 1308778
2988 1308778 1367194 1408253 1426280 1488095 1576794 1687617 1749824 1859590 1992783 2122948 2181080
2977 2181080 2184637 2160590 2034536 1950409 1812192 1743493 1663139 1617116 1594400 1510089 1509136 1489094
2965 1489094 1472322 1477326 1459000 1510979 1511876 1536084 1570364 1568625 1536267 1579229 1635740 1702936
2953 1702936 1738322 1791897 1878277 1912757 1997681 2112349 2192704 2253176 2229005 2246505 2323314
2942 2323314 2304144 2291376 2289585 2229224 2198316 2249393 2257351 2263752 2260213 2223515 2242186 2253409
2930 2253409 2266082 2316218 2326960 2365118 2374321 2412800 2456184 2491335 2511572 2559230 2589168 2601535
2918 2601535 2625196 2700738 2767394 2772582 2809996 2935538 3019966 3144696 3215068 3232192 3352966
2907 3352966 3351537 3327245 3342764 3338295 3271173 3153637 2997126 2926511 2845845 2754141 2737589
2896 2737589 2793089 2780113 2763530 2764454 2723873 2741051 2745095 2788460 2807570 2765223 2798781 2813196
2884 2813196 2886500 2844376 2783519 2796674 2865778 2836106 2808304 2726935 2682065 2639650 2515078
2873 2515078 2476646 2375229 2289478 2241672 2172445 2136091 2121796 2076844 2013601 1997400 1980368
2862 1980368 2003980 1979724 1965420 1922136 1909096 1825667 1788939 1710855 1664596 1637415 1540754
2851 1540754 1506487 1445044 1415878 1373042 1359497 1256429 1202110 1163309 1150681 1167980 1178826
2840 1178826 1139246 1109903 1049443 998741 957007 948151 924839 910720 889188 885749 904100 915504
2828 915504 931999 883556 849124 859646 805138 771521 767792 737664 714607 666674 678156 698031
2816 698031 721771 753877 695869 706390 637149 622603 621920 629821 599997 557322 504450 480449
2804 480449 480419 488293 463532 471028 489974 525253 491587 459365 508352 495984 479228 452761 437950
2791 437950 407064 430445 415031 430578 482846 434523 450879 420123 371926 386008 369521 354710
2779 354710 336057 313002 280880 264989 259642 283166 287872 288720 280277 270887 277253 284260 263695
2766 263695 303871 306953 297665 276316 276010 302463 289742 292825 230912 195030 229887 202716 164499
2753 164499 151190 157917 168489 193008 185367 183488 199518 166347 163549 162549 159205 132432 146589
2740 146589 155256 160341 162714 150281 140210 83564 100997 131069 191175 208630 159749 129431
2728 129431 159608 160562 110385 146334 129659 114480 102546 85036 100689 89250 76772 26164
2716 26164 43750 101121 79666 108221 116251 82963 45915 39850 66743 39012 76037 82278
2704 82278 27120 68511 73105 39913 52293 46173 108345 55630 22536 4042 -3000 -43109
2692 -43109 -32470 -13576 54842 30313 -16215 6344 47329 59991 43441 56258 46144 47519
2680 47519 63722 45025 100767 90157 46372 51288 72623 60081 47769 59116 -7804 -23711
2668 -23711 13086 53295 69671 94863 53942 1777 9230 21829 14660 44969 6790 855
2656 855 17436 21443 4631 -32615 -25521 12827 11071 13502 -1037 26760 -2298 -30306 -12499
2643 -12499 4222 3352 10362 21517 0 2287 -23640 -38898 35975 23641 -22005 -4506 7770
2630 7770 -49858 -10848 -3334 -46639 -4553 45030 68446 46725 -8622 -54130 -12157 -668
2618 -668 -2866 26195 11770 242 18604 -21395 -58116 41113 100670 78142 37593 44263 -9333
2605 -9333 -7015 -26876 -54213 -32076 -32524 -66278 -33222 11132 37722 44660 20965 7768 11830
2592 11830 22347 14340 24714 866 50497 27595 28016 31946 -3994 -11099 3075 -23324 -37551
2579 -37551 7210 16979 -22145 -44449 -469 -36418 -32837 10491 11604 -17168 -19906 35185 40939
2566 40939 24882 -16570 -29899 25100 75332 20782 -1630 -25654 -21366 -35831 -17357 -1714
2554 -1714 -42658 -47915 -37158 -48580 -17890 -47969 -46665 -4380 18943 13265 -30170 -25679 10168
2541 10168 -21574 -54339 -37299 -55901 -19833 31515 28241 -22673 -29697 1053 27035 6628
2529 6628 -15289 -42294 -35011 -29290 -44101 -43124 -53483 -56131 -58862 -38788 -75935 -48124 -32005
2516 -32005 -30537 5706 4095 -25211 -10724 7096 -23354 -33319 -90123 -60182 -24009 -24801 1168
2503 1168 -27142 -33379 18385 -9104 -51921 -104333 -108572 -30734 -44832 -78717 -50177 -31406
2491 -31406 37594 -19781 -65586 -41101 12609 5580 -9239 -11473 -45671 -6475 24503 -13000
2479 -13000 -28580 -59051 -4463 -45353 -89079 -48777 -50421 -4521 -18616 14498 29038 7111
2467 7111 -44998 -59264 -27546 -15615 -22781 4424 -39486 -63734 -61991 -47429 -53627 -30088 -10448
2454 -10448 13954 4310 12834 18667 67780 5562 -18451 -22386 -69618 -62097 -46337 -33983 -22315
2441 -22315 -64184 -86892 -51308 -53784 -64527 -39393 -49457 -56556 -42568 -42400 -77398 -80290 -39392
2428 -39392 -6321 -38301 -70590 -19660 1964 -12194 -32117 -74569 -74481 -44694 -20344 -24833 -86595
2415 -86595 -5622 -23802 -21560 -32071 -10401 -23436 -72628 -65585 -42430 -37088 -34104 -23351 -433
2402 -433 -35722 -56086 -10369 31951 5995 5913 -41936 -65445 -72476 -6143 25789 -4329 -19440
2389 -19440 -18833 -15125 -32310 -15574 -11441 -31290 21341 -35199 -6028 24638 8567 56198 24977
2376 24977 3325 18929 15085 -18953 -8497 -7917 15139 -35783 -91548 -55906 -50104 -76613 831
2363 831 25569 -6592 242 -18506 -33343 19824 34398 -14329 -35408 -52191 -2885 -21748
2351 -21748 -52350 -68556 -76620 -20443 -17324 -20144 -40947 -37583 -32040 -26722 -46826 24327 -19443
2338 -19443 -2599 -15509 -21006 -39113 -33711 -24314 -5435 7964 38913 -8000 -70939 -42016
2326 -42016 -47606 -65035 -58637 -32407 -55344 -37088 -42308 -56917 -80080 -32996 425 -21732
2314 -21732 -9346 -29025 -16145 -66296 -47477 -6330 -18189 -35724 -22176 3171 -13184 -49249
2302 -49249 -57763 -10230 -16747 -45942 -44597 -36756 -75779 -59909 -40620 -33709 -59872 -44055 -28230
2289 -28230 -4437 11691 23291 -37438 -63145 5554 48109 -189 -80624 -27110 26324 -3436
2277 -3436 -20331 8617 32491 16758 -7594 -9356 55425 68545 74870 44269 36551 36361 57525
2264 57525 111639 110929 57424 -7159 62905 101313 51449 23975 -5364 56718 27164 66570
2252 66570 75392 -1051 46791 73936 65937 24932 34183 24472 40336 39082 61753 101481 33246
2239 33246 10082 31105 39310 42726 69094 64475 79604 69628 102891 80803 89158 56100 33860
2226 33860 102762 19650 48228 58642 64765 81426 131467 100487 10861 22950 32364 59342
2214 59342 91403 130203 139581 126734 122694 127363 106942 95102 115833 108091 118483 82623 75905
2201 75905 83314 93700 133642 179554 234621 221302 209430 202859 202411 212969 249386 278215 285561
2188 285561 313052 254139 234396 241440 275407 263814 335705 322228 297068 277186 305221 359338
2176 359338 368575 396498 409598 358305 343097 405818 396792 397141 436286 453402 423710 511038
2164 511038 513498 487627 559590 561587 519713 594164 626902 661067 733011 734040 709712 773607
2152 773607 779103 763689 788837 817836 806869 843272 920800 986720 1021217 1038175 1087085 1156171
2140 1156171 1228832 1286206 1382113 1422776 1507181 1593785 1629289 1708805 1849498 1926413 2015459
2129 2015459 2156416 2350605 2550638 2754986 3027096 3182132 3373651 3665559 3937680 4207165
2119 4207165 4579268 5095813 5742514 6481435 7445644 8669057 10164408 12126215 14679527
2110 14679527 17602253 19890016 21268160 20762608 17160680 12924451 9875866 7907522
2102 7907522 6549752 5554091 4844036 4302341 3820180 3483278 3252390 3075072 2962218
2093 2962218 2737564 2560796 2386895 2177712 1985100 1829197 1721340 1662013 1523135 1407082
2083 1407082 1306703 1208539 1167442 1161178 1106773 1021735 961012 926386 838344 800443 805961 768968
2071 768968 773151 754947 714443 713252 638983 607837 652835 657700 655781 590592 541019 482252
2059 482252 476942 503931 428626 447540 469827 474432 462001 459647 446189 366854 318946 369556
2047 369556 414261 413328 370013 344006 312698 304072 301018 282163 297457 271375 255764 261972 278172
2034 278172 253014 230803 248594 223390 256372 264526 280214 228825 183340 152140 207717 227969
2022 227969 191968 208569 235028 156536 115942 117776 127296 112939 112954 126315 103545 97179 111686
2009 111686 130384 143854 124964 76111 108986 124757 90301 51347 36452 58971 64082 108218
1997 108218 98096 92256 97855 111584 104444 75815 101822 85890 69981 32183 80505 84166
1985 84166 72411 37693 57727 78579 42499 23702 94713 100740 73127 27054 27687 -11250
1973 -11250 6247 45422 67162 23403 33275 35235 73482 52288 36567 24216 82631 65435
1961 65435 62649 42025 6231 23464 28872 50854 30289 63440 86837 67719 14777 60239
1949 60239 64080 44632 19216 49756 28494 -16611 11666 -200 10825 -13113 -8007 27346
1937 27346 13700 33978 28471 -759 9171 20992 -17545 5684 32201 23333 -11883 -45402
1925 -45402 -16469 1106 22101 42350 -13060 2185 37676 23538 6597 1597 11171 40830
1913 40830 1891 -3679 -26350 -18017 -15496 -38277 -38522 -40485 -30785 -74593 -87317 531 -16013
1900 -16013 9117 8675 5743 8752 -32955 -19059 -883 -12836 -63818 -67427 7239 24245 -15434
1887 -15434 -82694 -70445 -35226 -37248 -12646 -32994 -29191 20906 55849 14044 18047 33962
1875 33962 -23302 -22405 30333 56624 -13019 -18398 3957 10533 7748 5718 19844 -33714 -29162
1862 -29162 -70601 -34190 -8818 -21998 13458 -17489 11457 -44913 -57742 -23301 -327 1056
1850 1056 16755 18215 -32098 -10263 31050 1191 -2034 49054 42439 63730 89998 135946 132615
1837 132615 84981 55135 67202 3504 -32485 -33561 -38628 -13681 -17869 -31936 -11742 -5982
1825 -5982 -40976 -11183 -39890 3090 -4916 6001 -43846 -88456 -76073 -39622 34659 -5175
1813 -5175 -4071 -22676 -31642 -39928 -44844 -19061 17497 20884 42500 26872 -6199 -10036 -28715
1800 -28715 -82416 -95797 -89702 -46801 2008 -50499 -58814 -50245 -72807 -47464 -15237 -38461
1788 -38461 -76681 -28139 -1533 -20983 -30418 10164 -5347 40935 5373 -25388 -23343 -20206
1776 -20206 -31907 -18067 -25034 -17187 -7468 -27811 -23648 36700 8593 -18539 7729 -1041 -26955
1763 -26955 -22923 -29591 -22078 -44480 -43907 18998 -40395 -89279 -86694 -40393 -54844 -79593 -52397
1750 -52397 -16859 -24714 1709 -8041 -21981 -885 10986 29899 40084 16075 -63982 -29961
1738 -29961 32712 29043 17873 -6727 -831 -9461 -11318 -16612 -7867 -29501 -102989 -123378 -88595
1725 -88595 -90110 -57329 -90480 -106182 -92926 -71336 -97067 -63018 -37580 -67593 -47354 28711
1713 28711 -13695 -33373 11448 -11001 -32883 3391 20682 6694 1249 -12247 -21818 -37714
1701 -37714 -45267 -27257 -28345 -25025 -54066 -22708 -20084 -23445 -31391 -64041 -50689 -27711 -51236
1688 -51236 -69966 -43020 -35746 -32013 -18979 -919 5091 -36466 -44326 -46265 -62722 647 44713
1675 44713 61174 -15996 -47165 -78508 -87484 -76245 -74955 -38127 3025 -474 -41135 -85061
1663 -85061 -88160 -79074 -94983 -101739 -55911 -52045 -33718 -29750 -31007 -46171 -61034 -42445 -24504
1650 -24504 -31219 -18259 -88656 -95612 -52089 -53237 2023 -10106 -68249 -41918 18961 9034 -16064
1637 -16064 -26951 -6819 -21591 -79895 -58968 -8730 -14236 17189 -8483 -13090 2061 -37518
1625 -37518 -64249 -41370 -40870 -99796 -77100 -56765 -39237 -382 39797 33874 -39791 -8539
1613 -8539 -59242 -64644 -10780 -24653 -7009 -18536 -26863 -23111 -41065 -9447 12901 -45390 -21493
1600 -21493 -43731 -64695 -27507 -76005 -129913 -110019 -55728 -21723 -3158 -5321 8728 -10157
1588 -10157 -31779 -29102 -57226 -56073 -80581 -68578 -94604 -114176 -46389 -29604 -4631 13892
1576 13892 -566 -8439 -10202 27958 -29984 -63821 -77743 -32505 19218 5957 3575 -12317
1564 -12317 -4684 -14581 -23145 -43833 -25905 -35093 -76804 -25709 3650 -68633 -90385 -84345 -62057
1551 -62057 -57303 -33510 -33366 -25497 -10483 15920 36934 41214 11939 20527 33224 -21733 -14703
1538 -14703 5261 32553 -3921 -14794 -29090 -26759 8138 -16284 5126 20378 9683 32650
1526 32650 -16674 -33043 10626 5428 51299 -6703 404 -29424 -100676 -68300 -44476 -45732
1514 -45732 -48692 -4990 350 -37112 -82628 -81355 -48943 -11014 -45031 -41447 -5220 -49209 -37552
1501 -37552 -32506 -25243 -34802 -28510 -21550 -51891 -60458 -59875 -11860 -19669 -32979 -53663 -36987 -71562
1487 -71562 -56011 -32703 7421 57019 63702 -6155 -53830 -34693 -54555 -50689 -57538 -49987 -24309
1474 -24309 -15061 2169 22488 -2741 -25400 -54174 -43245 12499 28762 -4750 -8791 -31530
1462 -31530 5946 3552 21246 54998 3283 -591 11584 -10714 -44375 -52433 -23809 26020
1450 26020 24444 -2274 -23712 -3114 37494 34570 29117 35310 -10002 -45468 -30909 23711 37028
1437 37028 -7815 -31247 19556 11535 -11189 -57832 -42203 23134 -23797 -54632 -14747 51247
1425 51247 24375 11736 -10766 10150 12029 -20364 32392 51142 18365 19160 259 -25656
1413 -25656 13313 8398 5114 24437 18203 -49839 -61760 -64755 -32380 47220 37524 3717 17397
1400 17397 6255 4193 -2926 13663 21027 -7408 61864 37640 12924 -605 -3439 -54175 -22720
1387 -22720 11199 8469 19063 700 931 3026 -46217 -28261 -10351 12368 -6690 6901 -3692
1374 -3692 4442 -26125 -45217 -31591 -8142 44625 30806 -14636 16930 7404 10707 -28644 -49718
1361 -49718 14582 -3146 -15169 -38857 28624 -28047 -3585 2926 27689 -1922 -27198 11
1349 11 -32261 -7693 4282 -39184 -49318 -21522 -32625 -64208 -24406 -45317 -85783 -94404 -60869
1336 -60869 5710 41291 -32874 -40583 -8653 -19058 -47065 -3879 -62531 -46146 -11928 -27185
1324 -27185 -11269 8497 20357 9679 18766 13569 3827 4927 2424 15702 20809 -4922 -28654
1311 -28654 -16438 -21423 -705 44321 1199 -12782 -19870 41807 17117 18802 -2427 13883
1299 13883 -62985 -55546 5337 -10450 -25222 -39333 3450 -47079 -29457 3861 -1451 -31743
1287 -31743 -80493 -76619 -36511 -25005 -3227 -2105 -70598 -65054 -46930 -38167 -4480 29944 7991
1274 7991 54520 5649 -40138 -4343 -291 1235 -12093 13283 40978 35010 -28390 768 -4482
1261 -4482 -26136 -7585 -1116 46298 61984 17680 20550 -29604 -27126 -6892 -38068 19368 13126
1248 13126 -9008 3710 -15232 -11963 12970 44320 38685 2385 1853 -41255 -47035 -26726 -44573
1235 -44573 18072 7959 -13148 -27045 20270 15996 -10164 -6125 3218 14803 -18967 -23975 -3764
1222 -3764 -25437 -69828 -39809 19463 2898 -10848 27154 -18071 -17701 -48811 -43840 -36062 -30852
1209 -30852 -32979 11275 18443 46692 13393 -16703 -18229 -2315 -5378 -2482 15904 -10182 -6142
1196 -6142 12300 26331 -7296 -31154 -40010 -25732 -34185 -32833 -45315 -17310 -26068 -50722 -3484
1183 -3484 -42859 -56014 -58615 -68985 -29129 14223 -1258 5147 -7719 5699 52561 44966 17033
1170 17033 -8326 -18783 -6517 2583 11993 -30956 -87120 -78973 -99873 -63200 -50127 -59127 -49422
1157 -49422 -38807 -15341 25003 17503 14297 5269 2679 -32840 15512 68088 25023 -8773 37579
1144 37579 -4526 -6084 -4083 -21616 -45305 -67966 -29784 -50076 -51922 -38495 -71607 -120030
1132 -120030 -64642 -12702 -70731 -87734 -37673 -10904 -6814 -9031 -16777 -7520 -14656 -35544 -8444
1119 -8444 27529 14661 5378 2016 -12137 -6291 -14266 2752 -15678 -17844 -35802 -58977 -14741
1106 -14741 1014 32720 61918 36534 -19337 -16381 63433 14634 -8295 34633 80 -78321
1094 -78321 -97354 -69772 -53045 -36223 -26079 -40491 -6586 15524 22788 -33113 -57626 -38774
1082 -38774 -58502 -18302 22349 9452 6866 -174 -32219 -23681 -17110 -30431 -15424 23850 -8528
1069 -8528 2866 21116 48416 1300 27017 14955 5680 12589 43605 30476 18703 19812 11445
1056 11445 -3139 -7744 -16390 4877 -953 53301 11615 -8347 -37782 -30764 4695 -35741 -1387
1043 -1387 6539 51537 53991 7663 -3525 9214 -53866 -13021 -77785 -39498 -8105 -710 -32044
1030 -32044 -60877 -65004 -35366 -17310 15650 -37184 -55470 -1291 -17979 -11470 -1011 -13212
1018 -13212 -17737 -16062 -16025 -64243 -67095 -65442 -47824 -382 16895 -16337 -58411 -34882 -43162
1005 -43162 -25342 -22665 -24360 5140 -6027 30330 1386 21183 36313 12418 -17668 -37731
993 -37731 -24595 -13908 7460 4320 42111 33555 12591 -13796 -23035 -29784 -10785 46926 20822
980 20822 42285 16183 -10695 35775 14388 -29054 10290 6587 2419 -17873 -58696 -55528 -57648
967 -57648 -45268 -38894 -38515 -18010 -25041 -25348 8023 -5754 49095 49154 -4753 32454 53409 28248
953 28248 37074 11634 -6370 -36927 -1665 -24197 -39827 -12914 -38496 -37910 -18379 -27926 40689
940 40689 42530 2740 -57514 -31350 -18493 6838 9617 5291 26188 10579 11993 38122 -12779
927 -12779 435 25541 -2708 -2297 23013 11313 -17326 -44875 -40640 -54162 -63599 -236 -2833
914 -2833 11840 20106 -31201 -11440 50157 12880 -15872 -15545 18560 8280 -26599 -44502 -42391
901 -42391 -34436 -27868 -37797 2659 -3914 22056 45741 -1351 -44553 -46094 -32765 -31578 -42310
888 -42310 -55860 6018 11131 9874 -5926 6480 -2921 -38557 -6756 24413 56393 154 22731
875 22731 39551 -35965 -10469 68247 29846 12639 8224 948 25486 18307 21788 20545 15198
862 15198 10920 -10528 18408 49492 16172 5894 29979 22121 10388 6451 32149 -28898 -45477
849 -45477 -37144 -38845 -19952 8249 39446 -11649 -17637 -43924 -47081 -1958 744 15839 -22395
836 -22395 15137 21396 18435 51686 -21352 -27527 -8058 -44869 7792 -16671 -57837 18953 4823
823 4823 -32749 -50262 -55949 5094 14095 -38374 -45054 -41510 -47341 -27878 -16223 4432 45659
810 45659 42437 64056 28663 11422 20796 45013 51783 38474 -1485 7651 50133 22278 -42400
797 -42400 4396 11017 4910 -22551 4554 49484 35360 27039 -26466 -25553 8840 53577 57841
784 57841 10891 24869 57164 85572 72194 50232 16883 -14423 -17533 -6307 20524 20943 10609
771 10609 -26550 2852 21917 32396 -9800 39837 7047 -11041 -6567 -22141 39158 28932
759 28932 16140 29601 37091 54277 23283 11371 18046 -13079 -672 39852 12967 3009 -17871
746 -17871 41949 30425 25178 27289 -7229 11041 4217 -5644 -26136 51187 37618 -42875 -78670
733 -78670 -50181 -35130 36998 51327 72732 81810 52865 12115 -20864 20321 25416 -10376
721 -10376 -45165 -23375 43145 39780 14001 -14339 22628 53860 45700 30646 6512 20753
709 20753 46964 50412 -20016 -37423 -9706 4010 -930 51793 30062 11116 11819 20669 26986
696 26986 8401 -15884 572 -13947 -29647 25278 30928 2506 3568 23587 36703 105455
684 105455 50111 110 4639 -877 21545 27942 1646 -19236 -7788 14733 14598 13612 24445
671 24445 -27412 -50838 3779 20950 -12186 12247 5905 -4062 40073 33308 4372 50245 35335
658 35335 5895 89641 81980 41087 -20694 -2427 26944 10841 35761 63784 14232 14520 40106
645 40106 37304 43641 36250 75787 53450 65611 60605 9292 40885 46553 43070 25607 -29932
632 -29932 -25327 -6209 14854 42225 -3733 -32852 -17432 7644 27688 14420 12911 2561
620 2561 23922 44166 40384 25415 27129 93058 61671 22070 3178 -3220 3688 36260 1276
607 1276 11926 -1131 16608 43000 24477 41328 19997 39302 23335 20936 17003 71372 76656
594 76656 31008 -42847 16245 55901 49556 77205 35246 -11556 19685 31855 59913 61951
582 61951 46316 -8075 23375 38428 -7243 7652 8478 5529 -12023 -22556 27038 43971 16015
569 16015 882 31377 52414 -24588 -8494 13692 8484 23666 -37686 -36711 -20755 1081 21737
556 21737 54468 59941 -12755 -10978 16467 35640 28280 68644 55767 55737 50807 48910 10223 7567
542 7567 9973 6437 -31046 4936 45093 15863 34662 61467 52484 21395 37539 14179 -27204
529 -27204 -4300 29337 36848 56625 8026 61305 31604 1674 43962 49014 37586 2171
517 2171 59497 7364 12830 10581 -5568 -3251 -19564 -17122 22803 22044 -9597 52790 28856
504 28856 -8141 7484 28780 -6651 12506 24590 19727 41695 17446 21357 29043 -59995 -36937
491 -36937 -8543 27422 82305 17798 -28924 30884 52922 20855 17030 -16697 -55802 -46640
479 -46640 -29494 -44422 -20539 -7901 -44682 -29777 25585 7590 69804 58964 41626 83932
467 83932 98589 91548 10147 -15837 -13816 -45855 -26036 -23891 -136 -22331 50018 17985 -25962
454 -25962 955 44111 62393 26523 52421 -9689 -2341 19819 59508 33199 54385 34723
442 34723 21012 35446 39091 19320 2972 27283 -34082 -21901 -44766 -83310 -25543 -7274
430 -7274 16218 -12389 25972 73907 65676 73731 53641 13813 19890 -28838 -45295 4612 33360
417 33360 31324 6589 9128 -19627 -18175 -8047 -7034 23598 11852 51426 77213 49689 5296
404 5296 -25836 32101 30762 8638 -8525 1871 -9622 -36234 -56662 -54474 -69426 -50753 9961
391 9961 -4160 -12090 8750 25895 40253 35661 29671 53709 28331 -12607 69281 78254 40037
378 40037 -4841 -24620 1053 -653 -41907 -21343 -16215 -49448 -5397 -24587 -26620 18118 58730
365 58730 -23004 -20680 -15908 -41467 -22217 -2058 27027 25684 74773 57276 14525 17776 36925
352 36925 11251 67829 51159 48561 11893 -13719 -53617 -32345 12181 7582 13460 -12131 -41676
339 -41676 1730 43032 -17681 2994 -20296 -26266 51725 54308 26013 20387 44768 28430 -10804
326 -10804 -28885 -12100 32295 38731 56950 62397 45457 6592 -3895 33187 40119 2117 3881
313 3881 -6421 6135 30948 37347 34413 23621 8389 16307 16227 53535 32459 4085 -26855
300 -26855 -7769 12339 37832 60365 14134 -24283 763 -12214 -80671 -55174 -44325 -25197
288 -25197 -18381 22087 -21404 -16746 42461 34193 -14415 -31023 20825 19938 -12124 -21323 -7121
275 -7121 -38523 19553 -26261 -2183 -16191 -24075 -1636 5377 -37430 -19241 4561 -15889 -6067
262 -6067 -41463 -1527 -6806 -34658 13174 38253 18917 5482 18022 48334 61814 11179
250 11179 -17796 -20048 17860 -3104 -6230 -6412 36918 68780 22137 -3879 -17425 33483 20010
237 20010 -22757 -45339 -58108 -53072 -8713 37918 65449 28236 38456 -27445 10201 -8352
225 -8352 40302 75283 58427 23890 60820 56991 17614 25247 -12787 -6516 -4808 -28536 -51070
212 -51070 -31969 -25672 -3849 -5638 -6849 -6475 -66475 -234 55396 27642 -2175 -3595 -44172
199 -44172 -7091 1691 43249 49022 15361 -22324 -10628 28260 28373 14784 6525 23134 9634
186 9634 33304 -1636 18495 -19354 20169 -9477 -25463 1078 44102 47575 7535 8348 26480
173 26480 56369 37347 -18224 36689 51490 14131 29202 10858 18371 9627 23038 40719
161 40719 32281 24272 23971 -28898 -37667 7538 -18300 19850 -24138 -5177 37376 8901 -1721
148 -1721 -12378 -15392 -22980 309 -27973 -27497 -24241 -18869 -13797 -37428 13935 10322 -18427 -33178
134 -33178 2039 48183 50153 18633 -8868 -7442 7029 42839 13242 -7142 34960 37993 10207
121 10207 47718 53002 24178 -17421 -35063 -11683 -5858 50922 40695 28074 27519 33796 972
108 972 -29939 -48698 -57649 -62952 -39270 12919 -5307 4925 -17828 -22039 -195 27525 30578
95 30578 4036 2236 7895 -3084 -39811 -14481 37381 25439 21657 -58811 -37924 5783 -9079
82 -9079 -18098 11168 14462 8553 20811 19701 14427 -12471 4885 14741 5206 56233 72434 47547
68 47547 -1893 -25241 -29403 -26046 -14647 24380 63665 35773 3510 -9153 -25623 23162 33696
55 33696 -785 13431 39276 43844 24964 5 -8459 9518 -17195 4934 -23191 -4027 -14568
42 -14568 19503 32300 -21244 -32907 -18028 -9671 -1357 897 -20276 -2099 22957 12627 11875
29 11875 2628 -10827 32553 19978 22563 23236 -1341 -44391 -24847 27640 13201 3048 -14913
16 -14913 -10364 3859 29995 36953 33412 12705 12059 -2506 -7750 -13671 -6259 6600 -11320 -5527
2 -5527 14514 19445
0 19445
$$ Imaginary data points
##PAGE= N=2
##DATA TABLE= (X++(I..I)), XYDATA
16383 -542547 -515468 -498353 -452151 -437017 -441975 -412031 -418004 -440353 -425340 -369109 -336222 -320770
16371 -320770 -350447 -355226 -320660 -321368 -319735 -301043 -263414 -254025 -255897 -273591 -291023 -260809 -237758
16358 -237758 -245011 -231470 -233374 -214945 -165030 -176590 -160058 -135798 -125907 -127523 -119822 -86798
16346 -86798 -81040 -107772 -109950 -73716 -39251 -31042 -21315 -6775 -22055 -33412 8476 22677
16334 22677 20346 15407 9671 23869 49915 38683 30152 38040 62359 78970 101652 96827 64412
16321 64412 97050 138326 138735 158630 199090 179563 172727 219532 255223 221483 225218 243696
16309 243696 226205 230892 261139 276150 288041 265483 309796 307786 299928 308260 304337 297259 342786
16296 342786 362937 337025 370431 393291 398294 390794 392745 395089 387509 423430 426226 425377 459800
16283 459800 491972 485089 443766 465728 468048 493764 487450 454891 470707 476233 519758 563777
16271 563777 565478 573726 570343 543442 577270 568525 543264 586334 588932 604541 632408 632392 638499
16258 638499 618509 594469 601445 663642 680113 679738 687588 694295 708853 685298 695056 692081 710371
16245 710371 745560 717329 755092 747678 726329 761318 743926 762878 752599 762326 763185 773626
16233 773626 757181 733920 807223 786162 767582 799890 841391 917262 881607 822709 836679
16222 836679 886373 910839 907134 861188 858620 868134 898437 923006 931762 902690 922376 930803
16210 930803 945185 937522 933129 933071 915478 920945 909619 918601 949207 1018418 1046411 1025050 971116
16197 971116 969721 930627 934645 947024 931296 922906 980834 971202 973725 943285 934072 1010348 1004198
16184 1004198 975785 960900 1020082 1062428 1055209 1013035 1010066 1037378 1005960 980429 945819 983471
16172 983471 995365 999315 1043466 1098585 1109753 1053621 1018217 1023008 1023530 1070279 1068660 1085669
16160 1085669 1123714 1134070 1139316 1083521 1067233 1067817 1117314 1155578 1103603 1076131 1102155 1092841
16148 1092841 1127356 1129242 1079054 1066504 1094552 1084235 1092676 1116677 1117015 1168849 1166912 1134064
16136 1134064 1130501 1178863 1182337 1104003 1123657 1123610 1130556 1118289 1129645 1114378 1104215 1145039
16124 1145039 1158846 1127185 1130147 1173821 1180560 1145257 1124531 1140552 1119875 1096459 1124958 1131413
16112 1131413 1136998 1122999 1145821 1134295 1136647 1135303 1165102 1164218 1165282 1166881 1130437 1120791 1146563
16099 1146563 1174063 1143550 1191516 1211504 1217988 1127492 1160238 1210559 1159507 1213734 1220413 1166116
16087 1166116 1135391 1168173 1191841 1198095 1235530 1208994 1164469 1209544 1182249 1220837 1196298
16076 1196298 1139614 1145892 1133588 1178387 1162144 1160007 1111016 1093978 1126240 1203431 1186658 1148080
16064 1148080 1145930 1162536 1202966 1178844 1204924 1199159 1158373 1196591 1222602 1197135 1216986 1235670
16052 1235670 1228574 1189849 1156352 1155326 1157373 1270298 1227253 1146444 1157109 1222511 1195550 1152223
16040 1152223 1171623 1174408 1167092 1206913 1204742 1190630 1220734 1206385 1206422 1174175 1186085 1208454
16028 1208454 1221393 1220318 1240022 1267397 1270733 1218389 1163255 1127667 1141905 1183462 1241891 1231874
16016 1231874 1241407 1267252 1268048 1257220 1240689 1293895 1228518 1181304 1151901 1209840 1199216 1198591
16004 1198591 1239308 1205453 1234949 1225516 1186522 1205195 1229473 1214986 1221957 1237787 1249284 1260341
15992 1260341 1227914 1197814 1201225 1177286 1154959 1208953 1226705 1222475 1179061 1180437 1217296 1195835
15980 1195835 1184875 1236827 1210266 1177555 1212695 1193950 1235444 1230681 1229299 1199659 1197628 1178058
15968 1178058 1161316 1175207 1217396 1269896 1219960 1216973 1234096 1219557 1221669 1216335 1219136 1171425
15956 1171425 1161583 1186038 1210259 1187187 1231985 1259339 1229142 1265255 1259837 1253547 1232020 1205168
15944 1205168 1212024 1226807 1200329 1204592 1200593 1228400 1237530 1234544 1222618 1214153 1243684 1199862
15932 1199862 1244851 1202991 1172334 1236180 1264296 1244917 1206385 1168824 1212161 1227595 1233272
15921 1233272 1183244 1186416 1171626 1188226 1240215 1254322 1212135 1191867 1220879 1220686 1207631 1221055
15909 1221055 1209807 1285928 1275767 1215835 1229481 1223418 1269961 1206642 1216045 1226614 1227597 1224656
15897 1224656 1260890 1283615 1306197 1211501 1174743 1185741 1229497 1228968 1210990 1242962 1260724 1251658
15885 1251658 1213666 1198243 1183799 1203028 1198291 1192202 1194459 1184108 1161083 1211170 1223696 1145917
15873 1145917 1148198 1189986 1195010 1246957 1269637 1247932 1263387 1225259 1202093 1216261 1233624 1242047
15861 1242047 1207546 1207223 1147612 1203591 1280804 1294146 1286941 1229495 1243814 1242678 1268508 1234678
15849 1234678 1269861 1277751 1226979 1206506 1192277 1152527 1173698 1181587 1170711 1187397 1250174 1289837
15837 1289837 1242196 1237876 1251923 1247435 1204813 1254615 1251886 1189118 1194191 1179109 1202454 1187576
15825 1187576 1186640 1218928 1246583 1289064 1276509 1209924 1171826 1209280 1224552 1247254 1249074 1217145
15813 1217145 1206881 1240653 1276197 1222929 1233466 1287497 1276041 1232630 1225796 1237460 1218187
15802 1218187 1216809 1207143 1202813 1192727 1182629 1223146 1232313 1238188 1233341 1250459 1273350 1192212
15790 1192212 1219898 1218134 1232680 1230244 1212108 1190695 1188757 1236725 1232870 1174538 1205803 1199816
15778 1199816 1178297 1182476 1182159 1172726 1178290 1186878 1192960 1220024 1205437 1228884 1310174 1321061 1242366
15765 1242366 1268651 1296194 1232832 1270306 1264949 1227634 1272408 1260631 1220724 1186695 1239930
15754 1239930 1248920 1276173 1240223 1219324 1224132 1238268 1264156 1303993 1276292 1273966 1262676 1245453
15742 1245453 1247232 1239600 1249903 1224081 1224050 1198352 1205974 1219991 1244764 1261566 1268785 1226353 1198584
15729 1198584 1220276 1281870 1296754 1281054 1232504 1247629 1254254 1253423 1250705 1241005 1267973 1268054 1269783
15716 1269783 1282797 1276475 1274373 1282904 1272781 1255054 1296564 1306382 1271441 1273059 1247712 1258707
15704 1258707 1243221 1242683 1235873 1254137 1224835 1286874 1245869 1231257 1200251 1191412 1246783 1235874
15692 1235874 1234078 1254750 1267103 1246028 1208521 1256170 1285798 1271806 1286534 1319400 1310674 1219063
15680 1219063 1205108 1258282 1256795 1221683 1218714 1262544 1264695 1243051 1280868 1276751 1249441 1259037
15668 1259037 1275780 1269175 1286938 1232867 1265433 1253846 1245803 1259813 1279088 1239233 1223018 1236047
15656 1236047 1232791 1229242 1271524 1257707 1280788 1254832 1283741 1272583 1265505 1268897 1232504 1277761
15644 1277761 1314490 1301249 1305792 1275880 1250973 1239411 1257284 1290997 1256294 1270140 1243314
15633 1243314 1202255 1237308 1215242 1243226 1238881 1241254 1252666 1238096 1217764 1236912 1278621 1289012
15621 1289012 1262311 1228869 1245119 1251791 1249072 1239882 1217495 1224287 1245834 1211409 1230435 1212469
15609 1212469 1231046 1242710 1265199 1286083 1274572 1234419 1272804 1260279 1232871 1212533 1328066
15598 1328066 1335323 1277215 1233921 1215622 1237039 1212037 1216984 1262910 1277811 1259728 1233434 1198941
15586 1198941 1241276 1305387 1305256 1262073 1225031 1207928 1256929 1252402 1243051 1239181 1209617 1211828
15574 1211828 1216825 1249457 1283533 1251075 1228287 1279863 1260909 1203100 1184015 1223922 1214620 1246046
15562 1246046 1254210 1241952 1297127 1253921 1199531 1246319 1240012 1276433 1238695 1210990 1175232 1150278
15550 1150278 1200194 1263687 1287526 1299771 1219798 1203871 1265672 1224620 1259729 1284472 1298984
15539 1298984 1297718 1272354 1293944 1276026 1277863 1261338 1249974 1248092 1234899 1278352 1288949 1234705
15527 1234705 1236209 1280901 1283825 1280437 1240661 1273452 1306138 1295980 1276164 1256289 1262650 1282937
15515 1282937 1311130 1311100 1273441 1284838 1274555 1237866 1229823 1259222 1243727 1265595 1271344 1267574
15503 1267574 1248370 1275320 1259393 1245449 1213361 1242813 1255832 1260026 1263734 1303029 1302347 1262666
15491 1262666 1296440 1328361 1335280 1283725 1290897 1319555 1303624 1258598 1268714 1288795 1257079 1267250
15479 1267250 1277437 1300887 1303174 1286346 1230296 1255694 1278532 1260387 1286230 1308539 1325802
15468 1325802 1317009 1278059 1239424 1276631 1277142 1290541 1297348 1293281 1361579 1333178 1335266 1296944
15456 1296944 1274590 1267862 1289111 1310748 1282636 1283740 1325869 1274382 1252291 1270786 1288966 1280378
15444 1280378 1264522 1258653 1258434 1306890 1306225 1300325 1313069 1280849 1245926 1295923 1260140 1249973
15432 1249973 1274170 1327203 1321149 1295829 1247776 1265044 1235617 1253847 1253334 1268106 1256576 1232476
15420 1232476 1307705 1258887 1223582 1303143 1284025 1285202 1249652 1240547 1293770 1292237 1261802 1283879
15408 1283879 1300263 1256030 1235399 1285092 1257024 1226013 1289897 1250738 1262455 1269077 1289836
15397 1289836 1282539 1246868 1265451 1292878 1321966 1335499 1329225 1308343 1273255 1282616 1296693 1282013
15385 1282013 1280249 1287926 1311460 1322342 1294673 1288997 1287159 1334650 1341014 1307400 1299446 1310872
15373 1310872 1326313 1344602 1347665 1356569 1369600 1290933 1287451 1314240 1279180 1276126 1271920 1259121
15361 1259121 1290947 1257027 1321113 1330703 1331146 1330984 1354976 1324296 1344548 1347655 1254703 1260866 1279568
15348 1279568 1257843 1273821 1273618 1334754 1351068 1313283 1336412 1346923 1284935 1299051 1297323 1288164
15336 1288164 1284002 1231111 1255361 1266101 1305836 1313416 1288912 1262670 1279461 1273791 1274671 1265317
15324 1265317 1279459 1311054 1321461 1342045 1367603 1318712 1328511 1321467 1300522 1301198 1296709 1281388
15312 1281388 1294832 1358644 1356213 1293890 1319206 1305387 1318433 1333431 1364443 1324255 1342219
15301 1342219 1322192 1326619 1300803 1268550 1285484 1255786 1282439 1324310 1365480 1325477 1289722
15290 1289722 1321028 1336585 1347921 1304064 1283908 1314296 1317214 1334703 1320860 1273884 1240814
15279 1240814 1251860 1280483 1269830 1284640 1319876 1305050 1318263 1298082 1272490 1284634 1344898
15268 1344898 1357273 1330191 1273572 1280070 1301339 1299473 1319659 1279104 1293301 1301053 1314829 1300438
15256 1300438 1273352 1340179 1344106 1355916 1329436 1303515 1291625 1290996 1297446 1316474 1325945 1330711
15244 1330711 1325939 1365214 1338404 1335935 1322967 1309528 1346390 1340208 1320948 1339448 1321325 1325665
15232 1325665 1343414 1352631 1350840 1319821 1318738 1320165 1317822 1316467 1288077 1325552 1336103 1332333 1360870
15219 1360870 1397249 1379095 1306880 1330338 1295654 1376098 1331878 1314125 1320710 1305184 1260794
15208 1260794 1292183 1337533 1348009 1361426 1358322 1310341 1318241 1343859 1343749 1290366 1261614 1262281
15196 1262281 1235870 1251994 1299498 1313364 1308225 1354380 1387000 1357446 1352130 1341080 1306295 1311733
15184 1311733 1273930 1287950 1301099 1305222 1277598 1304762 1306605 1314893 1327355 1314919 1303438 1321572
15172 1321572 1282276 1309369 1330091 1322329 1284650 1359236 1355523 1283851 1313806 1367733 1369804 1361358
15160 1361358 1352456 1366115 1365679 1361704 1337377 1313161 1304239 1322411 1321965 1348528 1328404 1347391 1369145
15147 1369145 1295862 1305046 1293706 1274978 1314297 1341980 1268662 1313846 1309748 1299634 1293151 1320348
15135 1320348 1344180 1391094 1390647 1346073 1318311 1372125 1403605 1383875 1350548 1316076 1352839 1364288
15123 1364288 1305461 1316786 1362353 1376265 1329848 1315476 1317268 1333883 1342166 1286735 1305556 1373161
15111 1373161 1361012 1376865 1378407 1299698 1351711 1357938 1314212 1337088 1349425 1363310 1306941 1274623
15099 1274623 1280826 1309010 1347767 1333034 1322620 1399956 1386644 1348990 1376248 1334241 1357295
15088 1357295 1351674 1393029 1408144 1395372 1307601 1308732 1330809 1309219 1338031 1318806 1341527 1364128
15076 1364128 1293336 1315968 1330499 1351116 1323880 1339604 1349567 1305409 1329353 1329969 1371809 1375783
15064 1375783 1365181 1364885 1339331 1337746 1367493 1365097 1350595 1382071 1378516 1390695 1392926 1390195 1369578
15051 1369578 1324614 1308665 1340403 1364253 1368046 1379543 1331646 1365708 1337429 1308950 1334119
15040 1334119 1299310 1274000 1320823 1321341 1295281 1314423 1304635 1320216 1315694 1300106 1307020 1314741
15028 1314741 1293716 1286199 1322661 1341214 1319152 1330840 1379238 1419069 1390705 1339565 1312506
15017 1312506 1346179 1425658 1383633 1335270 1336465 1340836 1336909 1369054 1380884 1383973 1362690 1413764
15005 1413764 1420656 1371398 1383811 1387541 1370073 1396919 1363712 1352476 1387011 1366247 1329442 1312388
14993 1312388 1336558 1351482 1333354 1387630 1368040 1410393 1394784 1366025 1364264 1363529 1364848 1306885
14981 1306885 1302845 1338021 1371682 1334181 1393521 1442991 1356130 1301309 1336624 1387732 1431527
14970 1431527 1393646 1379988 1345880 1339952 1370515 1346878 1404232 1383362 1339645 1293196 1329252
14959 1329252 1355668 1339944 1299711 1300556 1384827 1363670 1391493 1360549 1348500 1340180 1400457 1385844
14947 1385844 1351209 1342127 1369441 1338860 1325399 1353828 1418973 1384348 1362948 1407530 1411821 1385854
14935 1385854 1299681 1365282 1385397 1390549 1400933 1364926 1309853 1328897 1324889 1348773 1347956 1328661
14923 1328661 1337863 1387275 1424510 1405582 1451321 1421136 1381586 1357368 1347739 1370720 1401219 1388963
14911 1388963 1380027 1411123 1395003 1389746 1387278 1408069 1354925 1337844 1357775 1380225 1375819 1343179
14899 1343179 1370284 1399972 1405442 1378201 1361922 1350858 1378241 1378561 1384216 1367439 1370001 1383693
14887 1383693 1362293 1308644 1325916 1331144 1362855 1374314 1377673 1415927 1425192 1383771 1393202 1346239
14875 1346239 1406185 1432141 1376242 1316144 1310116 1379565 1352586 1350538 1366892 1403864 1409825 1401312
14863 1401312 1399145 1427194 1425121 1366413 1387133 1417127 1381957 1407349 1399076 1393192 1378597 1392474
14851 1392474 1390973 1390869 1375685 1402158 1450593 1467936 1449926 1420490 1441048 1438166 1408475 1391245
14839 1391245 1382568 1437424 1444613 1391649 1389094 1383997 1384930 1368782 1400097 1408049 1387269 1424046 1365603
14826 1365603 1350194 1406959 1478201 1459333 1380239 1386901 1410950 1415797 1392615 1405043 1368230 1368843
14814 1368843 1366451 1369620 1375299 1383350 1389963 1405051 1410944 1377242 1407663 1421894 1352776 1352367 1388850
14801 1388850 1401387 1358304 1333536 1359570 1385222 1362009 1412267 1440527 1403508 1394254 1411333
14790 1411333 1441500 1437509 1439554 1385773 1373599 1365205 1417947 1385401 1439001 1435531 1459141 1468052
$$ [...]
##END NTUPLES=NMR SPECTRUM
##END=
