##TITLE=1H_TG-2347-A2
 CDCl3
 8 sc, 
 16.02.2022
##JCAMPDX= 6.0         $$ Bruker NMR JCAMP-DX V2.0
##DATA TYPE= NMR SPECTRUM
##DATA CLASS= NTUPLES
##ORIGIN= UXNMR, Bruker Analytische Messtechnik GmbH
##OWNER= root
$$ XWIN-NMR		Version 3.5
$$ Wed Feb 16 11:26:29 2022 Russian Standard Time (UT+4h)  she@DPX200
##.OBSERVE FREQUENCY= 200.131346
##.OBSERVE NUCLEUS= ^1H
##.ACQUISITION MODE= SIMULTANEOUS
##.ACQUISITION SCHEME= undefined
##.AVERAGES= 8
##.DIGITISER RES= 18
##SPECTROMETER/DATA SYSTEM= spect
##.PULSE SEQUENCE= zg30
##.SOLVENT NAME= CDCl3
##.SHIFT REFERENCE= (INTERNAL, CDCl3, 0, 15.7766)
##AUDIT TRAIL= $$ (NUMBER, WHEN, WHO, WHERE, WHAT)
$$ ##TITLE= Audit trail, XWIN-NMR		Version 3.5
$$ ##JCAMPDX= 5.01
$$ ##ORIGIN= Bruker BioSpin GmbH
$$ ##OWNER= she
$$ F:/spectra/data/she/nmr/H-F/1/pdata/1/auditp.txt
$$ ##AUDIT TRAIL=  $$ (NUMBER, WHEN, WHO, WHERE, WHAT)
(   1,<2022-02-16 11:24:42.60 +0400>,<she>,<DPX200>,
      <created by zg, POWCHK disabled, PULCHK disabled
       configuration hash MD5:
       00 E9 B6 7A A2 85 ED C7 34 08 36 98 17 FE 4E 26
       data hash MD5: 16K
       99 A0 CA CB 28 D1 3D D4 C7 1E B3 54 78 A8 68 D0>)
(   2,<2022-02-16 11:24:46.04 +0400>,<she>,<DPX200>,
      <Start of raw data processing
       efp BC_mod = 2 LB = 0.24 FT_mod = 6 PKNL = 1 PHC0 = -16230.97 PHC1 = 12.80078 SI = 16K 
       data hash MD5: 16K
       2E E1 F6 72 1F 45 ED 04 40 09 6D E6 32 5D C8 1E>)
(   3,<2022-02-16 11:25:18.95 +0400>,<she>,<DPX200>,
      <pk PHC0 = 3.601496 PHC1 = -4.6 
       data hash MD5: 16K
       45 0B 15 7C 25 7F 47 58 70 95 BF A1 D4 0D FA 4A>)
(   4,<2022-02-16 11:25:23.73 +0400>,<she>,<DPX200>,
      <abs ABSG = 5 
       data hash MD5: 16K
       6C BD 7C 89 AE 87 6F 24 00 6D A3 73 14 4B 7E 06>)
$$ ##END=
$$ 
$$ hash MD5
$$ 00 7E D7 34 14 AD 22 98 4D 66 0F C4 C0 44 6C E4
##$RELAX= 
##$RELAX= 
##$RELAX= 
##$RELAX= 
##$RELAX= 
##$RELAX= 
$$ Bruker specific parameters
$$ --------------------------
##$DU= <F:/spectra>
##$EXPNO= 1
##$NAME= <H-F>
##$PROCNO= 1
##$TYPE= <nmr>
##$USER= <she>
##$AMP= (0..31)
100 100 100 100 100 100 100 100 100 100 100 100 100 100 100 100 100 100 
100 100 100 100 100 100 100 100 100 100 100 100 100 100 
##$AQSEQ= 0
##$AQ_mod= 1
##$AUNM= <au_zg>
##$AUTOPOS= <>
##$BF1= 200.13
##$BF2= 200.13
##$BF3= 200.13
##$BF4= 200.13
##$BF5= 200.13
##$BF6= 200.13
##$BF7= 200.13
##$BF8= 200.13
##$BYTORDA= 1
##$CFDGTYP= 0
##$CFRGTYP= 5
##$CHEMSTR= <none>
##$CNST= (0..31)
1 1 145 1 1 1 1 1 1 1 1 1 1 1 1 1 1 1 1 1 1 1 1 1 1 1 1 1 1 1 1 1 
##$CPDPRG= <>
##$CPDPRG1= <>
##$CPDPRG2= <>
##$CPDPRG3= <>
##$CPDPRG4= <mlev>
##$CPDPRG5= <mlev>
##$CPDPRG6= <mlev>
##$CPDPRG7= <mlev>
##$CPDPRG8= <mlev>
##$CPDPRGB= <>
##$CPDPRGT= <>
##$D= (0..31)
0 1.2 0 0 0 0 0 0 0 0.06 0 0.03 0 0 0 0 0.0002 0 0 0 0 0 0 0 0 0 0 0 0 
0 0 0 
##$DATE= 1644996282
##$DBL= (0..7)
120 120 120 120 120 120 120 120 
##$DBP= (0..7)
150 150 150 150 150 150 150 150 
##$DBP07= 0
##$DBPNAM0= <>
##$DBPNAM1= <>
##$DBPNAM2= <>
##$DBPNAM3= <>
##$DBPNAM4= <>
$$ [...]
##$SUBNAM2= <"">
##$SUBNAM3= <"">
##$SUBNAM4= <"">
##$SUBNAM5= <"">
##$SUBNAM6= <"">
##$SUBNAM7= <"">
##$SUBNAM8= <"">
##$SUBNAM9= <"">
##$SW= 18.0517287032376
##$SWIBOX= (0..15)
0 0 2 0 0 0 0 0 0 0 0 0 0 0 0 0 
##$SW_h= 3612.71676300578
##$TD= 16384
##$TD0= 1
##$TE= 0
##$TE2= 300
##$TE3= 300
##$TEG= 300
##$TL= (0..7)
0 120 120 120 120 120 120 120 
##$TP= (0..7)
150 150 150 150 150 150 150 150 
##$TP07= 0
##$TPNAME0= <>
##$TPNAME1= <>
##$TPNAME2= <>
##$TPNAME3= <>
##$TPNAME4= <>
##$TPNAME5= <>
##$TPNAME6= <>
##$TPNAME7= <>
##$TPOAL= (0..7)
0.5 0.5 0.5 0.5 0.5 0.5 0.5 0.5 
##$TPOFFS= (0..7)
0 0 0 0 0 0 0 0 
##$TUNHIN= 0
##$TUNHOUT= 0
##$TUNXOUT= 0
##$USERA1= <user>
##$USERA2= <user>
##$USERA3= <user>
##$USERA4= <user>
##$USERA5= <user>
##$V9= 5
##$VALIST= <valist>
##$VCLIST= <CCCCCCCCCCCCCCC>
##$VD= 0
##$VDLIST= <DDDDDDDDDDDDDDD>
##$VPLIST= <PPPPPPPPPPPPPPP>
##$VTLIST= <TTTTTTTTTTTTTTT>
##$WBST= 1024
##$WBSW= 4
##$XGAIN= (0..3)
0 0 0 0 
##$XL= 0
##$YL= 0
##$YMAX_a= 572851
##$YMIN_a= -848104
##$ZGOPTNS= <>
##$ZL1= 120
##$ZL2= 120
##$ZL3= 120
##$ZL4= 120
##$ABSF1= 15.72375
##$ABSF2= -2.328099
##$ABSG= 5
##$ABSL= 3
##$ALPHA= 0
##$AQORDER= 0
##$ASSFAC= 0
##$ASSFACI= 0
##$ASSFACX= 0
##$ASSWID= 0
##$AUNMP= <proc_1d>
##$AZFE= 0.1
##$AZFW= 0.1
##$BCFW= 0
##$BC_mod= 2
##$BYTORDP= 0
##$COROFFS= 0
##$CY= -3
##$DATMOD= 1
##$DC= 0
##$DFILT= <>
##$DTYPP= 0
##$F1P= 0
##$F2P= 0
##$FCOR= 1
##$FTSIZE= 16384
##$FT_mod= 6
##$GAMMA= 0
##$GB= 0
##$INTBC= 1
##$INTSCL= 0
##$ISEN= 128
##$LB= 0.24
##$LEV0= 0
##$LPBIN= 0
##$MAXI= 10000
##$MC2= 0
##$MEAN= 0
##$ME_mod= 0
##$MI= 1.114404
##$NCOEF= 0
##$NC_proc= -6
##$NLEV= 6
##$NOISF1= 3.799351
##$NOISF2= 2.8
##$NSP= 0
##$NTH_PI= 0
##$NZP= 0
##$OFFSET= 15.77664
##$PC= 1
##$PHC0= -16227.37
##$PHC1= 8.200781
##$PH_mod= 1
##$PKNL= yes
##$PPARMOD= 0
##$PSCAL= 0
##$PSIGN= 0
##$REVERSE= no
##$SF= 200.129994980215
##$SI= 16384
##$SIGF1= 3
##$SIGF2= 2
##$SINO= 5.538805
##$SIOLD= 16384
##$SREGLST= <1H.CDCl3>
##$SSB= 0
##$STSI= 16384
##$STSR= 0
##$SW_p= 3612.71676300578
##$SYMM= 0
##$S_DEV= 0
##$TDeff= 16384
##$TDoff= 0
##$TI= <>
##$TILT= no
##$TM1= 0
##$TM2= 0
##$TOPLEV= 0
##$USERP1= <user>
##$USERP2= <user>
##$USERP3= <user>
##$USERP4= <user>
##$USERP5= <user>
##$WDW= 1
##$XDIM= 16384
##$YMAX_p= 528466779
##$YMIN_p= -319272
$$ End of Bruker specific parameters
$$ ---------------------------------
##NTUPLES= NMR SPECTRUM
##VAR_NAME=  FREQUENCY,     SPECTRUM/REAL,   SPECTRUM/IMAG
##SYMBOL=    X,             R,               I
##VAR_TYPE=  INDEPENDENT,   DEPENDENT,       DEPENDENT
##VAR_FORM=  AFFN,          ASDF,            ASDF
##VAR_DIM=   16384,         16384,           16384
##UNITS=     HZ,            ARBITRARY UNITS, ARBITRARY UNITS
##FACTOR=    0.220516191357247, 1,           1
##FIRST=     3157.37887166754, 0,            0
##LAST=      -455.337891338236, 0,           0
##MIN=       -455.337891338236, -319272,     0
##MAX=       3157.37887166754, 528466779,    0
$$ Real data points
##PAGE= N=1
##DATA TABLE= (X++(R..R)), XYDATA
$$ [...]
6995E341040k70672l24019k09873l47978k27515k02860j83700q3565j12089j11303
6985C267466j28004r2560j1943p2815j43491P5331m511l8900q1144N7434m4992
6974B781871k3021r5503L86j18466r6627l5871j47900L8648l015j30290q5366
6963B084846p8945j53427O7725q7895k7066o08j04589q0490l5247N9301m6579
6952A597026j19509r7083j12593p1882j6021J48686L7443r6831j60331k0555n20
6941A087830L9466L895j5707P6496p1641q8632J37789k6556p9101J29155r9845
6930A093149j19598j7687O3043l9471l9810j555R4477j02538K4815M0688l8794
6919I56719r0927l4547Q3125R7176R4900k7401K125p4315P4312J8686l7437J01672
$$ y = [5341040, 5070368, 4746349, 4536476, 4188498, 3960983, 3758123, 3574423, 3490858, 3378769, 3267466, 3139462, 3046902, 3034959, 2962144, 2818653, 2893984, 2889473, 2850573, 2769429, 2826863, 2781871, 2758850, 2663347, 2663733, 2545267, 2448640, 2412769, 2264869, 2303517, 2300502, 2170212, 2084846, 2005901, 1852474, 1920199, 1832304, 1805238, 1804630, 1700041, 1619551, 1584304, 1643605, 1597026, 1477517, 1380434, 1267841, 1195959, 1179938, 1328624, 1366067, 1269236, 1108905, 1088350, 1087830, 1127296, 1131191, 1115484, 1191980, 1120339, 1031707, 1169496, 1142940, 1063839, 1192994, 1093149, 973551, 955864, 1018907, 979436, 939626, 938071, 1032548, 930010, 954825, 995513, 956719, 865792, 831245, 914370, 1011546, 1106446, 1079045, 1081170, 1006855, 1081167, 1099853, 1062416, 1164088]
6907A164088P0018P1431q723N6847L6947m3077O5782P3116J13190P9313r767K9861
6895A699026l0967O6842R8275J07864M7282K3836N9909P5079j0620K2043J19L6647
6883B195335k5977k41236j02419j74446r7926o5693m6681j4716m4494n4324p2787
6872A254636j25468M1553k9726k6323p8354p9140L537J7677J94r3867m7870l3869
6860H02980J0374J9696p542n4227Q7948r8699p8452K3659M3567o9023j06565R7376
6848F71092J8145K249l9868j6567M7208m842r300P0483M6777o8867j15822o8376
6836E32312J21204N6065P7536M7343j7592j01097J2210J41839J07901K6450J04806
6825A108977N2131m965k0648k5027J10157M4539L9318L9431J53849J33008K5404
$$ y = [1164088, 1234106, 1305537, 1296814, 1353661, 1390608, 1347531, 1413313, 1486429, 1599619, 1678932, 1669165, 1699026, 1668059, 1734901, 1833176, 1941040, 1988322, 2012158, 2072067, 2147146, 2136526, 2158569, 2158688, 2195335, 2169358, 1928122, 1825703, 1651257, 1553331, 1487638, 1440957, 1426241, 1381747, 1327423, 1254636, 1129168, 1170721, 1140995, 1114672, 1036318, 957178, 960715, 978392, 978586, 884719, 836849, 802980, 813354, 833050, 825508, 771281, 859229, 760530, 682078, 705737, 749304, 680281, 573716, 671092, 689237, 691486, 651618, 635051, 682259, 677417, 668117, 738600, 785377, 716510, 600688, 532312, 653516, 709581, 787117, 834460, 816868, 715771, 727981, 869820, 977721, 1004171, 1108977, 1161108, 1156143, 1135495, 1110468, 1220625, 1265164, 1304482, 1343913, 1497762, 1630770, 1656174]
6814A656174k2463J39903m5851j18089r1557N688J1856j36967r5038m2755r8851
6803A162050o7375n3659j37586o8255n9025n3291q0443l2611r1739L6650l0183
6792E24533l9483L6770r4850L4048n9478l7844J5344K3009O0672r327n7505r537
6780C86352l7605J9126o525O0444o7832Q6255o9031l7950N5851l3728j5640j02934
6768B36783J0315J2535k3710l7609k8981M0768O3855O971o9985N1706K290k1155
6756B43783l5608l1526O1158J25l5079M0041R6171o8449M8329K5083j2330K369
6744C34067M6222j3394q721P562l2465j03354m6244p584K4115N1375Q8371o2476
6732B77474j24658n2988K0586k1232n6214O7048R1775k2062m963R930j4085k4628
$$ y = [1656174, 1633711, 1773614, 1727763, 1609674, 1518117, 1523805, 1535661, 1398694, 1303656, 1260901, 1162050, 1094675, 1041016, 903430, 835175, 776150, 722859, 642416, 609805, 518066, 554716, 524533, 485050, 521820, 426970, 461018, 401540, 363696, 379040, 402049, 462721, 453394, 395889, 386352, 348747, 367873, 361348, 421792, 353960, 440215, 371184, 333234, 389085, 355357, 339717, 236783, 247098, 259633, 235923, 198314, 169333, 210101, 273956, 280927, 210942, 262648, 264938, 243783, 208175, 176649, 237807, 237932, 202853, 242894, 339065, 270616, 318945, 344028, 331698, 334067, 380289, 366895, 358174, 365736, 333271, 229917, 183673, 176089, 200204, 251579, 339950, 277474, 152816, 99828, 120414, 99182, 42968, 110016, 201791, 179729, 174766, 184696, 170611, 145983]
6720A45983L9324J6445N331L55L2287K7378o7718p0756J55946Q9719J497q9574
6708B86217k5279n4814l5292L1392j01093K3160k654L2329L4555o8675J1905O0618
6696A92369m7926L351K1986o6129k0190Q0898N4844k0843R737j3514L6525j0850
6684B20258n8616o1361o5522J9081R8140J06128l8471k841M2396p926K6343o5869
6672B11740k5607L5685L3570m6331L5699O8184j08213M5949n713P8134Q179O6766
6660C98042m2596N7150j54193P0725J5741j3577M9726j8949P9607L1884O4831
6649E38391p6215K8123M9767M6640j6692J17594n366r4100K6556J2672n4554j0959
6637E61857k6866o702n8019p2980n1245O886k4216m1093J6895l3794l0771M4049
$$ y = [145983, 185307, 201752, 207083, 207438, 239725, 267103, 199385, 128629, 284575, 374294, 375791, 286217, 260938, 206124, 170832, 202224, 101131, 124291, 121637, 153966, 188521, 119846, 131751, 192369, 144443, 147794, 169780, 103651, 83461, 164359, 219203, 198360, 208097, 194583, 231108, 220258, 161642, 100281, 34759, 53840, 151980, 258108, 219637, 216796, 259192, 251266, 277609, 211740, 186133, 221818, 255388, 209057, 244756, 312940, 204727, 250676, 244963, 323097, 331276, 398042, 355446, 412596, 258403, 329128, 344869, 331292, 381018, 362069, 441676, 473560, 538391, 462176, 490299, 540066, 586706, 570014, 687608, 682242, 588142, 614698, 627370, 572816, 561857, 534991, 528289, 470270, 397290, 346045, 352931, 328715, 287622, 304517, 270723, 239952, 284001]
6625B84001n8045K6995P068O864P0709Q161m8456q3178l3839r424M8036L078p298
6612B14672j22350M609K5662j7311R9677P1668j9323n0547q4566N3107N0928L7958
6600B64184l3792o4408K3168j9540j23248l7716R1002o6782l9714N1001O5673
6589A09828k2610n7049l0852R8657j9381J5848o5026N1951L7928k6833N3665P8011
6577B24137j5108M108j2611q4991j3678P5776j1119p6421o2329k5844Q4104Q5249
6565A71273l079j09685R6037m9015J8392j3179k014p1336M7124j5872j7114O7133
6553A18665j4610n0392k2317L4997l2927J33347k2866j15118n7379P0609O5777
6542A07786n0106Q210L3996k6716J3726m818J8959k7320K9898l833N5005j7290
$$ y = [284001, 225956, 252951, 260019, 266883, 337592, 345753, 297297, 214119, 180280, 170856, 218892, 221970, 214672, 92322, 96931, 122593, 105282, 204959, 276627, 257304, 206757, 122191, 175298, 226226, 264184, 230392, 165984, 189152, 169612, 46364, 8648, 99650, 32868, -6846, 44155, 109828, 87218, 30169, -683, 97974, 78593, 94441, 29415, 81366, 119294, 92461, 146126, 224137, 209029, 213137, 200526, 115535, 101857, 177633, 166514, 90093, 27764, 1920, 86024, 171273, 168194, 58509, 154546, 105531, 123923, 110744, 108730, 37394, 84518, 68646, 51532, 118665, 104055, 53663, 31346, 66343, 33416, 166763, 143897, 28779, -28600, 42009, 107786, 57680, 65890, 99886, 73170, 86896, 82078, 101037, 73717, 103615, 99782, 154787, 137497]
6530A37497q8908R3594J03708R12j05955J3500J5344k7473R312l4794l8898J0959
6518H8798P3810m9243n2110p013J8737M6757N5416l671M2999k9061l5679j4526
6506A35214O9215N1198q1811j03563l6262O1696k3840k0450m104J52647k3944
6495A75996Q6229l0837q0378M8087P0867o2865J4589L3444J6459q8176k4858o5291
6483I3266K7416K5445m3263n1369J20231K8183j15484K8540K7133J22840k2420
6472B40518j4415o3207n0178L5849k5564J1652L5765j0160M0121m863O4904p9510
6460A80912p4491R5806M541j03316N0877O170J129J04810k9928j19361p5770O6056
6448A07435O3243j2750m8605q566k6660J06542l1456q5846N8513n2447p296M262
$$ y = [137497, 48589, 142183, 245891, 246803, 140848, 154348, 169692, 142219, 151531, 116737, 77839, 88798, 162608, 113365, 61255, 54242, 72979, 119736, 175152, 171481, 214480, 185419, 149740, 135214, 204429, 255627, 173816, 70253, 33991, 95687, 71847, 51397, 47293, 199940, 175996, 262225, 231388, 151010, 199097, 269964, 207099, 221688, 255132, 271591, 183415, 158557, 93266, 120682, 146127, 102864, 51495, 171726, 199909, 84425, 112965, 140098, 262938, 240518, 226103, 162896, 112718, 148567, 123003, 134655, 170420, 160260, 200381, 195518, 260422, 180912, 106421, 202227, 206768, 103452, 154329, 160499, 161628, 266438, 236510, 117149, 41379, 107435, 170678, 157928, 109323, 100757, 74097, 180639, 149183, 63337, 121850, 69403, 62107, 66369]
6436F6369K0269q2874Q3111J30439J6604j3916Q9919j2914o6561n6379j879L3034
6424B05222J7124l5386P5850j20886P283Q8440n3337L0763K9303K1524N2854K2276
6412C41030q6199k9839L5367O6414M4513K5722j01413j4455J00098q8535j6004
6401B76699K7170k1742L6242q1549j34395R2047O8480M6772l782n7543J0764n000
6389B54163j21727p344R6225Q3189J5574m3525p279M462n7349J9061K9777j5660
6377B49567n741J1571N4091l6312M5984M2650P325k040m5951N7516l6194o9081
6365B73385Q2977n4114m899p3445O4667M056M2823N6261n3387J9557O4777j09159
6353C13499R264J5341j9248j30669O2057J57017o0343m5435M8978M9704m0562
$$ y = [66369, 86638, 3764, 86875, 217314, 233918, 220002, 309921, 297007, 230446, 174067, 172188, 205222, 222346, 186960, 262810, 141924, 149207, 237647, 184310, 215073, 244376, 265900, 318754, 341030, 254831, 224992, 260359, 326773, 371286, 397008, 295595, 281140, 381238, 292703, 276699, 303869, 282127, 318369, 236820, 102425, 194472, 262952, 309724, 305942, 248399, 259163, 254163, 132436, 125092, 221317, 304506, 320080, 276555, 269276, 273738, 216389, 235450, 265227, 249567, 243826, 255397, 309488, 273176, 319160, 361810, 369135, 367095, 321144, 378660, 342466, 273385, 356362, 302248, 297349, 223904, 288571, 292627, 335450, 391711, 338324, 357881, 422658, 313499, 322763, 338104, 318856, 188187, 250244, 407261, 346918, 301483, 350461, 400165, 359603]
6342C59603l6077J6633J8591K334J083m485j9283L4653K6025m8791J1633Q957
6330C70876L3781j01451O660R0768m7793L4518J9836n6412o5792J9825K2673j11898
6318B15591P7259K3849J21982Q3943k6848L1030k4759N5826q8971k5219N4295
6307D97978J1002o9906k0796R4813j0290M5154N8037j12295K5157j37901K7652
6296D08605O6392R5352m8152r0978R6822l894j5118r1880j2383M4762Q117l3445
6284D24200m835r038N740N3048p029J12411n1567o292K4619l0647P9245m9930
6272E39925L9161O1m6560p1274j3392J73918J68837j72253r059o5572O9879m3214
6260E70457J08838M2644J052j7809j21215J14548J95349J4327K3315l6851N220
$$ y = [359603, 323526, 340159, 358750, 361084, 362167, 357682, 338399, 373052, 399077, 350286, 361919, 370876, 404657, 303206, 309866, 400634, 352841, 387359, 407195, 350783, 284991, 304816, 327489, 215591, 292850, 316699, 438681, 522624, 495776, 526806, 502047, 557873, 468902, 443683, 497978, 508980, 439074, 418278, 513091, 502801, 547955, 605992, 493697, 518854, 380953, 408605, 474997, 570349, 522197, 431219, 528041, 524147, 509029, 417149, 404766, 449528, 457645, 424200, 419365, 410327, 416067, 469115, 462086, 574497, 522930, 516638, 541257, 510610, 589855, 539925, 579086, 579147, 532587, 461313, 447921, 621839, 790676, 618423, 609364, 543792, 613671, 570457, 679295, 721939, 722991, 705182, 583967, 698515, 893864, 908191, 931506, 894655, 899875]
6249H99875l906P3996L9128k3531M9293K9448p2749k8484J28502j04351J7804
6238A005025m0045M6548l2071j81366k6869J22020M1102M6279k844q6532l7385
6227H53862O8001P3138J0637m9323N8080J8608p2190L2961J1715o2134q9652o4521
6215G89182O9561J09709l3887L8747L3981o2782Q1548l4766J4470m8276l6141
6204I21346O0506m6138J166N8651j5038M8557r722j12107n3868k999J6414j2078
6192H54690O3651J4639l227L5035p1153k027O3226J7033p3764R0829m9553l9011
6180I00368K7282J00660L2243r0783P8811n7542L866J6687N2359o392j7160L9087
6168A079486J6843p0726j08498J6527K5984m483J33341k9015M0016j8566o2240
$$ y = [899875, 895969, 969965, 1009093, 985562, 1034855, 1064303, 991554, 963070, 1091572, 987221, 1005025, 964980, 1011528, 979457, 798091, 771222, 893242, 934344, 980623, 977779, 891247, 853862, 921863, 995001, 1005638, 956315, 1014395, 1033003, 960813, 993774, 1005489, 943355, 853703, 789182, 858743, 968452, 934565, 973312, 1007293, 944511, 1026059, 991293, 1005763, 957487, 921346, 981852, 935714, 936880, 995531, 980493, 1029050, 1019328, 907221, 853353, 850354, 866768, 854690, 918341, 932980, 929753, 964788, 893635, 891608, 954834, 971867, 898103, 988932, 939379, 900368, 927650, 1028310, 1060553, 969770, 1048581, 991039, 994905, 1011592, 1063951, 1057559, 1040399, 1079486, 1096329, 1025603, 917105, 933632, 959616, 955133, 1088474, 1059459, 1099475, 1080909, 1018669]
6157A018669P0858K3749j2038m0660l339j2771n9162R7873O6077R6636M7061n2145
6145A240808j04931J06403q7405m1113K8398M0349Q0597j7037o0143J0899P1148
6134A267973M5596N7389q1210j1139J36425R8924p8003M0334L861L472M3097M5921
6122A572640N4373r0096k5509K4200K8244O2652J1742J43669O5114q9717j5677
6111A741635q181P9588p908q7140J38610l1976J29385n0678q6115j4979N0308
6100A852549R1164J14844l529j03955K4442J31093j8419J9423Q0579L8124j0828
6089B215487j1389j6477Q4160m528M0554N4573p990J2902q887M3076J6860J02940
6077B521281J9871K7385N4873m0018q510o496q640l6678J02805M4807k7945N4803
$$ y = [1018669, 1089527, 1113276, 1101238, 1060578, 1057239, 1044468, 985306, 1083179, 1149256, 1245892, 1292953, 1240808, 1135877, 1242280, 1154875, 1113762, 1142160, 1182509, 1263106, 1246069, 1185926, 1196825, 1267973, 1313569, 1370958, 1289748, 1278609, 1415034, 1513958, 1435955, 1476289, 1480150, 1483622, 1526719, 1572640, 1627013, 1536917, 1511408, 1535608, 1563852, 1626504, 1638246, 1781915, 1847029, 1757312, 1741635, 1733454, 1813042, 1805134, 1717994, 1856604, 1824628, 1954013, 1903335, 1817220, 1802241, 1852549, 1943713, 2058557, 2055028, 1951073, 1975515, 2106608, 2088189, 2107612, 2188191, 2226315, 2215487, 2204098, 2187621, 2271781, 2267253, 2307807, 2362380, 2354390, 2367292, 2358405, 2401481, 2418341, 2521281, 2541152, 2568537, 2623410, 2583392, 2574882, 2568386, 2559746, 2523068, 2625873, 2670680, 2642735, 2697538]
6065B697538l9310L2384J42384Q4489N7406r9275M82J11339n4160J9600O6026
6054C018903o144N1381J1537M7692l777r3460L1128p3745L8229Q1134l2501O215
6042C076592P9220m8754p937M4320K6091L103J239P1305N4617J2515J06380K5726
6030C444417j7314o3736l0271j3997j9125J06975J02541q6688R1523J9740J65922
6019C699987J26155l0051k6032R870q0981k9191J13459Q6741P421N7517K5778
6008C960673r2714L8318J83720K5524k196J8376L3794R0660Q5135N3321j2296
5997D382315J25255L9706r011P9201J60174k4595l731k0169k8159J53876Q6284
5986D941146l796q781o3619N2742j9702J6950J61887Q5303J35720L3647j1849
$$ y = [2697538, 2658228, 2690612, 2832996, 2917485, 2974891, 2875616, 2876098, 2987437, 2933277, 2952877, 3018903, 3012759, 3064140, 3075677, 3123369, 3119592, 3026132, 3057260, 2983515, 3021744, 3102878, 3070377, 3076592, 3155812, 3107058, 3099121, 3143441, 3169532, 3172635, 3173874, 3245179, 3299796, 3312311, 3418691, 3444417, 3427103, 3363367, 3333096, 3319099, 3299974, 3406949, 3509490, 3422802, 3514325, 3534065, 3699987, 3826142, 3796091, 3770059, 3779929, 3698948, 3669757, 3783216, 3869957, 3877378, 3934895, 3960673, 3867959, 3906277, 4089997, 4115521, 4113325, 4131701, 4165495, 4256155, 4341290, 4394611, 4382315, 4507570, 4547276, 4538265, 4617466, 4777640, 4753045, 4749314, 4729145, 4700986, 4854862, 4941146, 4937350, 4928569, 4864950, 4917692, 4897990, 4914940, 5076827, 5162130, 5297850, 5331497, 5319648]
5975E319648K0033J92713K3101P4143Q2129n0553R8468j7900J1610J46412M3756
5964E943560n1025M597Q4901N1290J48849P1929l5172J41757N7664J4432O0108
5953F492890j2732N5311M1351L6222J42534N7370J82783P4445K8653J87472j0198
5942G276101J09018Q0886N9789o693k81J55523J20911m6784P6246J42361J8588
5931G985665K22309J27245L6297L6718R8328J01642J29295Q253J15663J32272
5921H993687K03704J43541P4723J22330J10405l2055J04383J14453J56478K13278
5911A0204927K38384N7013N7029J15387J62108J57593O2047R6031J92475J40741
5901A1483735J27926J55096K46654J72007J69026J20711J40802J70294R9082K40526
$$ y = [5319648, 5339681, 5532394, 5555495, 5629638, 5711767, 5661214, 5759682, 5741782, 5753392, 5899804, 5943560, 5892535, 5897132, 5982033, 6033323, 6182172, 6254101, 6218929, 6360686, 6418350, 6432782, 6492890, 6480158, 6535469, 6576820, 6613042, 6755576, 6812946, 6995729, 7070174, 7098827, 7286299, 7276101, 7385119, 7466005, 7525794, 7519101, 7518820, 7674343, 7795254, 7748470, 7824716, 7967077, 7985665, 8207974, 8335219, 8371516, 8408234, 8506562, 8608204, 8737499, 8745752, 8861415, 8993687, 9197391, 9340932, 9415655, 9537985, 9648390, 9616335, 9720718, 9835171, 9991649, 10204927, 10443311, 10500324, 10557353, 10672740, 10834848, 10992441, 11054488, 11150519, 11342994, 11483735, 11611661, 11766757, 12013411, 12185418, 12354444, 12475155, 12615957, 12786251, 12885333, 13125859]
5891A3125859J76889K14622K52848K48056J75259J12790J97069K78810J66233
5882A4948435K66938J63544P1180K49792K44849J62101L21998K02533L12586K89247
5872A7233203R9355K27775L23502L17090L91322K64929J42557L32316K65102K38071
5862A9835222K68641L42055K61149L41188K59539M10840M10350K48719K51545
5853B2629248L59730L92065L84906M86012L65243M64300L88797M63805L59750
5844B6293856M51569N83657N56160M53459M58599N34425N16016N06373O29527
5835C0983641M82120N55572N49404O32182P01072O89729N32771O86089O22373
5826C6434953N67422P33617P02664O69905P27959P83927Q69134Q64148Q00360
$$ y = [13125859, 13302748, 13517370, 13770218, 14018274, 14193533, 14306323, 14503392, 14782202, 14948435, 15215373, 15378917, 15450097, 15699889, 15944738, 16106839, 16428837, 16631370, 16943956, 17233203, 17332558, 17560333, 17883835, 18200925, 18592247, 18857176, 18999733, 19332049, 19597151, 19835222, 20103863, 20445918, 20707067, 21048255, 21307794, 21718634, 22128984, 22377703, 22629248, 22988978, 23381043, 23765949, 24251961, 24617204, 25081504, 25470301, 25934106, 26293856, 26745425, 27329082, 27885242, 28338701, 28797300, 29331725, 29847741, 30354114, 30983641, 31465761, 32021333, 32570737, 33202919, 33903991, 34593720, 35126491, 35812580, 36434953, 37002375, 37735992, 38438656, 39108561, 39836520, 40620447, 41489581, 42353729, 43154089]
5817D3154089Q97466P73841R33285J032998R04707R30959R52336J058227J211547
5808E1849455J085029J114044J175754J127333J138846J043283J108180J208543
5800F0850467J018051R49036J109206J148633R23857J040200R67288J001545J031947
5791G0040230J117240R69876J030622J100216J039636J108120J075686J175622
5783G8657248J190749J187082J136478J278869J171377J140308J264919J344235
5775H8371265J406657J392681J548581J388514J491052J734862J755879J810865
5767A00900356J816225K057315K126907K369803K489310K449287K683379K945287
5759A19837869K891746L045248L267338L430777L610100L736753L934797M050283
$$ y = [43154089, 44051555, 44825396, 45758681, 46791679, 47696386, 48627345, 49579681, 50637908, 51849455, 52934484, 54048528, 55224282, 56351615, 57490461, 58533744, 59641924, 60850467, 61868518, 62817554, 63926760, 65075393, 65999250, 67039450, 68006738, 69008283, 70040230, 71157470, 72127346, 73157968, 74258184, 75297820, 76405940, 77481626, 78657248, 79847997, 81035079, 82171557, 83450426, 84621803, 85762111, 87027030, 88371265, 89777922, 91170603, 92719184, 94107698, 95598750, 97333612, 99089491, 100900356, 102716581, 104773896, 106900803, 109270606, 111759916, 114209203, 116892582, 119837869, 122729615, 125774863, 129042201, 132472978, 136083078, 139819831, 143754628, 147804911]
5751A47804911M452601M810547M909851N107113N197984N234235N154023N035446
5743A87706711M662501M329295L839007L060772K208920J262170K10179j056025
5735B06223530k243326l428887m403341n458520o279089o932943p257401p529516
5727A62690507p398129p384718p140142o650704o337932n924806n275456n024029
5719A11554591m682939m105625l862301l430547l140983k894791k731975k588717
5711H4116713k529306k408500k352531k347501k260181k400161k250335k103586
5703F5464612j857049j830365j732427j542396j505378j373873j221508j220150
5695E3181466j249983j138267j256494j427251j221791j228651j291810j271555
$$ y = [147804911, 152257512, 157068059, 161977910, 167085023, 172283007, 177517242, 182671265, 187706711, 192369212, 196698507, 200537514, 203598286, 205807206, 207069376, 207279555, 206223530, 203980204, 200551317, 196147976, 190689456, 184410367, 177477424, 170220023, 162690507, 155292378, 147907660, 140767518, 134116814, 127778882, 121854076, 116578620, 111554591, 106871652, 102766027, 98903726, 95473179, 92332196, 89437405, 86705430, 84116713, 81587407, 79178907, 76826376, 74478875, 72218694, 69818533, 67568198, 65464612, 63607563, 61777198, 60044771, 58502375, 56996997, 55623124, 54401616, 53181466, 51931483, 50793216, 49536722, 48109471, 46887680, 45659029, 44367219, 43095664]
5687D3095664j173660r81711j020601j022716j059033r13429r36542q44692r33940
5678C4209340p88511o87137p28130o22031o31831o38125o02135m57773l63296
5669B8690371n00449l94122n05066m57909l63920m70030n83833m91039l94735
5660B4529268m73171n20787m90138m26205m76645l48299l42737l76632k16703
5651B0857951m05603k41511j79750j84066k79071k63666k00589k49486k44252
5642A8609957k73138j52273q8799k4790q3724k06890j19426j68335j81491p8463
5632A7232628j25199k34797k66123k91967k43727k31926j90522j72063l19791
5623A5156513k92954k76984j80732j91921k82900k35563k11718l01689j46625
$$ y = [43095664, 41922004, 40940293, 39919692, 38896976, 37837943, 36924514, 35987972, 35143280, 34209340, 33420829, 32733692, 32005562, 31383531, 30751700, 30113575, 29511440, 29053667, 28690371, 28189922, 27795800, 27290734, 26832825, 26468905, 25998875, 25415042, 24924003, 24529268, 24056097, 23535310, 23045172, 22618967, 22142322, 21794023, 21451286, 21074654, 20857951, 20452348, 20210837, 20031087, 19847021, 19567950, 19304284, 19103695, 18854209, 18609957, 18336819, 18184546, 18095747, 18070957, 17987233, 17780343, 17660917, 17492582, 17311091, 17232628, 17107429, 16872632, 16606509, 16314542, 16070815, 15838889, 15648367, 15476304, 15156513, 14863559, 14586575, 14405843, 14213922, 13931022, 13695459, 13483741, 13182052, 13035427]
5614A3035427r5979j96251j66914p1111j64016r1258k06814j98583q5574n7948
5604A1700979j22999j07706j11536o9934j71415j28109j79662q9789o7668p0076
5594A0582085j58986m8461p7925j71933j42248j00913p8495j66693k9692o253
5584I600486m0846j28047r5727j90154j74809j12567q8591m7674j06454j72449
5574H443168r6267M0637o0315o6650q6030r1407j7610j12743j7546M0413j50930
5563G824720n6950k9165j00291k5481o0573p8233p1552j06597p7643P573j2217
5552G213591p8150q9360j62939K8260L2549j03394l4064Q076q0367o3296M0583
5541F711489K0581k466p6473M3041j40388r5592Q1200K7213R4649J8018Q965l0428
$$ y = [13035427, 12939448, 12743197, 12576283, 12505172, 12341156, 12249898, 12043084, 11844501, 11758927, 11700979, 11577980, 11470274, 11358738, 11288804, 11117389, 10989280, 10809618, 10719829, 10652161, 10582085, 10423099, 10374638, 10296713, 10124780, 9982532, 9881619, 9803124, 9636431, 9606739, 9600486, 9559640, 9431593, 9335866, 9145712, 8970903, 8858336, 8769745, 8722071, 8615617, 8443168, 8346901, 8387538, 8327223, 8260573, 8174543, 8083136, 8065526, 7952783, 7935237, 7975650, 7824720, 7767770, 7738605, 7638314, 7612833, 7552260, 7474027, 7402475, 7295878, 7218235, 7225808, 7213591, 7135441, 7046081, 6883142, 6911402, 6943951, 6840557, 6806493, 6814569, 6734202, 6670906, 6711489, 6732070, 6729604, 6653131, 6696172, 6555784, 6460192, 6541392, 6568605, 6663254, 6681272, 6690237, 6659809]
5529F659809p8885L1653J2455p57m4906O0857j9580N4881l3174k7065n573J4546
5517F624261O1185O201M5593L7330n6327p3504M7190J77445L1386J7326n8086
5506F860000J23591l0215J6137Q136J77494J63543J33676J73237K00739J60980
5496G987318M0601J81215N1472j43999j46026j24234j64723l42047m73960m08217
5486F457400l45562j17804j48677n9224p0065j87457l7436q493p7328j27595k12034
5475E065725P3908o1134k699M1023n1199M8775j9344m8095J9843j17901K4855
5464D973757n5580l0082n5153o2908n2713L150j121j12004P9361j5400k0472n0968
5452D599867l4656m7929j5234O0430n037J6214O1224R6901k3830l5169K7438K0857
$$ y = [6659809, 6580924, 6612577, 6625032, 6624275, 6579369, 6640226, 6620646, 6675527, 6642353, 6615288, 6609715, 6624261, 6685446, 6691647, 6737240, 6774570, 6718243, 6644739, 6691929, 6869374, 6900760, 6918086, 6860000, 6983591, 6953376, 6969513, 6977649, 7155143, 7318686, 7452362, 7625599, 7826338, 7987318, 8027919, 8209134, 8260606, 8116607, 7970581, 7846347, 7681624, 7339577, 6865617, 6457400, 6111838, 5994034, 5845357, 5786133, 5716068, 5528611, 5491175, 5482682, 5405354, 5277759, 5065725, 5139633, 5078499, 5075800, 5116823, 5065624, 5114399, 5095055, 5046960, 5066803, 4948902, 4973757, 4918177, 4888095, 4832942, 4770034, 4717321, 4720471, 4719350, 4607346, 4686707, 4671307, 4650835, 4599867, 4565211, 4517282, 4502048, 4562478, 4557441, 4573655, 4634879, 4731780, 4707950, 4672781, 4700219, 4721076]
5440D721076o1312P7918N0887l1053k4458J08373P808J32312m989j415M1684J81274
5428E198105J8650J1415Q9844P6041N4159j3754J73619K6175J30178R1460K12260
5417F068152K736L9017J71647J55147J6236N6210J00547n743p2379m392J33428
5406F660606o0829j6095o9241j33176o9810N5262Q6424L5970R3302M8814K7969
5395F659196J69352J87076N2601J3217J5665N6955K26864K17651K05139K97425
5385H101141J80967L27241K36057J61596J79710J40469L9960l8356L6068m9353
5375I315500j57337l56084k68896k06145k81298l08428j85892j19511r1641n0408
5365G289860r0585l6141j17026r5431O6166O6324K7369O5855O1818J02914K17138
$$ y = [4721076, 4659764, 4737682, 4788569, 4757516, 4733058, 4841431, 4849239, 4981551, 4976562, 4975147, 5016831, 5198105, 5216755, 5228170, 5318014, 5394055, 5448214, 5434460, 5608079, 5634254, 5764432, 5855892, 6068152, 6070888, 6109905, 6281552, 6436699, 6452935, 6509145, 6609692, 6603949, 6531570, 6527178, 6660606, 6599777, 6583682, 6514441, 6381265, 6311455, 6366717, 6453141, 6489111, 6582413, 6631227, 6659196, 6828548, 7015624, 7068225, 7081442, 7097107, 7154062, 7380926, 7598577, 7803716, 8101141, 8282108, 8609349, 8845406, 9007002, 9186712, 9327181, 9367141, 9328785, 9364853, 9315500, 9158163, 8802079, 8533183, 8327038, 8045740, 7737312, 7551420, 7431909, 7340268, 7289860, 7199275, 7163134, 7046108, 6950677, 7016843, 7083167, 7110536, 7176391, 7238209, 7341123, 7558261]
5354G558261K64792L17577K26678J27552J11527J91987J41784K0238m9287r7994
5344H813115j43104k42621j84568l52511l55747l24067k02738k12719j60357j89016
5334F445667j37398N671J8294K9843p8394j6282j3095r9823O2400l2273q6881
5323F097729J58460O6843M6533J36606r3922P5929P3217K0840l533l1600p5270
5312F471832j22772j09776l1922r6558r7944k43174k41505j31879j62577k4688
5302E209037j11176r9232j69395j89509j42250j24990j36299m6084k10871j12545
5292C866686p9064k9418l9602j69958j35141m2832N2985j15073j56319o6365P5502
5281C161401K2389j03092j82991q2278R1109m0657q4431p9659l250o6091o548
$$ y = [7558261, 7823053, 8140630, 8367308, 8494860, 8606387, 8798374, 8940158, 8960396, 8911109, 8813115, 8670011, 8427390, 8242822, 7890311, 7534564, 7210497, 7007759, 6795040, 6634683, 6445667, 6308269, 6313940, 6332234, 6362077, 6283683, 6267401, 6254306, 6154483, 6216883, 6184610, 6097729, 6256189, 6323032, 6369565, 6506171, 6412249, 6488178, 6561395, 6582235, 6578702, 6547102, 6471832, 6349060, 6239284, 6207362, 6110804, 6012860, 5769686, 5528181, 5396302, 5233725, 5209037, 5097861, 4998629, 4829234, 4639725, 4497475, 4372485, 4236186, 4190102, 3979231, 3866686, 3787622, 3758204, 3718602, 3548644, 3413503, 3370671, 3423656, 3308583, 3152264, 3085899, 3161401, 3183790, 3080698, 2897707, 2815429, 2906538, 2865881, 2781450, 2701791, 2698541, 2632450, 2625902]
5270B625902k7054L454N7566p6903o7804j87623O3889l2371K5282L4623j10692
5259B308269L0396j16698j03753k8500J57375L6002p2411R7560J6264j08795j13091
5248B102618P9490P9834q299l9271N412L6549j01417O9612l0419l1868j35672
5237B026569L4120m1901O5213M4284j91036O291Q7099N312p220p5600l928o2916
5225A886287n8155O3404m3659r3551n6599l121n0624R3571j6088o4906m3540J16834
5213A729853k3669r2279j15246O8065O2186R2420j443j06775R995R4188L2084
5202A749379r8825k0162l3574j4606n2979K6781L2814P9001j17559j3779J07938
5191A644429K5810m8465k8664K7360L7289n2741p61O3645J12213o3441n7874j1431
$$ y = [2625902, 2598848, 2602302, 2659868, 2582965, 2515161, 2327538, 2391427, 2359056, 2384338, 2418961, 2308269, 2338665, 2221967, 2118214, 2089714, 2247089, 2283091, 2210680, 2308240, 2324504, 2215709, 2102618, 2182108, 2261942, 2253643, 2214372, 2219784, 2256333, 2154916, 2224528, 2194109, 2162241, 2026569, 2060689, 2018788, 2084001, 2128285, 1937249, 1943540, 2030639, 2035951, 2028731, 1953131, 1949203, 1886287, 1828132, 1891536, 1847877, 1754326, 1697727, 1694606, 1643982, 1737553, 1721465, 1656559, 1613019, 1729853, 1706184, 1613905, 1498659, 1566724, 1628910, 1721330, 1719887, 1613112, 1623107, 1717295, 1749379, 1650554, 1630392, 1596818, 1582212, 1529233, 1556014, 1588828, 1667829, 1550270, 1536491, 1644429, 1670239, 1621774, 1593110, 1620470, 1657759, 1605018, 1604257, 1667902, 1780115, 1716674, 1658800, 1647369]
5179A647369o0752j3150q6835r4955p1353M0591J2935q765p1004L861R772P8353
5167A386067K1215q2005j19589J9289N8318M0047j1760N551P9736q3684j33997
5156A179188J4127O8688O3397j09498L9569J25422N2906k0441o5367J760n41J4143
5144A363353J3469L3261q54j9043N2552O8159r2481J042M4022j8166K1857o7919
5132A399252p5753R0137J11742J29012l0996j4318L5967L4549J07868O9667P2109
5121A929236m1381R154N0857j13486p349k6591j4050N8205p8166J4597r5314k43823
5109A441889J2840R3026n7628j52942J5203N1005p1774o7738Q515j39931p237
5098A125228p4533j609J29734q6580Q184q8511L8510K2517J5862J6314l5838M3105
$$ y = [1647369, 1586617, 1573467, 1486632, 1391677, 1320324, 1360915, 1373850, 1365085, 1294081, 1297942, 1307714, 1386067, 1407282, 1325277, 1205688, 1224977, 1283295, 1323342, 1311582, 1317133, 1396869, 1313185, 1179188, 1193315, 1262003, 1325400, 1215902, 1255471, 1380893, 1433799, 1413358, 1347991, 1349751, 1349210, 1363353, 1376822, 1410083, 1409229, 1390186, 1442738, 1510897, 1418416, 1419458, 1463480, 1445314, 1467171, 1399252, 1323499, 1413636, 1525378, 1654390, 1623394, 1609076, 1645043, 1679592, 1787460, 1857127, 1929236, 1887855, 1897009, 1947866, 1834380, 1827031, 1800440, 1786390, 1844595, 1766429, 1781026, 1685712, 1441889, 1454729, 1547755, 1490127, 1337185, 1352388, 1403393, 1331619, 1263881, 1272396, 1132465, 1125228, 1050695, 1049086, 1178820, 1092240, 1100424, 1011913, 1050423, 1072940, 1088802, 1105116, 1069278, 1112383]
5086A112383L4347n9569l2032M0532J14587n4909l2389l9590j4557N5516N6191
5075A180510n5878n0913l7439n4113P5185l8498L8388Q6752k2805q4425q3013
5064I53751J7168Q7603p7820M8441o8217L285Q9806J5783P0171l7711o492j2419
5052A083349J3315Q695M3133m0445p0894L6384J25421L1478l2040m6489K8200
5041A180107J3475n66J29368K6921j37735L688p306j3162J9584l9016P6315j6110
5029A235563o3819J1665P0269J39358K8864r7502O3182J5168k6273M6939o3187
5018A360227K6959m333n420O0577j41791J23507Q8352J3509P2495j20821l9174
5007A434087J6868n999J4154j7380M3555j8703J0959P3951l1030k3646M6255N859
$$ y = [1112383, 1146730, 1087161, 1055129, 1095661, 1210248, 1155339, 1122950, 1083360, 1068803, 1124319, 1180510, 1124632, 1073719, 1036280, 982167, 1057352, 1018854, 1057242, 1143994, 1121189, 1036764, 953751, 970919, 1058522, 980702, 1029143, 960926, 964211, 1054017, 1069800, 1139971, 1102260, 1095768, 1083349, 1096664, 1105359, 1148492, 1108047, 1037153, 1073537, 1198958, 1230436, 1198396, 1151907, 1180107, 1193582, 1193016, 1322384, 1349305, 1211570, 1215258, 1207952, 1194790, 1214374, 1175358, 1251673, 1235563, 1171744, 1183409, 1253678, 1393036, 1421900, 1324398, 1387580, 1402748, 1376475, 1423414, 1360227, 1387186, 1382853, 1377433, 1438010, 1296219, 1419726, 1508078, 1521587, 1594082, 1473261, 1434087, 1450955, 1444956, 1459110, 1441730, 1485285, 1466582, 1477541, 1551492, 1520462, 1496816, 1543071, 1548930]
4995A548930m5834M9593N75N5096R913n3004m4150m3991J06967R452p0806J08016
4983A630757k5123q4232N6421j4550j4328K0026r3410o1592M2637l7530j6053
4972A403023p1622P3874Q9271K5312k6982q4117M7217M7110k7122N0452J142q6865
4960A440693R781J8344M0795K2469j19157O5840N683K4875q1535p2924J11472
4949A466336M9786O542J0133j3881M0709J00612M5762k9535Q6471J30171n0246
4938A842860o786q9941P3128O3698l3067j7187J33224j323k095l374o0852M7296
4926A945581L5622O0608Q4688l6347L349j4276P584J05716m0481p9625P5610j4402
4914B133627j9618J1016p6154m8264O1836n7096p0057O7018L0614J32j86376j12148
$$ y = [1548930, 1503096, 1552689, 1553264, 1608360, 1618273, 1565269, 1521119, 1477128, 1584095, 1593547, 1522741, 1630757, 1605634, 1521402, 1577823, 1563273, 1548945, 1568971, 1475561, 1413969, 1456606, 1419076, 1403023, 1331401, 1405275, 1494546, 1519858, 1492876, 1408759, 1455976, 1503086, 1475964, 1526416, 1527558, 1440693, 1450474, 1468818, 1509613, 1532082, 1412925, 1478765, 1484448, 1509323, 1427788, 1354864, 1466336, 1516122, 1522664, 1532797, 1518916, 1559625, 1660237, 1705999, 1676464, 1762935, 1893106, 1842860, 1836074, 1746133, 1819261, 1882959, 1849892, 1832705, 1965929, 1964606, 1962511, 1959137, 1898285, 1945581, 1981203, 2041811, 2126499, 2090152, 2093501, 2079225, 2086809, 2192525, 2152044, 2072419, 2148029, 2133627, 2114009, 2125025, 2048871, 2000607, 2062443, 2005347, 1935290, 2002308, 2032922, 2033054, 1846678, 1734530]
4902A734530J3199O0230L5859j48118L8446M8204j3344L7047j5467m6084o0336
4891A684166M1686J0835K0049R8063Q7603j36833m9745K3501O3165j9870Q7132
4880A909752J3490l8321L4850R3877o1470M3572Q4431l0244N2636O7541N790J45184
4868B321088q0360j6126J56607L3140Q3748o0984n6631j0132J57346K1589O7473
4857B616758o285M430q7479K4117M7407M940j06231j0487J44391p8142j05019
4846B448400k9934l0041L6131Q9915l802q8108p8676k0484N5951M9292P2782p0935
4834B430491j26733K3608K7527o7928P207M6272M4139O0362K4652n6446q504P0518
4822B475165p9671k2406M5972O0585k1065p110j2399n3402n415r167P4907K6551
$$ y = [1734530, 1747729, 1807959, 1843818, 1695700, 1734146, 1782350, 1769006, 1806053, 1790586, 1744502, 1684166, 1725852, 1736687, 1756736, 1854799, 1942402, 1805569, 1755824, 1779325, 1842490, 1822620, 1909752, 1923242, 1884921, 1919771, 2013648, 1952178, 1995750, 2080181, 2049937, 2102573, 2170114, 2175904, 2321088, 2240728, 2224602, 2381209, 2414349, 2498097, 2437113, 2380482, 2370350, 2527696, 2549285, 2616758, 2610473, 2614903, 2527424, 2551541, 2598948, 2603888, 2497657, 2487170, 2631561, 2553419, 2448400, 2418466, 2388425, 2424556, 2514471, 2510669, 2422561, 2343885, 2323401, 2379352, 2428644, 2501426, 2430491, 2303758, 2327366, 2354893, 2286965, 2294172, 2340444, 2384583, 2444945, 2469597, 2413151, 2404647, 2475165, 2395494, 2373088, 2419060, 2479645, 2458580, 2451470, 2439071, 2385669, 2380254, 2371087, 2445994, 2472545]
4810B472545J4676j9748M4167r661L615P9428j25274J24815m4054k3608P7605
4799B594506L3147K5069o3129L2781n3767J726n106J8920N6946N0339o5310P3861
4787B699983k6259j02187M8830J78687m687O7812O5048N3070O5440o2862j7701
4776B965174M9454J91822q596P3331o5751M7606J3212q874O7055J15500J9993
4765C459926J0622J5606j12960Q9638J03457J78456J8545L6090R97K0030P175
4754C827582M2630O5043j0000R3559J28932J05235Q8636r267K5302J22856P9775
4743D560283M0988L648L2752J43195L4882L4142N3639M5516L9336q58J36517O490
4731E130530Q4165K371M9390J32976J07642n3688J72364R6508L9779J95875R8376
$$ y = [2472545, 2487221, 2467473, 2511640, 2501979, 2505594, 2585022, 2459748, 2584563, 2540509, 2516901, 2594506, 2627653, 2652722, 2589593, 2622374, 2568607, 2570333, 2565227, 2584147, 2641093, 2691432, 2626122, 2699983, 2673724, 2571537, 2620367, 2799054, 2794367, 2862179, 2927227, 2980297, 3045737, 2982875, 2965174, 3014628, 3206450, 3197854, 3271185, 3205434, 3253040, 3266252, 3257378, 3324433, 3439933, 3459926, 3470548, 3486154, 3373194, 3462832, 3566289, 3744745, 3763290, 3799380, 3800377, 3820407, 3827582, 3870212, 3935255, 3925255, 4018814, 4147746, 4252981, 4341617, 4332350, 4357652, 4480508, 4560283, 4601271, 4604919, 4637671, 4780866, 4815748, 4849890, 4903529, 4949045, 4988381, 4987523, 5124040, 5130530, 5214695, 5217066, 5266456, 5399432, 5507074, 5453386, 5625750, 5722258, 5762037, 5957912, 6056288]
4720F056288R1046J90162R6050M9666J45312J42446J79059J13026J55057J91899
4710G410011J37274K27533K17634K72588K10322K22734K25381M04373K96472K92370
4700I916692M09002M62155M01390L48534M74998M43913M88401O93943N09425M33191
4690A4581644P34020Q27733O54281P24400Q06568Q73772Q48918Q49823R94164
4681B1895323Q13241P04161O15265N58728L93247K88739K65270K10674K731l369
4671B5744010p89R5113L1281J96000J05903j2836r7489r7761k31405l36302m08872
4660B4986853n81007o17739p41785o01641n81776n26182n79649m71002j61246
4651B0124826l03664j36706j68881n0638J37220J19325K69920M34481M50154L72311
$$ y = [6056288, 6147334, 6337496, 6433546, 6483212, 6628524, 6770970, 6950029, 7063055, 7218112, 7410011, 7547285, 7774818, 7992452, 8265040, 8475362, 8698096, 8923477, 9327850, 9624322, 9916692, 10325694, 10787849, 11189239, 11537773, 12012771, 12456684, 12945085, 13639028, 14148453, 14581644, 15315664, 16143397, 16797678, 17522078, 18328646, 19202418, 20051336, 20901159, 21895323, 22708564, 23412725, 24027990, 24586718, 24979965, 25268704, 25533974, 25744648, 25747379, 25744010, 25743221, 25838334, 25869615, 26065615, 26171518, 26158682, 26061193, 25963432, 25732027, 25395725, 24986853, 24405846, 23788107, 23046322, 22444681, 21862905, 21336723, 20757074, 20286072, 20124826, 19821162, 19684456, 19515575, 19464937, 19602157, 19721482, 19991402, 20425883, 20876037, 21248348]
4641B1248348M85419N36351P27880P56239Q06583R06092Q36210J140650J140502
4632B8584274J142712J254600J321148J353518J438866J418421J279523J143299
4624C8936361J098754Q49749P23918N31370M17861L27451N5895j97359l41606
4615D2402394m89680o70384q27097q81420j030921j167210j316311j455516j550257
4606C3013598j462985j497583j601377j461544j524840j342050j432743j333673
4598B1356803j057429j006903q13404p74310q05337p19700p28988n45347m77620
4589A4427765n18662l97639l47796l39933j99428k88888j91161k11809l64650
4580A1567799j89511j52405j75988q8009j26012j53197j41254l6691k5704j60366
$$ y = [21248348, 21733767, 22270118, 22997998, 23754237, 24560820, 25466912, 26303122, 27443772, 28584274, 29726986, 30981586, 32302734, 33656252, 35095118, 36513539, 37793062, 38936361, 40035115, 40884864, 41608782, 42140152, 42558013, 42885464, 42941359, 42744000, 42402394, 41912714, 41242330, 40415233, 39533813, 38502892, 37335682, 36019371, 34563855, 33013598, 31550613, 30053030, 28451653, 26990109, 25465269, 24123219, 22690476, 21356803, 20299374, 19292471, 18479067, 17704757, 16899420, 16179720, 15450732, 14905385, 14427765, 13909103, 13511464, 13163668, 12823735, 12624307, 12335419, 12144258, 11932449, 11567799, 11378288, 11225883, 11049895, 10961886, 10835874, 10682677, 10541423, 10504732, 10479028, 10318662]
4570A0318662j03951N5226n6696m0730M3177L4913O1700Q3463J77255J18918O8318
4559A0760255Q5624K04414J78439J85572J27730J96199K06007R0703K91539K99157
4549A2625639L00889L18171K21950L62287L68532L25682M60088L33990L88465
4540A5705693M30331L88503N55468O26513O24691N97434P10530P45426P42599
4531B1127188Q94751Q35638R87386R95674R62744Q53501Q67761Q76134P04439
4522B9105216N33713L57218K85089J99466o5596k59930k98940m09633l89691m15639
4512B8641273m83885l37266l20137k47959k83637j25403o2380j09466J2892J80755
4502B6864787K79995K63767L32960L46496L85037L87879M41949N27054M59873
$$ y = [10318662, 10214711, 10269937, 10213241, 10172511, 10215688, 10250601, 10312301, 10395764, 10573019, 10691937, 10760255, 10845879, 11050293, 11228732, 11414304, 11542034, 11738233, 11944240, 12034943, 12326482, 12625639, 12926528, 13244699, 13466649, 13828936, 14197468, 14523150, 14983238, 15317228, 15705693, 16136024, 16524527, 17079995, 17706508, 18331199, 18928633, 19639163, 20384589, 21127188, 22021939, 22857577, 23844963, 24840637, 25803381, 26656882, 27524643, 28400777, 29105216, 29638929, 29996147, 30281236, 30480702, 30415106, 30155176, 29856236, 29446603, 29056912, 28641273, 28157388, 27820122, 27499985, 27252026, 26968389, 26842986, 26780606, 26671140, 26684032, 26864787, 27144782, 27408549, 27741509, 28088005, 28473042, 28860921, 29302870, 29829924, 30289797]
4493C0289797M52496L72221L56781L49554J73537Q2298p7855k11294l26650n23207
4483C0937678n52808o89421o73425o81451p33499p06209o06410m67788m19625
4474B5407042k83308j92949j34525n3327m3970j8862j84463j53951k60504k23919
4464B3857264j98338l48371l59136l96104l66393k71814k43076l03856l51487
4455B1018689j89079j49963j08259j48922j60991j59265k09317j07607k73248
4446A9512038r7529j18075k22280j25645k16970j87380k03112k39251j70046k15904
4436A7715846j88392k55954j41125k53363k42878k84556l25256m96978m37456
4427A5089888m27626m36614m99522m29837n18107l91993m18077l50155k88127
$$ y = [30289797, 30742293, 31114514, 31471295, 31820849, 31994386, 32076684, 31998829, 31787535, 31460885, 30937678, 30384870, 29695449, 29022024, 28340573, 27607074, 26900865, 26294455, 25826667, 25407042, 25123734, 24930785, 24796260, 24742933, 24698963, 24680101, 24495638, 24341687, 24081183, 23857264, 23658926, 23310555, 22951419, 22555315, 22188922, 21917108, 21674032, 21370176, 21018689, 20829610, 20679647, 20571388, 20422466, 20261475, 20102210, 19892893, 19785286, 19512038, 19414509, 19296434, 19074154, 18948509, 18731539, 18544159, 18341047, 18101796, 17931750, 17715846, 17527454, 17271500, 17130375, 16877012, 16634134, 16349578, 16024322, 15527344, 15089888, 14662262, 14225648, 13726126, 13296289, 12778182, 12386189, 11968112, 11617957, 11329830]
4418A1329830l20271k19192k36333j80424k42108j96516k56223j52278j82147
4409I344338k09673k40064k09612q2264j93273r3620j53097j47428j13739j01477
4399G800091P11r1727n6250K4527l0709J06485j3733K2067L6674M8048O6237Q8668
4387H001089m3291m1060J6931j00290j03197r1994j57394j13074j93198j43795
4377G030727j16184o8725k02719j22617q2340j55903K8156q2697l1287n5291O9477
4366F210597L0844j49660J642J9474n6006N744M9985J28376K2301R196L7265P0867
4354F380625M0328j0648p8802j5j21527p1899M7219K9208r6668l0548K4875J2823
4342F124971j4879J19617K9855N675M967l3293N5642p5535l0179K11442L9978
$$ y = [11329830, 11009559, 10790367, 10554034, 10373610, 10131502, 9934986, 9678763, 9526485, 9344338, 9134665, 8894601, 8684989, 8602725, 8409452, 8315832, 8162735, 8015307, 7901568, 7800091, 7800802, 7709075, 7652825, 7677352, 7646643, 7753128, 7739395, 7761462, 7798136, 7846184, 7912421, 8001089, 7957798, 7916738, 7933669, 7833379, 7730182, 7638188, 7480794, 7367720, 7174522, 7030727, 6914543, 6845818, 6643099, 6520482, 6438142, 6282239, 6310395, 6227698, 6196411, 6141120, 6210597, 6241441, 6091781, 6093423, 6112897, 6056891, 6062635, 6112620, 6240996, 6263297, 6272493, 6309758, 6380625, 6420953, 6410305, 6331503, 6331488, 6209961, 6138062, 6185281, 6214489, 6117821, 6087273, 6112148, 6124971, 6110092, 6229709, 6259564, 6265239, 6270206, 6236913, 6292555, 6217020, 6186841, 6398283, 6438261]
4331F438261M4715R5207n0851o2755Q4691o5972J29273M8562M3625J7752J35652
4320F858160P1422K1145K64000n1515Q1436J53143J49105Q4186J19582J54624
4310G905288J86956K01076K78433J83185K11971J04654J7886O6881J6007L9314
4300I211651k05212k35431j76407k00271k34305k07353j69158r0033j96890j00583
4290G396008m912j37007l4554Q8042j26764p0091J7061J09568J3998J38293l170
4279G386472L0387J9202M4824J75475O7041R5605J20115P6635j27369Q445J33255
4268H030087M3901j0346R8174N9037m9346J5920r6275J66587J60524M106j9826
4257H402543j5588J16457Q8092R0308J18348K8991l0981J24984J01399J17757
$$ y = [6438261, 6482976, 6578183, 6527332, 6464577, 6549268, 6483296, 6612569, 6661131, 6704756, 6722508, 6858160, 6929582, 6950727, 7214727, 7163212, 7244648, 7397791, 7546896, 7631082, 7750664, 7905288, 8092244, 8293320, 8571753, 8754938, 8966909, 9071563, 9089449, 9156330, 9172337, 9211651, 9006439, 8771008, 8594601, 8394330, 8160025, 7952672, 7783514, 7693481, 7496591, 7396008, 7391096, 7254089, 7219535, 7307577, 7180813, 7110722, 7127783, 7237351, 7251349, 7389642, 7386472, 7416859, 7436061, 7480885, 7656360, 7723401, 7819006, 7939121, 8015756, 7888387, 7896832, 8030087, 8073988, 8063642, 8161816, 8220853, 8171507, 8187427, 8091152, 8257739, 8418263, 8422369, 8402543, 8386955, 8503412, 8591504, 8681812, 8800160, 8829151, 8798170, 8923154, 9024553, 9142310]
4247I142310L458K528l3173O3006j227J57428P2448l2956Q7526N7275J33332P4575
4235I726530O4468K6032J85268J71832R6930Q3577J53142J55319l5259J53788
4225A0781627l3195R9294J87893J9206J25138k208M800J4504N6084J58559J06771
4214A1518473N4047J15083J47004J3947J74328K5639O2506J39608J29305J67196
4204A2547136K7289J22501J36135J21839J88992J71977K84507J65367K60433K04067
4194A4230243K55210L40166K72899J87547J85243J54906J31816J59707K57003
4185A6174740J92189J37932K33269L38590K48857L92714J42830L13968L37109
4176A8512198L90812L10188K06805L45168L10103L58214L42428N20459M71873
$$ y = [9142310, 9145768, 9148296, 9115123, 9178129, 9176902, 9334330, 9406778, 9373822, 9461348, 9518623, 9651955, 9726530, 9790998, 9817030, 10002298, 10174130, 10271060, 10354637, 10507779, 10663098, 10627839, 10781627, 10748432, 10847726, 11035619, 11054825, 11179963, 11177755, 11182555, 11197059, 11253143, 11411702, 11518473, 11572520, 11687603, 11834607, 11848554, 12022882, 12048521, 12111027, 12250635, 12379940, 12547136, 12574425, 12696926, 12833061, 12954900, 13143892, 13315869, 13600376, 13765743, 14026176, 14230243, 14485453, 14825619, 15098518, 15286065, 15471308, 15626214, 15758030, 15917737, 16174740, 16366929, 16504861, 16738130, 17076720, 17325577, 17718291, 17861121, 18175089, 18512198, 18903010, 19213198, 19420003, 19765171, 20075274, 20433488, 20775916, 21296375, 21768248]
4167B1768248M43223M06639M33345M93545L80953N75226N12673L91194N16939
4158B5921985N11714N24715M85025N53752N10122N47562N54924N58881N37500
4149C0706180N69170P23092O13750O18528M68207Q72864Q26797P68417R32740
4140C7099745Q29546Q92564R83520J129764J014282J150326J391768J680064J498855
4131D7670434J754182K024302K055659K332833K442974K591522K898730L178263
4123F6948899L356767L678691L796089M251707M656683N004191N417002O255211
4115A03365240O818430P398172Q245269Q595740Q774929Q765182R262822J0211451
4107A71437235J1706023J3331422J5455279J7360626J8960481J9405784J9109038
$$ y = [21768248, 22211471, 22618110, 23051455, 23545000, 23925953, 24501179, 25013852, 25405046, 25921985, 26433699, 26958414, 27443439, 27997191, 28507313, 29054875, 29609799, 30168680, 30706180, 31275350, 31998442, 32612192, 33230720, 33698927, 34571791, 35398588, 36167005, 37099745, 37929291, 38821855, 39805375, 40935139, 41949421, 43099747, 44491515, 46171579, 47670434, 49424616, 51448918, 53504577, 55837410, 58280384, 60871906, 63770636, 66948899, 70305666, 73984357, 77780446, 82032153, 86688836, 91693027, 97110029, 103365240, 110183670, 117581842, 125827111, 134422851, 143197780, 151962962, 161225784, 171437235, 183143258, 196474680, 211929959, 229290585, 248251066, 267656850, 286765888]
4100B86765888J7199002J4175687R388592L852340k064942p693822j3127474j8271528
4092B90223743k2181588k3558103k2642514k0216498j7403748j4696453j2393526
4085A57131313j0603314r050142p868625p070740o352506n802109n039210m596832
4077A00747835m019417l545412k939308k524944k294758k095033j775750j673918
4069G9879295j694974j513068j302952j315612j317888j271766q83561q40301
4061F9739173m54577m88054o89826p52842n72307m62981k18912p2680K11335L66980
4051F6605309Q08166J163822J252840J558895K114656K261210K599428L128107
4043H1492433L582820L846722L980214M380236M994668N800215O488304P363378
$$ y = [286765888, 303964890, 318140577, 327529169, 331381509, 329316567, 321622745, 308495271, 290223743, 268042155, 244484052, 221841538, 201625040, 184221292, 169524839, 157131313, 146527999, 137477857, 129609232, 122538492, 116185986, 110383877, 105344667, 100747835, 96728418, 93183006, 90243698, 87718754, 85423996, 83328963, 81553213, 79879295, 78184321, 76671253, 75368301, 74052689, 72734801, 71463035, 70579474, 69739173, 69284596, 68796542, 68106716, 67353874, 66781567, 66318586, 66099674, 66026994, 66238329, 66605309, 67413475, 68577297, 69830137, 71389032, 73503688, 75764898, 78364326, 81492433, 85075253, 88921975, 92902189, 97282425, 102277093, 108077308, 114565612, 121928990]
4035A21928990Q616201R912578J1531806J4540538J3700206P294519O231732Q599328
4027B02355898J2072233J6320955K0549473K8922270L4890257M1280761M2076224
4020C98468071L9416146L8066149K8656559J6067229P792625j3466642j7946704
4013D97053433k1943145m7271474o9404862o5224116m7480240l5805089k5926362
4006A83998145j9268108j4633425j1658681r310656q231706p367825p469758o790734
3998I9267252o529563n505597m631892l670095l171639k447550k176007j764323
3990F9370586j723909j490682j454423j260881j151913q07302p39280n14224m72155
3981E9755817j32423j17530o1322j02237p4784j74537k0407Q5067L50408K70684
$$ y = [121928990, 130545191, 140457769, 151989575, 166530113, 180230319, 187524838, 193756570, 202355898, 214428131, 230749086, 251298559, 280220829, 315111086, 356391847, 398468071, 437884217, 475950366, 504606925, 520674154, 528466779, 515000137, 497053433, 475110288, 427838814, 358433952, 293209836, 245729596, 209924507, 183998145, 164730037, 150096612, 138437931, 129127275, 120895569, 113527744, 106057986, 99267252, 92737689, 87232092, 82600200, 78930105, 75758466, 73310916, 71134909, 69370586, 67646677, 66155995, 64701572, 63440691, 62288778, 61481476, 60742196, 60227972, 59755817, 59623394, 59505864, 59444542, 59342305, 59267521, 59092984, 59072577, 59157644, 59508052, 59778736]
3971E9778736M34612M48288P26598J033713J146097J308223J648562J681439J873910
3962G0080178K035955K267896K301705K487080K526999K690562K833556K931661
3954I0155592L101525L066142L112511L241274L325231L355871L189092L258564
3946A15805802L269631L269474L298167L064070K770010K655330K592497K418961
3938A39143942K162028K082510J921181J802839J501758J372809J127277Q24877
3930A51939221O82706M47066J04169k34139n43673p60623j011079j246234j519202
3921A47858212j741857j885948k036944k304799k391998k592026k706132k891494
3913A29307014k965675l205332l286838l258830l414691l545676l649397l657391
$$ y = [59778736, 60213348, 60661636, 61388234, 62421947, 63568044, 64876267, 66524829, 68206268, 70080178, 72116133, 74384029, 76685734, 79172814, 81699813, 84390375, 87223931, 90155592, 93257117, 96323259, 99435770, 102677044, 106002275, 109358146, 112547238, 115805802, 119075433, 122344907, 125643074, 128707144, 131477154, 134132484, 136724981, 139143942, 141305970, 143388480, 145309661, 147112500, 148614258, 149987067, 151114344, 151939221, 152621927, 153068993, 153173162, 152939023, 152395350, 151634727, 150623648, 149377414, 147858212, 146116355, 144230407, 142193463, 139888664, 137496666, 134904640, 132198508, 129307014, 126341339, 123136007, 119849169, 116590339, 113175648, 109629972, 105980575, 102323184]
3905A02323184l570525l450841l598115l473412l365687l303630l233172l129550
3897G5198252l135058k925096k842261k855216k777567k762491k606747k459028
3889E2834788k269039k256042k152906j890641j821412j700372j700566j621194
3881C7422616j606118j455779j333404j144882j217218j091369j078193r45513
3873B7550140r49079r33547q41129q41881q85536q64780p70183o28639o73619
3864B0161747n82244n67089n25890n39241m45051l29034l41419m00174l04524
3855A6127081k97188k06319k09862j60931j63414j48870k38865j76688j11289
3846A4413655j89855j66169j99373j72097j78456j00975K9264r5804r8163m7098
$$ y = [102323184, 98752659, 95301818, 91703703, 88230291, 84864604, 81560974, 78327802, 75198252, 72063194, 69138098, 66295837, 63440621, 60663054, 57900563, 55293816, 52834788, 50565749, 48309707, 46156801, 44266160, 42444748, 40744376, 39043810, 37422616, 35816498, 34360719, 33027315, 31882433, 30665215, 29573846, 28495653, 27550140, 26601061, 25667514, 24826385, 23984504, 23098968, 22234188, 21464005, 20835366, 20161747, 19579503, 19012414, 18486524, 17947283, 17502232, 17173198, 16831779, 16431605, 16127081, 15829893, 15623574, 15413712, 15252781, 15089367, 14940497, 14701632, 14524944, 14413655, 14223800, 14057631, 13858258, 13686161, 13507705, 13406730, 13435994, 13340190, 13242027, 13194929]
3836A3194929k6489j40660j54548q6454M7661K2919k8442K6149o7269j74866l9025
3825A2573905J010l7174j5674K6188J8278O104P2689Q9262m0457Q4785J34791
3814A2913707O0308J36244R7897k268O5075M7225K1409N4142M3342p4026j15647
3803A3247408k9076p6182k17235o4613p0081r4676o3700j98300L1118l0515l9503
3792A2394645r5648j17601q1286k2858l8066K7940j5923l9425n1916Q7720L643
3781A2051225N266L8470N4606M570o9944O9735R5868L7657N1949o233N7325P0691
3769A2461185J8114p821n5754K8647R2528N1142Q7589P7159P3191J00131J14934
3758A3041045K02821J94738J03708J96166K45398J80575N9274J02507J92936L20064
$$ y = [13194929, 13168440, 13027780, 12873232, 12786778, 12834439, 12857358, 12828916, 12855065, 12787796, 12612930, 12573905, 12574915, 12537741, 12522067, 12548255, 12566533, 12572637, 12645326, 12734588, 12694131, 12778916, 12913707, 12974015, 13110259, 13208156, 13205888, 13270963, 13318188, 13339597, 13393739, 13437081, 13363055, 13247408, 13218332, 13142150, 12924915, 12860302, 12790221, 12695545, 12631845, 12433545, 12464663, 12434148, 12394645, 12298997, 12181396, 12100110, 12077252, 12039186, 12067126, 12051203, 12011778, 11959862, 12047582, 12051225, 12056491, 12094961, 12149567, 12154137, 12084193, 12153928, 12249796, 12287453, 12339402, 12333169, 12390494, 12461185, 12479299, 12471478, 12415724, 12444371, 12536899, 12588041, 12675630, 12752789, 12825980, 12926111, 13041045, 13243866, 13438604, 13542312, 13738478, 13983876, 14164451, 14223725, 14326232, 14519168, 14839232]
3748A4839232J68638P0565J16347J04972J8581J81235J21289L115J17206M3784
3738A5784964Q8494M7375J06042J85399J08606J63682K25533J87077K06193K01081
3728A7304446K08944J45111J14592P313r073j61440q2983j01610j53985p0778
3718A7200537j33277L1259Q0453P7625M7346K8482M9747J64844P7961J73770J89161
3707A7987908J44558L2687J26029J17877J01683K03030M3957j0285J51218J72804
3697A9071466J21605J68335J16623M8448J56808L08808J58514K25935J87040J64432
3687B0728014j6034J34917J64359J81114J37740J02322M6034J73848K09333J36489
3677B1998136L00684J19873K10856K32230K08814K50431L16825K24363L39681
$$ y = [14839232, 15007870, 15078435, 15194782, 15299754, 15318335, 15499570, 15620859, 15623974, 15741180, 15784964, 15873458, 15920833, 16026875, 16212274, 16320880, 16484562, 16710095, 16897172, 17103365, 17304446, 17513390, 17658501, 17773093, 17780406, 17771333, 17609893, 17526910, 17425300, 17271315, 17200537, 17067260, 17098519, 17178972, 17256597, 17303943, 17332425, 17382172, 17547016, 17624977, 17798747, 17987908, 18132466, 18165153, 18291182, 18409059, 18510742, 18713772, 18757729, 18747444, 18898662, 19071466, 19193071, 19361406, 19478029, 19526477, 19683285, 19992093, 20150607, 20376542, 20563582, 20728014, 20711980, 20846897, 21011256, 21192370, 21330110, 21432432, 21478466, 21652314, 21861647, 21998136, 22298820, 22418693, 22629549, 22861779, 23070593, 23321024, 23637849, 23862212, 24201893]
3668B4201893K59726K86435L08199K90566L14440L17067L18635L70021L31698
3659B6998680K96260L12345M01331L98095L90942M14232M23058M47368M85775
3650C0568086L86284M86897N31470N87054O03820O14584O87927N76996Q44992
3641C5888110P90368Q51697R05382R47773Q27373R70630R89688J156857J162577
3632D4490455J225814J313506J414285J554156J337211J614645J697622J706741
3624E6354435J771631J907460J819367J859673J958034J963534J863794J822501
3616G1320429K050292J812354J757982J798892J979791J739755J642198J585382
3608H5687075J636772J568170J396165J375276J267149J135055J227867J107694
$$ y = [24201893, 24461619, 24748054, 25056253, 25346819, 25661259, 25978326, 26296961, 26666982, 26998680, 27294940, 27607285, 28008616, 28406711, 28797653, 29211885, 29634943, 30082311, 30568086, 30954370, 31441267, 31972737, 32559791, 33163611, 33778195, 34466122, 35043118, 35888110, 36678478, 37530175, 38435557, 39383330, 40210703, 41181333, 42171021, 43327878, 44490455, 45716269, 47029775, 48444060, 49998216, 51335427, 52950072, 54647694, 56354435, 58126066, 60033526, 61852893, 63712566, 65670600, 67634134, 69497928, 71320429, 73370721, 75183075, 76941057, 78739949, 80719740, 82459495, 84101693, 85687075, 87323847, 88892017, 90288182, 91663458, 92930607, 94065662, 95293529, 96401223]
3600I6401223J006892R33180Q65525R69206R98125R30752Q82649R17379R35357
3591A04840288R83766R60116J059326J151329J167438J297033J518173J440364
3583A14417833J663809J795773J893559K161310K334548K485208K664572L003882
3575A32420494L155142L486511L660125L856032M234919M436872M623795M923763
3567A64797653N089168N249125N630796N686334N816760N973546O258643O314365
3559B10816390O515443O473962O621995O778069O788743P155650P173712P277023
3551B65600987P400054P496205P604416P807145Q040225Q028098Q264440Q343231
3543C28584801Q589085Q909366Q984171R016853R327316R420378R314993R277411
$$ y = [96401223, 97408115, 98341295, 99206820, 100176026, 101174151, 102104903, 102987552, 103904931, 104840288, 105824054, 106784170, 107843496, 108994825, 110162263, 111459296, 112977469, 114417833, 116081642, 117877415, 119770974, 121932284, 124266832, 126752040, 129416612, 132420494, 135575636, 139062147, 142722272, 146578304, 150813223, 155250095, 159873890, 164797653, 169886821, 175135946, 180766742, 186453076, 192269836, 198243382, 204502025, 210816390, 217331833, 223805795, 230427790, 237205859, 243994602, 251150252, 258323964, 265600987, 273001041, 280497246, 288101662, 295908807, 303949032, 311977130, 320241570, 328584801, 337173886, 346083252, 355067423, 364084276, 373411592, 382831970, 392146963, 401424374]
3535D01424374Q923349Q320531P756492P095376O070326M966515M017864K976876
3527D51551703J924838R30319n8741q73651j732285k398949l142614m033128m751662
3518D37415830n366907o233559p096383p823281q521656r105745r754913j0236243
3510C73277143j0561197j0599052j0542378j0338011j0139545r953007r614795
3503C01529158r332952q940859q728480q258301q135798p860272p632837p461206
3495B35178453p341796p232927o956189o771654o638990o567165o269393o115893
3487A81284446n865829n802066n593941n413170n407258n122602m787393m836656
3479A38455531m635548m291066m128181l938855l512305l382009l184234k893024
$$ y = [401424374, 410347723, 418668254, 426424746, 433520122, 439590448, 444556963, 448574827, 451551703, 453476541, 454406860, 454348119, 453474468, 451742183, 449343234, 446200620, 442167492, 437415830, 432048923, 425815364, 418718981, 410895700, 402374044, 393268299, 383513386, 373277143, 362715946, 352116894, 341574516, 331236505, 321096960, 311143953, 301529158, 292196206, 283255347, 274526867, 266268566, 258132768, 250272496, 242639659, 235178453, 227836657, 220603730, 213647541, 206875887, 200236897, 193669732, 187400339, 181284446, 175418617, 169616551, 164022610, 158609440, 153202182, 148079580, 143292187, 138455531, 133819983, 129528917, 125400736, 121461881, 117949576, 114567567, 111383333, 108490309]
3471A08490309k617272k396328k070410j912884j654679j395752j300421j106153
3463I4036410j072343r41770q71336p16529p86637p69533p24388o53792p22883
3454H6777199q44315q16515q66935q50009p48619q29410q98575r90629j033633
3445G8898559j139452j199112j333688j261471j521306j594334j620481j737489
3437F7491226j697454j633828j747722j794410j634685j735112j765181j736814
3429E3746020j671510j628457j642170j644506j556261j558513j470463j477893
3421D1096247j561628j428628j307255j274965j132249j097815j043692j070631
3413C1179384r62973q67596q08606q70735p45983p65677o31405o52377p58687
$$ y = [108490309, 105873037, 103476709, 101406299, 99493415, 97838736, 96442984, 95142563, 94036410, 92964067, 92022297, 91150961, 90434432, 89647795, 88878262, 88153874, 87500082, 86777199, 85932884, 85116369, 84249434, 83399425, 82650806, 81821396, 80922821, 79932192, 78898559, 77759107, 76559995, 75226307, 73964836, 72443530, 70849196, 69228715, 67491226, 65793772, 64159944, 62412222, 60617812, 58983127, 57248015, 55482834, 53746020, 52074510, 50446053, 48803883, 47159377, 45603116, 44044603, 42574140, 41096247, 39534619, 38105991, 36798736, 35523771, 34391522, 33293707, 32250015, 31179384, 30216411, 29348815, 28540209, 27669474, 26923491, 26157814, 25526409, 24874032, 24115345]
3404B4115345n71557n80228n89086m48977m43151m05136n16233m78939m10028
3395A9672010m43492m26518l01193l87248l90724j91904l04755l57552l68573
3386A6500051k46458l03638k66041j91918k90655l66198j67168k13409l54012
3377A4100554j97906k07894l13221j54708j85411k12749j95584j89034k18349
3368A2225698j97605k51769j85975j67780j12674k22512k50895k43141j09256
3359A0484091j51288q3981q5596k05424k35565j50914j35754j58280j95085q6470
3349H995734j50040j36345j59576k15340j24582k18629j64455k15878j69990j52557
3339G288342j05938j52269j1424j89534j99451j12218q4419j05133j44292r393
$$ y = [24115345, 23543788, 22963560, 22374474, 21925497, 21482346, 21077210, 20560977, 20082038, 19672010, 19228518, 18802000, 18500807, 18113559, 17722835, 17530931, 17226176, 16868624, 16500051, 16253593, 15949955, 15683914, 15491996, 15201341, 14835143, 14667975, 14454566, 14100554, 13902648, 13694754, 13381533, 13226825, 13041414, 12828665, 12633081, 12444047, 12225698, 12028093, 11776324, 11590349, 11422569, 11309895, 11087383, 10836488, 10593347, 10484091, 10332803, 10248822, 10163226, 9957802, 9722237, 9571323, 9435569, 9277289, 9082204, 8995734, 8845694, 8709349, 8549773, 8334433, 8209851, 7991222, 7826767, 7610889, 7440899, 7288342, 7182404, 7030135, 7018711, 6829177, 6629726, 6517508, 6433089, 6327956, 6183664, 6174271]
3329F174271J2621o5549o9579j36821j03626r0272r4207r3489k02100J7039M3078
3318E391366m4523m5175r7055r4247j23151j76987n167j0750j65411p5082K5925
3307D579743J8639r7644k426q3134j06935o5673M3640j08049J2057n5868j01778
3296D032572m596k2958j50478k7072L6886k6785P8907j8893J3820l4549l5171
3285C841683o9612k3401m304J22526j6377n2867m1090M9471j283k6569N2131M4435
3273C874743N2478n3023N0130q8721J14788K262K5190K5398m2693N5714O2122
3262D078388J07829O5545k9537j3723O1599J15384Q3749l6997K2660O8332K2992
3251D546221N5457J29083M2992L6771N740l7170j1105J31960R9382Q995L4509
$$ y = [6174271, 6186892, 6121343, 6051764, 5914943, 5811317, 5721045, 5626838, 5533349, 5331249, 5348288, 5391366, 5346843, 5301668, 5204613, 5110366, 4987215, 4810228, 4805061, 4794311, 4628900, 4553818, 4579743, 4598382, 4500738, 4498312, 4415178, 4308243, 4242570, 4286210, 4178161, 4190218, 4134350, 4032572, 4027976, 4005018, 3854540, 3827468, 3864354, 3837569, 3916476, 3897583, 3911403, 3876854, 3841683, 3772071, 3748670, 3744366, 3866892, 3850515, 3797648, 3756558, 3806029, 3804746, 3778177, 3830308, 3874743, 3927221, 3874198, 3924328, 3835607, 3950395, 3952657, 3977847, 4003245, 3960552, 4016266, 4078388, 4186217, 4251762, 4222225, 4208502, 4270101, 4385485, 4469234, 4432237, 4454897, 4523229, 4546221, 4601678, 4730761, 4773753, 4810524, 4816264, 4779094, 4767989, 4899949, 4999331, 5008326, 5042835]
3240E042835J50598J8830k2286o4522K8867L1881o120l6270l1885j231o2037j4599
3228E034061M7569M2865l2642j26589J1911j4060q9842j5228J95J01691L1288
3217D991219k7895M0556l3057q3957n2669N9326J1251p7736L851J04620N5467
3206D990976L6750o4624q7191m6244o7968k7505m861M4789j21233l1609p6373
3195D544907k0062J63470K7091P0743M6347J8943O1977J2287J0910L5480m3259
3184D928834J26002O3512j9973J78844M0755O6385J68755Q5699J02087M8782J71394
3173E961076L17986K25825K56844L61659L63402K42304L12735J86934R2351J43034
3163H464150J7945k11142k08050k45535k41873l42279m19222l73217j60335P2697
$$ y = [5042835, 5193433, 5212263, 5189977, 5125455, 5154322, 5186203, 5180083, 5143813, 5111928, 5110697, 5048660, 5034061, 5081630, 5124495, 5091853, 4965264, 4977175, 4963115, 4873273, 4858045, 4858240, 4959931, 4991219, 4963324, 5003880, 4970823, 4886866, 4834197, 4893523, 4904774, 4827038, 4830889, 4935509, 4990976, 5027726, 4963102, 4875911, 4829667, 4761699, 4734194, 4729333, 4774122, 4652889, 4621280, 4544907, 4524845, 4688315, 4715406, 4786149, 4832496, 4851439, 4913416, 4925703, 4936613, 4972093, 4928834, 5054836, 5118348, 5098375, 5277219, 5317974, 5384359, 5553114, 5638813, 5740900, 5789682, 5961076, 6279062, 6504887, 6761731, 7123390, 7486792, 7729096, 8041831, 8228765, 8321116, 8464150, 8482095, 8270953, 8062903, 7817368, 7575495, 7233216, 6813994, 6440777, 6280442, 6353139]
3153F353139j25728m1505J02237Q5952J48355Q9582J12531J19768J77738J04374
3143G126443L37741L41392M99617N66308N94548N28570N87301O24471M95218M01758
3133A2103367L1696L7472k75245k96179l97471p05353r25196r24564q38736o56317
3123G153474o32771m97933k82684k62604j61700k4209j08485q5277j06753m4965
3113D946093n3337M9874J01650M0804M5848K40955L48357J55631K52784J89957
3103F318616J03588N0051p3355n4577k67586k31770k14124m58378m15223n82606
3093D174636l44622l58906l10199k33970k20585k77929j26184j21583j43562j04242
3083A932854j64886n7565r8427n8018j38156n2794l6160j3989j15942k6350j07446
$$ y = [6353139, 6227411, 6185906, 6288143, 6374095, 6522450, 6612032, 6724563, 6844331, 7022069, 7126443, 7464184, 7805576, 8305193, 8871501, 9466049, 9994619, 10581920, 11206391, 11701609, 12103367, 12135063, 12172535, 11897290, 11601111, 11203640, 10498287, 9573091, 8648527, 7809791, 7153474, 6520703, 6022770, 5740086, 5477482, 5315782, 5291573, 5183088, 5097811, 4991058, 4946093, 4892756, 4942630, 5044280, 5085084, 5130932, 5371887, 5720244, 5875875, 6128659, 6318616, 6422204, 6472255, 6398900, 6344323, 6076737, 5844967, 5630843, 5172465, 4757242, 4174636, 3830014, 3471108, 3160909, 2926939, 2706354, 2428425, 2302241, 2180658, 2037096, 1932854, 1767968, 1710403, 1611976, 1553958, 1415802, 1363008, 1326848, 1312859, 1196917, 1170567, 1063121]
3072A063121M5891N3014n8914j47158j12649Q6247K588n955L3878j29031j06394
3061G24638o0698K7185P804Q7788K589n7348j4904j53746J1656m8092j8790L8934
3049E47016N61K2447o293m728q0562M5229K4864l2426P064l339K7543k1977K7890
3036E53289p5560n330n7730Q6664J2073q553P8847q412p7191J0732p8835M2866
3024D72860J4774n2563P8369K4467K6716k0963m0l0446o6122M0256q0943O7652
3012D74017R6406j5603j18472q834L9465K8935J6437M2254J48670j14605l0366
3001E58304M9259j99729R336P0430Q0008J7977K046N1007r0272k0282q9545Q3287
2989E21826j2077K6248l0574K0763L6384j3721j04827l9590J2700m702L2142K9583
$$ y = [1063121, 1109012, 1162026, 1103112, 955954, 843305, 929552, 932140, 926185, 960063, 831032, 724638, 663940, 691125, 698929, 786717, 789306, 731958, 717054, 563308, 574964, 526872, 508082, 547016, 547577, 570024, 563731, 559003, 478441, 523670, 548534, 516108, 523172, 519833, 547376, 525399, 553289, 477729, 472399, 414669, 501333, 513406, 504853, 583700, 575288, 498097, 508829, 429994, 472860, 487634, 435071, 513440, 537907, 564623, 543660, 543620, 513174, 447052, 487308, 406365, 474017, 570423, 554820, 436348, 427514, 466979, 495914, 512351, 554605, 703275, 588670, 558304, 607563, 407834, 417170, 487600, 567608, 585585, 587631, 638638, 548366, 528084, 438539, 521826, 509749, 535997, 505423, 526186, 562570, 548849, 444022, 404432, 417132, 412430, 444572, 474155]
2977D74155J4011j03190K2216P474M5312N3372k4782n568Q903K212j15824m0003
2965C38288m7955J19273M6042k0602j95811L470j5905K2112R1882J9146L4697
2954C94637q7348j5825M9045O1630J8528L0251M959M5839q9612k0236l9368K4485
2942C76985j3575J2378k7132n1034p042j2739q042j9973J3402L2211Q870K9816
2930C34125l5400M8522r411k6576K480k4010L072R6161m2052L2939J3237n4912
2918C38175L0422m4957k7106M2935L4325k3710n3350N7657o5750o0123J19044
2907C47562k8396l8156K1605J4351n0468M8031L0051N8407N8369o7448p1877K5712
2895C47743n0586N4169n7799J6754J9419j609m3324l991k6651o2896L6159K0423
$$ y = [474155, 488166, 384976, 407192, 414666, 459978, 513350, 488568, 483000, 491903, 494115, 378291, 338288, 290333, 409606, 455648, 435046, 239235, 242705, 226800, 248912, 340794, 359940, 394637, 307289, 291464, 340509, 402139, 420667, 450918, 455877, 501716, 412104, 391868, 352500, 376985, 363410, 375788, 348656, 297622, 290580, 277841, 269799, 249826, 263228, 295439, 304309, 334125, 298725, 347247, 337836, 311260, 313740, 289730, 292802, 388963, 346911, 379850, 393087, 338175, 368597, 323640, 296534, 339469, 373794, 350084, 296734, 354391, 288641, 228518, 347562, 319166, 281010, 302615, 316966, 266498, 314529, 344580, 402987, 461356, 393908, 322031, 347743, 297157, 351326, 293527, 310281, 329700, 328091, 284767, 280776, 254125, 191229, 227388, 247811]
2883B47811L3632J47448k7597n6163l7878p5001K7331L6243N5075L1056o2508
2872C19449n2675N9538o2185J6134k847J02677J02184l1137r4686R506l8564M9620
2860C77014K5742M7774j32643j636K5910M8525q569J4917o725j9218L3806o5436
2848C39461L9793j12492k9112J01288L4008K7444j4662N6645m6030q8394N9773
2837C67722O1280Q475j59268L2775K6260L5662r0838j3264K0729J6128J7715k5067
2825B98309k0051J07345m7996m051O142p4108K6926J3897m4430P9985R87m0522
2813C02433j18994L9040j7608j59183J31718m3218N8410K9034n0620J04714l9643
2802B36083m9509P8827n9819n0348R1519L4630M153n4948n3311M823l7725o7940
$$ y = [247811, 281443, 428891, 401294, 345131, 307253, 232252, 259583, 295826, 350901, 381957, 319449, 266774, 326312, 264127, 280261, 277414, 380091, 482275, 451138, 356452, 365958, 327394, 377014, 402756, 450530, 317887, 316251, 342161, 390686, 382117, 397034, 390309, 371091, 404897, 339461, 379254, 266762, 237650, 338938, 372946, 400390, 385728, 442373, 396343, 307949, 367722, 429002, 437477, 278209, 310984, 337244, 372906, 282068, 268804, 289533, 305661, 323376, 298309, 278258, 385603, 337607, 333556, 339698, 265590, 292516, 306413, 261983, 341968, 342955, 302433, 183439, 222479, 204871, 45688, 177406, 134188, 192598, 221632, 171012, 275726, 236083, 186574, 265401, 205582, 155234, 246753, 281383, 285536, 230588, 177277, 182100, 144375, 76435]
2790G6435k1286r727P1992j9279k6794J00045m7897p273n3030o7297O1392J0593
2778F7874Q1895j0827p1311L8483j5475n8100M9309Q4552n7143q3547k1275o6148
2766f1713j0999N5383O7940Q932j03131R9525O4492J2901r6149k3579J973n6448
2754d0873R5643m9340l6364P9487Q779J507m2974R2413n5118q4615p8454N7045
2742e2864O5021k5117K9002q8297J3143P0423q1566J5486M2794O7700j04794K9100
2730a9969l0833r839o153j2374M3562P243O0363m9962n962j1566l9650o6439N210
2717a36369K9693Q9902J2245j6266O772n5333j3515o1942j1213l990K4134p7210
2705b13092J56043j2589p5234j548L3494j1505j05303J17494p721M9939R785n4129
$$ y = [76435, 55149, 45422, 117414, 98135, 71341, 171386, 123489, 116216, 63186, -4111, 57281, 67874, 149769, 138942, 67631, 106114, 90639, 32539, 81848, 166400, 109257, 25710, 4435, -61713, -72712, -17329, 50611, 59543, -43588, 55937, 120429, 133330, 37181, 13602, 15575, -40873, 54770, 5430, -30934, 48553, 57332, 58839, 15865, 108278, 53160, -31455, -109909, -52864, 12157, -12960, 16042, -72255, -59112, 11311, -70255, -54769, -11975, 55725, -49069, -19969, -50802, -60641, -66794, -79168, -35606, -28363, 32000, -17962, -23924, -35490, -75140, -141579, -136369, -106676, -16774, -4529, -20795, -14023, -69356, -82871, -144813, -156026, -160016, -135882, -213092, -57049, -69638, -144872, -146420, -112926, -124431, -229734, -112240, -119961, -70022, -60237, -114366]
2693a14366k7211j5176Q7785k671q8021K17309n1505j42611m5702Q6127n0716
2682a46758l9042Q148O7597q3116J507K9477l6602p897K5631Q8414j668n4044
2670a48353K3476j0311n1254p2739J57890N2655n6946k586J02386k1049K3367
2659c464L447r3140j053m4894l0447L7922O458m4542K4432l3123P206K8898J05633
2646c6667p8523L7128n006k5103J7060j20428J04321K9045L6509l8008K1230o6756
2634a25198k8207O1070n235Q6798p1043l3558r1113M3269M707L6538n1101J252
2622a71821J09420k4335j59598P2857K6516J7725M8621o6212p7560j344P1203
2611a54528L6363O1900q0495M2453j9557M9567J01201j06207q5785J2266r655
$$ y = [-114366, -141577, -156753, -68968, -71639, -159660, 57649, 6144, -136467, -182169, -96042, -146758, -185800, -177652, -110055, -193171, -191664, -162187, -198789, -206686, -181055, -92641, -94309, -148353, -124877, -135188, -186442, -259181, -101291, -48636, -105582, -108168, -5782, -26831, -3464, -17, -93157, -94210, -139104, -169551, -131629, -125171, -169713, -145281, -178404, -171198, -142300, -36667, -115190, -78062, -83068, -108171, -91111, -211539, -107218, -78173, -41664, -79672, -58442, -125198, -153405, -92335, -97570, -10772, -81815, -115373, -206486, -163217, -158510, -121972, -173073, -171821, -62401, -86736, -246334, -173477, -146961, -129236, -80615, -146827, -224387, -225731, -154528, -118165, -56265, -136760, -94307, -113864, -64297, 36904, -69303, -155088, -142822, -152477]
2600a52477N3348L4486P1122L462r1291p7726L8158Q754K4167K5318j12524J4635
2588a60568O0196L2783n7964o337L8012j9519j38509J2535J02426J14668q0686
2577a02963J6713l8119M9975m418j0630O827o2349P2449R5451m8714m6205M5936
2565b6047q486J3579J1196m9075P4957m5880J6343p2056j0886N8341n0901L213
2553h5702l2913N1359j9073j3955k885j9816m3599J22742m235j32115j5511R794
2541a85909M815P794K2732M7325l5325J4788j1636J3770L5688M9505q1054r5544
2529b13051N1123P2706k955o6777J14323j30845l9486O6285l1116J35343k5859
2518g0309p3711l5024K0162l0552N3910K3574k442J6324o3173N1602j9763j578
$$ y = [-152477, -99129, -64643, 6479, 9941, -81350, -159076, -120918, -112164, -87997, -62679, -175203, -160568, -100372, -67589, -125553, -131890, -93878, -113397, -251906, -239371, -136945, -22277, -102963, -86250, -124369, -74394, -78812, -89442, -82615, -144964, -72515, 22936, -25778, -71983, -26047, -34533, -20954, -9758, -58833, 16124, -29756, -13413, -85469, -96355, -38014, -88915, -85702, -118615, -67256, -86329, -100284, -103169, -122985, -166584, -43842, -48077, -180192, -195703, -185909, -181094, -173300, -150568, -103243, -138568, -123780, -135416, -121646, -85958, -36453, -117507, -213051, -161928, -89222, -92177, -158954, -44631, -175476, -214962, -148677, -179793, -44450, -70309, -144020, -179044, -158882, -189434, -135524, -111950, -114392, -98068, -161241, -109639, -129402, -130980]
2506a30980O7024p8057K1404k3079J33355M9538j06123l1952Q8506J5652n1568
2495d6280l2199K5235n5712q647j8283J40201j05761q8302K232m972k8688N3290
2483a67886M9749j0243M7137m6389M9378o2780J50100j4208k2933k5812n0209
2472a04096r128J533L9390R2080m8368r146k8063J8079J8611j30280m4890L7713
2460a66565L3967j0118J607J11126N8392j11816n0222P2713L1939j03563J00312
2449c2228J16422j29613r2342J48527L5272r8484o8263j285L9120R2522O8100
2438G7748q3138j2649l223k4175p209O213k0061p538l860m5874l5643J38869m7690
2425f8230l8503J20790M0125j21874L6585K1562o7356n33k7273M5777o8507K8353
$$ y = [-130980, -63956, -142013, -120609, -143688, -10333, 39205, -66918, -98870, -10364, 5288, -46280, -78479, -53244, -108956, -117603, -135886, 4315, -101446, -189748, -187516, -192488, -221176, -167886, -118137, -128380, -81243, -127632, -78254, -141034, 9066, -5142, -28075, -53887, -104096, -113224, -111691, -72301, 19779, -28589, -37735, -65798, -47719, -29108, -159388, -204278, -166565, -132598, -142716, -141109, -29983, 28409, -83407, -133629, -60916, -28977, -132540, -32228, 84194, -45419, -137761, 10766, 46038, -52446, -120709, -121994, -82874, 9648, 77748, -5390, -18039, -21262, -45437, -52646, -46433, -66494, -74032, -77892, -123766, -159409, -20540, -68230, -106733, 14057, 54182, -67692, -31107, -9545, -76901, -77434, -104707, -58930, -127437, -99084]
2413i9084M671r4003O1267M3643k3488L640K8724P2659l8974j2395K2110l134
2401c4364Q6762N318l3219n9025J8327J5041j0007m0071j06417N8989J3858l7210
2389a22018J13261P343l5681m1989m7980n5928M6111P1345j03548J02358J25108
2378E8382o5753n2472o812k3969J2051o5024M1795l453O4462N919m7813P9216
2366c471j6915j3966J7591J8576n6539J1493p4270p2N4327n9480o6892R1319K2170
2353g6129L6087m6949j3906J54168J8429p0217o6438q506M3334J16792L8370o4699
2341F0336r3619n4551P4332l5676J00748m6259k4178j9618r4782N7045q7009Q5604
2329g7627O0395Q1025K6110n3732k7265k3536j7838P4530j7311n8502j24450L5278
$$ y = [-99084, -94413, -188416, -127149, -83506, -106994, -103354, -74630, -1971, -40945, -53340, -31230, -34364, 52398, 57716, 24497, -34528, -16201, -1160, -11167, -51238, -157655, -98666, -84808, -122018, -8757, -1414, -37095, -79084, -127064, -182992, -136881, -65536, -169084, -66726, 58382, -7371, -59843, -66655, -90624, -78573, -143597, -101802, -105255, -40793, -34874, -82687, -3471, -20386, -34352, -16761, 1815, -54724, -43231, -117501, -117573, -63246, -122726, -189618, -98299, -76129, -40042, -86991, -100897, 53271, 71700, 1483, -64955, -73461, -30127, 86665, 125035, 60336, -33283, -87834, -13502, -49178, 51570, 5311, -18867, -38485, -133267, -76222, -163231, -77627, -17232, 63793, 89903, 36171, 8906, -14630, -32468, 42062, 24751, -33751, -158201, -122923]
2317a22923O2564K0857l455O9697o3052j4992n3556J2132M6863O2003q639K3328
2305C0827J45584r8181p2065p7835j5063m9122M9367N3368M5430O8276n4862l9939
2293a4215p8724p5854N2202O1787M2670j23306O0520j4202j8973l9616M091N9539
2281h4081N6576k6581o2773j1037P3018O7354n5934M6885o9134k631R60q8965
2269a56343J96L7394N2733K729o1365J64767p063J965J8111m2480j1227j3724
2257a4307j471n8947q219m1010K6467J2190k840J04072l9691j13041P1313J06092
2245D0608L1037n8748j7736o7792P9645n1359j3896L7646o7446l2945L5983J1927
2233g3076N8809N3165k926J043m5810K1642J6031l1923R863m1502J25849l4824
$$ y = [-122923, -60359, -39502, -42957, 26740, -36312, -51304, -104860, -92728, -45865, 16138, 7499, 30827, 176411, 78230, 6165, -71670, -86733, -135855, -86488, -33120, 12310, 80586, 25724, -14215, -92939, -168793, -116591, -54804, -12134, -135440, -74920, -89122, -108095, -147711, -143620, -84081, -27505, -54086, -116859, -127896, -54878, 12476, -43458, 3427, -65707, -68338, -67378, -156343, -156147, -118753, -66020, -63291, -124656, 40111, 33048, 35013, 53124, 10644, -583, -14307, -15778, -74725, -82944, -123954, -97487, -85297, -88137, 15935, -23756, -136797, -65484, 40608, 71645, 12897, -4839, -72631, 7014, -44345, -58241, -20595, -88041, -120986, -85003, -73076, -14267, 38898, 35972, 37015, -8795, 12847, 28878, -3045, 6818, -34684, 91165, 56341]
2221E6341l4012J208o4608K3110r9415J36846L4413k6525M9416m3455j05694j0802
2209h3177k6472K8139J38824M0232m7049l4136l9949M6521R800J573k9681M7897
2197E2522j3776l0081J361O2264K3768K5463j00730P1605L6730l9251L9536q4209
2185D5202n4430L9889q1442r814Q1141Q3311j9484r1679P4468Q3695P1076r3131
2173A28802j6935O204L7405N7752P514j74845M2855K7821O8183m0625O0693M9972
2161B54796n2022p4136O2569R0544o1595l8773L8714N0983q9103r557k0577J2766
2149A64609M754n1069K6082J55392L5056k3438o9758p7492O8793Q4193o7324l1763
2137B18035J01944P8011P1397J3749k8768j4162N5412l6821N9010P7474l1304
$$ y = [56341, 22329, 23537, -41071, -17961, -117376, 19470, 53883, 27358, 76774, 33319, -72375, -83177, -109649, -81510, 57314, 97546, 50497, 16361, -23588, 22933, 32733, 34306, 4625, 52522, 38746, 8665, 10026, 72290, 96058, 121521, 20791, 92396, 129126, 89875, 129411, 45202, -9228, 30661, -50781, -60595, 20546, 103857, 84373, -7306, 67162, 150857, 221933, 128802, 111867, 118071, 155476, 213228, 220742, 45897, 88752, 116573, 184756, 144131, 204824, 254796, 202774, 128638, 191207, 281751, 220156, 181383, 220097, 271080, 181977, 172420, 151843, 164609, 169363, 118294, 144376, 299768, 334824, 311386, 241628, 164136, 232929, 317122, 249798, 218035, 319979, 397990, 469387, 483136, 454368, 440206, 495618, 458797, 517807, 595281, 563977]
2126E63977m6079m608J19459O0703k3603J0613J431n3590L8182o4322m1755N0471
2114F10879J2660J01968K7236k0342J12672K2561M8804J07523N8292n0741L4142
2103A065654Q2463J25967O5508L6240K5971j4606J02614J19494M4440J68330J59509
2092A981584J15795J61350Q4433L3874J70761J73987J78356L63581K37808K58521
2082C760050L12935L28195M47012M97083N49691O80617L03584L02611M95211O22924
2072H299913R43969R48909J408265J516839J739447J852235J350124Q51375L34550
2063A9245626n86996r42947j092502k217608k947042k304493j648162j138152
2055F367724q01583n14765m94415l48573k89048l33790j82961k37232k68701k24088
$$ y = [563977, 517898, 513290, 632749, 693452, 669849, 680462, 681893, 628303, 666485, 602163, 560408, 610879, 623539, 725507, 752743, 732401, 845073, 867634, 916438, 1023961, 1082253, 1031512, 1065654, 1148117, 1274084, 1339592, 1375832, 1401803, 1387197, 1489811, 1609305, 1653745, 1822075, 1981584, 2097379, 2258729, 2343162, 2377036, 2547797, 2721784, 2900140, 3263721, 3501529, 3760050, 4072985, 4401180, 4848192, 5345275, 5894966, 6575583, 6879167, 7181778, 7676989, 8299913, 9243882, 10192791, 11601056, 13117895, 14857342, 16709577, 18059701, 18911076, 19245626, 18658630, 17715683, 16623181, 14405573, 11458531, 9154038, 7505876, 6367724, 5566141, 5051376, 4556961, 4208388, 3919340, 3585550, 3402589, 3165357, 2896656, 2672568]
2045B672568j57757l26423k72893j24563j66427q5252j02340j84233o9589r1837
2035A091254O6108j60936r4658N369Q269l3996r2225j3274m0606p2565L8673n1502
2023F49911r6488p2789J6291j05133k0740n610k6669k6660l0797N6780K2816l6642
2011C24270j32497j03709Q5113J9480J7676j2360j977J5698q4741o2408M966Q231
1999G7742m2823M4066R7226p3685P2826L3249N1959l7142m6205L176K0841N163
1987B06393j05019n7904p2338R0726J7704l9657p9440L9195k0517Q2209l9654
1976B1698o1087K0416Q2967k384j22467m4819M8570L6616k8488J13969K0476l1887
1964E3580j599k8935n7641j5477J30031n0369p6304J22371m064k9180o6273p7078
$$ y = [2672568, 2514811, 2188388, 1915495, 1790932, 1624505, 1539253, 1436913, 1252680, 1183091, 1091254, 1157362, 996426, 901768, 907137, 915406, 881410, 789185, 775911, 735305, 662740, 701413, 649911, 553423, 480634, 496925, 391792, 371052, 365442, 338773, 312113, 281316, 338096, 360912, 324270, 191773, 88064, 173177, 192657, 210333, 197973, 195996, 211694, 126953, 64545, 69511, 77742, 34919, 78985, 176211, 102526, 175352, 208601, 260560, 223418, 177213, 180389, 201230, 206393, 101374, 43470, -28868, 61858, 79562, 39905, -39535, -340, -20857, 61352, 21698, -39389, -18973, 63994, 61610, -60857, -105676, -57106, -20490, -48978, 64991, 85467, 53580, 51981, 23046, -34595, -50072, 79959, 29590, -46714, 75657, 71593, 42413, -23860, -100938]
1952a00938o0638P8842J98866l4055p6660j6127K1586j7812L8162m6161J9707
1941D772J0213M6975L3644m9572L2615r4436j00938K0041J9560O1084r037p03
1929b5782r544Q389J2364o6335N1415m0935n2101J03817J5652O4784q2749L1621
1917A0596q815J1218N1127l8015J1371p9746o5894Q3305p914R431j8240n6800
1905i8376J57925l6014K6674J1136j06919r943o4409n4009L3317P4100K5876M8378
1893G736m5673K228R430O477r8497M1423P8447o9807N34o3511J0224j45338N3444
1880b12883J59796L086L6426M5953j30060n4774k0939J68135L2725j08253k8147
1869a08935k7092m52J6812N5260q7995J05403L8960r9923J5362k5720n7281O5286
$$ y = [-100938, -161576, -82734, 116132, 82077, 5417, -10710, 10876, -6936, 31226, -14935, 4772, 14985, 61960, 95604, 46032, 78647, -15789, -116727, -96686, -77126, -16042, -25079, -25782, -35326, -26937, -14573, -80908, -29493, -70428, -122529, -18712, -3060, 61724, -21025, 10596, 1781, 12999, 64126, 26111, 37482, -42264, -108158, -24853, -32767, -23336, -41576, -98376, 59549, 23535, 50209, 61345, -45574, -55517, -119926, -173935, -140618, -66518, -40642, 7736, -37937, -35709, -26279, -19802, -118299, -76876, 1571, -68236, -67702, -131213, -120989, -266327, -212883, -53087, -50001, -13575, 32378, -97682, -152456, -173395, -5260, 27465, -80788, -108935, -136027, -136479, -119667, -64407, -152402, -46999, -8039, -107962, -92600, -118320, -175601, -110315]
1857a10315O0518l0619p7328O6067O8646n3159l4028J8428p885p8996K0106l515
1845a62080R0300j35567P8131M0172n426N0474q9897n4098J01998R8075p6335
1834f4253l1363k216P2376q6527L63J1641q919j2015L9888P1067n8342O5594l7525
1821d0231O481p4092K6242J131n1961K4599m4359m799M0257M7247P1901O940L2444
1808D1800r8433j16497o489J19289Q1502L6213l1193r3041O4649J21845J1361
1797A31006l8016k575m3575J1605k6061q1885L6565K8230k985j0258Q991K1890
1785C2932q8716P7318M2324M2120m9958L5934r1082k2932o134O4150o3807k1736
1773d9587j8377M7752L9342j07938n311M5964L7996o0656O510J01087o2371j46377
$$ y = [-110315, -49797, -80416, -157744, -91677, -23031, -76190, -110218, -91790, -99675, -178671, -158565, -162080, -71780, -207347, -129216, -89044, -94470, -43996, -133893, -187991, -85993, 12082, -64253, -95616, -97832, -25456, -111983, -111620, -99979, -108898, -120913, -81025, -9958, -68300, -2706, -40231, -33750, -107842, -81600, -80469, -132430, -107831, -152190, -156989, -116732, -69485, 2416, 9356, 41800, -56633, -173130, -179619, -60330, 21172, 57385, 26192, -66849, -2200, 119645, 131006, 92990, 90415, 46840, 58445, 32384, -49501, -12936, 15294, 12309, 2051, 11042, 32932, -55784, 21534, 63858, 105978, 56020, 91954, 872, -22060, -28194, 35956, -27851, -49587, -67964, -20212, 19130, -88808, -94119, -48155, -10159, -70815, -64305, 36782, -25589, -171966]
1761a71966k184N5867J37689k7640l3714o9115j597K8710o6456O0859J3388r9622
1749a75781p930P6882Q9673n5525o3020P4381J2311J1003J6164L5332q2122r8429
1737a67061N7666J18202n1468j43010k1273J48616L4826r830R4084m8033n0893
1726c8174L2268L6182l5334k081K4484j06918N2109n309j32961O3347M4002J1288
1714e7097j3921O4084q9066L1587J8567L5174l261O0938N4450j28497k9484l0994
1702h7520R5204n9668o5325K0724L0859J7432j8155J1277j9906R7286l5396p7738
1690i0926O2286j2241k8900k1486N8575M0407l7240K1969K3729J2355l2145p2871
1678g6488J1074M4303k0258m9071j5781Q048N0421L7861O7358q0517K4096k0803
$$ y = [-171966, -174150, -118283, 19406, -8234, -41948, -111063, -112660, -83950, -150406, -89547, -76159, -175781, -183711, -106829, -17156, -72681, -135701, -61320, -49009, -38006, -21842, 13490, -68632, -167061, -109395, 8807, -42661, -185671, -206944, -58328, -23502, -33332, 60752, 12719, -38174, -5906, 30276, -5058, -7139, 17345, -89573, -37464, -42773, -175734, -112387, -68385, -57097, -71018, -6934, -96000, -64413, -45846, -10672, -13933, 47005, 101455, -27042, -56526, -87520, 7684, -51984, -117309, -96585, -65726, -48294, -66449, -55172, -75078, 22208, -13188, -90926, -28640, -40881, -69781, -91267, -32692, 7715, -29525, -7556, 16173, 28528, -3617, -76488, -65414, -21111, -41369, -90440, -106221, -98173, -47752, -9891, 57467, -23050, 1046, -19757]
1666a9757p9588R173J02607n496m2128J1569l1509J2761k2775r0589L6264K5094
1654i4374o153l4589M493P9345k9798j3165K4510q390n6393m5369j5318N0095
1642a45106O1051K4996M6619K4073l8398q4149M6005M0100q7261r502m1283L2762
1630a30093O7592k6908j396O8l9937N3823l0220R0162L3076l5163n6285J5337
1618e9944p400l1756Q194O2723k1790q4808O6876K5498o3424Q6811l8448L4300
1606b3168o7066n8541K4413l2916L2956O7592n5737O5970L4402j05737N2143m5758
1594a11447M7412Q0759j343J9942q5931l6822Q9352J3979J9387o8828L0301N6676
1582E3437p7500l1520m4909P2671l067L392l877K0967q8302p418o743l1801Q6982
$$ y = [-19757, -99345, -90172, 12435, 6939, -35189, -23620, -55129, -42368, -65143, -155732, -119468, -94374, -100527, -135116, -130623, -51278, -81076, -94241, -69731, -78121, -134514, -179883, -195201, -145106, -84055, -59059, -12440, 11633, -26765, -110914, -64909, -24809, -112070, -121572, -162855, -130093, -62501, -89409, -90805, -90737, -130674, -76851, -107071, -16909, 16167, -18996, -75281, -59944, -67344, -99100, -90906, -28183, -49973, -134781, -67905, -42407, -105831, -19020, -57468, -23168, -90234, -148775, -124362, -157278, -124322, -56730, -112467, -46497, -12095, -117832, -65689, -111447, -64035, 16724, 15381, 35323, -50608, -87430, 1922, 15901, 35288, -33540, -3239, 53437, -24063, -55583, -100492, -27821, -30888, -27496, -31373, -10406, -98708, -106126, -112869, -144670, -57688]
1569e7688k8117J00594j11614L1257O4458q330p0992m9103L988L5662k2135M7272
1557f4748K0934J3028R157r1043J2603M8306r222L3922j4872k0086j6852k399
1545h1272L3257K7434M0639J5197m8035j035O3615j26851L1269J16846j4987q5725
1533b9648m9417L6437l9140K0756N2749n1145l7813N5577J06359j02226j248K8441
1521a0318N0031P3647j16888R326l315j3143n4005K5370k0301N9195O8180m7807
1509A9972o3696q3436J474q2241J00934M8485k9425J29521o9380J5895Q6138J7580
1497I1821o3199p8896J21712j12917m6855N8932o7560n316l5472k335N2967j3951
1485a01069l0244M4738K464j0824l2867K424R2R7803k32K4967l2703q961J9831
$$ y = [-57688, -85805, 14789, -96825, -65568, -1110, -9440, -80432, -129535, -125547, -89885, -112020, -64748, -43814, -30786, -21629, -112672, -100069, -51763, -60985, -27063, -41935, -62021, -78873, -81272, -48015, -20581, 20058, 35255, -12780, -13815, 49800, -77051, -45782, 71064, 56077, -29648, -79065, -42628, -81768, -61012, -8263, -59408, -97221, -41644, 64715, -37511, -38759, -10318, 39713, 113360, -3528, 5798, 2483, -10660, -64665, -39295, -59596, -401, 67779, 19972, -43724, -127160, -125686, -207927, -106993, -58508, -87933, 41588, -27792, -11897, 74241, 91821, 28622, -50274, 71438, -41479, -88334, -29402, -96962, -102278, -137750, -140085, -87118, -101069, -131313, -86575, -84111, -94935, -127802, -125378, -125286, -27483, -27715, -2748, -35451, -44412, -24581]
1472b4581P5189j6985k6172r1909p3262K2670K5534O4234k7345J931R2724j2380
1460I648n2458j7202Q2817p267k2954P4265l9086K8297q6869Q4924k431p4179
1448b2495m0155J3918P0217n1097N4947P8179k5330j2128o067o2345L1501O4078
1436I3223j6815j3371j71314O9493J28081j39576N5221J24693j706k9123o1256
1425C7550l9076o9642k1170J3180M8627L4369m3050o4245K0564O3277M5222O172
1413C1778j4802n2532L20j01953j4085R1312j6p3055k1488K8842P0891Q8568L1743
1400F5523l5255J3022j05579q2406P8785N3863J7820K7597q1809j29782n7894
1389b36115J06330J18594k7890j03801N0715P3997l2416l7760J852m6178K1612
$$ y = [-24581, 50608, 33623, 7451, -84458, -157720, -135050, -109516, -45282, -72627, -70696, 22028, 9648, -42810, -60012, 22805, 15538, -7416, 66849, 27763, 56060, -30809, 54115, 51684, -22495, -62650, -48732, 21485, -29612, 25335, 103514, 78184, 66056, 59989, -2356, 29145, 93223, 76408, 63037, -108277, -38784, 89297, -50279, 4942, 129635, 127929, 98806, 37550, -1526, -71168, -92338, -79158, -30531, 3838, -39212, -103457, -82893, -19616, 25606, 31778, 16976, -35556, -35236, -137189, -151274, -59962, -59978, -133033, -154521, -125679, -54788, 33780, 65523, 30268, 43290, -62289, -144695, -65910, -12047, 5773, 33370, -48439, -178221, -236115, -129785, -11191, -39081, -142882, -92167, -18170, -50586, -88346, -86494, -132672, -111060]
1378a11060N8607J04149P781j01510L1043k8687P902Q8188K0603p5568N4035O9098
1366A24581m6501o8920k2327J19334L7806l7368n0752o2000n3321K1105P1184
1355C2821O310k7100K3049N6030o0395P1799N8738j24485m9983M709r7943P0739
1343c5711L7265J22876M6868m4611o3058n1996J1155j11948M4075O6161P7077
1332I8153m3761l1787j9337l9043K3800k4123K7371N606L8781R655m5744p1987
1320g2416O5321K1737j6676L4057J606m7526o5622J3412R5502k1121m5444R715
1308b7455L1804J4775P535j1354l0606L1404o8062J0256k8213k340n1811J01926
1296b2141J00551l7491J9676o1106K0399m2784O0923m7039K9918k7616n869l1134
$$ y = [-111060, -52453, 51696, 59477, -42033, -10990, -39677, -31775, 56413, 77016, 1448, 55483, 124581, 78080, 9160, -13167, 106167, 143973, 106605, 55853, -6147, -59468, -38363, 32821, 39131, 12031, 35080, 91110, 30715, 102514, 161252, 36767, -13216, -8507, -106450, -35711, 1554, 124430, 171298, 126687, 63629, 11633, 22788, -89160, -45085, 21076, 98153, 54392, 22605, 3268, -35775, -11975, -36098, -8727, -3121, 35660, 45315, -429, -72416, -7095, 14642, -2034, 32023, 33629, -13897, -79519, -66107, 29395, 8274, -37170, -27455, 4349, 19124, 26659, 15305, -15301, 16103, -51959, -41703, -69916, -72256, -124067, -22141, 78410, 40919, 60595, -511, 19888, -22896, 38027, -9012, 20906, -6710, -12579, -43713]
1284d3713K9102J9275q1597P1580n728n6248O8368K3269K32O979M5095p5591J38608
1271A39631j36916l2323J20029j20359j8932N2947r5011l2138Q6508l50N3073
1260A6159L0802p202q8815K5548O7172p994r6247R73P5057k4825q1436o3431O1127
1247i3112O9922r0362P9623o778k6240J3702q156j8742N3121l4131J1501m1943
1235i1595j146O6571k5298M8641m7682k9189K2376N5210n1989M3639k7877o0948
1223i9287K0901j9437K3973k3295K6529J3637Q1878N0000J7177m3623q8592j5071
1211e5210L1524M4088J8560k3485L8443j8056O45O9620M3829p9299j2180j0636
1199D7843j4093j4911N5401M1150N2627k62309j76J27566J4287o6512l7161L7760
$$ y = [-43713, -14611, 4664, -76933, -5353, -11081, -67329, 1039, 24308, 24540, 31519, 76614, 1023, 139631, 2715, -29608, 90421, -29938, -48870, 4077, -90934, -123072, -36564, -36914, 16159, 46961, 39759, -49056, -23508, 43664, 35670, -60577, -59604, 15453, -9372, -90808, -154239, -93112, -23190, -113552, -33929, -40707, -66947, -53245, -61401, -80143, -27022, -61153, -49652, -91595, -92741, -26170, -51468, -2827, -50509, -79698, -57322, -2112, -54101, -10462, -38339, -99287, -78386, -97823, -73850, -97145, -70616, -56979, 24899, 74899, 92076, 48453, -40139, -55210, -23686, 20402, 38962, 15477, 53920, 35864, 36509, 106129, 149958, 70659, 58479, 47843, 33750, 18839, 74240, 115390, 168017, -94292, -94468, 33098, 47385, -19127, -56288, -18528]
1187a8528K2957Q1589o7463k809R4868n6061p3950O5247Q333J669l5514m7056
1175b6718k6989L2430P7407L7395L2612j27743q3849Q8518k7364L1582j0984j3302
1163a7005J5953O2802j24409J0442J22390j7839m6761j06538J35661k2066m8274
1152c5644J09629O2327j12043l0738l6624k4881J5706N470Q9377p765m7638j7511
1140c0335J6848Q7350j8447o2018J47647k1822o5875O0098p8812J4093k6604o2196
1128d0073o670L2164M4715m6836J05372K9493p6093m4092l0053M7287k9970k3502
1116c8258M4592k7200K8200j825O0489k5093j3236j6977N4751K6974l5105n6680
1104F32M085K7332P8244j24532r0253O2663M4391J0271L901O2909j01611J0504
$$ y = [-18528, 4429, 86018, 18555, 15746, 110614, 54553, -19397, 45850, 54183, 55852, 20338, -26718, -53707, -21277, 56130, 93525, 126137, -1606, -85455, 3063, -24301, 7281, -3703, -17005, -1052, 61750, -62659, -52217, 70173, 52334, 5573, -100965, 34696, 12630, -35644, 73985, 136312, 24269, -6469, -43093, -67974, -52268, -46798, 42579, 34814, -12824, -30335, -13487, 73863, 55416, -6602, 141045, 119223, 53348, 113446, 34634, 48727, 22123, -40073, -46743, -14579, 30136, -16700, 88672, 118165, 42072, -2020, -32073, 15214, -14756, -38258, 6334, -20866, 7334, 5509, 65998, 40905, 27669, 10692, 65443, 92417, 57312, 632, 4717, 32049, 110293, -14239, -104492, -41829, 2562, 12833, 16734, 79643, -21968, -11464]
1092a1464L8590j21506K3714K2388Q782l5214O9544k555J06519J4052l298j06199
1080C353p293L6865O169J2970j2749o783o3112k1430l2301J7205M9542l2701N4339
1067D074k7231J1151L8316k9050O4267m1000N0673q736M2392l531r0242m7183
1055c6100L7692m4791L1360k5789j3795J04920K9996R3o566o7992m1870j6081
1043d8923J85459P2899j32299L704J9857l394K6373Q239n1313p366k6457k4373
1031B2406o9366K8575Q0595M3318k9625j04198N9705l0352L2268L1040k2603L6340
1019G8103o4284n1220L9316o731n8720m3031r050M6847J03753l9787p0348p7468
1007a52620K8076J01153Q658j4968N8165P8762p7060j9161o7472l3645Q8108l5652
$$ y = [-11464, 27126, -94380, -70666, -48278, -39496, -74710, -5166, -7721, 98798, 112850, 109552, 3353, -3940, 32925, 39094, 52064, 39315, 32532, -30580, -52010, -84311, -67106, -17564, -50265, 4074, -23157, -12006, 26310, -2740, 61527, 20527, 71200, 62464, 104856, 101325, 11083, -36100, 1592, -43199, -11839, -37628, -51423, 53497, 83493, 83586, 77020, 9028, -32842, -48923, 136536, 209435, 77136, 80840, 100697, 97303, 123676, 131915, 80602, 73236, 46779, 22406, -46960, -18385, 62210, 105528, 75903, -28295, 31410, 1058, 33326, 64366, 41763, 78103, 13819, -37401, 1915, -4816, -63536, -106567, -115617, -68770, 34983, -4804, -75152, -152620, -124544, -23391, -14733, -29701, 28464, 107226, 30166, 11005, -56467, -90112, -2004, -37656]
995c7656R518r8037J75847R3759o23j39507l7013O0555l196k9090J6075L8677
983D9309J482N5427l8556l6765N8221J9195q0803p3724L2069J19771K9793j28516
971F903K57J33126k4267k35420J850Q1343N5282R9911j14196m2661n8114J16207
959B0221O3516r4296j0334k569L7305N6002m7587O39L8535r476o1175j2658J5714
946f163n609M4946M1570P5964j44870k7134k901M1002J9164q2701J03691j6200
934D0759K2390k5516J2539K7145j9107L0200n2327j4644L8858r896J20849j04772
922F6478n0381O8077p0788M087J2751K753M5121o1400M772o339l4062o344P7295
909E2020N883j55421M9718Q1766k8506Q9315k0106j64382n5114N6108J07861O8148
$$ y = [-37656, -28138, -126175, 49672, 143431, 142808, 3301, -33712, 26843, 23647, -5443, 10632, 49309, 50791, 106218, 67662, 30897, 89118, 108313, 27510, -46214, -14145, 105626, 135419, 6903, 7160, 140286, 116019, -119401, -117551, -36208, 19074, 118985, 4789, -37872, -95986, 20221, 83737, -10559, -20893, -23462, 13843, 69845, 22258, 22897, 61432, 51956, -9219, -21877, -6163, -11772, 33174, 74744, 150708, 5838, -21296, -24197, 16805, 35969, -46732, 56959, 40759, 63149, 37633, 50172, 77317, 58210, 88410, 36083, 21439, 60297, 50401, 171250, 66478, 16097, 84174, 13386, 17473, 30224, 32977, 78098, 16698, 21470, 15131, -18931, -25275, 52020, 57903, -97518, -47800, 33966, 5460, 94775, 74669, -89713, -144827, -88719, 19142, 87290]
$$ [...]
##END NTUPLES=NMR SPECTRUM
##END=
