##TITLE=1H_TG-2347-A1
 CDCl3
 8 sc, 
 16.02.2022
##JCAMPDX= 6.0         $$ Bruker NMR JCAMP-DX V2.0
##DATA TYPE= NMR SPECTRUM
##DATA CLASS= NTUPLES
##ORIGIN= UXNMR, Bruker Analytische Messtechnik GmbH
##OWNER= root
$$ XWIN-NMR		Version 3.5
$$ Wed Feb 16 10:45:52 2022 Russian Standard Time (UT+4h)  she@DPX200
##.OBSERVE FREQUENCY= 200.131346
##.OBSERVE NUCLEUS= ^1H
##.ACQUISITION MODE= SIMULTANEOUS
##.ACQUISITION SCHEME= undefined
##.AVERAGES= 8
##.DIGITISER RES= 18
##SPECTROMETER/DATA SYSTEM= spect
##.PULSE SEQUENCE= zg30
##.SOLVENT NAME= CDCl3
##.SHIFT REFERENCE= (INTERNAL, CDCl3, 0, 15.7238)
##AUDIT TRAIL= $$ (NUMBER, WHEN, WHO, WHERE, WHAT)
$$ ##TITLE= Audit trail, XWIN-NMR		Version 3.5
$$ ##JCAMPDX= 5.01
$$ ##ORIGIN= Bruker BioSpin GmbH
$$ ##OWNER= she
$$ F:/spectra/data/she/nmr/H-F/1/pdata/1/auditp.txt
$$ ##AUDIT TRAIL=  $$ (NUMBER, WHEN, WHO, WHERE, WHAT)
(   1,<2022-02-16 10:44:22.23 +0400>,<she>,<DPX200>,
      <created by zg, POWCHK disabled, PULCHK disabled
       configuration hash MD5:
       00 E9 B6 7A A2 85 ED C7 34 08 36 98 17 FE 4E 26
       data hash MD5: 16K
       E2 4F 41 B1 C8 BC AE 66 BA 68 74 4F 8A 7E 1C 83>)
(   2,<2022-02-16 10:44:26.04 +0400>,<she>,<DPX200>,
      <Start of raw data processing
       efp BC_mod = 2 LB = 0.24 FT_mod = 6 PKNL = 1 PHC0 = -16234.63 PHC1 = 19.20078 SI = 16K 
       data hash MD5: 16K
       1D CF D4 63 A2 07 94 55 5F 4D 27 31 42 5D C0 CF>)
(   3,<2022-02-16 10:44:49.57 +0400>,<she>,<DPX200>,
      <pk PHC0 = 3.658362 PHC1 = -6.399999 
       data hash MD5: 16K
       35 97 B4 75 4E 1E 02 E8 A0 4A 00 7D 1C 6C 98 33>)
(   4,<2022-02-16 10:44:53.31 +0400>,<she>,<DPX200>,
      <abs ABSG = 5 
       data hash MD5: 16K
       08 B3 B0 0D 03 8F C7 37 16 D5 A9 6D 6A DB 76 CB>)
$$ ##END=
$$ 
$$ hash MD5
$$ 19 E6 64 9C C6 5F BB D1 0B A3 73 AC C3 22 3B C1
##$RELAX= 
##$RELAX= 
##$RELAX= 
##$RELAX= 
##$RELAX= 
##$RELAX= 
$$ Bruker specific parameters
$$ --------------------------
##$DU= <F:/spectra>
##$EXPNO= 1
##$NAME= <H-F>
##$PROCNO= 1
##$TYPE= <nmr>
##$USER= <she>
##$AMP= (0..31)
100 100 100 100 100 100 100 100 100 100 100 100 100 100 100 100 100 100 
100 100 100 100 100 100 100 100 100 100 100 100 100 100 
##$AQSEQ= 0
##$AQ_mod= 1
##$AUNM= <au_zg>
##$AUTOPOS= <>
##$BF1= 200.13
##$BF2= 200.13
##$BF3= 200.13
##$BF4= 200.13
##$BF5= 200.13
##$BF6= 200.13
##$BF7= 200.13
##$BF8= 200.13
##$BYTORDA= 1
##$CFDGTYP= 0
##$CFRGTYP= 5
##$CHEMSTR= <none>
##$CNST= (0..31)
1 1 145 1 1 1 1 1 1 1 1 1 1 1 1 1 1 1 1 1 1 1 1 1 1 1 1 1 1 1 1 1 
##$CPDPRG= <>
##$CPDPRG1= <>
##$CPDPRG2= <>
##$CPDPRG3= <>
##$CPDPRG4= <mlev>
##$CPDPRG5= <mlev>
##$CPDPRG6= <mlev>
##$CPDPRG7= <mlev>
##$CPDPRG8= <mlev>
##$CPDPRGB= <>
##$CPDPRGT= <>
##$D= (0..31)
0 1.2 0 0 0 0 0 0 0 0.06 0 0.03 0 0 0 0 0.0002 0 0 0 0 0 0 0 0 0 0 0 0 
0 0 0 
##$DATE= 1644993861
##$DBL= (0..7)
120 120 120 120 120 120 120 120 
##$DBP= (0..7)
150 150 150 150 150 150 150 150 
##$DBP07= 0
##$DBPNAM0= <>
##$DBPNAM1= <>
##$DBPNAM2= <>
##$DBPNAM3= <>
##$DBPNAM4= <>
$$ [...]
##$SUBNAM2= <"">
##$SUBNAM3= <"">
##$SUBNAM4= <"">
##$SUBNAM5= <"">
##$SUBNAM6= <"">
##$SUBNAM7= <"">
##$SUBNAM8= <"">
##$SUBNAM9= <"">
##$SW= 18.0517287032376
##$SWIBOX= (0..15)
0 0 2 0 0 0 0 0 0 0 0 0 0 0 0 0 
##$SW_h= 3612.71676300578
##$TD= 16384
##$TD0= 1
##$TE= 0
##$TE2= 300
##$TE3= 300
##$TEG= 300
##$TL= (0..7)
0 120 120 120 120 120 120 120 
##$TP= (0..7)
150 150 150 150 150 150 150 150 
##$TP07= 0
##$TPNAME0= <>
##$TPNAME1= <>
##$TPNAME2= <>
##$TPNAME3= <>
##$TPNAME4= <>
##$TPNAME5= <>
##$TPNAME6= <>
##$TPNAME7= <>
##$TPOAL= (0..7)
0.5 0.5 0.5 0.5 0.5 0.5 0.5 0.5 
##$TPOFFS= (0..7)
0 0 0 0 0 0 0 0 
##$TUNHIN= 0
##$TUNHOUT= 0
##$TUNXOUT= 0
##$USERA1= <user>
##$USERA2= <user>
##$USERA3= <user>
##$USERA4= <user>
##$USERA5= <user>
##$V9= 5
##$VALIST= <valist>
##$VCLIST= <CCCCCCCCCCCCCCC>
##$VD= 0
##$VDLIST= <DDDDDDDDDDDDDDD>
##$VPLIST= <PPPPPPPPPPPPPPP>
##$VTLIST= <TTTTTTTTTTTTTTT>
##$WBST= 1024
##$WBSW= 4
##$XGAIN= (0..3)
0 0 0 0 
##$XL= 0
##$YL= 0
##$YMAX_a= 284783
##$YMIN_a= -509232
##$ZGOPTNS= <>
##$ZL1= 120
##$ZL2= 120
##$ZL3= 120
##$ZL4= 120
##$ABSF1= 15.71164
##$ABSF2= -2.340209
##$ABSG= 5
##$ABSL= 3
##$ALPHA= 0
##$AQORDER= 0
##$ASSFAC= 0
##$ASSFACI= 0
##$ASSFACX= 0
##$ASSWID= 0
##$AUNMP= <proc_1d>
##$AZFE= 0.1
##$AZFW= 0.1
##$BCFW= 0
##$BC_mod= 2
##$BYTORDP= 0
##$COROFFS= 0
##$CY= -3
##$DATMOD= 1
##$DC= 0
##$DFILT= <>
##$DTYPP= 0
##$F1P= 0
##$F2P= 0
##$FCOR= 1
##$FTSIZE= 16384
##$FT_mod= 6
##$GAMMA= 0
##$GB= 0
##$INTBC= 1
##$INTSCL= 0
##$ISEN= 128
##$LB= 0.24
##$LEV0= 0
##$LPBIN= 0
##$MAXI= 10000
##$MC2= 0
##$MEAN= 0
##$ME_mod= 0
##$MI= 1.114404
##$NCOEF= 0
##$NC_proc= -6
##$NLEV= 6
##$NOISF1= 3.799351
##$NOISF2= 2.8
##$NSP= 0
##$NTH_PI= 0
##$NZP= 0
##$OFFSET= 15.72375
##$PC= 1
##$PHC0= -16230.97
##$PHC1= 12.80078
##$PH_mod= 1
##$PKNL= yes
##$PPARMOD= 0
##$PSCAL= 0
##$PSIGN= 0
##$REVERSE= no
##$SF= 200.130005564638
##$SI= 16384
##$SIGF1= 3
##$SIGF2= 2
##$SINO= 5.538805
##$SIOLD= 16384
##$SREGLST= <1H.CDCl3>
##$SSB= 0
##$STSI= 16384
##$STSR= 0
##$SW_p= 3612.71676300578
##$SYMM= 0
##$S_DEV= 0
##$TDeff= 16384
##$TDoff= 0
##$TI= <>
##$TILT= no
##$TM1= 0
##$TM2= 0
##$TOPLEV= 0
##$USERP1= <user>
##$USERP2= <user>
##$USERP3= <user>
##$USERP4= <user>
##$USERP5= <user>
##$WDW= 1
##$XDIM= 16384
##$YMAX_p= 356988375
##$YMIN_p= -229090
$$ End of Bruker specific parameters
$$ ---------------------------------
##NTUPLES= NMR SPECTRUM
##VAR_NAME=  FREQUENCY,     SPECTRUM/REAL,   SPECTRUM/IMAG
##SYMBOL=    X,             R,               I
##VAR_TYPE=  INDEPENDENT,   DEPENDENT,       DEPENDENT
##VAR_FORM=  AFFN,          ASDF,            ASDF
##VAR_DIM=   16384,         16384,           16384
##UNITS=     HZ,            ARBITRARY UNITS, ARBITRARY UNITS
##FACTOR=    0.220516191357247, 1,           1
##FIRST=     3146.79419790004, 0,            0
##LAST=      -465.922565105742, 0,           0
##MIN=       -465.922565105742, -229090,     0
##MAX=       3146.79419790004, 356988375,    0
$$ Real data points
##PAGE= N=1
##DATA TABLE= (X++(R..R)), XYDATA
$$ [...]
7152C298839O2488J43304O4592J6919J46881O1717J39354L4343O0127P9918Q7263
$$ 3298839 3361327 3504631 3569223 3586142 3733023 3794740 3934094 3968437 4028564 4108482 4195745
7141D195745J92051Q9821O8202J04257P8865O9342J55969J65642J31644K77709
$$ 4195745 4387796 4477617 4545819 4650076 4728941 4798283 4954252 5119894 5251538 5529247
7131E529247K19459K10161J88971K18176K40091K18654K91390J36332J51178L50996
$$ 5529247 5748706 5958867 6147838 6366014 6606105 6824759 7116149 7252481 7403659 7754655
7121G754655L76773L24477M23041L38287L32169L19287K12712N2583J02257Q3407
$$ 7754655 8131428 8455905 8878946 9217233 9549402 9868689 10081401 10133984 10236241 10319648
7111A0319648P6545K13865K89983J32457K32607M08296M69228N20462N87533N04264
$$ 10319648 10396193 10610058 10900041 11032498 11265105 11673401 12142629 12663091 13250624 13754888
7101A3754888N66080Q32527R43994R06529J220102J397940J586799J994192K286741
$$ 13754888 14320968 15153495 16097489 17004018 18224120 19622060 21208859 23203051 25489792
7092B5489792K696224K959616L239728L068090K477468J512513N61253L9128k25832
$$ 25489792 28186016 31145632 34385360 37453450 39930918 41443431 42004684 42043812 41817980
7083D1817980k29671L26830M85856M83374K70989K26783q6108l35205l48123l25362
$$ 41817980 41588309 41915139 42400995 42884369 43155358 43382141 43296033 42960828 42612705 42287343
7073D2287343J27962R57198J650108J924403J637544J284603P58868N47926Q32601
$$ 42287343 42415305 43372503 45022611 46947014 48584558 49869161 50628029 51175955 52008556
7064E2008556J113719R22844L15154r42131k501929l809362m890725n219290n167592
$$ 52008556 53122275 54045119 54360273 53418142 50916213 47106851 42216126 36996836 31829244
7055C1829244m433180l753363k874492k061110j813836j383449j149268j009568
$$ 31829244 27396064 23642701 20768209 18707099 16893263 15509814 14360546 13350978
7047A3350978p87604r51006o52086n31181n02096m69879n04861l48058l65461
$$ 13350978 12563374 11612368 10960282 10429101 9927005 9457126 8952265 8604207 8238746
7038H238746k75729k19244k71342j80525j66854k42572j85971j01965j47690j10243
$$ 8238746 7963017 7743773 7472431 7291906 7125052 6882480 6696509 6594544 6446854 6336611
7028F336611j02070p6268p6202J4297J75579K8926Q0458L10367K65415L16206
$$ 6336611 6234541 6158273 6082071 6096368 6271947 6300873 6381331 6691698 6957113 7273319
7018G273319N32355O60837Q49050P60957O07990M71085j87411p33217j011771
$$ 7273319 7805674 8466511 9315561 10076518 10684508 11155593 10968182 10234965 9223194
7009I223194j129811j137687q17596o50304m01175m16530l19288l58058k33655
$$ 9223194 8093383 6955696 6138100 5487796 5086621 4670091 4350803 3992745 3759090
7000C759090q5104r3972k67853j30746N6613k10990k5110j39700j44926j12840
$$ 3759090 3673986 3580014 3312161 3181415 3238028 3027038 3001928 2862228 2717302 2604462
6990B604462L104K6960o1984j03418r9243m0029r8341r5451o0544n111l6712j10524
$$ 2604462 2607566 2634526 2572542 2469124 2369881 2329852 2231511 2136060 2075516 2070405 2033693 1923169
6978A923169P3084q5920j17102J33248n6200j40130J2719p7874L499j2934p1623
$$ 1923169 1996253 1910333 1793231 1926479 1870279 1730149 1742868 1664994 1668493 1655559 1583936
6967A583936p1016N0265j4812M7939n7622r4128j39827m2835n027J9574J42098
$$ 1583936 1512920 1563185 1548373 1596312 1538690 1444562 1304735 1261900 1256873 1276447 1418545
6956A418545j320j15903K3350j02219J5191j46874J6816N8382l921M221j5296
$$ 1418545 1417225 1301322 1324672 1222453 1237644 1090770 1107586 1165968 1162047 1166268 1150972
6945A150972l3317L3052m0136J3980J1365n1145q383J8648m5133l9362R2259j0252
$$ 1150972 1117655 1150707 1110571 1124551 1135916 1084771 1076388 1095036 1049903 1010541 1102800 1092548
6933A092548K742p8132l3744k1346M3173n9366K7580j8259J3910q6307M084J1795
$$ 1092548 1095290 1017158 983414 962068 1005241 945875 973455 955196 969106 882799 886883 898678
6921H98678k5877J19157n3699j10581L530p998N0445m9132M2834K6468Q8021k2564
$$ 898678 872801 991958 938259 827678 831208 823210 873655 824523 867357 893825 981846 959282
6909I59282o4R3544K5388r1499m7560j4827M1628j3719M8185n1349o9343Q9859
$$ 959282 959218 1052762 1078150 986651 939091 924264 965892 952173 1000358 949009 879666 969525
6897I69525q8323l1463M7138R656j9935M5844Q8726j23657p704J6441Q5372j2412
$$ 969525 881202 849739 896877 906533 886598 932442 1021168 897511 889807 906248 991620 979208
6885I79208j6845q1488o8732L0216j1097L6469j548j7544J00011n0336m6647m0789
$$ 979208 962363 880875 812143 842359 831262 867731 866183 848639 948650 898314 851667 810878
6873H10878k9424J3035m0707k1191J06263N201p509J4401r2959L101L9772j9914
$$ 810878 781454 794489 753782 732591 838854 844055 836546 850947 757988 761089 800861 780947
6861G80947L1609p1167m5935J14682k6182l3222q7345j8720J41509o2354j05016
$$ 780947 812556 741389 695454 810136 783954 750732 663387 644667 786176 723822 618806
6850F18806M58n5375O5474J4481K2080L1786k411m3012J9286p285o544q6270o404
$$ 618806 619264 563889 629363 643844 665924 697710 695299 652287 671573 664288 657744 571474 565070
6837E65070r6657N2962Q0851Q9962N9165m9935m6494m1467Q7851r7265k5751L3929
$$ 565070 468413 521375 602226 692188 751353 701418 654924 613457 701308 604043 578292 612221
6825F12221m9806L8584n7709k8506L6150J12287M679j38148k4563L1181P2755
$$ 612221 562415 600999 543290 514784 550934 663221 667900 529752 505189 536370 609125
6814F09125m6900j0556Q2942M862p8875r7494L8640o1128J48836j1666N0404K5388
$$ 609125 562225 551669 634611 639473 560598 463104 501744 440616 589452 577786 628190 653578
6802F53578q6963m9204O139J8749k9123l2656J13298J00619j02420k4766m9923
$$ 653578 566615 517411 523550 542299 513176 480520 593818 694437 592017 567251 517328
6791E17328M1464Q5722m742K2857q7353P998l8016R1615Q4530K9750j6794k0857
$$ 517328 558792 644514 639772 662629 575276 583274 545258 636873 721403 751153 734359 713502
6779G13502j9107j6626o5996m9545L465L0734k3674k1739L753j01348J32838P4398
$$ 713502 694395 677769 611773 562228 565693 596427 572753 551014 554767 453419 586257 660655
6767F60655m7133L8495L8199n7388j6292O8283l2620R457N3182j31709R3370J0713
$$ 660655 613522 652017 690216 632828 616536 684819 652199 661656 714838 583129 676499 687212
6755F87212L7489j39943L5427M3869l7622J5406n7080Q17K3652n6925o2285J14319
$$ 687212 724701 584758 620185 664054 626432 641838 584758 585575 609227 552302 490017 604336
6743F04336j00167j03455Q7763L5866M2535P432k388j4099l9358o0841O0400Q9794
$$ 604336 504169 400714 488477 524343 566878 574310 571922 557823 518465 457624 518024 607818
6731F07818j5367O3739k3881p0429J15403o3178n1544n7062r227O6682M2655Q2048
$$ 607818 592451 656190 632309 561880 677283 614105 562561 505499 496272 562954 605609 687657
6719F87657q6145o030m9501j19751N678J00524L9973j2443N8997o9555N3121k4339
$$ 687657 601512 595482 545981 426230 431908 532432 572405 559962 618959 549404 602525 578186
6707E78186J4057R0477m8411j43088J28139M4863q1113N2759Q8509q2392m132
$$ 578186 592243 682720 634309 491221 619360 664223 583110 635869 724378 641986 637854
6696F37854K6812l5780M4380N6202l075p1536O8260J5563J05091k5285o1450P3741
$$ 637854 664666 628886 673266 729468 726393 654857 723117 738680 843771 818486 757036 830777
6684H30777l8112p3681J63194Q0816L8236Q129q9302J6386M629R3420K5674n6322
$$ 830777 792665 718984 882178 962994 1001230 1009359 920057 936443 941072 1034492 1060166 1003844
6672A003844j08977N9728J22897j08766m5358j8993O2890j0849q6811j9993l1
$$ 1003844 894867 954595 1077492 968726 923368 904375 967265 956416 869605 849612 849581
6661H49581J34476L4713j1661M0007p9176o5534k2905o2467m8278m1424O9726
$$ 849581 984057 1018770 1007109 1047116 967940 902406 879501 817034 768756 727332 797058
6650G97058M3113k0616m7225n3335P9152L2758j6085n2009R5753Q9278r1532j0479
$$ 797058 840171 819555 772330 718995 798147 830905 814820 762811 858564 947842 856310 845831
6638H45831J1266r2378o6296M0072K4659O971Q35j4735K1891K4382N0590o7233
$$ 845831 857097 764719 698423 738495 763154 770125 770960 756225 778116 802498 853088 785855
6626G85855N2163R543L6345n7788L3868Q5222n3765j03301P734J78545R7697r3083
$$ 785855 838018 847561 883906 826118 859986 945208 891443 788142 795876 974421 1072118 979035
6614I79035J5897J5716J1018q962m6580J0635p2181J29884m6846K5735M3218q4211
$$ 979035 994932 1010648 1021666 1012704 966124 976759 904578 1034462 987616 1013351 1056569 972358
6602I72358K3912K9355p515j52895N826p9003m547M0408K2731j55147j0510l3728
$$ 972358 996270 1025625 1018110 865215 871041 792038 787491 827899 850630 695483 684973 651245
6590F51245r225P3491o4660j0795L4827k3848K0430K3498K1966q4020q1825m9595
$$ 651245 642020 715511 650851 640056 674883 651035 671465 694963 716929 632909 551084 501489
6578E01489O900J6480L8254j4841j02295J68K0519L5246J9184K7923m7583o4245
$$ 501489 508389 524869 563123 548282 445987 446155 466674 501920 521104 549027 501444 437199
6566D37199Q4894J57768q348o1575q1260j3659j20213P8270O7352j69331Q5452
$$ 437199 522093 679861 671513 609938 528678 515019 394806 473076 540428 371097 456549
6555D56549Q8655j7524N0339l024K5026n0392N452p60k995p3958K7845M0258q3424
$$ 456549 545204 527680 578019 574995 600021 549629 555081 554321 551326 477368 505213 545471 462047
6542D62047j02671n497r7233N9652R6508J3064K6778O0113m9382M0848n4012O8751
$$ 462047 359376 353879 256646 316298 412806 425870 452648 512761 463379 504227 450215 518966
6530E18966K6812J5125r8991O0155M9407r0334r1996P1485J10312K8100r2845
$$ 518966 545778 560903 461912 522067 571474 481140 389144 460629 570941 599041 506196
6519E06196L7788l0676j00269L9011j269j0252M7965L3272M11M1642o7058k3550
$$ 506196 543984 513308 413039 452050 450781 440529 488494 521766 522177 563819 496761 473211
6507D73211j79278O7415J58618J13732m1583r4657m2806N9121p9187j7956J51099
$$ 473211 293933 361348 519966 633698 592115 497458 454652 513773 434586 416630 567729
6496E67729j1764p523k3136P7073l8968j3600P838L3510O5658k5621o1373k0692
$$ 567729 555965 548442 525306 602379 563411 549811 557649 591159 656817 631196 569823 549131
6484E49131O2534j8086N1442o7183O1446r4115N568J7290P2493n0034n5207J1692
$$ 549131 611665 593579 645021 577838 639284 545169 550737 568027 640520 590486 535279 546971
6472E46971N0211l8726l3472M7669J3264N8273L0557q9406L2946j9694l1217M2198
$$ 546971 597182 558456 524984 572653 585917 644190 674747 585341 618287 598593 567376 609574
6460F09574l1743k1526M2105K6253r5743P7569M6350R8333K3382J5375O570r7762
$$ 609574 577831 556305 598410 624663 528920 606489 652839 751172 774554 789929 796499 698737
6448F98737L3555n2183N3155J312k4121j0933j9185K5991J4732r871R3978n1541
$$ 698737 732292 680109 733264 734576 710455 699522 680337 706328 721060 711189 805167 753626
6436G53626j05202m4756O0531M8672k1109n8468L860o7082M6301P7930J1896J11162
$$ 753626 648424 603668 664199 712871 691762 633294 637154 570072 616373 694303 706199 817361
6424H17361J12689m388j62184n3794J2841J5159q2227k9423N8491K7660n1227
$$ 817361 930050 925662 763478 709684 722525 737684 655457 626034 684525 712185 660958
6413F60958M7843n5473P5505J8501L5298O2015K3937L5499j8493p5952n5335K2503
$$ 660958 708801 653328 728833 747334 782632 844647 868584 904083 885590 809638 754303 776806
6401G76806J2426M1050q644J8052Q8119j1920L6934K7611R616k1426o9760L3585
$$ 776806 789232 830282 821638 839690 927809 915889 952823 980434 990050 968624 898864 932449
6389I32449K5041p2438K6149k568k3762j5778k8165k4370Q0570j1293L5227k6282
$$ 932449 957490 885052 911201 908633 884871 869093 840928 816558 897128 885835 921062 894780
6377H94780R8838J1572J2714K0493L946N2495j4306k0248N0207L7323l0253O6864
$$ 894780 993618 1005190 1017904 1038397 1042343 1094838 1080532 1060284 1110491 1147814 1117561 1184425
6365A184425N691K8441J455N8865n4490m2829O4852p3279n3632m526O5354p14
$$ 1184425 1190116 1218557 1220012 1278877 1224387 1181558 1246410 1173131 1119499 1114973 1180327 1179613
6353A179613k1980P8606m2658L5688J05898o4459Q370J31931Q016P7750K4286
$$ 1179613 1157633 1236239 1193581 1229269 1335167 1270708 1279078 1411009 1419025 1496775 1521061
6342A521061L2060l8412P1517P6861J15232J15004L5127P1187K15713J28469K5976
$$ 1521061 1553121 1514709 1586226 1663087 1778319 1893323 1928450 1999637 2215350 2343819 2369795
6331B369795K1395M958r601j56105j39783j03001j21620p8226l4591M3398J01619
$$ 2369795 2391190 2396148 2386547 2230442 2090659 1987658 1866038 1787812 1753221 1796619 1898238
6320A898238o9913L7520n2512O853k6411p699O3126M4333O660P2927k9154m6406
$$ 1898238 1828325 1865845 1813333 1820186 1793775 1786076 1849202 1893535 1900195 1973122 1943968 1897562
6308A897562J25838J08056J83430P5236M8566m4133R9760J23860j2988R6932J52444
$$ 1897562 2023400 2131456 2314886 2390122 2438688 2394555 2494315 2618175 2605187 2702119 2854563
6297B854563N131J88187J54679K01644L61981K28187L03982N41177M33551N69317
$$ 2854563 2859694 3047881 3202560 3404204 3766185 3994372 4298354 4839531 5273082 5842399
6287E842399Q04187P51086R45699J093922J450574J794112K156288K119404J243079
$$ 5842399 6646586 7397672 8343371 9437293 10887867 12681979 14838267 16957671 18200750
6278A8200750j73758j513134k463111k755935k254339j615412j066566p88007
$$ 18200750 18026992 16513858 14050747 11294812 9040473 7425061 6358495 5570488
6270E570488o87732m22617l10577l18224j93107k37209k45770j62099j47962j60449
$$ 5570488 4882756 4460139 4149562 3831338 3638231 3401022 3155252 2993153 2845191 2684742
6260B684742p6717o1235q2881p8381K9283n2830o9018j48767j32210J11835j35137
$$ 2684742 2608025 2546790 2463909 2385528 2414811 2361981 2292963 2144196 2011986 2123821 1988684
6249A988684r9686Q3562O3849J0875j6989J0617Q4499O8945N8314m368j53950
$$ 1988684 1888998 1972560 2036409 2047284 2030295 2040912 2125411 2194356 2252670 2248302 2094352
6238B094352J5853P9895m3583j61203j47590j02820m5314k1924m2279j1825m2396
$$ 2094352 2110205 2190100 2146517 1985314 1837724 1734904 1689590 1667666 1625387 1613562 1571166
6227A571166l5692j41605J9198O6779L8819m04q6924K3292p2074J3864O0704M5566
$$ 1571166 1535474 1393869 1413067 1479846 1518665 1518261 1431337 1454629 1382555 1396419 1457123 1502689
6215A502689k9530j1476j0920j65094m383M9816N3154J05525N1437o8551M1299
$$ 1502689 1473159 1461683 1450763 1285669 1281286 1331102 1384256 1489781 1541218 1472667 1513966
6204A513966N3473Q4397J03267k2666L5325N6892n218j07108o1399m1565m854
$$ 1513966 1567439 1651836 1755103 1732437 1767762 1824654 1819436 1712328 1650929 1609364 1604510
6193A604510r9207l2370Q1490j6152j47471J4549o3202M349J36638k6710m9918
$$ 1604510 1505303 1472933 1554423 1538271 1390800 1405349 1342147 1346496 1483134 1456424 1406506
6182A406506N317N7387j6105q12p5922M4348j1332k8317N131N2921R2900K9497
$$ 1406506 1411823 1469210 1453105 1452293 1376371 1420719 1409387 1381070 1386201 1439122 1532022 1561519
6170A561519j3472L1487J04803q930J4979p7448o6115K5689J7095j14732o4360
$$ 1561519 1548047 1579534 1684337 1675407 1690386 1612938 1546823 1572512 1589607 1474875 1410515
6159A410515k7078j15537j7674J08375K1867K8956K3608j4270j4872n2231M0484
$$ 1410515 1383437 1267900 1250226 1358601 1380468 1409424 1433032 1418762 1403890 1351659 1392143
6148A392143L5138j5530o0152O2478o0250K5218O7394O7350j6890J380j3029L6991
$$ 1392143 1427281 1411751 1351599 1414077 1353827 1379045 1446439 1513789 1496899 1498279 1485250 1522241
6136A522241J35181P0939j20963K3636L7571M5652n414o692k1201k0226M8022
$$ 1522241 1657422 1728361 1607398 1631034 1668605 1714257 1708843 1702151 1680950 1660724 1708746
6125A708746p2690K2967K5009J1758M0034K1171J0660O2200M9981m9699k3436
$$ 1708746 1636056 1659023 1684032 1695790 1735824 1756995 1767655 1829855 1879836 1830137 1806701
6114A806701J01867K2420N5401N6532J19232K4460j7698J7149P0353o0338J07380
$$ 1806701 1908568 1930988 1986389 2042921 2162153 2186613 2168915 2186064 2256417 2196079 2303459
6103B303459J01836L3690n6117j27642o7285N5616M7815j8814J0032Q8354K4315
$$ 2303459 2405295 2438985 2382868 2255226 2187941 2243557 2291372 2272558 2282590 2370944 2395259
6092B395259L7500l7837J40857Q7418m1385K6518R9693q6p1925J67113P4124J8722
$$ 2395259 2432759 2394922 2535779 2623197 2581812 2608330 2708023 2707937 2636012 2803125 2877249 2895971
6080B895971j5067L1318l2020r0560k7495M4236o6110n0122l4508J13969N8562
$$ 2895971 2880904 2912222 2880202 2789642 2762147 2806383 2740273 2690151 2655643 2769612 2828174
6069B828174J6859m2689R136k3337R5295j7713Q9400j0040M2599J15504p9388
$$ 2828174 2845033 2802344 2811480 2788143 2883438 2865725 2955125 2945085 2987684 3103188 3023800
6058C023800j4971M8500L4512L2390K05340L888L8352N4525K656J04412o5012
$$ 3023800 3008829 3057329 3091841 3124231 3329571 3333459 3371811 3426336 3428992 3533404 3468392
6047C468392J5838j366J0833L6019l7787J05630O5150l4162K8103R7190K6177
$$ 3468392 3484230 3482864 3493697 3529716 3491929 3597559 3662709 3628547 3656650 3753840 3780017
6036C780017J12717j1151N0992Q297L9874J40136J73752P1260J55305J85463O1686
$$ 3780017 3892734 3881583 3932575 3940872 3980746 4120882 4294634 4365894 4521199 4706662 4768348
6025D768348k5948l1677j2510O291K2959p2428r8020j33219j45924n5717j36190
$$ 4768348 4742400 4710723 4698213 4704504 4727463 4655035 4557015 4423796 4277872 4222155 4085965
6014D085965j01036p965J0670q5821j14750l9593p7270k8581l8637R3811n7232
$$ 4085965 3984929 3976964 3987634 3901813 3787063 3747470 3670200 3641619 3602982 3696793 3639561
6003C639561K5799O4597l6575n1019p701P271P881j3490M3636L9716O7438J07438
$$ 3639561 3665360 3729957 3693382 3642363 3634662 3641933 3649814 3636324 3679960 3719676 3787114 3894552
5991C894552J01850N2380m9259Q8435q125Q6117R926P0184O5189j28668k9045
$$ 3894552 3996402 4048782 3999523 4087958 4079833 4165950 4175876 4246060 4311249 4182581 4153536
5980D153536m2451p7617M9669P7103J07245l9347j9835J7441K4441m7507j5115
$$ 4153536 4111085 4033468 4083137 4160240 4267485 4228138 4208303 4225744 4250185 4202678 4187563
5969D187563M3501J42650P5471O6109L8981L1938k5179J89374R9825o6141O0581
$$ 4187563 4231064 4373714 4449185 4515294 4554275 4586213 4561034 4750408 4850233 4784092 4844673
5958D844673j7123l8264M9861M8441N5177J4727j9850J7056K5408J47301N107
$$ 4844673 4827550 4789286 4839147 4887588 4942765 4957492 4937642 4954698 4980106 5127407 5132514
5947E132514J11546P3127Q5384j6802N9986R3474J26788J1347P0066N0532M3930
$$ 5132514 5244060 5317187 5402571 5385769 5445755 5539229 5666017 5677364 5747430 5797962 5841892
5936E841892J61114J97714P8533J7769J02207l3500J51764J77812k2993K3806
$$ 5841892 6003006 6200720 6279253 6297022 6399229 6365729 6517493 6695305 6672312 6696118
5926F696118K40132J58412J03708J60573K6002M5758J89495K61576K43724J06379
$$ 6696118 6936250 7094662 7198370 7358943 7384945 7430703 7620198 7881774 8125498 8231877
5916H231877K43863L93098K33339K44647L09381K61483K20748L45922L61313L84319
$$ 8231877 8475740 8868838 9102177 9346824 9656205 9917688 10138436 10484358 10845671 11229990
5906A1229990M44153M94851M75322N84186J81662l5668k98895m12103l79739k66707
$$ 11229990 11674143 12168994 12644316 13228502 13410164 13374496 13075601 12663498 12283759 12017052
5896A2017052l1208q0206o209J20722N7466K10730K61044K63821K46032K58653
$$ 12017052 11985844 11905638 11899429 12020151 12077617 12288347 12549391 12813212 13059244 13317897
5886A3317897M27890M72456N18970M11141N29527N88690O04984P18394P72365
$$ 13317897 13745787 14218243 14737213 15148354 15677881 16266571 16871555 17589949 18362314
5877A8362314R84500J058380J200985J666091K055145K148537J785911J033892
$$ 18362314 19346814 20405194 21606179 23272270 25327415 27475952 29261863 30295755
5869C0295755j03207p52867j095903r39365k91225K97628O73312R91764J430147
$$ 30295755 30192548 29439681 28343778 27404413 27113188 27410816 28084128 29075892 30506039
5860C0506039J711035J907050K126909K228475K098058J988375J665771J357085
$$ 30506039 32217074 34124124 36251033 38479508 40577566 42565941 44231712 45588797
5852D5588797N51718j31281k59139k16219m74549j120815j088858p56946m47390
$$ 45588797 46140515 46009234 45750095 45533876 45059327 43938512 42849654 42092708 41645318
5843D1645318k79855j52609K75532K51326k29725j042689k156133k784117l131002
$$ 41645318 41365463 41212854 41488386 41739712 41509987 40467298 38311165 35527048 32396046
5834C2396046k901517k274855j648715j456022j108374r18285o95583m98031l85566
$$ 32396046 29494529 27219674 25570959 24114937 23006563 22088278 21392695 20894664 20509098
5825B0509098k70376j47399O334J27520J62554K92097M03278M52831N43848M96217
$$ 20509098 20238722 20091323 20097657 20225177 20387731 20679828 21083106 21535937 22079785 22576002
5815B2576002L47086K12668R6100P4150m03R5714K38714J64113R8791n3302j56546
$$ 22576002 22923088 23135756 23231856 23306006 23305603 23401317 23640031 23804144 23902935 23849633 23693087
5804B3693087k99712l48724o2914J45353N08238O31211P78683J019652Q92193
$$ 23693087 23393375 23044651 22981737 23127090 23635328 24266539 25045222 26064874 26957067
5795B6957067Q04758P60218M83874J56068O083k53899m27332m11375m68874n48636
$$ 26957067 27761825 28522043 29005917 29161985 29168068 28914169 28486837 28075462 27606588 27057952
5785B7057952o56871n22324l75199r3146J80290L75355O09989P73929J094367
$$ 27057952 26401081 25878757 25503558 25410412 25590702 25966057 26576046 27349975 28444342
5776B8444342J270547J176229J242539J142419Q30880N02891J16006k04765n68916
$$ 28444342 29714889 30891118 32133657 33276076 34106956 34609847 34725853 34521088 33952172
5767C3952172j016842j395107j462662j429265j470338j315859j203860p50624
$$ 33952172 32935330 31540223 30077561 28648296 27177958 25862099 24658239 23907615
5759B3907615n00314n16980k67123k19458k63882l84949m34634l53407m73766
$$ 23907615 23407301 22890321 22623198 22403740 22139858 21754909 21320275 20966868 20493102
5750B0493102n28364m47567n77722m28684l62271k55900k17923j95095p2084o8982
$$ 20493102 19964738 19517171 18939449 18510765 18148494 17892594 17674671 17479576 17407492 17338510
5740A7338510R7751j453n5363J44997N5570K20871L09719L73742M01705M42308
$$ 17338510 17436261 17434808 17379445 17524442 17580012 17800883 18110602 18484344 18886049 19328357
5730A9328357N66999P11800O32634O66540N93783O67394N33838M38874M19066
$$ 19328357 19895356 20607156 21239790 21906330 22500113 23167507 23701345 24140219 24559285
5721B4559285M15730L38910L85181L03979M31767M13631N10244L69459K44947
$$ 24559285 24975015 25313925 25699106 26003085 26434852 26848483 27358727 27728186 27973133
5712B7973133L39953L87676K17570K23061K18387J80888L39228K64154J16471
$$ 27973133 28313086 28700762 28918332 29141393 29359780 29540668 29879896 30144050 30260521
5703C0260521N2377Q0791J59802J97190P2948K98543M59403M21966O25032O59837
$$ 30260521 30312898 30393689 30553491 30750681 30823629 31122172 31581575 32003541 32628573 33288410
5693C3288410N63264L16068j07645l80402o23453q67343j203923j314064j279335
$$ 33288410 33851674 34167742 34060097 33679695 33056242 32188899 30984976 29670912 28391577
5684B8391577j339527j064993r77243r12068m98393n18744m99995m41865k24839
$$ 28391577 27052050 25987057 25009814 24097746 23599353 23080609 22580614 22138749 21913910
5675B1913910o9165r4093j05541K5130J35217K39812J53143K34958K01861J91348
$$ 21913910 21844745 21750652 21645111 21670241 21805458 22045270 22198413 22433371 22635232 22826580
5665B2826580L27682K70979K86336K40523R1510N0629n5305j75807k69157l32080
$$ 22826580 23154262 23425241 23711577 23952100 24043610 24094239 24038934 23863127 23593970 23261890
5655B3261890k77435l70289l48293k58208l73016j66856r2632l3709q8798k8261
$$ 23261890 22984455 22614166 22265873 22007665 21634649 21467793 21375161 21341452 21252654 21224393
5645B1224393R9957J25771K07450J64682K29595K96493J79905J58154J1506P5813
$$ 21224393 21324350 21450121 21657571 21822253 22051848 22348341 22528246 22686400 22697906 22773719
5635B2773719o1268J815r9329j21748p4270N0097Q1204L9290m5322Q287Q3170
$$ 22773719 22712451 22714266 22614937 22493189 22418919 22469016 22550220 22589510 22544188 22552475 22635645
5624B2635645O2525n743M2793j0862j9613o0204j79927j72265k3867P873j24298
$$ 22635645 22698170 22692427 22735220 22724358 22704745 22644541 22464614 22292349 22268482 22276355 22152057
5613B2152057r6926j92470r8263j03039j02629j12347j07770o7252j22510P14
$$ 22152057 22055131 21862661 21764398 21661359 21558730 21446383 21338613 21271361 21148851 21149565
5603B1149565j17130k26343k02095l70107l19046m79287m21991l69929m58305
$$ 21149565 21032435 20806092 20603997 20233890 19914844 19435557 19013566 18643637 18185332
5594A8185332l23610m56654k92794k51979l03071k78751k41317j94178n5299n6641
$$ 18185332 17861722 17405068 17112274 16860295 16557224 16278473 16037156 15842978 15787679 15731038
5584A5731038j23954j95840l14890k55835k96884m76745l13723l52744l23659
$$ 15731038 15607084 15411244 15096354 14840519 14543635 14066890 13753167 13400423 13076764
5575A3076764j55600j95318j41681j91447j47661k33515j82680k79932j59370
$$ 13076764 12921164 12725846 12584165 12392718 12245057 12011542 11828862 11548930 11389560
5566A1389560j65408j13079k80178j12634j96430k44388j91646j51637j76036
$$ 11389560 11224152 11111073 10830895 10718261 10521831 10277443 10085797 9934160 9758124
5557I758124o3647j85626j65733j50229j23164j9741q6338p4025k00968j8812
$$ 9758124 9694477 9508851 9343118 9192889 9069725 9049984 8963646 8889621 8688653 8669841
5547H669841q6021r6895r1898j41124o0814n3628j0149j16370j25734k05035j09107
$$ 8669841 8583820 8486925 8395027 8253903 8193089 8139461 8129312 8012942 7887208 7682173 7573066
5536G573066r0264M9937q7344r6172j7135n2200K4016L5520o8461R1225J1056
$$ 7573066 7482802 7532739 7445395 7349223 7332088 7279888 7303904 7339424 7270963 7362188 7373244
5525G373244r1813o128j08285k8293l56o3833K3288o0083p6547K4561l2547o2844
$$ 7373244 7281431 7275303 7167018 7138725 7138369 7074536 7097824 7037741 6961194 6985755 6953208 6890364
5513F890364N0190R1222R817j60348q1573J55613p4560n4898M2565Q7964K8721
$$ 6890364 6940554 7031776 7041593 6881245 6799672 6955285 6880725 6825827 6868392 6956356 6985077
5502F985077l4544N3365p0129p3327j01218o2336K9041K8101K7685r9792P1722
$$ 6985077 6950533 7003898 6933769 6860442 6759224 6696888 6725929 6754030 6781715 6681923 6753645
5491F753645r283j10307n1403P1167J9640L6162M5816o1576k5914O2673L8825
$$ 6753645 6744362 6634055 6582652 6653819 6673459 6709621 6755437 6693861 6667947 6730620 6769445
5480F769445L0788o4256P2016J12025l6182p1488j898P5171J27233L6767j00698
$$ 6769445 6800233 6735977 6807993 6920018 6883836 6812348 6810450 6885621 7012854 7049621 6948923
5469F948923N0787J7090r9422J28141M0051P6956N7684m2884K6058P8337Q3987
$$ 6948923 6999710 7016800 6917378 7045519 7085570 7162526 7220210 7177326 7203384 7281721 7365708
5458G365708P6338o8217M1552n3000Q3950J04338N939P1190R7197J4846J15714
$$ 7365708 7442046 7373829 7415381 7362381 7446331 7550669 7556608 7627798 7724995 7739841 7855555
5447G855555N9504J07518J75393j1923J02622J0705K2147M5568J9624q23J73365
$$ 7855555 7915059 8022577 8197970 8186047 8288669 8299374 8321521 8367089 8386713 8385890 8559255
5436H559255J60008L8862J594k1648K7275j9116J91427l6364R8213R8158J8836
$$ 8559255 8719263 8758125 8759719 8738071 8765346 8746230 8937657 8901293 8999506 9097664 9116500
5425I116500P0962P3437R2130O2213Q760M2842J08459J18262n4644K0490P0218
$$ 9116500 9187462 9260899 9353029 9415242 9424002 9466844 9575303 9693565 9638921 9659411 9729629
5414I729629l8185L9968J34220o042O2658J90656J88641J78865J52230K68596
$$ 9729629 9691444 9731412 9865632 9859590 9922248 10112904 10301545 10480410 10632640 10901236
5404A0901236J29678K54013J93065L32270L24447M44503L61464M47559M30514
$$ 10901236 11030914 11284927 11477992 11810262 12134709 12579212 12940676 13388235 13818749
5395A3818749O05764O46930P26001N61599O01602N46793M11253M30260M28744
$$ 13818749 14424513 15071443 15797444 16359043 16960645 17507438 17918691 18348951 18777695
5386A8777695L27198K14268J01012K09345K49988K32377K73426P0168K38207K79826
$$ 18777695 19104893 19319161 19420173 19629518 19879506 20111883 20385309 20455477 20693684 20973510
5376B0973510K95704K97543K07106N0487O7342O4814K0988J5274q9527k58581
$$ 20973510 21269214 21566757 21773863 21824350 21891692 21956506 21977494 21992768 21903241 21644660
5366B1644660m31920m86475n10905n21440n99970p07998m86018n58477n84884
$$ 21644660 21212740 20726265 20215360 19693920 19093950 18385952 17899934 17341457 16756573
5357A6756573n01544n55905l75074m47536m21281m25314m99314n26027n87341
$$ 16756573 16255029 15699124 15324050 14876514 14455233 14029919 13530605 13004578 12417237
5348A2417237o25541l59677k37364k65644j99648j85133j55599j70068k03950
$$ 12417237 11791696 11432019 11194655 10929011 10729363 10544230 10388631 10218563 10014613
5339A0014613k0532j3607o1282o448r2636l8897l7322m9124J1096O4822j00649
$$ 10014613 9994081 9980474 9919192 9912744 9820108 9781211 9743889 9694765 9705861 9770683 9670034
5328I670034j20857k5265K4527r5300j58288j49230J5222j63590q9929M1811j64690
$$ 9670034 9549177 9523912 9548439 9453139 9294851 9145621 9160843 8997253 8907324 8949135 8784445
5317H784445n3079M7778j9778r4299j5241K9195K1229r0914m8865J652p738O4947
$$ 8784445 8731366 8779144 8759366 8665067 8649826 8679021 8700250 8609336 8560471 8562123 8554385 8619332
5305H619332K4947j57637p5416m8281q8595m0343K1951j38984j44060l4254j42780
$$ 8619332 8644279 8486642 8411226 8362945 8274350 8234007 8255958 8116974 7972914 7938660 7795880
5294G795880p2254l2098l8894q6945n4897N1466j31456n5360N2112o6155l1546
$$ 7795880 7723626 7691528 7652634 7565689 7510792 7562258 7430802 7375442 7427554 7361399 7329853
5283G329853n6534P832K4253m560j12763q1150k3340j3359l9112q7258o2007k9445
$$ 7329853 7273319 7281151 7305404 7300844 7188081 7106931 7083591 7070232 7031120 6943862 6881855 6852410
5271F852410M4492o2745k6293M2870J056m0993j31607N970p8557j00120L7063
$$ 6852410 6896902 6834157 6807864 6850734 6851790 6810797 6679190 6685160 6606603 6506483 6543546
5260F543546m033n1736Q038m4277K4042k1139j598o4940N9159n2771K8980m8358
$$ 6543546 6539513 6487777 6495815 6451538 6475580 6454441 6452843 6387903 6447062 6394291 6423271 6374913
5248F374913k5769k3317n1324O5176j2576R6345m4703q7079p704o1053j00964
$$ 6374913 6349144 6325827 6274503 6339679 6327103 6423448 6378745 6291666 6283962 6222909 6121945
5237F121945n7581o2728l2956L7121J0481m4639K5994K2811o1547Q061M5750l6352
$$ 6121945 6064364 6001636 5968680 6005801 6016282 5971643 5997637 6020448 5958901 5966962 6012712 5976360
5225E976360k9219p2764J1834m3110n7776J9400J3010r6266l1937l1119J2309
$$ 5976360 5947141 5874377 5886211 5843101 5785325 5804725 5817735 5721469 5689532 5658413 5670722
5214E670722Q0116k5761k7560M4432n3340J9452q3592r5445k3572j29555l7225
$$ 5670722 5750838 5725077 5697517 5741949 5688609 5708061 5624469 5529024 5505452 5375897 5338672
5203E338672R1639l2200K4313J43959q0939l1765m9594j8656k7656n3138M8462
$$ 5338672 5430311 5398111 5422424 5566383 5485444 5453679 5404085 5385429 5357773 5304635 5353097
5192E353097k5686o9777k0195P537J8492l4358m9304k1359Q2480n9792j3551k3957
$$ 5353097 5327411 5257634 5237439 5244976 5263468 5229110 5179806 5158447 5240927 5181135 5167584 5143627
5180E143627o5454N7407J2709l2976N540j14335m3042J49073j5364l7388p376
$$ 5143627 5078173 5135580 5148289 5115313 5120853 5006518 4963476 5112549 5097185 5059797 5052421
5169E052421Q8575m7726m9426R8691q2403n1415P8709k7782j3988k2214P1884
$$ 5052421 5140996 5093270 5043844 5142535 5060132 5008717 5087426 5059644 5045656 5023442 5095326
5158E095326j4315K2540j12505j00972K9726L6580Q189O8246L2975J921N7863
$$ 5095326 5081011 5103551 4991046 4890074 4919800 4956380 4964569 5032815 5065790 5067711 5125574
5147E125574k6341J5340K6711K4872m7975J9966L1979P353N6600k4393j7896p328
$$ 5125574 5099233 5114573 5141284 5166156 5118181 5138147 5170126 5177479 5234079 5209686 5191790 5184462
5135E184462n4712j13596K9040Q0689q4535j30837J16956m1706r0807k0387q339
$$ 5184462 5129750 5016154 5045194 5125883 5041348 4910511 5027467 4985761 4894954 4874567 4866228
5124D866228N45o3484J4028N8251L8600n4715L3702Q1k0929M8241j3187J11328
$$ 4866228 4866773 4803289 4817317 4875568 4914168 4859453 4893155 4893236 4872307 4920548 4907361 5018689
5112E018689l0642j42952P1668n463N365o5951P299P1558q3333N3377J8101j7875
$$ 5018689 4988047 4845095 4916763 4911300 4916665 4850714 4858013 4929571 4846238 4899615 4917716 4899841
5100D899841M7185L602P1267J28160J16023J23856J54914J31619J40469J31002
$$ 4899841 4947026 4950628 5021895 5150055 5266078 5389934 5544848 5676467 5816936 5947938
5090E947938j6569K4537O0978j05212o6470r0729j13872o5856j06218q6875q6116
$$ 5947938 5931369 5955906 6016884 5911672 5845202 5754473 5640601 5574745 5468527 5381652 5295536
5079E295536j1907r8718L0812K11438J45001K43384K15845R7059P6303K44340
$$ 5295536 5283629 5184911 5215723 5427161 5572162 5815546 6031391 6128450 6204753 6449093
5069F449093K52402J95233L7602P0289R667k9369k88561k74477j83252k63209
$$ 6449093 6701495 6896728 6934330 7004619 7014286 6984917 6696356 6421879 6238627 5975418
5059E975418k32435k46013k38881j23082r6521q6744l9787K8916L9954j6331J6859
$$ 5975418 5742983 5496970 5258089 5135007 5038486 4951742 4911955 4940871 4980825 4964494 4981353
5048D981353R0849n148J13156J83057J53318q6258P6464J2672k07864r4752q4078
$$ 4981353 5072202 5067054 5180210 5363267 5516585 5430327 5506791 5519463 5311599 5216847 5132769
5037E132769j11237k99941k04512k7966j82109j13074j41180m8249o722q4747
$$ 5132769 5021532 4721591 4517079 4489113 4307004 4193930 4052750 4004501 3997779 3913032
5027C913032P8635O8785m6956m056L3765J417o7384k5336K9415m3952o750n951
$$ 3913032 3991667 4060452 4013496 4009440 4043205 4044622 3977238 3951902 3981317 3937365 3930615 3924664
5015C924664j5740n6983o7174j06821K4786l7336k209L7783m0810m3052M1195
$$ 3924664 3908924 3851941 3784767 3677946 3702732 3665396 3663187 3700970 3660160 3617108 3658303
5004C658303q0684N6208R5996L1946p826j01504o387N4900J52729q1621r3925
$$ 3658303 3577619 3633827 3729823 3761769 3753943 3652439 3646052 3700952 3853681 3772060 3678135
4993C678135P788p8367P0964J7112l2046N992p322j42863k388q4045p6459L4937
$$ 3678135 3685923 3607556 3678520 3695632 3663586 3669578 3662256 3519393 3517005 3432960 3356501 3391438
4981C391438P8134k034Q30p0226K1651M3996N5869m845q3347K5655N413N0890
$$ 3391438 3469572 3467538 3468368 3398142 3419793 3463789 3519658 3514813 3431466 3457121 3462534 3513424
4969C513424L108o512Q9863K245m6208j0948K3338M868J08550M0728M8831n0087
$$ 3513424 3516532 3510020 3599883 3602128 3555920 3544972 3568310 3573178 3681728 3722456 3771287 3721200
4957C721200N4031o9913J33901L3994N445O502P1394J68243j0344O8496N7029
$$ 3721200 3775231 3705318 3839219 3873213 3878658 3885160 3956554 4124797 4114453 4182949 4239978
4946D239978J53300k7728K5637M1219J68137J11790J52064J28507K07859K44842
$$ 4239978 4393278 4365550 4391187 4432406 4600543 4712333 4864397 4992904 5200763 5445605
4936E445605K31207M7388J71854K13024J77394J54801K14037K23724J50922L6662
$$ 5445605 5676812 5724200 5896054 6109078 6286472 6441273 6655310 6879034 7029956 7066618
4926G066618P0011R9510r4428l4648j7777q6617o2234J10369Q4344J6113o6277
$$ 7066618 7136629 7236139 7141711 7107063 7089286 7002669 6940435 7050804 7135148 7151261 7084984
4915G084984J8747M5219m966l8425j24789j9926n0739k04227j21986j07787k79210
$$ 7084984 7103731 7148950 7143984 7105559 6980770 6960844 6910105 6705878 6583892 6476105 6196895
4904F196895k07477k20227j05512k60537r3580q9195j38073k9596r6711M7251
$$ 6196895 5989418 5769191 5663679 5403142 5309562 5220367 5082294 5052698 4955987 5003238
4894E003238m4659M6761j82830k9742j9550J827J8148R54j2368k4427P1149r5588
$$ 5003238 4958579 5005340 4822510 4792768 4773218 4775045 4793193 4794147 4781779 4757352 4828501 4732913
4882D732913J21590L3470J34057J26798p3904J17165J42769M8014J60189K31077
$$ 4732913 4854503 4887973 5022030 5148828 5074924 5192089 5334858 5382872 5543061 5774138
4872E774138J98773M6286J73728J94888J52042J96811K38925J65295K16790J96326
$$ 5774138 5972911 6019197 6192925 6387813 6539855 6736666 6975591 7140886 7357676 7554002
4862G554002J71714J89917M3364J22797L9280n3129n9214n6987l47K2822r676
$$ 7554002 7725716 7915633 7958997 8081794 8121074 8067945 8008731 7951744 7951397 7974219 7964543
4851G964543j48424M4544O7792j87986q0781p0035r1474N3023j93879k29519l85356
$$ 7964543 7816119 7860663 7928455 7740469 7659688 7589653 7498179 7551202 7357323 7127804 6742448
4840F742448l77142k77053k76879j99170k25751l15648j81018j36093j34090k07033
$$ 6742448 6365306 6088253 5811374 5612204 5386453 5070805 4889787 4753694 4619604 4412571
4830D412571j30500J8689j07745r4697q5680p2198p8873j61197k0858j6438j22105
$$ 4412571 4282071 4300760 4193015 4098318 4012638 3940440 3861567 3700370 3679512 3663074 3540969
4819C540969q7498M8445k0482j18247J285k6549J2673k9565L0247J1473j10520
$$ 3540969 3453471 3501916 3481434 3363187 3364472 3337923 3350596 3321031 3351278 3362751 3252231
4808C252231o8530N1969m2691M0497r6824K6930M6536J6773j1794R834n2349l9467
$$ 3252231 3183701 3235670 3192979 3233476 3136652 3163582 3210118 3226891 3215097 3224931 3172582 3133115
4796C133115N3820k089m5514o6519J3760j3578o3202Q3972O6866m2349M5416M012
$$ 3133115 3186935 3184846 3139332 3072813 3086573 3072995 3009793 3093765 3160631 3118282 3163698 3167710
4784C167710o1598M5426n3587m1294n703O6070j6756K2985K6494j1765k8241R5773
$$ 3167710 3106112 3151538 3097951 3056657 3050954 3117024 3100268 3123253 3149747 3137982 3109741 3205514
4772C205514K0848J8004k2512n9613m853N9734n4992r631R4692L1937M313M9453
$$ 3205514 3226362 3244366 3221854 3162241 3157388 3217122 3162130 3152499 3247191 3279128 3283441 3332894
4760C332894O0508Q014M4597j30359R2039O8516j36245o5296m2933J1025N9195
$$ 3332894 3393402 3401416 3446013 3315654 3407693 3476209 3339964 3274668 3231735 3242760 3301955
4749C301955R8960M0717k0806L2283Q0376K9910J0084P7707K4495L424N9848Q4527
$$ 3301955 3400915 3441632 3420826 3453109 3533485 3563395 3573479 3651186 3675681 3679105 3738953 3823480
4737C823480n8850M2405m09N8384j3544r4216r0039m8147O1262J03261K0209o1804
$$ 3823480 3764630 3807035 3806626 3865010 3851466 3757250 3667211 3619064 3680326 3783587 3803796 3741992
4725C741992J39548N035m8949O4600J20609J54937R6448L9254q5922Q6379O695
$$ 3741992 3881540 3886575 3837626 3902226 4022835 4177772 4274220 4313474 4227552 4313931 4320626
4714D320626n0718l1786N427N2902K529j328P6062L5719N0574Q4907L5261k1554
$$ 4320626 4269908 4238122 4243549 4296451 4298980 4297652 4373714 4409433 4460007 4544914 4580175 4558621
4702D558621J44922R2641R6187J33726J31326J49331J77805K01987K01440K76824
$$ 4558621 4703543 4796184 4892371 5026097 5157423 5306754 5484559 5686546 5887986 6164810
4692F164810K06687K72224K91920L44114M20891L36606K57421K56074J04126R7703
$$ 6164810 6371497 6643721 6935641 7279755 7700646 8037252 8294673 8550747 8654873 8752576
4682H752576Q7380J4399m3042j5885O597j7851J63742J86866J13332J84235L56828
$$ 8752576 8839956 8854355 8811313 8795428 8802025 8784174 8947916 9134782 9248114 9432349 9789177
4671I789177K76661J60506J61599K26852J11867Q8987k3665j22635n3608j12524
$$ 9789177 10065838 10226344 10387943 10614795 10726662 10815649 10791984 10669349 10615741 10503217
4661A0503217k24715j99601l31857k34467j50073j14069k59190k46927j05209
$$ 10503217 10278502 10078901 9747044 9512577 9362504 9248435 8989245 8742318 8637109
4652H637109j34743k02971j12827j12836m9865o7409k1170L0430K76J07538J23942
$$ 8637109 8502366 8299395 8186568 8073732 8023867 7956458 7935288 7965718 7965994 8073532 8197474
4641H197474J15540J57889L43875J33043L74289M61128M06958M96087O61885M01498
$$ 8197474 8313014 8470903 8814778 8947821 9322110 9783238 10190196 10686283 11348168 11749666
4631A1749666M12840L31618J34092L537j2836j95380k85641l10470l08410L222
$$ 11749666 12162506 12494124 12628216 12631753 12618917 12423537 12137896 11827426 11519016 11522238
4621A1522238m6835L8134K27795L69254M20441M35814M37800O36014O11494M33301
$$ 11522238 11475403 11513537 11741332 12110586 12531027 12966841 13404641 14040655 14652149 15085450
4611A5085450K39001K19175P9342k43344k79549m60430l79888l01938l23915m23138
$$ 15085450 15324451 15543626 15622968 15379624 15100075 14639645 14259757 13957819 13633904 13210766
4601A3210766k16897l38875l25949j11808k15360k13834j21600k55505k01447
$$ 13210766 12993869 12654994 12329045 12217237 12001877 11788043 11666443 11410938 11209491
4592A1209491l13695l51735l56710m07174l26895l99901k63605j23728j64685
$$ 11209491 10895796 10544061 10187351 9780177 9453282 9053381 8789776 8666048 8501363
4583H501363l14533l27539k10280j97201n8692j92284k07139r4544j40988l2688
$$ 8501363 8186830 7859291 7649011 7451810 7393118 7200834 6993695 6899151 6758163 6725475
4573F725475J3536j14647Q6645q4019j79446o4898R212n434j24006Q2161m8612
$$ 6725475 6739011 6624364 6711009 6626990 6447544 6382646 6391858 6386424 6262418 6344579 6295967
4562F295967j1278j1693L2175r2901p727l6821r3095p974P5431N4838q7079L3317
$$ 6295967 6284689 6272996 6305171 6212270 6204543 6167722 6074627 6066653 6142084 6196922 6109843 6143160
4550F143160M3791L222R1406J2332j5723n3396M4257M9160J12045j7226M1636
$$ 6143160 6186951 6190173 6281579 6293911 6278188 6224792 6269049 6318209 6430254 6413028 6454664
4539F454664P4573K1604L2496P1249J31177J18346J64096J75189K06541J29324
$$ 6454664 6529237 6550841 6583337 6654586 6785763 6904109 7068205 7243394 7449935 7579259
4529G579259K26711K67425K33271M60899M36416L32729M08144N51713N85581N31304
$$ 7579259 7805970 8073395 8306666 8767565 9203981 9536710 9944854 10496567 11082148 11613452
4519A1613452N96124K83177J78545J25084k50602l32405m36090l26100l65071
$$ 11613452 12209576 12492753 12671298 12796382 12545780 12213375 11777285 11451185 11086114
4510A1086114j13924j0527o3517J1412o2966M0899P2888J42511K40501K56129
$$ 11086114 10972190 10961663 10898146 10909558 10846592 10887491 10960379 11102890 11343391 11599520
4500A1599520K58428K9087J33169J15492j21M0522j3062L6997M072J945J29243
$$ 11599520 11857948 11887035 12020204 12135696 12135575 12176097 12163035 12200032 12204104 12206049 12335292
4489A2335292J47736O4279J68903K04967L37739L80452K21361K18399O200l79295
$$ 12335292 12483028 12547307 12716210 12921177 13258916 13639368 13860729 14079128 14085328 13706033
4479A3706033m16881m66767n71633m54094k07320l44259j25490J0947o7797J06753
$$ 13706033 13289152 12822385 12250752 11796658 11589338 11245079 11119589 11130536 11062739 11169492
4469A1169492K29512J97817K54658K65266L05006L45045K06938J50461J74677
$$ 11169492 11399004 11596821 11851479 12116745 12421751 12766796 12973734 13124195 13298872
4460A3298872j43086k62124k08527k74502k66408j95650k55568k10897j90945
$$ 13298872 13155786 12893662 12685135 12410633 12144225 11948575 11693007 11482110 11291165
4451A1291165k72783p2839j14624k07938K8275N0943K7139M3011J78498K07467
$$ 11291165 11018382 10945543 10830919 10622981 10651256 10702199 10729338 10772349 10950847 11158314
4441A1158314J23584J90703R2610O5976m0695P413n5591j55895J6930L8847P0290
$$ 11158314 11281898 11472601 11565211 11631187 11590492 11597905 11542314 11386419 11403349 11442196 11512486
4430A1512486J25019J31925O37K5557j69107l01473m03623m65870m19173l69726
$$ 11512486 11637505 11769430 11770067 11795624 11626517 11325044 10921421 10455551 10036378 9666652
4420I666652l30082j68022j51038j36267j55874j87212q3622K4060P4975l5537
$$ 9666652 9336570 9168548 9017510 8881243 8725369 8538157 8454535 8478595 8553570 8518033
4410H518033K9456K0272J8375R0103J22214R2541J47356O4963J64114J96071R8463
$$ 8518033 8547489 8567761 8586136 8676239 8798453 8890994 9038350 9103313 9267427 9463498 9561961
4399I561961J35595J19310K00628J87293K1573J18923J42032J34186K02127K10257
$$ 9561961 9697556 9816866 10017494 10204787 10226360 10345283 10487315 10621501 10823628 11033885
4389A1033885K8088q175P2425M1806N3467M3508Q60L9627M9879O7846q5021K3260
$$ 11033885 11061973 11053798 11126223 11168029 11221496 11265004 11265864 11305491 11355370 11423216 11338195 11361455
4377A1361455k6331n6150L8109Q2934J04667M0549Q5767J49471L40815M97423
$$ 11361455 11335124 11278974 11317083 11400017 11504684 11545233 11631000 11780471 12121286 12618709
4367A2618709K33806n9645m17453o24639p26378n74316k91779l52247j78403j15734
$$ 12618709 12852515 12792870 12375417 11750778 11024400 10450084 10158305 9806058 9627655 9511921
4357I511921r7586L5060r0735J952J9717P7822J45456Q5311J11107J62981K5746
$$ 9511921 9414335 9449395 9358660 9360612 9380329 9458151 9603607 9688918 9800025 9963006 9988752
4346I988752p441J29983J65550J33131J02781N1838L0478M9788j31214j3804o7233
$$ 9988752 9981311 10111294 10276844 10409975 10512756 10564594 10595072 10644860 10513646 10499842 10432609
4335A0432609k1390k10067j83018N9227p8974k32261p2104k3797m2208o2669R1214
$$ 10432609 10411219 10201152 10018134 10077361 9998387 9766126 9694022 9670225 9628017 9565348 9656562
4324I656562p0052J9089K33937P3643J37310P4245K3023J53346J50360k1591R0216
$$ 9656562 9586510 9605599 9839536 9913179 10050489 10124734 10147757 10301103 10451463 10429872 10520088
4313A0520088K6915n2911j1322q5557n5093l0562j8404j52635q1496m7396r5493
$$ 10520088 10547003 10494092 10482770 10397213 10342120 10311558 10293154 10140519 10059023 10011627 9916134
4302I916134o1863j52488k0676p2289J6841P5508l5523K9738J0585K1098J10132
$$ 9916134 9854271 9701783 9681107 9608818 9625659 9701167 9665644 9695382 9705967 9727065 9837197
4291I837197K7585L1379J11034J52277J11906J19017P9548J89773K06357O2038
$$ 9837197 9864782 9896161 10007195 10159472 10271378 10390395 10469943 10659716 10866073 10928111
4281A0928111K94672J56764J72865J43787J23420J65426O4397N2586n5933l9103
$$ 10928111 11222783 11379547 11552412 11696199 11819619 11985045 12049442 12102028 12046095 12006992
4271A2006992j37913j11448q7540p2164r8500j32248K2154q3532o0288P4400q0924
$$ 12006992 11869079 11757631 11670091 11597927 11499427 11367179 11389333 11305801 11245513 11319913 11238989
4260A1238989l6022j4658O5357L2422M6388J21881M8356N5628J08351J97161Q3510
$$ 11238989 11202967 11188309 11253666 11286088 11332476 11454357 11502713 11558341 11666692 11863853 11947363
4249A1947363J34012J11278J38205K30292L09288K06703J43539K07632K33102
$$ 11947363 12081375 12192653 12330858 12561150 12870438 13077141 13220680 13428312 13661414
4240A3661414L14595K28005K24492L05679J76914Q9818J83179J44489J83656K00388
$$ 13661414 13976009 14204014 14428506 14734185 14911099 15000917 15184096 15328585 15512241 15712629
4230A5712629J68247J44992J47406K90606K80299K28709L27786L57342L44141
$$ 15712629 15880876 16025868 16173274 16463880 16744179 16972888 17300674 17658016 18002157
4221A8002157K85877J84181K56540K48763K64386K91203K86682L16235K82099
$$ 18002157 18288034 18472215 18728755 18977518 19241904 19533107 19819789 20136024 20418123
4212B0418123K38266K42932J62352J12697J70165J05416K40788L33270L62294
$$ 20418123 20656389 20899321 21061673 21174370 21344535 21449951 21690739 22024009 22386303
4203B2386303L13657L98564L23287M26419N58178M69975O59752O30814N72920
$$ 22386303 22699960 23098524 23421811 23848230 24406408 24876383 25536135 26166949 26739869
4194B6739869P54927R41819J000081Q94717R59388J014484R80038J113404J211975
$$ 26739869 27494796 28436615 29436696 30331413 31290801 32305285 33285323 34398727 35610702
4185C5610702J180446J320412J558842J481739J556709J749941J796213J931293
$$ 35610702 36791148 38111560 39670402 41152141 42708850 44458791 46255004 48186297
4177D8186297J894248K107889K360352K419487K602164K918847L435329L958433
$$ 48186297 50080545 52188434 54548786 56968273 59570437 62489284 65924613 69883046
4169F9883046M748383N563823O364359P685819R012526J0424387J1988725J3461347
$$ 69883046 74631429 80195252 86559611 94245430 103257956 113682343 125671068 139132415
4161A39132415J5127326J7263839K0276970K4111736K7479640L0124555L0368626
$$ 139132415 154259741 171523580 191800550 215912286 243391926 273516481 303885107
4154C03885107K7064363J9190669O848236o788560j9974600k9482171l3980456
$$ 303885107 330949470 350140139 356988375 350199815 330225215 300743044 266762588
4147B66762588l3989998l0342279k5722108k0898680j6479491j2457918r013514
$$ 266762588 232772590 202430311 176708203 155809523 139330032 126872114 117858600
4140A17858600o584622m216167k466863j897846k649321m077758n359939o023273
$$ 117858600 111273978 107057811 104590948 102693102 100043781 95966023 90606084 84582811
4132H4582811o532555n973072m823138m214809l765438l328163k984344k574453
$$ 84582811 78050256 72077184 67254046 63039237 59273799 55945636 52961292 50386839
4124E0386839k144069j865819j621778j611167j361026j388421j336358j236232
$$ 50386839 48242770 46376951 44755173 43144006 41782980 40394559 39058201 37821969
4116C7821969j183000j137174j143709r94077j031625q71275q25402q02334p38149
$$ 37821969 36638969 35501795 34358086 33364009 32332384 31461109 30635707 29833373 29095224
4107B9095224o52729o76147m63576n48853m84853l95820l93513l92686m27237
$$ 29095224 28442495 27766348 27302772 26753919 26269066 25873246 25479733 25087047 24659810
4098B4659810l51988m12112m32242l37506k80827l69700k54844k36027k86822
$$ 24659810 24307822 23895710 23463468 23125962 22845135 22475435 22220591 21984564 21697742
4089B1697742k97251j56305p8403j69735j15131j34899j39822j4073L4108p2883
$$ 21697742 21400491 21244186 21165783 20996048 20880917 20746018 20606196 20592123 20626231 20553348
4079B0553348o0578M7966j04347r8809j54214j79297j76881k37499k82152j11107
$$ 20553348 20492770 20540736 20436389 20337580 20183366 20004069 19827188 19589689 19307537 19196430
4069A9196430j13163o5011M1097j59373j14069r3956j61807j10704M7281k971
$$ 19196430 19083267 19018256 19059353 18899980 18785911 18691955 18530148 18419444 18466725 18463754
4059A8463754J2059O1547R953k9155J20927P6195o4622L4642N7720P5788J53439
$$ 18463754 18475813 18537360 18547313 18518158 18639085 18715280 18650658 18685300 18743020 18818808 18972247
4048A8972247J29006M4706Q9603O7141J30845J45584K04444J51620N6665J08336
$$ 18972247 19101253 19145959 19235562 19302703 19433548 19579132 19783576 19935196 19991861 20100197
4038B0100197J72778K05557J77686J95459K29318J28132J73104R0493K22112J08844
$$ 20100197 20272975 20478532 20656218 20851677 21080995 21209127 21382231 21472724 21694836 21803680
4028B1803680M4722J20895L23825L42199J81612L46906K94235J80478L39946L10548
$$ 21803680 21848402 21969297 22293122 22635321 22816933 23163839 23458074 23638552 23978498 24289046
4018B4289046K21439L33740M97353M09653M74679K89841N21659N78452N87821
$$ 24289046 24510485 24844225 25341578 25751231 26225910 26515751 27037410 27615862 28203683
4009B8203683O82751O12462P77626O47484Q27524P42161Q79023Q24431R68326
$$ 28203683 28886434 29498896 30276522 30924006 31751530 32493691 33372714 34197145 35165471
4000C5165471Q79905Q96825R23951J011661J033361J096351J162832J036688J123708
$$ 35165471 36045376 36942201 37866152 38877813 39911174 41007525 42170357 43207045 44330753
3991D4330753J110375J196059J009746J038123J028452Q60974R79333R13571R26792
$$ 44330753 45441128 46637187 47646933 48685056 49713508 50574482 51553815 52467386 53394178
3982E3394178R50771Q66345R03211Q29182Q61414Q03149O20443O91195M78522
$$ 53394178 54344949 55211294 56114505 56943687 57805101 58608250 59228693 59919888 60398410
3973F0398410L66006L32049K80339K05503J98233P669K9430K1731j35524j40221
$$ 60398410 60764416 61096465 61376804 61582307 61780540 61788209 61817639 61839370 61703846 61563625
3963F1563625j57028k02605l29985l88172o91198p64937r32405j021666r02616
$$ 61563625 61406597 61203992 60874007 60485835 59794637 59029700 58097295 57075629 56173013
3954E6173013j019091j015880j031613j021796j046115j113946j172076j224744
$$ 56173013 55153922 54138042 53106429 52084633 51038518 49924572 48752496 47527752
3946D7527752j127217j203615j206419j185401j127592j247162j138105j108594
$$ 47527752 46400535 45196920 43990501 42805100 41677508 40430346 39292241 38183647
3938C8183647j072844j124574j069144j044049r81695q88409q60135p93023r25441
$$ 38183647 37110803 35986229 34917085 33873036 32891341 32002932 31142797 30349774 29424333
3929B9424333p82137q91918p48804q11592p36752p07230p81458p61203o78538
$$ 29424333 28642196 27750278 27001474 26189882 25453130 24745900 23964442 23203239 22524701
3920B2524701o25830n87843l78158n34875n16296n13467l51616l55329l74771
$$ 22524701 21898871 21311028 20932870 20397995 19881699 19368232 19016616 18661287 18286516
3911A8286516l24109k38128l98536l15666k74807k66018j97752j30053k06386
$$ 18286516 17962407 17724279 17325743 17010077 16735270 16469252 16271500 16141447 15935061
3902A5935061j42312q9013j82441j83180k01056j96687k31940j09477k77685k17580
$$ 15935061 15792749 15703736 15521295 15338115 15137059 14940372 14708432 14598955 14321270 14103690
3892A4103690j59401j02199k13779p1670j69252j42574j34188j83489j28087j86585
$$ 14103690 13944289 13842090 13628311 13556641 13387389 13244815 13110627 12927138 12799051 12612466
3882A2612466l4423m6952j97714j24567p3347j98321j34566p7860j4197q6808
$$ 12612466 12578043 12531091 12333377 12208810 12135463 11937142 11802576 11724716 11710519 11623711
3872A1623711m5579j3977m2561k8921R8056J72500J44912J70400P9727J41245
$$ 11623711 11578132 11564155 11521594 11492673 11590729 11763229 11908141 12078541 12158268 12299513
3862A2299513M0581J88527l029p1173r6775r0332j0270l4925n2267P381K58184
$$ 12299513 12340094 12528621 12525592 12454419 12357644 12267312 12257042 12222117 12169850 12177231 12435415
3851A2435415P8664J65400O0918J23560J12758J92670L07564L48829J66037K75470
$$ 12435415 12514079 12679479 12740397 12863957 12976715 13169385 13476949 13825778 13991815 14267285
3841A4267285J89866J25798J30069k0283O3439o4458p1572k03667p5459j26349
$$ 14267285 14457151 14582949 14713018 14692735 14756174 14691716 14620144 14416477 14341018 14214669
3831A4214669j39963j39614N6541j15708l0377n2255k06992j77038k59747l4423
$$ 14214669 14074706 13935092 13991633 13875925 13845548 13793293 13586301 13409263 13149516 13115093
3821A3115093j45197l25232k20325k84705l04957k50252m22477k87239l03999
$$ 13115093 12969896 12644664 12424339 12139634 11834677 11584425 11161948 10874709 10570710
3812A0570710k68945j11729l0252j29367m6876j02032j30772j01723m5585p8016
$$ 10570710 10301765 10190036 10159784 10030417 9983541 9881509 9750737 9649014 9603429 9525413
3802I525413n507m7962k9715k9551o3787J24850n9363j37078k371r5132L0865
$$ 9525413 9519906 9471944 9442229 9412678 9348891 9473741 9414378 9277300 9274929 9179797 9210662
3791I210662R4312o8596r764o1972O0562q9800L4561L6903m1485R2093J49629
$$ 9210662 9304974 9236378 9226614 9164642 9225204 9135404 9169965 9206868 9165383 9257476 9407105
3780I407105J3131M5689M7371j3218L661N6035J02100J2486J04015J28580M8623
$$ 9407105 9420236 9465925 9513296 9500078 9503739 9559774 9661874 9674360 9778375 9906955 9955578
3769I955578m6491J89286J52694P6363J01112J38828J11573L8427M5521Q6918
$$ 9955578 9909087 10098373 10251067 10327430 10428542 10567370 10678943 10717370 10762891 10849809
3759A0849809J67408J00190Q7147J48050J47088K29928O6228J46255J07469N5804
$$ 10849809 11017217 11117407 11204554 11352604 11499692 11729620 11795848 11942103 12049572 12105376
3749A2105376N4632R061l9028K1562P1500Q8258R4030O7764J26023l4388N4901
$$ 12105376 12160008 12169069 12130041 12151603 12223103 12311361 12405391 12473155 12599178 12564790 12619691
3738A2619691M6633j0836j6928J50801j5829m9187L2201O6819L2868P6696J71049
$$ 12619691 12666324 12655488 12638560 12789361 12773532 12724345 12756546 12823365 12856233 12932929 13103978
3727A3103978l7134Q4247J11219J5805Q6363J22753Q9701J80105K13272J7079
$$ 13103978 13066844 13151091 13262310 13278115 13364478 13487231 13576932 13757037 13970309 13987388
3717A3987388K77166K27038J30063J74436K25581J81049K54470L51401K25650
$$ 13987388 14264554 14491592 14621655 14796091 15021672 15202721 15457191 15808592 16034242
3708A6034242K47300J75969J95403L04150K69271K22641L06193K60511J97411
$$ 16034242 16281542 16457511 16652914 16957064 17226335 17448976 17755169 18015680 18213091
3699A8213091K90879K97788L35720L80459L02432K31845L78966L95640L93342
$$ 18213091 18503970 18801758 19137478 19517937 19820369 20052214 20431180 20826820 21220162
3690B1220162K91873K81702L11092K89422M12752M69576L12960K72969M97581
$$ 21220162 21512035 21793737 22104829 22394251 22807003 23276579 23589539 23862508 24360089
3681B4360089N37294O18301M20654O25077N48874O45875O73627Q00759O98954
$$ 24360089 24897383 25515684 25936338 26561415 27110289 27756164 28429791 29230550 29929504
3672B9929504O17511P65149P66339O66035P57376Q96079Q36319R39819Q43927
$$ 29929504 30547015 31312164 32078503 32744538 33501914 34397993 35234312 36174131 37018058
3663C7018058R38448Q82925J082007J135275J039631J121167R41125Q61827Q34537
$$ 37018058 37956506 38839431 39921438 41056713 42096344 43217511 44158636 45020463 45855000
3654D5855000Q31963P24509O88965N72325L56728M86352M32985M54211M69968
$$ 45855000 46686963 47411472 48100437 48672762 49029490 49515842 49948827 50403038 50873006
3645E0873006N14441N17086M78368L13388K83363K49010J97720K12847L8608k5252
$$ 50873006 51387447 51904533 52382901 52696289 52979652 53228662 53426382 53639229 53677837 53652585
3635E3652585J02717O3414o2968Q0781J84251K22819K43469K08670M23814L59326
$$ 53652585 53755302 53818716 53755748 53836529 54020780 54243599 54487068 54695738 55119552 55478878
3625E5478878L47397N47857N31102O37617P16341P00622R75408Q81405R08917
$$ 55478878 55826275 56374132 56905234 57542851 58259192 58959814 59935222 60816627 61725544
3616F1725544J106589J000654J070298J063666J021762R67037J110916J235964
$$ 61725544 62832133 63832787 64903085 65966751 66988513 67955550 69066466 70302430
3608G0302430J092478J083537J164915J081745J134195J086915J031350R84817
$$ 70302430 71394908 72478445 73643360 74725105 75859300 76946215 77977565 78962382
3600G8962382P92860Q51660P41520N92459M47493M34077L92935L60436M94361
$$ 78962382 79755242 80606902 81348422 81940881 82388374 82822451 83215386 83575822 84070183
3591H4070183L28586K30244J59957K01143J48484J3949j9994R4627o569j76082
$$ 84070183 84398769 84629013 84788970 84990113 85138597 85152546 85132552 85227179 85220610 85044528
3581H5044528j18371r1604l4926j863m495n0966q0676J29621j7534J5940P4477
$$ 85044528 84926157 84834553 84799627 84797764 84793269 84742303 84661627 84791248 84773714 84789654 84864131
3570H4864131O3844J30974N5632J27810J43927O5027L2179J06113P2312J05407
$$ 84864131 84927975 85058949 85114581 85242391 85386318 85451345 85483524 85589637 85661949 85767356
3560H5767356J63869J05960J01721N7847J26101O1200J2101J63532L6681Q4616
$$ 85767356 85931225 86037185 86138906 86196753 86322854 86384054 86396155 86559687 86596368 86680984
3550H6680984J0183P7943J08155O1844K57413L37151M34721L96768N57703O94930
$$ 86680984 86691167 86769110 86877265 86939109 87196522 87533673 87968394 88365162 88922865 89617795
3540H9617795Q21189Q35827J109413J292597J372770J532413J583623J819045
$$ 89617795 90438984 91274811 92384224 93676821 95049591 96582004 98165627 99984672
3532I9984672J818228K058560K167502K314861K528946K484516K597967K711965
$$ 99984672 101802900 103861460 106028962 108343823 110872769 113357285 115955252 118667217
3524A18667217K537076K296011J956695J743263J293211O82342K20045K36l62802
$$ 118667217 121204293 123500304 125456999 127200262 128493473 129175815 129395860 129396096 129033294
3515A29033294o63860q30578q60192r76894j092100j185492j421885j504175j860795
$$ 129033294 128369434 127538856 126678664 125701770 124609670 123424178 122002293 120498118 118637323
3506A18637323k168343k564794k729135k989940l179959l205545l117779l121048
$$ 118637323 116468980 113904186 111175051 108185111 105005152 101799607 98681828 95560780
3498I5560780k981309k831903k668181k350325k063147k050606k016677j688876
$$ 95560780 92579471 89747568 87079387 84729062 82665915 80615309 78598632 76909756
3490G6909756j802944j812919j692965j538181j561342j518117j409976j489703
$$ 76909756 75106812 73293893 71600928 70062747 68501405 66983288 65573312 64083609
3482F4083609j457862j284909j356408j298254j252992j337782j367728j279251
$$ 64083609 62625747 61340838 59984430 58686176 57433184 56095402 54727674 53448423
3474E3448423j177500j172697j211151j195982j103163j055228r16828r77595
$$ 53448423 52270923 51098226 49887075 48691093 47587930 46532702 45615874 44638279
3466D4638279q64088p81085q43644q05314p33140o65653n91972n38628m74908
$$ 44638279 43774191 42993106 42149462 41344148 40611008 39945355 39353383 38814755 38339847
3457C8339847m58036n15945l27668l40842k08519j89574l9289R6249N5388R9491
$$ 38339847 37881811 37365866 37038198 36697356 36488837 36299263 36259974 36356223 36411611 36511102
3447C6511102K53764L31954L33037M97745N79338P86208R62179J185078J666821
$$ 36511102 36764866 37096820 37429857 37927602 38506940 39293148 40255327 41440405 43107226
3438D3107226J521816R71711l291j091424j764316k252740k011821j460343j004608
$$ 43107226 44629042 45600753 45597462 44506038 42741722 40488982 38477161 37016818 36012210
3429C6012210q99120q17751q04873o66843o48644n58470l87526m40864l54945
$$ 36012210 35113090 34295339 33490466 32823623 32174979 31616509 31228983 30788119 30433174
3420C0433174k79628k02091o2715M2363K80432K68573L58752N67406R22445J175780
$$ 30433174 30153546 29951455 29888740 29931103 30211535 30480108 30838860 31406266 32328711 33504491
3410C3504491J346852J736333K457045L231181L102763J861640j03273k553686
$$ 33504491 34851343 36587676 39044721 42275902 45378665 47240305 47137032 44583346
3402D4583346m020130m652758l906647k856356k051567j438077j102810q15262
$$ 44583346 40563216 35910458 32003811 29147455 27095888 25657811 24555001 23739739
3394B3739739q03427o53433o07910m89034m44327k72181j73659j92444j77147
$$ 23739739 22936312 22282879 21674969 21185935 20741608 20469427 20295768 20103324 19926177
3385A9926177M0325J26231O6418J27435N13613N19542N31154P60977Q27415J243597
$$ 19926177 19966502 20092733 20159151 20286586 20800199 21319741 21850895 22611872 23439287 24682884
3375B4682884J481223J315837J027197l6959j091716j688987k031569j842361
$$ 24682884 26164107 27479944 28507141 28470182 27378466 25689479 23657910 21815549
3367B1815549j272441p39096m95673n15111l32319l53505m63640n62342m57002
$$ 21815549 20543108 19804012 19308339 18793228 18460909 18107404 17643764 17081422 16624420
3358A6624420l64429l10050k81104k30435k52697k50481k94557r3364j46474r7288
$$ 16624420 16259991 15949941 15668837 15438402 15185705 14935224 14640667 14547303 14400829 14303541
3348A4303541r2564J04818j10549j47632Q1972l4851q3028J4954J52306j04587
$$ 14303541 14210977 14315795 14205246 14057614 14139586 14104735 14021707 14036661 14188967 14084380
3338A4084380L8644j3713M8038R2871J058n3332J04922J12980N1010O729O5926
$$ 14084380 14123024 14109311 14157349 14250220 14251278 14197946 14302868 14415848 14466858 14473587 14539513
3327A4539513O638L6252J13476p792o4485M1293N4997J5666P2545Q6964K08053
$$ 14539513 14546151 14582403 14695879 14688087 14623602 14664895 14719892 14735558 14808103 14895067 15103120
3316A5103120J33279J08331L31226L39832J98878J20977J32472j2777K7268J44910
$$ 15103120 15236399 15344730 15675956 16015788 16214666 16335643 16468115 16455338 16482606 16627516
3306A6627516M0701p8325K2473k682J56136Q4148J10639J08910N8582J38245K65018
$$ 16627516 16668217 16589892 16612365 16609683 16765819 16849967 16960606 17069516 17128098 17266343 17531361
3295A7531361L32184J69094Q0469L40547L66822K14009K35838K90219L49078L94907
$$ 17531361 17863545 18032639 18113108 18453655 18820477 19034486 19270324 19560543 19909621 20304528
3285B0304528M95781N23720N21972M63444M11702M18560N17609L16092L13606
$$ 20304528 20800309 21324029 21846001 22309445 22721147 23139707 23657316 23973408 24287014
3276B4287014M06597N24982M69032N98970Q46879Q16989Q09173R47512J015760
$$ 24287014 24693611 25218593 25687625 26286595 27133474 27950463 28759636 29707148 30722908
3267C0722908J163888J450209J448639J560192J718434J720392J887028J894919
$$ 30722908 31886796 33337005 34785644 36345836 38064270 39784662 41671690 43566609
3259D3566609J917873J785044J545400J300097Q29440K9728q70563j699045k408355
$$ 43566609 45484482 47269526 48814926 50115023 50944463 50974191 50103628 48404583 45996228
3250D5996228k704367k665829k602215k124808j534305j367500j174751j124678
$$ 45996228 43291861 40626032 38023817 35899009 34364704 32997204 31822453 30697775
3242C0697775j159127j133163j220821j140451j046091q85998o39525n83544n47452
$$ 30697775 29538648 28405485 27184664 26044213 24998122 24112124 23472599 22889055 22341603
3233B2341603m66791n35762m24916m77233m53451l88397m37069m21798m87037
$$ 22341603 21874812 21339050 20914134 20436901 19983450 19595053 19157984 18736186 18249149
3224A8249149l45001l26836m19150l81732k48268l00113k57907k65298l44620
$$ 18249149 17904148 17577312 17158162 16776430 16528162 16228049 15970142 15704844 15360224
3215A5360224k26286k94994l10909l02169k09744j86126k37252k59046k29815
$$ 15360224 15133938 14838944 14528035 14225866 14016122 13829996 13592744 13333698 13103883
3206A3103883j27036k19022j73506j93831k6947k3446k69936l00331j59403j01277
$$ 13103883 12976847 12757825 12584319 12390488 12363541 12340095 12070159 11769828 11610425 11509148
3196A1509148j58240k05591j19712j71102j20097q7734j52007k15663p4999j41797
$$ 11509148 11350908 11145317 11025605 10854503 10734406 10646672 10494665 10279002 10204003 10062206
3186A0062206r8225k03803j38518q49k3827q5981j47743o7021n5560j37803p9297
$$ 10062206 9963981 9760178 9621660 9620811 9596984 9511003 9363260 9296239 9240679 9102876 9023579
3175I023579M7816o9482j29081j53003j16090j16088O8602L9003o9972r8705j22266
$$ 9023579 9071395 9001913 8872832 8719829 8603739 8487651 8556253 8595256 8525284 8426579 8304313
3164H304313j19029K9284j30607p2169o5847j53274p5938k4929n1264l7164p9420
$$ 8304313 8185284 8214568 8083961 8011792 7945945 7792671 7716733 7691804 7640540 7603376 7523956
3153G523956j07117m3667o9704o269J1927l1706p193q5912j32467l6091r2864
$$ 7523956 7416839 7373172 7303468 7297199 7309126 7277420 7270227 7184315 7051848 7015757 6922893
3142F922893J6093j09151j94830N280r4605j8053K5608n2488r2305J2720q5052
$$ 6922893 6938986 6829835 6635005 6640285 6545680 6527627 6553235 6500747 6408442 6421162 6336110
3131F336110K2962J1331k1477j15844q298k8115L467J23758r6831j74466r5959
$$ 6336110 6359072 6370403 6348926 6233082 6224784 6196669 6200136 6323894 6227063 6052597 5956638
3120E956638o4897j06873J17216K7473K8300l7239L4708j97238m8218j76m1838
$$ 5956638 5891741 5784868 5902084 5929557 5957857 5920618 5955326 5758088 5709870 5709694 5667856
3109E667856n7l4748r4982p7715k2774J5413m162N9941J9701j2239k7670m5401
$$ 5667856 5667799 5633051 5538069 5460354 5437580 5452993 5448831 5508772 5528473 5516234 5488564 5443163
3097E443163o5104j37742L9214M120j1471L6792N0042j47643J2423P1903r6343
$$ 5443163 5378059 5240317 5279531 5283651 5272180 5308972 5359014 5211371 5223794 5295697 5199354
3086E199354k889P8883l2291k6160J24999q785o7420k3368j09572L8285J0393
$$ 5199354 5196465 5275348 5243057 5216897 5341896 5333111 5265691 5242323 5132751 5171036 5181429
3075E181429o2477K0753m1265r1186L2622j03175r0853M1863m9074m6414K2680
$$ 5181429 5118952 5139705 5098440 5007254 5039876 4936701 4845848 4887711 4838637 4792223 4814903
3064D814903l570o6665Q1451m9359k8007k0405j23589O4417P7804O8642o6996
$$ 4814903 4811333 4744668 4826119 4776760 4748753 4728348 4604759 4669176 4746980 4815622 4748626
3053D748626J19918J1616K8166n4019M5639J825O5046l9665o3523n6789j14692
$$ 4748626 4868544 4880160 4908326 4854307 4899946 4901771 4966817 4927152 4863629 4806840 4692148
3042D692148J10128L437p1096j56249J0091O8314k3500p1147K3231j24721O5257
$$ 4692148 4802276 4805713 4734617 4578368 4588459 4656773 4633273 4562126 4585357 4460636 4525893
3031D525893N6388R301J1101j1194l7067k3273L327J19788n5242o480K039M2050
$$ 4525893 4582281 4591582 4602683 4591489 4554422 4531149 4534476 4654264 4599022 4592542 4594581 4636631
3019D636631J52013j6762M0558P4472N1863k2618M2915J41969j01906j30276O2443
$$ 4636631 4788644 4771882 4812440 4886912 4938775 4916157 4959072 5101041 4999135 4868859 4931302
3008D931302K5480m2213L9990J01219k8865P5931M6653m7138J44378O3714j51453
$$ 4931302 4956782 4914569 4954559 5055778 5026913 5102844 5149497 5102359 5246737 5310451 5158998
2997E158998M1037J97072k4349R469J00787Q651J40376O1328K5385R9149J9411
$$ 5158998 5200035 5397107 5372758 5382227 5483014 5491665 5632041 5693369 5718754 5817903 5837314
2986E837314J32982P3352l614J53055L3234L70L8804q4276Q6592J41973j921Q0799
$$ 5837314 5970296 6043648 6040034 6193089 6226323 6226693 6265497 6181221 6267813 6409786 6407865 6488664
2974F488664l6972o5676K9619N6259Q4564O959O5831J25741l007l504P8735J44968
$$ 6488664 6451692 6386016 6415635 6471894 6556458 6563417 6629248 6754989 6751982 6748478 6827213 6972181
2962F972181J06630J76423K3585m3569Q7620K9508K49395K38265J00023J75607
$$ 6972181 7078811 7255234 7278819 7235250 7322870 7352378 7601773 7840038 7940061 8115668
2952H115668K19757K30361M3011J73379K56495J25426O7723K09514K52442J71068
$$ 8115668 8335425 8565786 8608797 8782176 9038671 9164097 9231820 9441334 9693776 9864844
2942I864844J19008J06203K02088Q6037J35772m3636P252R5340K37890Q6220P2665
$$ 9864844 9983852 10090055 10292143 10378180 10513952 10470316 10477568 10572908 10810798 10897018 10969683
2931A0969683M1290J34924J18328J66851K04126R7455L67457L43441K91364L06898
$$ 10969683 11010973 11145897 11264225 11431076 11635202 11732657 12100114 12443555 12734919 13041817
2921A3041817M02688M98648L96754L84084N34531N17142M96546M00032L42918
$$ 13041817 13444505 13943153 14339907 14723991 15258522 15775664 16272210 16672242 17015160
2912A7015160j11227j82645k49973m47521m59058n83778m52704k12603k34172
$$ 17015160 16903933 16721288 16471315 16023794 15564736 14980958 14528254 14315651 14081479
2903A4081479j81795n8703P3277P9689R4330O8412J69437J83663J41577K05428
$$ 14081479 13899684 13840981 13914258 13993947 14088277 14156689 14326126 14509789 14651366 14856794
2893A4856794L3656J58321J27561J21731M0153J8481J57862M7364P183j77260
$$ 14856794 14890450 15048771 15176332 15298063 15338216 15356697 15514559 15561923 15569106 15391846
2883A5391846j94097l88227k86681l13634n35912l40227m14355l72183l07250
$$ 15391846 15197749 14809522 14522841 14209207 13673295 13333068 12918713 12546530 12239280
2874A2239280k83828l62593j58484j71538l3182M2819j28222j05730p2494j37834
$$ 12239280 11955452 11592859 11434375 11262837 11229655 11272474 11144252 11038522 10966028 10828194
2864A0828194k14448j91352j63634j85508l04692j73509l06381k31322k57580
$$ 10828194 10613746 10422394 10258760 10073252 9768560 9595051 9288670 9057348 8799768
2855H799768l76702j95624l06392k20187k38649l36351j91253j45521j76896j76718
$$ 8799768 8423066 8227442 7921050 7700863 7462214 7125863 6934610 6789089 6612193 6435475
2845F435475o2625j94624j41649j87393o506j04415q6143J0595j48599r4910l7808
$$ 6435475 6372850 6178226 6036577 5849184 5842678 5738263 5652120 5662715 5514116 5419206 5381398
2834E381398q8280n9075N85j83486k60046q3089l4652k0361k22765j39748N7754
$$ 5381398 5293118 5234043 5234628 5051142 4791096 4708007 4673355 4652994 4430229 4290481 4348235
2823D348235j12632j53361k9362q0169m6630l7093j38282p9555k1502m8913o0238
$$ 4348235 4235603 4082242 4052880 3972711 3926081 3888988 3750706 3671151 3649649 3600736 3540498
2812C540498p4176k0968r348o6526n6040j46285k3217j19377p4849J2014M9658
$$ 3540498 3466322 3445354 3436006 3369480 3313440 3167155 3143938 3024561 2949712 2961726 3011384
2801C011384l4039l5337q7514l5841k3500j30140k3203M4424n9727L0772o8258
$$ 3011384 2977345 2942008 2854494 2818653 2795153 2665013 2641810 2686234 2626507 2657279 2589021
2790B589021j57409N145N7381j02503r7460R215J8299j25912o6922k3441K9812
$$ 2589021 2431612 2436757 2494138 2391635 2294175 2303390 2321689 2195777 2128855 2105414 2135226
2779B135226j8798J7289k8250q3744p3461p0105j226j6649L1852k8058j26080
$$ 2135226 2116428 2133717 2105467 2021723 1948262 1878157 1876931 1860282 1892134 1864076 1737996
2768A737996M3697m9360K7829P3658n6839j8299l615M179j20216l6172M3635m4324
$$ 1737996 1781693 1732333 1760162 1833820 1776981 1758682 1755067 1759246 1639030 1602858 1646493 1602169
2756A602169N5963j41741q7600l418q9210l3178l2108l6721J6206M8126m3350
$$ 1602169 1658132 1516391 1428791 1425373 1336163 1302985 1270877 1234156 1250362 1298488 1255138
2745A255138N944j6750L0113k9274N2266n1522n0106o3529K3821M4841q7683O7065
$$ 1255138 1261082 1244332 1274445 1245171 1297437 1245915 1195809 1132280 1156101 1200942 1113259 1180324
2733A180324K2856k9104n0622p4677O9219J7928p1877r0928m2768j0862m4121
$$ 1180324 1203180 1174076 1123454 1048777 1117996 1135924 1064047 973119 930351 919489 875368
2722H75368r832N7343j5885j05207P66O2420j4482K7194j48707L5012L9901j4224
$$ 875368 865536 922879 906994 801787 802553 864973 850491 877685 728978 763990 803891 789667
2710G89667K1067m641j23263M0220M0341k9353r5068J30710K8146q9638K2334
$$ 789667 810734 806093 682830 723050 763391 734038 638970 769680 797826 708188 730522
2699G30522j1832O326M3915O887p4990J12669m1689r7979k4558K1433J7798l1709
$$ 730522 718690 725016 768931 775818 700828 813497 771808 673829 649271 670704 688502 656793
2687F56793K4818k721q688L4893l8446N0788o4352R074J03056n7724o0941R756
$$ 656793 681611 678890 670202 705095 666649 717437 653085 662159 765215 707491 646550 656306
2675F56306r0558o8734N1652J15362j23071L2249j083o084m294L6133l306M7647
$$ 656306 565748 497014 548666 664028 540957 573206 572123 566039 561745 597878 594572 642219
2663F42219K2541n8110k5966J6992K4425o7317k7937m4937N2126P344j1502M6736
$$ 642219 664760 606650 580684 597676 622101 554784 526847 481910 534036 541380 529878 576614
2651E76614J6304l8911m4994l0969K0j08401J21958j7746r1212o24N0068n3032
$$ 576614 592918 554007 509013 478044 478064 369663 491621 473875 382663 382039 432107 379075
2639C79075k6495O2302R1115j14805J35304o4971n5433J07655n1113R866o9636
$$ 379075 352580 414882 505997 391192 526496 461525 406092 513747 462634 472500 402864
2628D02864J1400M934K9238n7520J14056n3549l2611J5217p1235K7013J20882
$$ 402864 414264 419198 448436 390916 504972 451423 418812 434029 362794 389807 510689
2617E10689l7093j4662L1962J611q8744N8564j8058j4651O330O582q5878o9164
$$ 510689 473596 458934 490896 492507 403763 462327 444269 429618 435948 442530 356652 287488
2605B87488P6671K4990Q4885j1973p2315o8103K7622O5158k5688K7466l6973k96
$$ 287488 364159 389149 474034 462061 389746 321643 349265 414423 388735 416201 379228 378932
2593C78932K6325r951j5553l1764M8053J482L2161N9417l1647l3387l9985j38716
$$ 378932 405257 395306 379753 347989 396042 397524 429685 489102 457455 424068 384083 245367
2581B45367L4352M6293q055n0240O9352R091P0053m3466M9692r2175j27699P4358
$$ 245367 279719 326012 317957 267717 337069 346160 416213 372747 422439 330264 202565 276923
2569B76923J4938m2233J66434J5846j40557M7672o2758K4910o2029L1786r3003
$$ 276923 291861 249628 416062 431908 291351 339023 276265 301175 239146 270932 177929
2558A77929J5650J14052j4657k7435k6153O8451J42790k5790m7225j3185q5090
$$ 177929 193579 307631 292974 265539 239386 307837 450627 424837 377612 364427 279337
2547B79337j06774M1297m1809N9203P4580Q464l160j16112o4650K6490N6543K898
$$ 279337 172563 213860 172051 231254 305834 314298 311138 195026 130376 156866 213409 216307
2535B16307R0874L511m7168l4504L8806k055O6124r0711q4024O8369n2830p7249
$$ 216307 307181 310692 263524 229020 267826 265771 331895 241184 157160 225529 172699 95450
2523I5450Q1506l2636J6256m2533j2260J60214k5453J685q4906k4558J45960p8564
$$ 95450 176956 144320 160576 118043 105783 265997 240544 242229 157323 132765 278725 200161
2511B00161Q550Q169o2902O7008j16927k9366Q456L0023j5402O4073o1226J0164
$$ 200161 208711 216880 153978 220986 104059 74693 83149 113172 97770 161843 100617 110781
2499A10781K7447L426M711R706k5933J05966k8164m3480r940m4606L6126m7788
$$ 110781 138228 141654 146365 156071 130138 236104 207940 164460 154520 109914 146040 98252
2487I8252K7949l540Q105K3788l2051j7511J1816K522J4917K5473j8451M2895
$$ 98252 126201 122661 130766 154554 122503 104992 116808 119330 134247 159720 141269 184164
2475A84164q0636k3773Q1644k0496P2052q9451j22692o7956J42291J05274Q8559
$$ 184164 103528 79755 161399 140903 212955 123504 812 -67144 75147 180421 268980
2464B68980k7495j58613M8219J7227k5322n791j9919K1169J4136M7957n0033K2957
$$ 268980 241485 82872 131091 148318 122996 117205 97286 118455 132591 180548 130515 153472
2452A53472k9860l3045q5721L3336J07527m5192k7359L5357k8378l2672P0343
$$ 153472 123612 90567 4846 38182 145709 100517 73158 108515 80137 47465 117808
2441A17808J11856j28786n6729J3268M4241P7890J01918l5435j75928n7975P9722
$$ 117808 229664 100878 44149 57417 101658 179548 281466 246031 70103 12128 91850
2430I1850j3971j876J6411k9013m8850o7445P6194Q5702p4036P1494M4162Q965
$$ 91850 77879 76003 92414 63401 14551 -52894 23300 109002 34966 106460 150622 159587
2418A59587J1919j7117J12n6030L1648r8376k6175O487N6022L8268n5638j04552
$$ 159587 171506 154389 154501 98471 130119 31743 5568 12055 68077 106345 50707 -53845
2406e3845N5902J16511p029m567P0563k5691l4565k7975Q1536p063j3356o933
$$ -53845 2057 118568 111539 106972 177535 151844 117279 89304 170840 163777 150421 143488
2394A43488p3026K6398k992Q9336L852K843J6538q0553L9951p489l3055k4591
$$ 143488 70462 96860 93868 183204 187056 189899 206437 125884 165835 158346 125291 100700
2382A00700J17639K640j6351J00676N115k084p2528j1193n8049M3564m5107p5415
$$ 100700 218339 220979 204628 305304 310419 308335 235807 224614 166565 210129 165022 89607
2370H9607K4959o1119J7580O4715Q2370p0300r1805j9270J58904k4779m9425p3481
$$ 89607 114566 53447 71027 135742 218112 147812 56007 36737 195641 170862 121437 47956
2358D7956L29k2626r3484R8367J16626m5094k2013R0524o524r8075r4785J07262
$$ 47956 48285 25659 -67825 30542 147168 102074 80061 170585 164061 65986 -28799 78463
2346G8463N7395N3399j12717k6952L1530J548J20329l1820l7358L2290o6202k1480
$$ 78463 135858 189257 76540 49588 81118 82666 202995 171175 133817 166107 99905 78425
2334G8425m2231O803m999r0765M3001P4111L6143k1482Q3714J5285j7538m2165
$$ 78425 36194 42997 37998 -52767 -9766 64345 100488 79006 162720 178005 160467 118302
2322A18302k5227j8656J8358L084P848M6673k1397p2720M4796m6994J6881r952
$$ 118302 93075 74419 92777 95861 103709 150382 128985 56265 101061 54067 70948 60996
2310F0996n3120n4539r937K12242p6004r425P5334q9757M8954O6839p584N7090
$$ 60996 7876 -46663 -56600 155642 79638 70213 145547 55790 104744 171583 163999 221089
2298B21089m3151r8516j8630J5581n6737O5287p4804k8807N7468m4866N5003n3626
$$ 221089 177938 79422 60792 76373 19636 84923 10119 -18688 38780 -6086 48917 -4709
2286d709P0642K0326J56644p1964j38635N6733q210n8688J14132N572q1416r2363
$$ -4709 65933 86259 242903 170939 32304 89037 80827 22139 136271 141843 60427 -31936
2274c1936M2621J68475j03920N5694J3186m1447j4317n8825L2881J04319n7587
$$ -31936 10685 179160 75240 130934 144120 102673 88356 29531 62412 166731 109144
2263A09144j2256K5353J04185l3152J1771J0107J42887k2349j4456j36099j45157
$$ 109144 96888 122241 226426 193274 205045 215152 358039 335690 321234 185135 39978
2252C9978J34712J9122r766k1250J17798l4263o1070O5091j27101Q4219j0265
$$ 39978 174690 193812 184046 162796 280594 246331 185261 250352 123251 207470 197205
2241A97205O9968M2424n4008O0660p0723K5330q1725m0254K8340j670j7800N0629
$$ 197205 267173 309597 255589 316249 245526 270856 189131 148877 177217 175547 157747 208376
2229B08376M0729Q1023M9727m8149L9667M682q6108M3589J08475n3559L3227J6550
$$ 208376 249105 330128 379855 331706 371373 376055 289947 333536 442011 388452 421679 438229
2217D38229j4243m8110l8194q326k8269J17119L2505k6350P5255k4432M794K8910
$$ 438229 423986 375876 337682 329356 301087 418206 450711 424361 499616 475184 479978 508888
2205E08888l162L5220L6613l5733J22585p4787j3455M9805n2168J42515J22340
$$ 508888 505726 540946 577559 541826 664411 589624 576169 625974 573806 716321 838661
2194H38661L0651r1188o6391Q4099l747K6681N8013O636r66n7324J0764j8885
$$ 838661 869312 778124 711733 795832 792085 818766 876779 883415 882449 825125 835889 817004
2182H17004n693p28j5172L3364J0612N3424n1258o3372O5123O8337J49604J3850
$$ 817004 811311 810583 795411 828775 839387 892811 841553 778181 843304 911641 1061245 1075095
2170A075095Q2521m2048p4713k6427M3978N4847M5152j6998O0867R4253O7870
$$ 1075095 1157616 1115568 1040855 1014428 1058406 1113253 1158405 1141407 1202274 1296527 1364397
2159A364397J25817p1066l5796J35661q579J31476J39940Q0777j4170N4332J06156
$$ 1364397 1490214 1419148 1383352 1519013 1510434 1641910 1781850 1862627 1848457 1902789 2008945
2148B008945P0405J39877J40409J85536O7155J45515K47320K5792J05046K07942
$$ 2008945 2079350 2219227 2359636 2545172 2612327 2757842 3005162 3030954 3136000 3343942
2138C343942J10805J76402K47658J36271K36097L11398K80313L92505M54065N08146
$$ 3343942 3454747 3631149 3878807 4015078 4251175 4562573 4842886 5235391 5689456 6197602
2128F197602O47487M62476N59428N91964Q90918J193711J492168J690184K118569
$$ 6197602 6845089 7307565 7866993 8458957 9349875 10543586 12035754 13725938 15844507
2119A5844507K438794L082091L884543N710068O644971N144210J162123m529770
$$ 15844507 18283301 21365392 25249935 30960003 37604974 42749184 43911307 39381537
2111C9381537p861933p979651n429369l559804k335588j690973j244444q82994
$$ 39381537 31519604 23539953 18110584 14550780 12215192 10524219 9279775 8396781
2103H396781p80192n59776m23160k50085k92540k86144m50826n08897n18867m51701
$$ 8396781 7616589 7056813 6633653 6383568 6091028 5804884 5354058 4845161 4326294 3874593
2093C874593k38025j47727j46975k70148j95856j45674n5635j24422j51262j18706
$$ 3874593 3636568 3488841 3341866 3071718 2875862 2730188 2674553 2550131 2398869 2280163
2083B280163q1108o7153k1617j88669j01051j03929n1667J201k03357r9790m6990
$$ 2280163 2199055 2131902 2110285 1921616 1820565 1716636 1664969 1666170 1462813 1363023 1316033
2072A316033m72r1682Q618N2637p9860N2426j92357P951l1809q7486K3853O5221
$$ 1316033 1315561 1223879 1232497 1285134 1205274 1257700 1065343 1073294 1041485 953999 977852 1043073
2060A043073m9135k4339r2363p9944J6008j2106J10074m5454k6581j3981j08920
$$ 1043073 993938 969599 877236 797292 813300 801194 911268 865814 839233 825252 716332
2049G16332q4243J00919j21818j37339J50562K3301n2761l7954m829P7592J0497
$$ 716332 632089 733008 611190 473851 624413 647714 594953 556999 552170 629762 640259
2038F40259J2069K8669o9937P1134J4983m6333k00203k540o40l0994o0339q0089
$$ 640259 652328 680997 611060 682194 697177 650844 450641 448101 447461 416467 356128 276039
2026B76039J16310m200M5257k4138j01685M2941R4961p8075K8264l4605n5311
$$ 276039 392349 388149 433406 409268 307583 350524 445485 367410 395674 361069 305758
2015C05758K2344M5616k9969l3414m5882P775o3409J35132M6565k9921j38618
$$ 305758 328102 373718 343749 310335 264453 272228 208819 343951 390516 360595 221977
2004B21977j1866P3819l5003K6696j9251Q0081o381l0410p6115j1271o7493M016
$$ 221977 210111 283930 248927 275623 256372 336453 330072 299662 223547 212276 144783 148799
1992A48799L2394k9495N51r957l6346j1492R5628m481p5764K2948P3235o647O8631
$$ 148799 181193 151698 152249 142292 105946 94454 190082 185601 109837 132785 206020 199373 268004
1979B68004m1554r12M0130L5632J4943k09135k7781O3613P2352l7906p3063R9690
$$ 268004 226450 225538 265668 301300 316243 107108 79327 142940 215292 177386 104323 204013
1967B04013K8531M266k6933n8847j93r1111J869m2536k6738P5988r619o3332L040
$$ 204013 232544 236810 209877 151030 150837 59726 61595 19059 -7679 68309 58690 -4642 -1602
1954a602l6662N460R8120j00928m8713J66085J33569J9910l773j00995o2753P7836
$$ -1602 -38264 -32804 65316 -35612 -84325 81760 215329 235239 231466 130471 67718 145554
1942A45554N979q0585j733J3453J7467N025k9467K8251L0547k6594n4668J8865
$$ 145554 151533 70948 69215 82668 100135 105160 75693 103944 134491 107897 53229 72094
1930G2094O4558K4202k9672j12855J47Q0730J9706q8154J2674Q4957K0055n8534
$$ 72094 136652 160854 131182 18327 18474 99204 118910 30756 43430 128387 148442 89908
1918H9908O877l9535l8531J3660M5024p9322k0324k3985K6665J21024N1500N47
$$ 89908 96785 57250 18719 32379 77403 -1919 -22243 -46228 -19563 101461 152961 153508
1906A53508j57406L0803m1708J8187l8211L1612N3365r8500J4599K853K0410m3220
$$ 153508 -3898 26905 -14803 3384 -34827 -3215 50150 -48350 -33751 -30898 -10488 -53708
1894e3708R0607j6997j2419m630j3903K7765J9538n580J12549j9294j03027q5380
$$ -53708 36899 19902 7483 2853 -11050 16715 36253 30673 143222 123928 20901 -64479
1882f4479J09681m4689j33418R263P9607P5056K6982K8147n0918J6072o05q3947
$$ -64479 45202 513 -132905 -123642 -44035 31021 58003 86150 35232 51304 50699 -33248
1870c3248m152k5980N1509k1629n0159P0323p8520j714Q3050O8243q0101R8471
$$ -33248 -37400 -63380 -11871 -33500 -83659 -13336 -91856 -93570 -10520 57723 -22378 76093
1858G6093o341n9583L076l9571N0885m7948q4818J72132N0660p255n9928J52810
$$ 76093 69752 10169 13245 -26326 24559 -23389 -108207 63925 114585 107330 47402 200212
1846B00212r959K7339k6820K897J1163k9582n5057r4292m0536P9441n6069K9843
$$ 200212 190253 217592 190772 193669 204832 175250 120193 25901 -14635 64806 8737 38580
1834C8580J4216Q703k2063J148M053o1600N0617J8026k1378n9480m7600o5257
$$ 38580 52796 61499 39436 40584 44637 -16963 33654 51680 30302 -29178 -76778 -142035
1822a42035J3775J7725L1228P2083J47923k071n2458r0720k8988k8025M2861J4793
$$ -142035 -128260 -110535 -79307 -7224 140699 138628 86170 -4550 -33538 -61563 -18702 -3909
1810c909K030K0069m6736L3182j10440Q2047J44484p4236q6654j3217J2677j13
$$ -3909 -1879 18190 -28546 4636 -105804 -23757 120727 46491 -40163 -53380 -40703 -40816
1798d0816P1027j4212r6511K8841p7523K2463R4833r362J0424l2467J667M8954
$$ -40816 30211 15999 -80512 -51671 -129194 -106731 -11898 -21260 -10836 -43303 -41636 7318
1786G318R1447N689k4298j51144m0934K2710o808P4617j6824p2458O517r223J4329
$$ 7318 98765 104454 80156 -70988 -111922 -89212 -96020 -21403 -38227 -110685 -104168 -113391 -99062
1773i9062J0427J10954Q516P4801j9495l0360j6491M5807r5773Q97J6827k0462
$$ -99062 -88635 22319 30835 105636 86141 55781 39290 85097 -10676 -9779 7048 -13414
1761a3414K8220K2124J2796j0267p1348l3967K5259j00853P0441O6796O5360L3549
$$ -13414 14806 36930 49726 39459 -31889 -65856 -40597 -141450 -71009 -4213 61147 94696
1749I4696p0349O4771q131J5392m6452j16206K0897R6980q378l1346J8649N3596
$$ 94696 24347 89118 80987 96379 49927 -66279 -45382 51598 43220 11874 30523 84119
1737H4119k75n5327p3533O0350p931n6849N6105l1093L9785m9487M2241q533K9306
$$ 84119 83844 28517 -45016 15334 7403 -49446 6659 -24434 15351 -34136 8105 -428 28878
1724B8878N1647n4841J1372q7474M6407M3065o9764M8006K3125j22597K0320R4728
$$ 28878 80525 25684 37056 -50418 -4011 39054 -30710 17296 40421 -82176 -61856 32872
1712C2872m6340k9415J7641Q9315P195j98118M9382R8078N8297j0564m3136M1349
$$ 32872 -13468 -42883 -25242 64073 71268 -126850 -77468 20610 78907 68343 25207 66556
1700F6556K1838q4753j22770L2531j10326N6086O7024N201o3473K0930M1167Q9004
$$ 66556 88394 3641 -119129 -86598 -196924 -140838 -73814 -68613 -132086 -111156 -69989 19015
1688A9015k5994q3098k082O3067k9847L748Q9422k9334l8951O6673n3874J3254
$$ 19015 -6979 -90077 -92159 -29092 -58939 -55191 34231 4897 -34054 32619 -21255 -8001
1676h001m1127J1348l4517m6371L1990n9619J26993Q4560q3409M3468M2458K8996
$$ -8001 -49128 -37780 -72297 -118668 -86678 -146297 -19304 65256 -18153 25315 67773 96769
1664I6769l3656l765j30809k8841J30589n1910o630L4741K6609j8319N5062p601
$$ 96769 63113 59348 -71461 -100302 30287 -21623 -28253 6488 33097 14778 69840 62239
1652F2239n8640j8650K6768k2324Q2036J9025r2894q1121r713J1781J7420N7117
$$ 62239 3599 -15051 11717 -10607 71429 90454 -2440 -83561 -93274 -81493 -64073 -6956
1640f956K0371n3036K5055K7101Q9148l0151K9557R479j8876k2364q9411J31341
$$ -6956 13415 -39621 -14566 12535 101683 71532 101089 110568 91692 69328 -20083 111258
1628A11258j29188n9081M7087m4545n0710K151J60610j81728j8933J34516M1440
$$ 111258 -17930 -77011 -29924 -74469 -125179 -123028 37582 -144146 -163079 -28563 12877
1617A2877j37p9730O7711n2097k7353P2707N1726l3818P003n9610M894Q4906j45918
$$ 12877 12740 -66990 721 -51376 -78729 -6022 45704 11886 18889 -40721 -35827 49079 -96839
1604i6839L3859K9874J56424P9882j21125m3349k1496M7908l3358r0964O3619
$$ -96839 -62980 -33106 123318 203200 82075 38726 17230 65138 31780 -59184 4435
1593D435Q0518j2336l2066l9129L7744l5270O76j4809J1836j8238l4480M4888
$$ 4435 84953 72617 40551 1422 39166 3896 4572 -10237 1599 -16639 -51119 -6231
1581f231j4584M814O0995k8773o0644j6681q4337L6763K9478m7834N9380N2175
$$ -6231 -20815 -16001 44994 16221 -44423 -61104 -145441 -108678 -79200 -127034 -67654 -15479
1569a5479k46Q046J1897n2927L5555j3537O753J18962L8284n7172l3958n8456
$$ -15479 -15725 -7679 4218 -48709 -13154 -26691 -19938 99024 137308 80136 46178 -12278
1557a2278P155k8322P492n3930o5065J18463J03935J4564J9606J5655m5339n8199
$$ -12278 -5123 -33445 -25953 -79883 -144948 -26485 77450 92014 111620 127275 81936 23737
1545B3737l2872m2225K5663l2764L310L7527n4896r80N574J31087n8287O7354
$$ 23737 -9135 -51360 -25697 -58461 -55151 -17624 -72520 -73500 -67926 63161 4874 72228
1533G2228n1261m3599M2318j04483o4960M5244M0741j8527J250L5889M1332Q4619
$$ 72228 20967 -22632 19686 -84797 -149757 -104513 -63772 -82299 -81049 -45160 -3828 80791
1521H0791P855l0921p1272j5556n6161O9801m9646l8364Q0456l3186k9086N7801
$$ 80791 88646 57725 -13547 -29103 -85264 -15463 -65109 -103473 -23017 -56203 -85289 -27488
1509b7488J3429m1697N4105r7160R7157L7288L5726j5856r5914Q0747N5393p8957
$$ -27488 -14059 -55756 -1651 -98811 -1654 35634 71360 55504 -40410 40337 95730 16773
1497A6773q858n5978L5683O3345O9330r6227J2773L523q7785j51555l186Q1081
$$ 16773 7915 -48063 -12380 50965 120295 24068 36841 40364 -47421 -198976 -202162 -121081
1485a21081J1896l490k8774J19257k095p8059K7106P668L8585K593m0844l0468
$$ -121081 -109185 -112675 -141449 -22192 -24287 -102346 -75240 -67572 -28987 -26394 -67238 -97706
1473i7706L4917R4866m491K0180l9763M9011n2310K5870N1113n3647j31896N6669
$$ -97706 -62789 32077 27586 47766 8003 57014 4704 30574 81687 28040 -103856 -47187
1461d7187m9495L2046L3463k2923n25M1416l7603j1909Q0357M8846P5569J632
$$ -47187 -96682 -64636 -31173 -54096 -54621 -13205 -50808 -62717 17640 66486 142055 143687
1449A43687r2326k3579j2963p5325M4047j3134k5501q8039J7957J04839j5037
$$ 143687 51361 27782 14819 -60506 -16459 -29593 -55094 -143133 -125176 -20337 -35374
1438c5374p5012N4028J18035j56492j18145J27041K2852K4729k7336n984j5007
$$ -35374 -110386 -56358 61677 -94815 -212960 -85919 -63067 -38338 -65674 -71658 -86665
1427h6665J09847M6467j44986O9154N5432k1769j5825J5734P0322p5551L5014
$$ -86665 23182 69649 -75337 -6183 49249 27480 11655 27389 97711 22160 57174
1416E7174p6423L7593P2216J0073p0148q93L8483q7477o2512J3227N7086k774
$$ 57174 -19249 18344 90560 100633 30485 29592 68075 -19402 -81914 -68687 -11601 -14375
1404a4375n0993M5060P0610j4498l8708L9447j3892k9717J15976m8932o11q743
$$ -14375 -65368 -20308 50302 35804 -2904 36543 22651 -7066 108910 59978 59367 50624
1392E0624m8981k1428J685n8911J9688J9544l3296p323N0672M0597n8032K1983
$$ 50624 1643 -19785 -18100 -77011 -57323 -37779 -71075 -78398 -27726 12871 -45161 -23178
1380b3178Q4843m9094k0113j3908J7804p953n9279j05610m411P0152l6181N8634
$$ -23178 61665 12571 -7542 -21450 -3646 -11599 -70878 -176488 -180899 -110747 -146928 -88294
1368h8294k0443L2279L4896k3674l5102O140L6474l9229K3259O8110j05071L7935
$$ -88294 -108737 -76458 -41562 -65236 -100338 -94198 -57724 -96953 -73694 -5584 -110655 -72720
1356g2720k4621N6816J14871k9708k1959J05963m6889l0316j09943k4729Q259
$$ -72720 -97341 -40525 74346 44638 22679 128642 81753 51437 -58506 -83235 -74976
1345g4976K5348L25k1617P130l690J20320o2662N5614k5487j40774J1398Q0611
$$ -74976 -49628 -49303 -70920 -63790 -67480 52840 -9822 45792 20305 -120469 -109071 -28460
1333b8460L5188r678O5445R196j31291L0374K1794j0642N9470j28044N5714J97058
$$ -28460 6728 -2950 62495 71691 -59600 -29226 -7432 -18074 41396 -86648 -30934 166124
1321A66124N677r1620j02508P4810m3191J4699o207m3328p5893P8492J06407l8927
$$ 166124 171801 80181 -22327 52483 9292 23991 17784 -25544 -101437 -22945 83462 44535
1309D4535r6668k5741L3076M7872l3970p06j054l5024o1605J24032R713m6385
$$ 44535 -52133 -77874 -44798 3074 -30896 -31602 -32656 -67680 -129285 -5253 4460 -41925
1297d1925j4596j901o9976Q8420P8160o1046q5951O7638J27954k8714j4819j22125
$$ -41925 -56521 -58422 -128398 -39978 38182 -22864 -108815 -41177 86777 58063 43244 -78881
1285g8881K3287J1513r119J13368j62690p052K0850M6842M0554k9789j0606j7951
$$ -78881 -55594 -44081 -53200 60168 -102522 -109574 -88724 -41882 -1328 -31117 -41723 -59674
1273e9674o6209R8209j5511p5795Q6602L3869J9906j16312Q6794K9423p4675j5662
$$ -59674 -125883 -27674 -43185 -118980 -32378 1491 21397 -94915 -8121 21302 -53373 -69035
1261f9035O3618L787n2911J0110k8613j4524J9438J1929K9585r1323R3275L6934
$$ -69035 -5417 -1630 -54541 -44431 -73044 -87568 -68130 -56201 -26616 -117939 -24664 12270
1249A2270O7275j8242m3603K0829P4295m8541q2587P6365P4450j3107m4467n9592
$$ 12270 79545 61303 17700 38529 112824 64283 -18304 58061 132511 119404 74937 15345
1237A5345q4905l0715P1309q952J33056j7977k2608m9852J609O8598J0706j57995
$$ 15345 -69560 -100275 -28966 -37918 95138 77161 54553 4701 6310 74908 85614 -72381
1225g2381N4725Q2296m553q3950j1632J17431n1213j63269J7959J67271p9486
$$ -72381 -17656 64640 60087 -23863 -35495 81936 30723 -132546 -114587 52684 -26802
1214b6802Q0173j9737j18240K9113n3923l7520Q3590L5538k1082M5419o8288j00042
$$ -26802 53371 33634 -84606 -55493 -109416 -146936 -63346 -27808 -48890 -3471 -71759 -171801
1202a71801K2029J7915Q1988j2676m3034P2039K6703n2498O4879L2311j2025j06694
$$ -171801 -149772 -131857 -49869 -62545 -105579 -33540 -6837 -59335 5544 37855 25830 -80864
1190h0864J127P9439L5360R415o3613M8252l910p2888N9115n771j1967j7885o1272
$$ -80864 -79737 -298 35062 44477 -19136 29116 25206 -47682 11433 5662 -6305 -24190 -85462
1177h5462K0029k4477M192Q4114l0474J21136J18045j43860l5839l6822J5608
$$ -85462 -65433 -89910 -85718 -1604 -32078 89058 207103 63243 27404 -9418 6190
1166F190n5893M6634J8374p7715J12842n7713J4975K3170k0200k2662j0364J3208
$$ 6190 -49703 -3069 15305 -62410 50432 -7281 7694 30864 10664 -11998 -22362 -9154
1154i154N0718M3432j11561n1497l8479L1260J16832o8429m7108O6232L3445m459
$$ -9154 41564 84996 -26565 -78062 -116541 -85281 31551 -36878 -83986 -17754 15691 11232
1142A1232K5788j0311j12310P4513M4836j00298L0232L6834l878p7291O6727m7905
$$ 11232 37020 26709 -85601 -11088 33748 -66550 -36318 516 -3362 -80653 -13926 -61831
$$ [...]
##END NTUPLES=NMR SPECTRUM
##END=
