##TITLE=1H_TG-2347-A
 CDCl3
 8 sc, 
 16.02.2022
##JCAMPDX= 6.0         $$ Bruker NMR JCAMP-DX V2.0
##DATA TYPE= NMR SPECTRUM
##DATA CLASS= NTUPLES
##ORIGIN= UXNMR, Bruker Analytische Messtechnik GmbH
##OWNER= root
$$ XWIN-NMR		Version 3.5
$$ Wed Feb 16 10:07:21 2022 Russian Standard Time (UT+4h)  she@DPX200
##.OBSERVE FREQUENCY= 200.131346
##.OBSERVE NUCLEUS= ^1H
##.ACQUISITION MODE= SIMULTANEOUS
##.ACQUISITION SCHEME= undefined
##.AVERAGES= 8
##.DIGITISER RES= 18
##SPECTROMETER/DATA SYSTEM= spect
##.PULSE SEQUENCE= zg30
##.SOLVENT NAME= CDCl3
##.SHIFT REFERENCE= (INTERNAL, CDCl3, 0, 15.7116)
##AUDIT TRAIL= $$ (NUMBER, WHEN, WHO, WHERE, WHAT)
$$ ##TITLE= Audit trail, XWIN-NMR		Version 3.5
$$ ##JCAMPDX= 5.01
$$ ##ORIGIN= Bruker BioSpin GmbH
$$ ##OWNER= she
$$ F:/spectra/data/she/nmr/H-F/1/pdata/1/auditp.txt
$$ ##AUDIT TRAIL=  $$ (NUMBER, WHEN, WHO, WHERE, WHAT)
(   1,<2022-02-16 10:05:23.20 +0400>,<she>,<DPX200>,
      <created by zg, POWCHK disabled, PULCHK disabled
       configuration hash MD5:
       00 E9 B6 7A A2 85 ED C7 34 08 36 98 17 FE 4E 26
       data hash MD5: 16K
       CA 6F 4D 80 B4 40 01 1D 35 B8 BC DF AE D8 AB AC>)
(   2,<2022-02-16 10:05:33.50 +0400>,<she>,<DPX200>,
      <Start of raw data processing
       efp BC_mod = 2 LB = 0.24 FT_mod = 6 PKNL = 1 PHC0 = -16228.52 PHC1 = 9.60078 SI = 16K 
       data hash MD5: 16K
       89 7C 25 EE D6 17 E8 43 E5 1F 92 ED 85 75 38 8A>)
(   3,<2022-02-16 10:05:56.54 +0400>,<she>,<DPX200>,
      <pk PHC0 = -6.108931 PHC1 = 9.6 
       data hash MD5: 16K
       11 64 38 C4 04 DB 41 02 8B 2C 8E 93 A0 C4 B5 D6>)
(   4,<2022-02-16 10:06:01.26 +0400>,<she>,<DPX200>,
      <abs ABSG = 5 
       data hash MD5: 16K
       28 EE 13 F3 59 25 29 96 DE A8 E6 8C 42 13 9F FD>)
$$ ##END=
$$ 
$$ hash MD5
$$ 49 B6 E3 4C 28 95 5B A2 C3 21 F4 90 32 BB 16 93
##$RELAX= 
##$RELAX= 
##$RELAX= 
##$RELAX= 
##$RELAX= 
##$RELAX= 
$$ Bruker specific parameters
$$ --------------------------
##$DU= <F:/spectra>
##$EXPNO= 1
##$NAME= <H-F>
##$PROCNO= 1
##$TYPE= <nmr>
##$USER= <she>
##$AMP= (0..31)
100 100 100 100 100 100 100 100 100 100 100 100 100 100 100 100 100 100 
100 100 100 100 100 100 100 100 100 100 100 100 100 100 
##$AQSEQ= 0
##$AQ_mod= 1
##$AUNM= <au_zg>
##$AUTOPOS= <>
##$BF1= 200.13
##$BF2= 200.13
##$BF3= 200.13
##$BF4= 200.13
##$BF5= 200.13
##$BF6= 200.13
##$BF7= 200.13
##$BF8= 200.13
##$BYTORDA= 1
##$CFDGTYP= 0
##$CFRGTYP= 5
##$CHEMSTR= <none>
##$CNST= (0..31)
1 1 145 1 1 1 1 1 1 1 1 1 1 1 1 1 1 1 1 1 1 1 1 1 1 1 1 1 1 1 1 1 
##$CPDPRG= <>
##$CPDPRG1= <>
##$CPDPRG2= <>
##$CPDPRG3= <>
##$CPDPRG4= <mlev>
##$CPDPRG5= <mlev>
##$CPDPRG6= <mlev>
##$CPDPRG7= <mlev>
##$CPDPRG8= <mlev>
##$CPDPRGB= <>
##$CPDPRGT= <>
##$D= (0..31)
0 1.2 0 0 0 0 0 0 0 0.06 0 0.03 0 0 0 0 0.0002 0 0 0 0 0 0 0 0 0 0 0 0 
0 0 0 
##$DATE= 1644991522
##$DBL= (0..7)
120 120 120 120 120 120 120 120 
##$DBP= (0..7)
150 150 150 150 150 150 150 150 
##$DBP07= 0
##$DBPNAM0= <>
##$DBPNAM1= <>
##$DBPNAM2= <>
##$DBPNAM3= <>
##$DBPNAM4= <>
$$ [...]
##$SUBNAM2= <"">
##$SUBNAM3= <"">
##$SUBNAM4= <"">
##$SUBNAM5= <"">
##$SUBNAM6= <"">
##$SUBNAM7= <"">
##$SUBNAM8= <"">
##$SUBNAM9= <"">
##$SW= 18.0517287032376
##$SWIBOX= (0..15)
0 0 2 0 0 0 0 0 0 0 0 0 0 0 0 0 
##$SW_h= 3612.71676300578
##$TD= 16384
##$TD0= 1
##$TE= 0
##$TE2= 300
##$TE3= 300
##$TEG= 300
##$TL= (0..7)
0 120 120 120 120 120 120 120 
##$TP= (0..7)
150 150 150 150 150 150 150 150 
##$TP07= 0
##$TPNAME0= <>
##$TPNAME1= <>
##$TPNAME2= <>
##$TPNAME3= <>
##$TPNAME4= <>
##$TPNAME5= <>
##$TPNAME6= <>
##$TPNAME7= <>
##$TPOAL= (0..7)
0.5 0.5 0.5 0.5 0.5 0.5 0.5 0.5 
##$TPOFFS= (0..7)
0 0 0 0 0 0 0 0 
##$TUNHIN= 0
##$TUNHOUT= 0
##$TUNXOUT= 0
##$USERA1= <user>
##$USERA2= <user>
##$USERA3= <user>
##$USERA4= <user>
##$USERA5= <user>
##$V9= 5
##$VALIST= <valist>
##$VCLIST= <CCCCCCCCCCCCCCC>
##$VD= 0
##$VDLIST= <DDDDDDDDDDDDDDD>
##$VPLIST= <PPPPPPPPPPPPPPP>
##$VTLIST= <TTTTTTTTTTTTTTT>
##$WBST= 1024
##$WBSW= 4
##$XGAIN= (0..3)
0 0 0 0 
##$XL= 0
##$YL= 0
##$YMAX_a= 305680
##$YMIN_a= -330882
##$ZGOPTNS= <>
##$ZL1= 120
##$ZL2= 120
##$ZL3= 120
##$ZL4= 120
##$ABSF1= 15.71603
##$ABSF2= -2.335819
##$ABSG= 5
##$ABSL= 3
##$ALPHA= 0
##$AQORDER= 0
##$ASSFAC= 0
##$ASSFACI= 0
##$ASSFACX= 0
##$ASSWID= 0
##$AUNMP= <proc_1d>
##$AZFE= 0.1
##$AZFW= 0.1
##$BCFW= 0
##$BC_mod= 2
##$BYTORDP= 0
##$COROFFS= 0
##$CY= -3
##$DATMOD= 1
##$DC= 0
##$DFILT= <>
##$DTYPP= 0
##$F1P= 0
##$F2P= 0
##$FCOR= 1
##$FTSIZE= 16384
##$FT_mod= 6
##$GAMMA= 0
##$GB= 0
##$INTBC= 1
##$INTSCL= 0
##$ISEN= 128
##$LB= 0.24
##$LEV0= 0
##$LPBIN= 0
##$MAXI= 10000
##$MC2= 0
##$MEAN= 0
##$ME_mod= 0
##$MI= 1.114404
##$NCOEF= 0
##$NC_proc= -6
##$NLEV= 6
##$NOISF1= 3.799351
##$NOISF2= 2.8
##$NSP= 0
##$NTH_PI= 0
##$NZP= 0
##$OFFSET= 15.71163
##$PC= 1
##$PHC0= -16234.63
##$PHC1= 19.20078
##$PH_mod= 1
##$PKNL= yes
##$PPARMOD= 0
##$PSCAL= 0
##$PSIGN= 0
##$REVERSE= no
##$SF= 200.130007988418
##$SI= 16384
##$SIGF1= 3
##$SIGF2= 2
##$SINO= 5.538805
##$SIOLD= 16384
##$SREGLST= <1H.CDCl3>
##$SSB= 0
##$STSI= 16384
##$STSR= 0
##$SW_p= 3612.71676300578
##$SYMM= 0
##$S_DEV= 0
##$TDeff= 16384
##$TDoff= 0
##$TI= <>
##$TILT= no
##$TM1= 0
##$TM2= 0
##$TOPLEV= 0
##$USERP1= <user>
##$USERP2= <user>
##$USERP3= <user>
##$USERP4= <user>
##$USERP5= <user>
##$WDW= 1
##$XDIM= 16384
##$YMAX_p= 276069892
##$YMIN_p= -396522
$$ End of Bruker specific parameters
$$ ---------------------------------
##NTUPLES= NMR SPECTRUM
##VAR_NAME=  FREQUENCY,     SPECTRUM/REAL,   SPECTRUM/IMAG
##SYMBOL=    X,             R,               I
##VAR_TYPE=  INDEPENDENT,   DEPENDENT,       DEPENDENT
##VAR_FORM=  AFFN,          ASDF,            ASDF
##VAR_DIM=   16384,         16384,           16384
##UNITS=     HZ,            ARBITRARY UNITS, ARBITRARY UNITS
##FACTOR=    0.220516191357247, 1,           1
##FIRST=     3144.36861090459, 0,            0
##LAST=      -468.348152101189, 0,           0
##MIN=       -468.348152101189, -396522,     0
##MAX=       3144.36861090459, 276069892,    0
$$ Real data points
##PAGE= N=1
##DATA TABLE= (X++(R..R)), XYDATA
$$ [...]
7386c9640Q041J18363l9804q8374R4953m2561l7595n5815J7643J2472m86q5193
7374a37996J2529N238L9697K4017J15455M5756j53511k1681k9649J2491r5489
7363a83143R5550R6163o8645L6943R225o8207p8936P1488N2639j0900J6760R3599
7351F2536j0170j63115M3194j5769O5610Q0242M855K169l4181L7935L7861r642
7339A01525k6803m4832L0239r9783p5138J17708l05j1614L075J19717n8699K6380
7327H1470P6162q4821l7392o1334J1270R6160N5804q7686m235J429k5629k5170
7315c972m405j7114R983J01380O9451L2181m0576j41250q2537M2453P623L5025
7303H242P6699m7190K1323q796R6317q351j00900m1432K7848r7040m0895M7069
$$ plain form
7386 -39640 -31599 86764 46960 -41414 53539 10978 -26617 -82432 -64789 -52317 -52803 -137996
7374 -137996 -125467 -120229 -80532 -56515 58940 104696 -48815 -70496 -100145 -87654 -183143
7363 -183143 -87593 8570 -60075 -23132 -13907 -82114 -161050 -89562 -36923 -47823 -31063 62536
7351 62536 52366 -110749 -67555 -83324 -17714 62528 67383 69552 35371 73306 111167 101525
7339 101525 74722 29890 60129 -39654 -114792 2916 2611 -9003 -5928 113789 55090 81470
7327 81470 157632 72811 35419 -25915 -14645 81515 137319 49633 45398 46827 21198 -3972
7315 -3972 -8377 -25491 -15508 85872 155323 187504 146928 5678 -76859 -34406 -26783 8242
7303 8242 84941 37751 59074 50278 146595 138244 37344 -4088 23760 -73280 -114175 -67106
7291f7106P8751N8580J2018J1268j8906M7714n6278m2522K183O0767Q199o9557
7279B5111L0863k9263j3781R0666j1635L368j1191j937L7761L1253L005P2107
7267B26327M2871n5133R473O5368l8487M2973q0521p4031J00420m9443p2196J7225
7255A34846j3132k4322n1296J27484p993L6568K9124j0961N1773o9799M92J09413
7243C12197N8530l6873p3836M0345n0933j11318k7622P0396N4172N4121j6959
7232B72220o682M0393N2220r432j02032j5188R4427j0956r673j3181M3967M6591
7220C82674m0320p4306J0454O8908m1033M393J24750j10540R370J47503K3034
7209E04887P8698j15082K1715l6332j1382k1772M243O8432M3218j03167o9418
$$ plain form
7291 -67106 11645 70225 82243 93511 74605 122319 66041 23519 25702 86469 94668 25111
7279 25111 55974 26711 12930 103596 91961 95329 84138 82201 119962 151215 154220 226327
7267 226327 269198 214065 223538 288906 250419 293392 212871 138840 239260 189817 117621 134846
7255 134846 121714 97392 46096 173580 165587 202155 231279 220318 272091 202292 202784 312197
7243 312197 370727 333854 260018 300363 249430 138112 110490 180886 235058 289179 272220
7232 272220 265538 305931 358151 348719 246687 231499 325926 314970 305297 292116 336083 382674
7220 382674 342354 268048 278502 347410 306377 310770 435520 324980 334350 481853 504887
7209 504887 583585 468503 490218 453886 442504 420732 424975 493407 536625 433458 364040
7198C64040L3108M39M2999M5119Q5325L7054q7694M0506R685K8531R1020J9158
7186G09290N0448l639k3681q298L3792J23190l0333P8233M1172l1494j10221J55049
7174I83508M1876K3053N0012l4940J36996K9238p3294m2003M1157K7054J10588
7163A293245J17069M1196L442M1093M2166r9894M0899R9135J94061K9299j8298
7152A783413J74034K6403k9550Q6650J07151R3122j09543L2709J18823J5668J6297
7141B315177J00776M2371o4603K45887J27492k0154J00259K1770M4969J27834
7131C041778L6985J03754P2081M7866P0597J24490Q2549J17842J46294J01107
7121C945343J20716K69075J96322K32126K86993L77431J52787L15573K97643M02372
$$ plain form
7198 364040 397148 397587 440586 485705 571030 608084 520390 560896 570581 599112 690132 709290
7186 709290 759738 756099 732418 724120 757912 881102 850769 929002 970174 938680 828459 983508
7174 983508 1025384 1048437 1098449 1063509 1200505 1229743 1156449 1114446 1155603 1182657 1293245
7163 1293245 1410314 1451510 1454952 1496045 1538211 1438317 1479216 1578351 1772412 1801711 1783413
7152 1783413 1957447 1983850 1954300 2040950 2148101 2241223 2131680 2164389 2283212 2298880 2315177
7141 2315177 2415953 2458324 2393721 2639608 2767100 2746946 2847205 2868975 2913944 3041778
7131 3041778 3078763 3182517 3254598 3302464 3373061 3497551 3580100 3697942 3844236 3945343
7121 3945343 4066059 4335134 4531456 4763582 5050575 5428006 5580793 5896366 6194009 6596381
7111F596381M50954M80563M86006J08633J75173K59189J96853K40354K74475L08516
7101I577097N95112N99619P72695Q28077R87214J406897J482819J773838K050504
7092B0073872K372106L038312L719100M430551N652309O926630Q690407R497069
7084F4400356Q421357N001518o80500o527103j0435844j1327446r753468p376273
7076C1722597n383098l818312k826517k294169j954760j567746j329322j109243
7068A1439430q78325p95490p36944o31052n52961m70326m76802m82764k60137
7059F154629l45892l07387j64819j40490k23537j98083j50323j60918k02137j84055
7049D076988o2479r3080q6582j34859j53592j35619l0125j34264j21056o6408
$$ plain form
7111 6596381 7047335 7527898 8013904 8122537 8297710 8556899 8753752 8994106 9268581 9577097
7101 9577097 10172209 10771828 11544523 12372600 13359814 14766711 16249530 18023368 20073872
7092 20073872 22445978 25484290 29203390 33633941 39286250 46212880 54903287 64400356
7084 64400356 72821713 77823231 77142731 70615628 60179784 48852338 39098870 31722597
7076 31722597 26339499 22521187 19694670 17400501 15445741 13877995 12548673 11439430
7068 11439430 10561105 9765615 9028671 8397619 7844658 7374332 6897530 6414766 6154629
7059 6154629 5808737 5501350 5336531 5196041 4972504 4774421 4624098 4463180 4261043 4076988
7049 4076988 4014509 3921429 3834847 3699988 3546396 3410777 3380652 3246388 3125332 3058924
7039C058924Q3712p5537m9169R2763O1811J56385O8620J34732K51254J83197K98339
7028D265031r7100l75784k89778k67947m20070k54017k36228k21348j60294j86735
7018A755730n2957l7723j5142l4614l2219k0937r2786n8944r4769k6275K7430
7007A316794n5296j8735J8504k8566q5427k1640N2843n6875k8571q136k8499o8826
6995I87570m2611k5047l9048j4369n6027p3358n6824O8254J5268m6722r2545n164
6983F19377l5631n914J25394l9713j25197m8135L5149O16J073p1587O9132j02973
6971D21591L1870m031q9934O7730P3787Q3113j14744j00023r5249m199M3463R6225
6959D09599O809j07541o2054l31j5559J2872K4250j3178r1072N9785R4065m9547
$$ plain form
7039 3058924 3142636 3067099 3017930 3110693 3172504 3328889 3397509 3532241 3783495 3966692 4265031
7028 4265031 4167931 3792147 3502369 3234422 2814352 2560335 2324107 2102759 1942465 1755730
7018 1755730 1702773 1665050 1649908 1615294 1583075 1562138 1469352 1410408 1315639 1289364 1316794
7007 1316794 1261498 1242763 1261267 1232701 1147274 1125634 1178477 1121602 1093031 1084895 1056396 987570
6995 987570 944959 919912 880864 866495 810468 737110 680286 748540 763808 717086 624541 619377
6983 619377 583746 577832 703226 663513 538316 490181 525330 525946 527019 455432 524564 421591
6971 421591 453461 449430 359496 427226 501013 584126 469382 369359 274110 269911 313374 409599
6959 409599 416408 308867 246813 246482 230923 243795 268045 254867 163795 223580 317645 268098
6947B68098o6778n9879L3009M6669J9613m784L4248R32j07796j8533M9150q582
6935A85367l0490J8327o1561R5088k5630R267k7541r9518M5449J7864l7172L8009
6923A27459J1952N6069K4974J3172n8158k1477k3312p3602K8348M2336o3492k1943
6911D2326J1617N9936l5725R8036o9319N7841P2901j26076q0709o3673M7898J5393
6899C0446J3972k6358j2533N1458O535O5184O7944j7774N836j18832m9943J4066
6887C0001J26427k9452j0536k2112n7231m5551L8299J22017J2786j9371P9073
6876B24350p4508q0446N012q985P8507p1241L6910Q4755K8669J3484m9006l382
6864A84119q1988o1823l5651J0947N8499K4276l9069j1663N7966n545r6682J8224
$$ plain form
6947 268098 201320 141441 174450 221119 240732 235948 270196 271128 163332 144799 193949 185367
6935 185367 154877 173204 111643 206731 181101 190368 162827 63309 108758 126622 89450 127459
6923 127459 139411 195480 220454 233626 175468 153991 130679 57077 85425 127761 64269 42326
6911 42326 53943 113879 78154 176190 106871 164712 237613 111537 30828 -32845 15053 30446
6899 30446 44418 18060 5527 56985 63520 128704 196648 178874 184710 65878 15935 30001
6887 30001 156428 126976 116440 94328 37097 -8454 29845 151862 164648 145277 224350
6876 224350 149842 69396 74408 65423 143930 72689 109599 194354 223023 236507 187501 184119
6864 184119 102131 40308 4657 15604 74103 98379 59310 47647 105613 100068 3386 21610
6852B1610J7487M0883J633K1740j3750j21327L1301J10510k6047m6567k2408l3903
6840a8838L0485P1077j120L5794L6160q2398l9767J3512J10253o2658j9421l5317
6828C7762n9850P2247J3853J14448q7176r2379M9201p2676l8263O7581l0740K5474
6816e18Q8746N0912m335J6199q8728m6266M0188P1410J12058j7470N956N8458
6804B86610n1803J7023p8342m4460k6941j29666N7430N9338M5852l0165m5914
6793E8962j442j56603M3798Q4493p5117N6439J04122n3125K4471j1131K9419n8040
6781D6246j1325J0092l3952M4906J05389K057N4710p9116j07092P1648k1605k3115
6769E8843o3340N0308O0697j8349m9894N7703L5501p8452l3789O7587k4205K7026
$$ plain form
6852 21610 39097 79980 81613 103353 89603 -31724 -423 110087 84040 37473 15065 -18838
6840 -18838 11647 82724 81604 117398 153558 71160 31393 44905 155158 92500 73079 37762
6828 37762 -22088 50159 64012 178460 91284 -1095 48106 -24570 -62833 4748 -25992 -518
6816 -518 88228 139140 134805 151004 62276 16010 56198 127608 239666 222196 228152 286610
6804 286610 234807 251830 173488 129028 102087 -27579 29851 89189 135041 104876 58962
6793 58962 57520 -99083 -55285 29208 -45909 10530 114652 61527 85998 74867 104286 46246
6781 46246 34921 45013 11061 55967 161356 163413 218123 139007 31915 103563 81958 58843
6769 58843 -4497 45811 106508 88159 38265 95968 131469 53017 19228 86815 62610 89636
6757H9636m3997o76J5142L9994l5380k6813J03009O0722j59057l517m0850M2950
6745D1163m1979k2070J79359Q387q692o2360Q9619O4001J4526j1449K8707o829
6733B72383n3099n8834N4607N4916m7369n2417n7262R0363K4897j16189j31380
6722a9384l3177M0510N7870k4890M2949l882n1582p5755M4463j3077J02121L271
6710F9437k3861j1860Q0205l0421n1954R4121J0367j8351J562j4746L5373K7652
6698A67524k809o9410J02405o794K0100Q521r0122l4358J09382J49312M4293l8300
6686C59744m2756J18764J0725k1969k7173M1528m3335j31855j21028R1349k741
6675B31253q1321j13692P335Q9626o7009j4737p759K3271k4769l5615J23398j00307
$$ plain form
6757 89636 45639 44963 60105 100099 64719 37906 140915 201637 42580 39063 -1787 41163
6745 41163 -816 -22886 156473 164860 156168 93808 183427 247428 261954 250505 279212 272383
6733 272383 219284 160450 215057 269973 222604 170187 112925 203288 228185 111996 -19384
6722 -19384 -52561 -12051 45819 20929 63878 59996 8414 -67341 -22878 -35955 66166 69437
6710 69437 45576 33716 113921 83500 31546 125667 136034 117683 119245 104499 139872 167524
6698 167524 164715 95305 197710 190916 211016 219537 129415 95057 204439 353751 398044 359744
6686 359744 316988 435752 446477 424508 397335 438863 395528 263673 142645 233994 231253
6675 231253 149932 36240 43575 133201 66192 51455 43696 66967 42198 6583 129981 29674
6663B9674O42j1618l7140l9749k6341L8346K5603o2886J25468j08958j2054L9569
6651c9444J16658m6751p9782j0335r6143K4901L5200N2855k2075j27L9064k5375
6639e1354P5698j3563m1656L4457M9055p9498J9266L7865n369L5124o542J06876
6627A60359n7551l7653p368L631m533J34453Q7133j47302J59390j15515j19092
6616E5952M9041q9655Q6424Q381N7721Q518J3201j00232k0769k901N4445J031
6604A21157J2913J3137m9482J7102l4463n5257l4562N5003o8259k9217r630j6070
6592g7628J1764k0870L231p3609K3778J01642J4710k6850K0761K5101M0169K1311
6580F3510J25114J4689J2017K657P5276o7000j11626M9921l2042j29938J8182
$$ plain form
6663 29674 30316 18698 -18442 -58191 -84532 -46186 -20583 -83469 41999 -66959 -79013 -39444
6651 -39444 77214 30463 -49319 -59654 -155797 -130896 -95696 -42841 -64916 -65043 -25979 -51354
6639 -51354 24344 10781 -30875 3582 52637 -26861 -7595 30270 24901 60025 53483 160359
6627 160359 102808 65155 57787 61418 56885 191338 278471 131169 290559 175044 55952
6616 55952 104993 15338 101762 110143 167864 176382 189583 89351 68582 65681 120126 121157
6604 121157 134070 147207 97725 114827 80364 25107 -9455 45548 -22711 -51928 -61558 -77628
6592 -77628 -65864 -86734 -83503 -157112 -133334 -31692 -16982 -43832 -23071 2030 42199 63510
6580 63510 188624 203313 215330 217987 293263 226263 114637 164558 132516 2578 20760
6569B0760l0597o4460k9475P8998n4126L9539J30575m313O5839l0766k7035K0171
6557A15110k8711k2283N82K7891o9804j07672M6864O25k9500n7008P2184l6005
6545h7727N385M2650n5264n652L0062M1533q682n6627L5673l7373j33109R6131
6533a33000J51510q458L4792J1002j0484l9220L9220l1738q9423K2667p0242M239
6521a19135K4399j4190M5387m5167m615L8510p310K1872N190K050j26921j6659
6509a96589J19355O704o1025j23000O744R2697R11J2318N7348N3001n4804k8968
6497a15308L1998n8664O1905J9633J0457l1048o5021k3190j9054R4717P8651k2693
6485c7617l0985R4276j05842o2249P2375q665l8310K0870L7686l08o076l4428
$$ plain form
6569 20760 -9837 -74297 -103772 -24774 -78900 -39361 91214 86901 152740 121974 94939 115110
6557 115110 86399 64116 64698 92589 22785 -84887 -38023 -37398 -66898 -123906 -51722 -87727
6545 -87727 -82342 -39692 -94956 -100608 -70546 -29013 -37695 -94322 -58649 -96022 -229131 -133000
6533 -133000 18510 10052 44844 55846 45362 6142 45362 13624 -75799 -53132 -123374 -119135
6521 -119135 -94736 -108926 -63539 -108706 -113321 -74811 -82121 -60249 -55059 -53009 -179930 -196589
6509 -196589 -77234 -70530 -131555 -254555 -247811 -155114 -154203 -141885 -84537 -31536 -86340 -115308
6497 -115308 -83310 -141974 -80069 -60436 -49979 -81027 -146048 -169238 -188292 -93575 -14924 -37617
6485 -37617 -68602 25674 -80168 -142417 -70042 -78707 -117017 -96147 -58461 -58769 -64845 -99273
6473i9273R7961R5929k5609o3675J3328M8258o5500o1803r655r562L5258k138
6461d6481L5435L627m5545L3273O2371l2880P5975k1887m8672O5539l4557l0557
6449A5641K0046K7720m9801o8041m311N840k9661N2412M7096O4458j7745o8420
6437d766j7043j11305L2569J87087j34652j41570j7340J07489O5209R0476j8758
6426C7396m7421m1008k2988K6089j21897M5894L9876P1542J6373l005o8633L6657
6414c1125J58969j62826p0704P7404o5461r921N1331R0871J10805n4793j8133
6403G6417J2093q8845m7933Q064R7187M6523O5565J7235q0514j28812o9951O3426
6391b9545R2892Q097Q0958l2943q1663K4986R721o9537K5315M3368r8034N0231
$$ plain form
6473 -99273 -1312 94617 69008 5333 18661 66919 1419 -60384 -70039 -79601 -44343 -46481
6461 -46481 -11046 -7419 -52964 -19691 42680 9800 85775 63888 15216 80755 46198 15641
6449 15641 35687 63407 13606 -54435 -58746 -52906 -82567 -30155 16941 81399 63654 -4766
6437 -4766 -21809 -133114 -100545 86542 -48110 -189680 -207020 -99531 -34322 56154 37396
6426 37396 -10025 -51033 -74021 -47932 -169829 -123935 -84059 -12517 3856 851 -67782 -31125
6414 -31125 127844 -34982 -105686 -28282 -93743 -103664 -52333 38538 149343 94550 76417
6403 76417 88510 -335 -48268 -40204 56983 103506 169071 186306 105792 -23020 -92971 -29545
6391 -29545 63347 71444 152402 119459 37796 62782 72503 2966 28281 71649 -26385 23846
6379B3846J40017q9879L3685P0379q3115l5950K812J21514j7671J914Q8685j24472
6367A31765R5413q1760P22j0682m0613Q31m7493J29160j7991M0954p2898J4218
6355A41626n3018k3415M4106K1334q1411q0359J38429k9977P5627N4284j30212
6344G7014M8827m663M0338J8348J0693l7119K9996L9704L2476p1780K0640K4837
6332B29311n4714L1152O1899M8448n013J163p1261Q8533J56861p629L4310j17905
6320C95155l3309J27981l2205n0157R0637N0966l291r6491N598R3979O1509j8541
6308E91831K9833P9258K031Q3321J48888K46211J43927J51821J76047K06200L29084
6297B188452M04104L47731O40615O81217O50860K17163n53231j042829p76235
$$ plain form
6379 23846 163863 73984 107669 178048 94933 58983 61795 183309 165638 167552 256237 131765
6367 131765 227178 145418 146140 135458 94845 95676 48183 177343 159352 200306 127408 141626
6355 141626 88608 65193 109299 130633 49222 -31137 107292 77315 152942 207226 77014
6344 77014 125841 121178 161516 179864 190557 153438 183434 223138 255614 183834 204474 229311
6332 229311 174597 205749 267648 316096 311083 312246 240985 329518 486379 478750 513060 395155
6320 395155 361846 489827 457622 407465 498102 549068 545777 449286 454884 548863 610372 591831
6308 591831 621664 700922 702953 786274 935162 1181373 1325300 1477121 1653168 1859368 2188452
6297 2188452 2592556 2940287 3580902 4262119 4912979 5130142 4576911 3534082 2757847
6288B757847n28910m96375k64632j29788j82187j86452k2430n4638q4290p5157
6278G32988r8847j10342O5307q0646q7811l1984q8264M2270Q22Q9963l9945o7596
6266C25915l8251M5247N1891p8064K1917k2072m580R2929q0041q1089J1439N7221
6254C02462n9886m3115J42298K1541P469n0782R6983j02283l0671l8665n7082
6243A88269J28740K6843m2519p8497n2482o6497L5586J12390n1603N5776J7422
6232B73428j17564J8102O4552J10570p2402M609L103j419J3214K1857l9685m2821
6220B35544P1760P3834J5996p0766l3145P4684J07511o3726L5736m7892J7396
6209D16932J382q0545o7170M5260N0804j36405O460k1457j5814j2473p6924M899
$$ plain form
6288 2757847 2228937 1732562 1467930 1338142 1155955 969503 947073 892435 808145 732988
6278 732988 634141 523799 589106 508460 420649 388665 300401 342671 343493 433456 393511 325915
6266 325915 287664 332911 384802 306738 328655 306583 302003 394932 314891 233802 245241 302462
6254 302462 242576 199461 341759 363300 370769 319987 416970 314687 284016 245351 188269
6243 188269 317009 343852 301333 222836 170354 103857 139443 251833 200230 256006 273428
6232 273428 155864 173966 238518 349088 276686 281295 284398 282979 296193 318050 278365 235544
6220 235544 307304 381138 397134 326368 293223 367907 475418 411692 447428 399536 416932
6209 416932 418314 337769 270599 315859 366663 230258 236718 215261 199447 186974 110050 114949
6197A14949l4357o263Q1734Q3722l3107k5946l0983Q0411Q2478N6559J2418n0345
6185C31270n1225P4358Q815J20729Q1383j53233L0723j20571K0707k971r8066
6174B41919N0410K5915r6329K3607m0417j094N3806M7333j66880l1311J73795
6163B80754J6863j8336j5238J9806M5627k9745r7244j5563O6033J07212O6142
6152D26311m3409k9937o5274L785Q7889r4722M9633K760j24067n927Q1709L1893
6140C20644m5116j4709P3656k8025p6402P1211p9308K1081P0045K7942N6672n1040
6128C46651l592M3240m8134J1928M9599L1964j605L3230M47q538l2713M4169Q423
6115D75069N3221k4120l1381K8915N4093J9916q6205L9890r248P3965L7128L7632
$$ plain form
6197 114949 80592 74329 156063 239785 206678 180732 149749 230160 312638 369197 381615 331270
6185 331270 280045 354403 363218 483947 565330 412097 442820 322249 342956 339985 241919
6174 241919 292329 318244 221915 245522 205105 204011 257817 305150 138270 106959 280754
6163 280754 297617 279281 264043 283849 329476 299731 202487 186924 252957 360169 426311
6152 426311 382902 352965 287691 291476 379365 284643 334276 337036 212969 207042 288751 320644
6140 320644 275528 260819 334475 306450 230048 301259 221951 243032 313077 341019 397691 346651
6128 346651 343059 386299 338165 350093 399692 431656 430051 463281 463728 455190 422477 466646 475069
6115 475069 528290 504170 472789 501704 555797 575713 489508 529398 520150 594115 631243 668875
6103F68875o462R801m8358J5050M2849k02k5953l286J8778K9989L0139l3908m2753
6090F54559L9830K7149N7548N830j7660k1978m986P7261l8559k6112P6624K2389
6078H51895m1887K0114J51475O5270K4053K14325J20459J50431L0466R9606J43565
6067A829772P4282K04370J41578J24144k15289k41743k45541j27628M9848k9776
6057A564017p7074j8092K3999O4773m5625Q6398k2043J5525p6714J07111M3460
6046A665735k9363M4385M1432Q9023J55980K13373J78176K44223K33908K84581
6036C121453K46209K62782K4117j84213k95415l65284l32867k21372j63647N643
6026B097406l7838j09806q6294k81M4043R0198O175j0519k3824m3812P8081J15743
$$ plain form
6103 668875 662413 672214 623856 638906 681755 681553 655600 652314 671092 701081 731220 697312 654559
6090 654559 694389 721538 779086 784916 767256 745278 740292 817553 778994 752882 829506 851895
6078 851895 810008 830122 981597 1046867 1070920 1285245 1405704 1556135 1586601 1686207 1829772
6067 1829772 1904054 2108424 2250002 2374146 2158857 1917114 1671573 1543945 1593793 1564017
6057 1564017 1486943 1468851 1492850 1557623 1511998 1598396 1576353 1591878 1515164 1622275 1665735
6046 1665735 1636372 1680757 1722189 1811212 1967192 2180565 2358741 2602964 2836872 3121453
6036 3121453 3367662 3630444 3654561 3470348 3174933 2809649 2476782 2255410 2091763 2097406
6026 2097406 2059568 1949762 1863468 1863187 1907230 1997428 2003603 1993084 1969260 1925448 2003529 2119272
6014B119272m71L2666O3941J18769p684O6976J25404J43140J67192K10404o1428
6003B978181m3622j62003j75547k24941k6100L3911R806o7310r946m0360p5424
5992B196645L9412P540Q7191J07284J0749j2315M6320O361L7764P7345J4365J07628
5980B726289K3903O1117p311l7919O3253m3803O2950J51945R4163P526j19987
5969B982126l9296K6063N7267J35182J3185j8116k669K565J37449J31162k325
5958C422593J52555l6645O7211Q3544J68971Q2954J40470J06947P0002K9088K21939
5947D509629J24458O2177R8295P0756J17777K05806P9689J11933R5148J77542
5937E653210N9346J49713K09157K07490L16965L92418L50890M42571M73065N52465
$$ plain form
6014 2119272 2118801 2151467 2215408 2334177 2326493 2393469 2518873 2662013 2829205 3039609 2978181
6003 2978181 2934559 2772556 2597009 2372068 2345968 2379879 2389685 2322375 2312429 2272069 2196645
5992 2196645 2236057 2243597 2330788 2438072 2448821 2436506 2482826 2489187 2526951 2604296 2618661 2726289
5980 2726289 2750192 2811309 2803998 2766079 2829332 2785529 2848479 3000424 3094587 3102113 2982126
5969 2982126 2942830 2968893 3026160 3161342 3174527 3156411 3153742 3156307 3293756 3424918 3422593
5958 3422593 3575148 3538503 3605714 3689258 3858229 3941183 4081653 4188600 4258602 4287690 4509629
5947 4509629 4634087 4696264 4794559 4865315 4983092 5188898 5268587 5380520 5475668 5653210
5937 5653210 5712556 5862269 6071426 6278916 6595881 6988299 7339189 7781760 8254825 8807290
5927H807290O62884Q37594J011646J132894J367243J669121K018739K461970K674119
5918B2643500K395790R94726j286090k748608k782395k124003j538808q51447
5910A4702665p16826m42567l15368k04522j09202J29016J22764J82228L45875
5901A3694063N11757O99878R56481J069650J302581J641371J812488K159994K637276
5892B6485539L349174M112457M735135N889387P473636Q431187P144832K946719
5884G0568066m594345j0395860j0030599p330523n052353l574020k735402k172194
5876B4682770j743804j522227j047811p31224n50857l11872k18485l1804J40577
5867A8665263M84522P54542J009443J205650J384505J881216K535969L228779
$$ plain form
5927 8807290 9470174 10307768 11319414 12452308 13819551 15488672 17507411 19969381 22643500
5918 22643500 25039290 26034016 24747926 21999318 19216923 17092920 15554112 14702665
5910 14702665 13985839 13543272 13227904 13023382 12914180 13043196 13165960 13348188 13694063
5901 13694063 14205820 14905698 15862179 16931829 18234410 19875781 21688269 23848263 26485539
5892 26485539 29834713 33947170 38682305 44571692 52045328 60476515 67621347 70568066
5884 70568066 65973721 55577861 45547262 38216739 33164386 29590366 26854964 24682770
5876 24682770 22938966 21416739 20368928 19637704 19086847 18774975 18556490 18524686 18665263
5867 18665263 19149785 19904327 20913770 22119420 23503925 25385141 27921110 31149889
5859C1149889L791094M462675N669346P197936Q322060O982837K920228m979759
5851F5516306j0833165j0555856p742681n265426l926296l023127k346915k020606
5843A9802234j851608j306127j095837p43292p29418n08396k91230l38399k37290
5834A2700637q6770M6043L32871K03244M20491P14697Q62817J066902J442374
5825A7703306J715393K198191K469414K040081N95033j831850l488320l556171
5817A7845077k694017j958637j435465j255572q78774p48710o97605n63747m22309
5808G190241l76464l65484l21347k69032l01730k28525j71827r4475k74093j76490
5798D610774j66981j89744j97343j12704r7351j08995j88869q1898j640q5687
$$ plain form
5859 31149889 34940983 39403658 45073004 52270940 60593000 67575837 70496065 65516306
5851 65516306 54683141 44127285 36384604 31119178 27192882 24169755 21822840 19802234
5843 19802234 17950626 16644499 15548662 14805370 14075952 13567556 13276326 12937927 12700637
5834 12700637 12613867 12659910 12992781 13196025 13616516 14331213 15194030 16260932 17703306
5825 17703306 19418699 21616890 24086304 26126385 26721418 24889568 21401248 17845077
5817 17845077 15151060 13192423 11756958 10501386 9622612 8873902 8176297 7612550 7190241
5808 7190241 6813777 6448293 6126946 5857914 5556184 5327659 5155832 5061357 4787264 4610774
5798 4610774 4443793 4254049 4056706 3944002 3846651 3737656 3548787 3466889 3465249 3379562
5788C379562n0288K492N56r4511q2620k15470M9255k0828j48037l9191J5899o4681
5776B732138l1563m2236n2852j38379p9505k8140p9707j3472m1070K7195n0450
5765B201959j00043O4479j30707j00136J2378l1493o490K42r3255O4424J17925
5754A999283j24737l6146m6138q6021p229N8222L299L3105q7239p4840K0303m4053
5742A607809P8204l8866j0256L1261k0590j04026j792J08814l0134r4945J4695
5731A540174p962M4613k0611k0809m6791l3827p6511L0097l8605j08345o34p0894
5719A189895j46640M5789o968j4926j7968j36854O0483J0637J05958j26414q8940
5708H74052P0097K8476n1648p8941R2487N468J1460K9742K24M8163M5257p1120
$$ plain form
5788 3379562 3329274 3331766 3332322 3237811 3155191 2939721 2988976 2968148 2820111 2780920 2796819 2732138
5776 2732138 2700575 2658339 2605487 2467108 2387603 2359463 2279756 2266284 2225214 2252409 2201959
5765 2201959 2101916 2166395 2035688 1935552 1947930 1916437 1909947 1910189 1816934 1881358 1999283
5754 1999283 1874546 1838400 1792262 1706241 1699012 1757234 1760533 1793638 1706399 1631559 1651862 1607809
5742 1607809 1686013 1647147 1636891 1668152 1647562 1543536 1541744 1650558 1620424 1525479 1540174
5731 1540174 1532212 1576825 1556214 1535405 1488614 1454787 1378276 1408373 1369768 1261423 1260789 1189895
5719 1189895 1043255 1089044 1082076 1067150 1049182 912328 972811 983448 1089406 962992 874052
5708 874052 944149 972625 920977 842036 934523 939991 951451 981193 981417 1029580 1074837 1003717
5696A003717n6580q6459O7312m7911k7052l0835K0744P6963o0479K600k860K8406
5684H87566o8538j61350L1691Q3168k7494L6780o7583R3769J2068q9704M4541
5673G74914J2432k9703J0468j06249J2691P8398J2939l5371K8057p7087j8547
5662F62942P0582O2696q6265o1017J03740J0418j0912P7558p2618N0000O0404
5651H67528K23q4662j15730m4902J08367p8780n3724J7942n928R1659K6409r1574
5639F36828Q1645l1187k765P6583L7647K1339j50231j2841Q2953J31337l5092
5628H36216K4723R3715p7534j16308r8569j46891J6745P7881R257l3968M8038
5617F33305m3705k6513R5989m4447j27459l3908j10192N4995R4197o7750m5817
$$ plain form
5696 1003717 947137 860678 927990 880079 853027 822192 842936 919899 859420 862020 859160 887566
5684 887566 819028 657678 689369 772537 745043 781823 714240 808009 820077 730373 774914
5673 774914 787346 757643 768111 661862 674553 752951 765890 730519 758576 681489 662942
5662 662942 733524 796220 709955 648938 752678 763096 752184 829742 757124 807124 867528
5651 867528 867751 783089 667359 622457 730824 652044 598320 616262 610334 701993 728402 636828
5639 636828 718473 687286 684521 761104 798751 820090 669859 657018 739971 871308 836216
5628 836216 860939 954654 877120 760812 662243 515352 532097 609978 619235 585267 633305
5617 633305 589600 563087 659076 614629 487170 453262 343070 398065 492262 424512 378695
5606C78695P4840L1429r3189Q8571o3519o7282J5785R028K7922L7746N463J4935
5594D60424P8475J3492K0138m68N9818n6440m0550n3120J08110p8186n7948O8041
5582E21786Q4376N8252K2849j37473l0700M888K6115L113l1599n7921j9576J0051
5570D54161N2826M3131j6897K4567p1737n3299R8163K9836L0136N5198O7378k6572
5558F86891o6226Q5015l296N4208P067N3744n7417R074n3572q2404j42834R211
5546D99461M6461q2696Q7109J3429j11341r6777O3744R1595l3484M7288l0705
5535D94084K6519r4887k5367O4528l0087n2810k3904O3716O1253L3951m0924Q2502
5523E58574O0862P7097m4853l356K7553n0614o2033l3955l2317o1685o3688M487
$$ plain form
5606 378695 453535 484964 391775 480346 416827 349545 365330 374358 402280 440026 445489 460424
5594 460424 538899 552391 572529 572061 631879 575439 534889 481769 589879 511693 453745 521786
5582 521786 606162 664414 687263 549790 519090 523978 550093 553206 521607 463686 444110 454161
5570 454161 506987 550118 533221 557788 486051 432752 530915 560751 590887 646085 713463 686891
5558 686891 620665 705680 702384 756592 763659 817403 759986 769060 715488 633084 490250 499461
5546 499461 545922 463226 550335 563764 452423 355646 419390 510985 477501 524789 494084
5535 494084 520603 425716 400349 464877 434790 381980 358076 421792 483045 516996 476072 558574
5523 558574 619436 696533 651680 648324 675877 625263 563230 529275 496958 435273 371585 376072
5511C76072O3511O7181p8113m5311O8103p5007P331J07319k2619l4700O0004l0073
5499D63698N0279K9554M6840k193j35030r577K5333J1844R7066J1405L067R377
5487F01663O8300J8805p6118P5620P8993p3467q8411Q1367o3387J3814N2251r8740
5475E90690n6190l5952J37699l762j01362K692P5205n2627L7011O0444m4152M1362
5463F51058k8338J284N5216J7460K0444k2785m8802j2912J59380k7698r4186R6498
5451G66619k619j65392J8422P9040l4948O3249N9762J5014k8957q0199o0310J9024
5439F48705O1620J17577m9247R2257N2194Q698M9300K9727j9500L4374L4485R2606
5427A152796k1303l106m7855q1399p2132L8811J51767Q2936J5586r0478R3960
$$ plain form
5511 376072 439583 506764 428651 383340 451443 376436 383767 491086 468467 433767 493771 463698
5499 463698 513977 543531 590371 588178 453148 443571 468904 480748 577814 589219 592286 601663
5487 601663 669963 688768 612650 688270 767263 693796 605385 686752 623365 637179 689430 590690
5475 590690 534500 498548 636247 632485 531123 533815 609020 556393 593404 653848 609696 651058
5463 651058 622720 624004 679220 696680 717124 694339 645537 632625 792005 764307 670121 766619
5451 766619 764000 598608 617030 696070 661122 724371 784133 799147 770190 689991 629681 648705
5439 648705 710325 827902 778655 870912 923106 931804 981104 1010831 991331 1025705 1060190 1152796
5427 1152796 1131493 1128387 1080532 999133 927001 965812 1117579 1200515 1216101 1125623 1219583
5416A219583o5313M742n2126l1292J80939j4374m2553J08752L9261Q1059K0646
5405A449324r4177j8579j05462N1018l3854j11529O1493m8852J766J15161j06586
5394A159723j28430m4005k929r853l2953j00302R666r7802q6086L1715n7022l2004
5382F09718m0641j07204K0741J02128K7810Q4647j69218L5003j7357J0819k6031
5371E30415K9162L8211K589n2339K7482j190m2693k9137L0574K122k9916K6056
5359E31336L6614K6555J9226K1838j56660P0400j535j02859j5339J12821L027
5348E45424j02893M3355q7568O6586j5255J3223n9452J3119J14633j45473n8353
5337C27346J38322M2488k6759J7068l6346o6443N0749P8004k8811o1990J10321
$$ plain form
5416 1219583 1154270 1159012 1106886 1075594 1256533 1242159 1199606 1308358 1347619 1428678 1449324
5405 1449324 1355147 1336568 1231106 1282124 1248270 1136741 1198234 1149382 1151148 1266309 1159723
5394 1159723 1031293 987288 984359 974506 941553 841251 850917 753115 667029 698744 641722 609718
5382 609718 569077 461873 482614 584742 612552 697199 527981 562984 545627 556446 530415
5371 530415 559577 597788 600377 548038 575520 574330 531637 502500 533074 535196 505280 531336
5359 531336 567950 594505 613731 635569 478909 549309 547774 444915 429576 542397 545424
5348 545424 442531 485886 398318 464904 449649 462872 403420 416539 531172 385699 327346
5337 327346 465668 508156 481397 498465 462119 395676 446425 524429 495618 433628 543949
5326E43949p3653j63883R8735k2864n439O3123R530O029L1663l267l6042k6061
5314D21820K2267j36406J11824j1799l6049J2977J031j8571N035r6462P1811r8142
5302B49336K4413M2766J6078l4796m4243O7948J9580k8369j165J0790L2090P6740
5290D31168n4451k3493m1973k9812j1865n5423K2501N4806L5433m5386o973Q5331
5278C59863j65210N2846M5174k178J5036j29665q002L3545j2931L0467O6624r8618
5266A86951P6177J44008n1490l8225n3925m1670p211j4164N0507m4870j6368l355
5254A86365k3185K3706k074K2124J025O5170p5773n8458p8929Q2123N609l6411
5242A11292J9181J19285M2713n2589j4375n997j33558j6301O9619K372l0402Q2157
$$ plain form
5326 543949 470296 306413 405148 382284 376845 439968 449498 455527 487190 483923 447881 421820
5314 421820 444087 307681 419505 407706 371657 384634 385665 367094 372129 275667 347478 249336
5302 249336 273749 316515 332593 297797 253554 321502 341082 312713 311548 322338 354428 431168
5290 431168 376717 353224 311251 281439 269574 214151 236652 291458 326891 281505 274532 359863
5278 359863 194653 247499 292673 290495 305531 175866 167864 201409 188478 218945 285569 186951
5266 186951 263128 407136 355646 317421 263496 221826 214615 200451 250958 206088 189720 186365
5254 186365 163180 186886 184812 206936 207961 273131 197358 138900 59971 142094 147703 111292
5242 111292 130473 249758 292471 239882 225507 219510 85952 69651 139270 141642 111240 193397
5230A93397j01419j01319J41390l4174K2444j8266J15093L3507j07635P2602n2651
5219A62969j12843J14241J8541J5925k6211l9767N8152k6171P7659k0242m6744
5208A75509j8813L158q852K3464P908j1958o8213K3139M9562J5008J4371r9890
5196A04393M0933n814K7576Q9230l260j29794j3375o9233J25123Q9995n3824Q3813
5184B85763o8465j981m0550O2689k6030O306O7905R6195m3396q140r524j06926
5172B13846L3737j9384L2325j259m4481M5747p455J5336K1335Q752L3625P4193
5160D06317p7153J2440O9578M4745j5440p9316N4276n2453K5300Q6417K4918k3146
5148D76483l8687L6487J8890k440j0349r3810O4365L3068j32069n6980j3898K6869
$$ plain form
5230 193397 91978 -9341 132049 97875 120319 102053 217146 250653 143018 215620 162969
5219 162969 50126 164367 182908 198833 172622 132855 191007 164836 242495 222253 175509
5208 175509 156696 159854 151002 174466 182374 170416 102203 125342 174904 189912 204283 104393
5196 104393 145326 139512 167088 256318 253058 123264 109889 40656 165779 255774 201950 285763
5184 285763 217298 215317 174767 237456 211426 217732 285637 381832 338436 330296 320772 213846
5172 213846 247583 228199 260524 259265 214784 260531 253076 268412 289747 298499 332124 406317
5160 406317 329164 341604 411182 455927 440487 361171 415447 362994 388294 474711 499629 476483
5148 476483 437796 474283 493173 490733 480384 386574 450939 484007 351938 294958 281060 307929
5136C07929O5244l4706R9561L6657k2871L0275m5346M4803M13n6415n6434K0893
5124C90003J0913M32J24495p9216j8052j7616n7681R9507J02453j78932K1857
5113C98163j7784M4231K3304n4911p934O878K1238k0932R8469J4393o1578j12209
5101C31328j1365k548p591l9129k8963p0857K0885K9293j0670N2758m7518k6765
5089A88858l8174O2574M3220j0860j2724l0854J22431L7269L1986j3102K7394
5078D08018O5581q5182m3212M5847m0581k9363m6949K5832N9228m9480p3429n097
5066B31213N1789j12469n2860N9761p558P898o406m2024k3101K2986k2850M8959
5054A55338L9645o805M3814j14147Q8795n2466L1370J6663n4408O580M1287N0886
$$ plain form
5136 307929 373173 338467 438028 474685 451814 482089 436743 481546 481959 425544 369110 390003
5124 390003 400916 401348 525843 446627 428575 410959 353278 452785 555238 376306 398163
5113 398163 380379 424610 447914 393003 385069 391947 413185 392253 490722 505115 443537 331328
5101 331328 319963 317415 309824 270695 241732 170875 191760 221053 210383 263141 215623 188858
5089 188858 150684 213258 256478 245618 232894 202040 324471 361740 393726 380624 408018
5078 408018 473599 388417 345205 391052 350471 321108 274159 299991 359219 309739 236310 231213
5066 231213 283002 170533 117673 177434 169876 177774 171368 129344 106243 129229 106379 155338
5054 155338 194983 188178 231992 117845 206640 154174 185544 202207 147799 154379 195666 246552
5042B46552J6871N5426j93147l429J10507o8746q440M9334j4497N857Q304o7351
5030A37241q094o369R4135J2064l1298J6226q6531j76256Q5501J18909O0128M8211
5018B63867r8703J7992j8966L1403o668p9979M927N0185k1255K0652J9575l9630
5006A43400J1775n4412O2773k4237l5937P423m1695N0779Q7930N5014j44972J1760
4994A29601K0894M6047o7301N4237K7698n9515Q148R9970K3199J9287o5626j23344
4982A13295J69653k9625r1674J8552K1215r127r6860j7529j7584J22784n202J17405
4970B95303j0017m674p3934r3680N9546N3086L4321M3760r6817j1127J1716n4674
4958A52809K5128J8490l8270n2419J15929k1637K4159J05368K562K1675J2065
$$ plain form
5042 246552 263423 318849 125702 122273 232780 164034 155594 204928 190431 196288 204592 137241
5030 137241 129147 122778 216913 228977 197679 213905 127374 -48882 36619 155528 215656 263867
5018 263867 165164 183156 164190 195593 188925 108946 113873 164058 142803 163455 183030 143400
5006 143400 155175 100763 163536 139299 103362 110785 69090 119869 207799 262813 117841 129601
4994 129601 150495 196542 129241 183478 211176 151661 159809 259779 282978 302265 236639 113295
4982 113295 282948 253323 161649 180201 201416 192289 95429 77900 60316 183100 177898 295303
4970 295303 285286 280612 206678 112998 172544 225630 259951 303711 206894 195767 207483 152809
4958 152809 177937 196427 158157 105738 221667 200030 224189 329557 332119 353794 365859
4947C65859n9862J00709q9966j1556k853p358N8231N8450m3684m1496J37316q098
4935D55692m4185k1908P682j42225M3294O6154n4647k2612J27214J07531j53292
4924C68698o4290n9800p500M4294J87609K656j67245q1105k4874L6956r8485L0665
4912A67579N7535K2393R61j3892Q095O93M9031K0185K582M1831R5848o1809J7053
4899D08085l3920P4287l538j8141j1264r5482o496L7467j46280K9008O786K1804
4887B62316k4488j6224K7605j9405j2784m0013N4382P2830n0609J5336R5283M3054
4875D07283J5424o7520k6267N8712J496k740k7431M4936j6582k4691M3148K9758
4863D35526P1156j02874n8272k7935O7381p014O8775k203p3759J5757R588L3706
$$ plain form
4947 365859 305997 406706 316740 305184 302331 294973 353204 411654 367970 326474 463790 455692
4935 455692 411507 389599 397281 255056 298350 364504 309857 287245 414459 521990 368698
4924 368698 304408 244608 237108 281402 469011 471667 304422 223317 198443 235399 136914 167579
4912 167579 225114 247507 248468 234576 242671 243364 292395 312580 315162 356993 452841 391032 408085
4899 408085 374165 448452 444914 426773 415509 320027 313531 350998 204718 233726 240512 262316
4887 262316 237828 221604 249209 229804 217020 177007 231389 304219 253610 268946 364229 407283
4875 407283 422707 355187 328920 387632 389128 386388 358957 403893 387311 362620 405768 435526
4863 435526 506682 403808 345536 317601 384982 377968 446743 444540 370781 386538 396126 429832
4851D29832j3099K5279M5701k5765l385j2359k4625q9500L7330L3773N4941m5500
4839D12623j11568K0640N1888m8085k8583R3750n881q6188N2805P5305k5771j9046
4827C81889j42392K0909K1916j8888j12313Q6892M6158Q41R9087J78678o2361
4816E00416R924N6760r1982o1740n7802N5632j20119l4888K53m907Q6707K8100
4804C66354n3907Q30n4451K8331P0341l5376p2637P4021O1416k2731p3958m3735
4792B44498n4520k1057P9456M7429Q21P5792p193j3449P2925K3868N4755p5748
4780D27577M664j2902o9432k3273n5576N8947J06496R3276K2705K5908o6458p8352
4768D33580o491J4407P593J01383o9422p1122M1779J03911n010m2376o2685j1834
$$ plain form
4851 429832 416733 442012 487713 461948 458563 446204 421579 332079 369409 403182 458123 412623
4839 412623 301055 321695 373583 325498 296915 390665 384784 298596 351401 426706 400935 381889
4827 381889 239497 260406 282322 263434 151121 238013 284171 285012 384099 562777 500416
4816 500416 510340 567100 475118 413378 355576 411208 291089 256201 256454 251547 338254 366354
4804 366354 312447 313277 258826 287157 357498 322122 249485 323506 384922 362191 288233 244498
4792 244498 189978 168921 248377 295806 296627 372419 365226 351777 424702 448570 503325 427577
4780 427577 432241 419339 349907 326634 271058 330005 436501 529777 552482 578390 511932 433580
4768 433580 427089 441496 449089 550472 481050 409928 451707 555618 550608 508232 445547 433713
4756D33713k0120o4675R1618J01271l5650K1302l542j9217j12643Q3585P109j1487
4744D71264n325n3000l0076l2292K9876P8891K0471P7797P5719N4672J3238o7670
4732F33565N2445l5013k09615p431J54781k2903k6794n6158P0185j2258M8959
4721E89763J959l5024n0363q5166m4551R4379Q375P5703K0703q5329n6170K7534
4709D61813P228J24958l8974p3188r662l854J03081N9223j1652q3431P7470J04659
4697G17671l6943k5953L887j28017J8010L9542L115p9567p4973J80191p698j4324
4685E94941J9655j6331N5113o5307o4763R2245K2360j2703j4607k3144j0581L9697
4673F16575O4738J5215O0253o2642m0198l6347N4809J0212m7155o6411k3456p332
$$ plain form
4756 433713 413593 348918 440536 541807 506157 527459 523917 504700 392057 475642 482751 471264
4744 471264 465939 412939 382863 350571 380447 459338 479809 557606 633325 687997 701235 633565
4732 633565 686010 650997 441382 433951 588732 565829 539035 482877 553062 540804 589763
4721 589763 591722 556698 506335 421169 376618 470997 479372 555075 575778 490449 434279 461813
4709 461813 469041 593999 555025 481837 472175 468321 571402 630625 618973 535542 613012 717671
4697 717671 680728 654775 658662 530645 548655 588197 591312 511745 436772 616963 609265 594941
4685 594941 614596 598265 653378 588071 523308 615553 637913 625210 610603 587459 576878 616575
4673 616575 681313 696528 756781 694139 653941 617594 672403 682615 635460 569049 545593 538261
4661E38261R9364j9792J7629j2937r945O9399q3282l8282k8661o995R7488K8372
4649F50619k3867Q0153r3311k3263l2213L7520l1024K7148M2683K8119p221L2665
4637F88008p1615R3945R0110m0616n7873l3916N4364L4360M1346k7482j4273O5599
4625H21957P3610n1354p9858M7531P1301o9324R6300M0045O4855p3967j86093
4614G55003P6308M8481r4593J12892l0711r7784k2554K9046M2328j110O4145j45006
4602G36445P2750J15303j18652j5419P7190p0000L9849m8397O6106m3634J01914
4591I13455j2702J087P0407R8231N2062p2656o2646l2686p4Q0839p1273r5995
4579H68049J13469L0499P7402J7490N5758q8581O0551k0724j14356L4449L1587
$$ plain form
4661 538261 637625 617833 635462 622525 612580 681979 598697 560415 531754 524759 622247 650619
4649 650619 626752 706905 613594 590331 558118 595638 564614 591762 634445 662564 655343 688008
4637 688008 616393 710338 800448 759832 701959 668043 722407 756767 798113 770631 756358 821957
4625 821957 895567 844213 764355 811886 883187 813863 910163 950208 1015063 941096 755003
4614 755003 831311 879792 785199 898091 867380 769596 747042 776088 818416 817306 881451 736445
4602 736445 809195 924498 805846 790427 867617 797617 837466 789069 855175 811541 913455
4591 913455 900753 901840 972247 1070478 1122540 1049884 987238 954552 954478 1035317 964044 868049
4579 868049 981518 1012017 1089419 1106909 1162667 1074086 1134637 1113913 999557 1034006 1065593
4568A065593J5765N7312J9803k5546p204j3322P51r3638p7071L6944j8823J24565
4556A085129p4265J791l8357Q9672J9636m394l660Q7995J4102q6226N9755l1194
4544A119984l6005P2433n4199r4379O8398P7793j06571O3715P2874k1K2068j5620
4532A190470K0680Q9709M3523N3484o7197J03431j1224n3418J05389J02977L202
4521A581026M7072k2884J7851K1100p2177N2351q567K4113N0076J3370n813Q9274
4509A786792q2341j43926P7394R9230j8753p5371R237l327m3164k3324P4644P277
4497A664368p7636q321M8973P7834p7192o2749N1758J15398O9505K4123o4596
4486A761465K5758M6852l209o9466o2744K9132O1311Q8145O5718j3683j3810p775
$$ plain form
4568 1065593 1081358 1138670 1158473 1132927 1125723 1112401 1113152 1019514 942443 979387 960564 1085129
4556 1085129 1010864 1012655 974298 1063970 1083606 1079212 1075552 1163547 1177649 1091423 1151178 1119984
4544 1119984 1083979 1156412 1102213 1007834 1076232 1154025 1047454 1111169 1184043 1184022 1206090 1190470
4532 1190470 1211150 1300859 1344382 1397866 1330669 1434100 1422876 1369458 1474847 1577824 1581026
4521 1581026 1628098 1605214 1623065 1644165 1571988 1624339 1615772 1639885 1689961 1703331 1697518 1786792
4509 1786792 1704451 1560525 1637919 1737149 1718396 1643025 1652262 1648935 1605771 1582447 1657091 1664368
4497 1664368 1586732 1578411 1627384 1705218 1628026 1565277 1617035 1732433 1801938 1826061 1761465
4486 1761465 1787223 1834075 1830866 1761400 1698656 1727788 1789099 1877244 1942962 1929279 1915469 1907694
4474A907694J10937R7308M8016l2498J7812L6054Q0519J34807J17324K49791K14799
4463B982563K9999R4633r4150j79147k80629j93576q9149j82188q6492J33612
4453B135476j29189m344n8054p3418r8220K6643J14223m055r0274J02559n4834
4442A866513o7532L5097k1004O6525l6984l1542n7831L8804l7657K0615K9563
4431A804567j26773N5874J6917N1014P2858K5638R614O781K280M6529o2176j4440
4419A888683K6050o5495o4216K7869J37395N2146L5478j6900j6347k4625J1922
4408A991960O3166J09990j706l2533M5393J1109l3681J14210m7039P8669R4726
4397B394264P8242R6814J21102J88106Q7947O6328J89532K32304L84841M17908
$$ plain form
4474 1907694 2018631 2115939 2163955 2131457 2149269 2185323 2265842 2400649 2517973 2767764 2982563
4463 2982563 3012562 3107195 3013045 2833898 2553269 2359693 2270544 2088356 2001864 2135476
4453 2135476 2006287 2001943 1943889 1870471 1772251 1798894 1913117 1909062 1818788 1921347 1866513
4442 1866513 1798981 1834078 1813074 1879599 1842615 1811073 1753242 1792046 1754389 1775004 1804567
4431 1804567 1677794 1733668 1750585 1801599 1874457 1900095 1909709 1916490 1918770 1965299 1903123 1888683
4419 1888683 1914733 1849238 1785022 1812891 1950286 2002432 2037910 2021010 2004663 1980038 1991960
4408 1991960 2055126 2165116 2163410 2130877 2176270 2187379 2153698 2267908 2220869 2299538 2394264
4397 2394264 2472506 2569320 2690422 2878528 2966475 3032803 3222335 3454639 3839480 4257388
4387D257388M40263K95901M6894k05109m50439n23498m14382l21017j62165m7858
4377B915978o8341j28856o8256L593o8842p3485p6680m7304l7090Q6797J819o1268
4365B378065l3201O0370q3909r7253M6868Q2170N7678r1321J3022J4605j3206
4354B333888O3343J3084l1261Q5972j3229R0833m4125Q479K5960M83n6305j6094
4342B461028K8462J1930J06786O8533j4520Q8982Q2579O82R5204j0730M1315o3991
4330B896260o3927j8837k4109Q1388p5817q086J7930m4344L0489L6990j5176L6934
4318B849695L585K5275l1547J55593O8905j904K3278J01510M0134m4467j6341
4307C173716J21785J06477O339Q6215l624k4402l5651K754P3824k7072K2285P7035
$$ plain form
4387 4257388 4697651 4993552 5040446 4835337 4384898 3861400 3447018 3126001 2963836 2915978
4377 2915978 2847637 2718781 2650525 2654118 2585276 2511791 2435111 2387807 2350717 2437514 2439333 2378065
4365 2378065 2344864 2405234 2321325 2224072 2270940 2353110 2410788 2319467 2332489 2347094 2333888
4354 2333888 2397231 2410315 2379054 2465026 2451797 2542630 2498505 2506984 2532944 2533427 2477122 2461028
4342 2461028 2489490 2501420 2608206 2676739 2662219 2751201 2833780 2834462 2929666 2918936 2960251 2896260
4330 2896260 2832333 2813496 2789387 2870775 2794958 2786872 2804802 2760458 2790947 2827937 2812761 2849695
4318 2849695 2853280 2878555 2847008 3002601 3071506 3069602 3092880 3194390 3234524 3190057 3173716
4307 3173716 3295501 3401978 3408317 3494532 3490908 3466506 3430855 3433609 3507433 3480361 3502646 3579681
4295C579681k1989k331J75727P5936J7831K022J14521J04064p3863Q1714Q8991
4284D142304L7303J7133J04738K7570k1677J68278J69336k9368Q5284R9997K12624
4273E013522J74836J03315M4K13785L9629K04714L86943K68601M14235N56129
4263G375753N23869J20488j54422l36197l84181j56749q8948j07274j26291j35437
4253F530611j7883J71947Q826j2499J60216K86705J04581J58210J44279P9829
4243G614822N6358J91437J08761K33315O7628J00939J61295L6148J36701L6243
4233H743647O6791O9550J86763J49276J28760N5079J50698K74300J67496J95419
4223A0187779K93992J69915J48221K60194K78861L31221M59669M21597L65814
$$ plain form
4295 3579681 3557692 3555361 3731088 3807024 3824855 3826877 3941398 4045462 3971599 4053313 4142304
4284 4142304 4179607 4196740 4301478 4329048 4307371 4475649 4644985 4615617 4700901 4800898 5013522
4273 5013522 5188358 5291673 5291717 5505502 5545131 5749845 6136788 6405389 6819624 7375753
4263 7375753 7899622 8020110 7865688 7529491 7145310 6988561 6899613 6792339 6666048 6530611
4253 6530611 6512728 6684675 6693501 6681002 6841218 7127923 7232504 7390714 7534993 7614822
4243 7614822 7671180 7862617 7971378 8204693 8272321 8373260 8534555 8570703 8707404 8743647
4233 8743647 8810438 8879988 9066751 9216027 9344787 9399866 9550564 9824864 9992360 10187779
4223 10187779 10481771 10651686 10799907 11060101 11338962 11670183 12129852 12551449 12917263
4214A2917263L59038M99714O04242O25623M92097O11787O44580P43564Q18607
4205A8316515P90430J031602J134386J012358Q83344R23059J131996J128393J180072
4196B7532155J348706J520501J700545J895205K332881K713318L233883L592649
4188D5869843M347413N131168N943346P090547Q538304J0675797J3002639J5868541
4180A16467598J9734066K5332714L2076667L6031554L2689592J3737701j3654312
4173B62415580l5770292m3597037l6079796k5027600j6977279j2276961r537329
4166H3149286q567017p797303o871341n497800m198586l134138k466815k008824
4158D2607462j580685j099290p44632p35658j389069k234462k497277k042997
$$ plain form
4214 12917263 13276301 13776015 14380257 15005880 15497977 16109764 16754344 17497908 18316515
4205 18316515 19106945 20138547 21272933 22285291 23168635 24091694 25223690 26352083 27532155
4196 27532155 28880861 30401362 32101907 33997112 36329993 39043311 42277194 45869843
4188 45869843 50217256 55348424 61291770 68382317 76920621 87596418 100599057 116467598
4180 116467598 136201664 161534378 193611045 229642599 262332191 276069892 262415580
4173 262415580 226645288 183048251 146968455 121940855 104963576 92686615 83149286
4166 83149286 74582269 66784966 59913625 54415825 50217239 47083101 44616286 42607462
4158 42607462 41026777 39927487 39182855 38447197 37058128 34823666 32326389 30283392
4150C0283392j722550j629372j515859j195448j025223q07484q01110p50122o78401
4141B0157823o48166n97996n76167m80726m87484n46326o24423n73681l69251
4132A5253603m40462l94430l48763l25713l21393j95369k27402k41467k32884
4123A2525720k85325j03236j61136l70208k12523j97284k19672j65843k52983
4114A0557510k02983j46105j03451m9471j02530j09165M661r9610j5300l3804
4104I699752p2425L3062J4368j0334L0261R5932J81726J44470L50388M12443O13299
4093A1492942Q14955Q18341P18135o4874j394123j409656r29525o48814n76267
4084H821114k84276k76348k72207k05410j04969k15246j51903j02339O36P3172
$$ plain form
4150 30283392 28560842 26931470 25415611 24220163 23194940 22387456 21586346 20836224 20157823
4141 20157823 19509657 18911661 18335494 17854768 17367284 16820958 16196535 15622854 15253603
4132 15253603 14813141 14418711 14069948 13744235 13422842 13227473 13000071 12758604 12525720
4123 12525720 12240395 12137159 11976023 11605815 11393292 11196008 10976336 10810493 10557510
4114 10557510 10354527 10208422 10104971 10055500 9952970 9843805 9848466 9748856 9733556 9699752
4104 9699752 9627327 9660389 9674757 9664423 9694684 9790616 9972342 10116812 10467200 10879643 11492942
4093 11492942 12307897 13126238 13844373 13779499 12385376 10975720 10046195 9397381 8821114
4084 8821114 8536838 8260490 7988283 7782873 7677904 7462658 7310755 7208416 7209052 7282224
4074G282224j95818j37736J1616j36805j63223p1334m1426k6655m866k8590q4535
4063F402852o2718n9991J40532O3976o9003r2736Q8608j09342n2529n3627k3036
4052F172986L8717j07328k452J4318r1606M3518m2174m3456j02484m3122K3735
4041E860652J6504l8061m1215l2194p2054m19m7488P3266m7574k0036P6265O159
4029E733805j05073l6559r579K2003j4885j9276J02555M2687j42679M3656k6946
4018E589709j33075k1483P8839l5335K193O8939O335R540K8396O7393O060M738
4006E672249K673J19467j12639k7796K8685j44090k8906R4719R391l9328Q4804
3995E659229j2804l7401J31031P6042L3802o6118l061R1931K4404K8266p2981
$$ plain form
4074 7282224 7086406 6948670 6960286 6823481 6660258 6588924 6547498 6520843 6515977 6487387 6402852
4063 6402852 6340134 6280143 6420675 6484651 6415648 6322912 6411520 6302178 6249649 6196022 6172986
4052 6172986 6211703 6104375 6101923 6116241 6024635 6068153 6025979 5982523 5880039 5836917 5860652
4041 5860652 5877156 5839095 5797880 5765686 5693632 5693213 5645725 5718991 5671417 5651381 5727646 5733805
4029 5733805 5628732 5592173 5582594 5604597 5589712 5570436 5672991 5715678 5572999 5616655 5589709
4018 5589709 5456634 5435151 5513990 5478655 5480848 5549787 5556122 5565662 5594058 5661451 5667511 5672249
4006 5672249 5674922 5794389 5681750 5653954 5682639 5538549 5509643 5604362 5613753 5574425 5659229
3995 5659229 5646425 5609024 5740055 5816097 5849899 5783781 5780720 5872651 5897055 5925321 5852340
3984E852340J5849J7153j9332P8191J96637M145n4657Q9074L8181n343K0071j9345
3972F212964j51698j19164j957m2107p021m3309q3320n1841q3373n498l7394K8300
3960E614582M2938m1483q4371J8775j0027j13352l7020j1471k8910K4272p8676
3949E295257k5580R9379r3595o8202R6173M8495P1035M5008O554Q9413m5112j52723
3937E366102j77676j72264j17214p0359Q804O8618L3155j52229p5566m2484j8234
3926D650653P3186q7726k5442L2004o5497O4066O226r1119o443N1769Q1314R1192
3914D774183k1599m5013J6918M3501L8580O2918N1439p2724L7203R0118L9229
3903E014753P261P0269l5373L0346J48383m8856J02253L7037K9047J63245K2397
$$ plain form
3984 5852340 5868189 5885342 5866010 5944201 6140838 6144983 6090326 6179400 6217581 6212238 6232309 6212964
3972 6212964 6061266 5942102 5940145 5898038 5891017 5847708 5764388 5712547 5629174 5623676 5586282 5614582
3960 5614582 5657520 5616037 5531666 5550441 5540414 5427062 5390042 5378571 5349661 5373933 5295257
3949 5295257 5269677 5369056 5275461 5207259 5303432 5351927 5422962 5467970 5474524 5563937 5518825 5366102
3937 5366102 5188426 5016162 4898948 4828589 4837393 4906011 4939166 4786937 4711371 4668887 4650653
3926 4650653 4723839 4636113 4610671 4642675 4577178 4641244 4647470 4556351 4549908 4601677 4682991 4774183
3914 4774183 4752584 4707571 4724489 4767990 4806570 4869488 4920927 4848203 4885406 4975524 5014753
3903 5014753 5022014 5092283 5056910 5087256 5235639 5186783 5289036 5326073 5355120 5518365 5540762
3892E540762M2872J53680K04295J21659J28290K16639K49578J60806K5227p1488
3882F772320q4836j07641j76733j17543m7564o2546j24980K3615L162K9734m3565
3871F063423j02597l5353j2844P9781Q3457o1336J21239R0276Q282L075J8471
3860F255874J68207k2598m4805m9685q4067R6497q0112o1920j1908L188N8242
3849F226913q298J8417O8050m84j954Q371j03088j56000j12809k843r8433o7994
3837E769848r5867q9638j28011m9250o1185q2344q1660j45703j47559O71n2362
3826D836940j17846K2601O2388l1862L267r6403j44755j51050M6550M9666j8690
3815D460806K7423M7934j6213j08122o2839m4979Q034k3054R8991o3860m7503
$$ plain form
3892 5540762 5583634 5737314 5941609 6063268 6191558 6408197 6657775 6818581 6843808 6772320
3882 6772320 6687484 6579843 6403110 6285567 6238003 6175457 6050477 6074092 6077254 6106988 6063423
3871 6063423 5960826 5925473 5912629 5992410 6075867 6014531 6135770 6226046 6234328 6237403 6255874
3860 6255874 6424081 6401483 6356678 6306993 6222926 6319423 6239311 6177391 6165483 6168671 6226913
3849 6226913 6218615 6237032 6305082 6304598 6302644 6311015 6207927 6051927 5939118 5936275 5837842 5769848
3837 5769848 5673981 5584343 5456332 5407082 5345897 5263553 5181893 5036190 4888631 4889302 4836940
3826 4836940 4719094 4741695 4804083 4772221 4775488 4679085 4534330 4383280 4429830 4479496 4460806
3815 4460806 4488229 4536163 4519950 4411828 4348989 4304010 4312044 4288990 4387981 4324121 4276618
3804D276618K4759Q0008p5248l3317J5899m0217Q0857r8311K361K4951Q3073N0817
3792D392250n2739R4K209n8668J2844J01711R3264J8883N5655M5655R5265O2926
3780D769349J27772j16907q374K8910p3449P0249p1678J19915O031L4448J54411
3769E040677J11671l0817j5456J53239K6960P0348L0529l781M0965j9875l3755
3758E370705N8285O4507P3478j2899j3265o0715J02812J32801k522M3141o499
3747E749829k2730n3690J29374R4970L9260L2050J46996P89L2763j6405K5910
3736F159116N8463n8756R0540Q0085K3939j4004P6342J44382L3481R143J13499
3725F716230K13100J38827K38647J88395m0546J05527J03036P9312K1402O590
$$ plain form
3804 4276618 4301377 4381385 4306137 4272820 4288719 4248502 4329359 4231048 4233409 4258360 4341433 4392250
3792 4392250 4339511 4339605 4341814 4283146 4295990 4397701 4490965 4509848 4565503 4611158 4706423 4769349
3780 4769349 4897121 4780214 4771840 4800750 4727301 4797550 4725872 4845787 4851818 4886266 5040677
3769 5040677 5152348 5121531 5106075 5259314 5286274 5356622 5387151 5383370 5424335 5404460 5370705
3758 5370705 5428990 5493497 5566975 5554076 5540811 5480096 5582908 5715709 5713187 5756328 5749829
3747 5749829 5727099 5673409 5802783 5897753 5937013 5969063 6116059 6116848 6149611 6133206 6159116
3736 6159116 6217579 6158823 6249363 6329448 6353387 6339383 6415725 6560107 6593588 6602731 6716230
3725 6716230 6929330 7068157 7306804 7495199 7454653 7560180 7663216 7742528 7763930 7770520
3715G770520P2373m1205Q7097J58831L68759J27139J54394J67930L3761J02397
3705I001996L5482n0957q0965N0166N1992r8539K17013K34718J81282L267Q2716
3694I628171J72312J11479J97751J98096J49054P9835J01164J48614J64522O6765
3684A1017763K01800M0598K21123J76238K67487Q8490N3103O339Q2394M395k3205
3673A2136525p2030k29672N0858j48361O2991R2065j6679R6303K2400N6107n4068
3662A1996439N4784n9080j01342j25401n2264p3420L9626J47102o8j38427j2103
3651A1675846J9435k2381l2611L7808q087p7483M942l647l1574j25176o8902J05772
3639A1473942j4195L5846J09994L463R5952k762m4101m1535O1142R8787K1392
$$ plain form
3715 7770520 7842893 7801688 7888785 8047616 8416375 8543514 8697908 8865838 8899599 9001996
3705 9001996 9037478 8986521 8905556 8955722 9007714 8909175 9126188 9360906 9542188 9545455 9628171
3694 9628171 9800483 9911962 10109713 10307809 10456863 10536698 10637862 10786476 10950998 11017763
3684 11017763 11219563 11260161 11481284 11657522 11925009 12013499 12066602 12072941 12155335 12159730 12136525
3673 12136525 12064495 11834823 11885681 11737320 11800311 11892376 11875697 11972000 11994400 12050507 11996439
3662 11996439 12051223 11992143 11890801 11765400 11713136 11639716 11679342 11826444 11826376 11687949 11675846
3651 11675846 11695281 11672900 11640289 11678097 11670010 11592527 11597469 11593822 11562248 11437072 11368170 11473942
3639 11473942 11459747 11495593 11605587 11609050 11705002 11702240 11658139 11616604 11677746 11776533 11797925
3628A1797925n0649M2760p940l7768j44250n1662k2634J08396j1624J104q6980
3617A1536678n6864j19151l333K3411j13466r6582p8098q021L695M2058p6613
3606A1053714k9073j7790R4677Q9826j2090q0819o0307P8981o8586N6912m1931
3595A1063514M7015k638o2683Q7920p9521k4554o8141J18758P480j43129j04083
3584A0839938o2525P3283j064J0717R9088p0757r3890p4679r0701j06038j0697
3573A0512675Q5407p8189m3509r6830o6813L4197m3527r0485J1413J19507K493
3562A0346339n4111j6147L1810j0365p706p1277P8345l0552j4395l3559r9121
3551A0119261o1937m4599Q0781m3068J7644l4557j6128p820m4022J19952p164
$$ plain form
3628 11797925 11747276 11790036 11782096 11744328 11600078 11548416 11525782 11634178 11622554 11623658 11536678
3617 11536678 11479814 11360663 11357330 11380741 11267275 11170693 11092595 11084574 11088269 11130327 11053714
3606 11053714 11024641 11006851 11101528 11191354 11179264 11098445 11038138 11117119 11048533 11105445 11063514
3595 11063514 11110529 11107891 11045208 11133128 11053607 11029053 10960912 11079670 11087150 10944021 10839938
3584 10839938 10777413 10850696 10849632 10860349 10959437 10888680 10794790 10720111 10629410 10523372 10512675
3573 10512675 10598082 10519893 10476384 10379554 10312741 10346938 10303411 10212926 10224339 10343846 10346339
3562 10346339 10292228 10276081 10307891 10297526 10289820 10218543 10296888 10266336 10251941 10218382 10119261
3551 10119261 10057324 10012725 10093506 10050438 10068082 10033525 10017397 10009577 9965555 10085507 10078343
3540A0078343O1973N6064l3337R115K1798j975J94738J75174K6211Q2466P9414
3529A0749984m1663N7539J9845J42739Q9535J80992K8056O3770J15227O2625Q1010
3518A1549659K1519O1201n815O2773j0153K3627k6885J2779J63619P9349L2937
3507A1964610J16959k1960n159J57359K0909L4439J04628L4021Q3228L8857O4302
3496A2592193J29918J57638J93091K05566J62163J88516J86800J19077K61362
3487A4196324K48626K15414K38188K50827L42378K91219K75738K59450K67612
3478A6585776J36186J76675K23689M36641L82497M59665M20139N99565O48040
3469B0068873O33119O10183R71189J199813J374947J614079J763470K090838K569385
$$ plain form
3540 10078343 10140316 10196380 10163043 10172158 10193956 10191981 10386719 10561893 10588104 10670570 10749984
3529 10749984 10708321 10765860 10785705 10928444 11017979 11198971 11227027 11290797 11406024 11468649 11549659
3518 11549659 11571178 11632379 11626564 11689337 11679184 11702811 11675926 11688705 11852324 11931673 11964610
3507 11964610 12081569 12059609 12054450 12211809 12232718 12267157 12371785 12405806 12489034 12527891 12592193
3496 12592193 12722111 12879749 13072840 13278406 13440569 13629085 13815885 13934962 14196324
3487 14196324 14444950 14660364 14898552 15149379 15491757 15782976 16058714 16318164 16585776
3478 16585776 16721962 16898637 17122326 17558967 17941464 18401129 18821268 19420833 20068873
3469 20068873 20701992 21312175 22283364 23483177 24858124 26472203 28235673 30326511 32895896
3460C2895896L061753L647232M424315N466475P046367Q788262R379073P535799
3452H2245172J746397o578637j0581474r309214o597248m541702l060282k051502
3444D1271510j524170j034356p22408n06957l46685j15206R0826K78281O95842
3435C8086677J164415J577523K105114K805560L221708L701343M452864N702732
3427F2817936P166233Q561375J0713002J3895104J7876623J9350895J5967751
3420A56348919L818224j4046822k2175376j9767712j5388347j1688431q483055
3413F8617400o182015m618908l626120l072124k525842k050938j548265j134776
3405D3858412p36694j55617K04508P21408J313767J408184J624968J099896Q11273
$$ plain form
3460 32895896 35957649 39604881 44029196 49495671 56542038 65330300 74709373 82245172
3452 82245172 83991569 77412932 66831458 57522244 50924996 46383294 43323012 41271510
3444 41271510 39747340 38712984 37990576 37483619 37136934 37021728 37112554 37390835 38086677
3435 38086677 39251092 40828615 42933729 45739289 48960997 52662340 57115204 62817936
3427 62817936 69984169 78545544 89258546 103153650 121030273 140381168 156348919
3420 156348919 160167143 146120321 123944945 104177233 88788886 77100455 68617400
3413 68617400 62435385 57816477 54190357 51118233 48592391 46541453 44993188 43858412
3405 43858412 43121718 42966101 43170609 43892017 45205784 46613968 48238936 49338832 50150105
3396E0150105J014521K064221L016999L942900N525888P363407P895098N862295
3388H6835434M30964p276986j0962632r542834o843114m794383l523833k592164
3380D1730452j806425j549004j171992r54362q76681p92671o60242o73967n78598
3371C2666510o70686n24911m23479m63235j93195r2218j30741j50333K0893N3642
3361C0092247P2020Q8863K73127K71762L10092M11107M26766N20513M40292N14979
3351C3421768M68254M87306M38598M54696M53371M40447M66253M99885M44931
3342C7575509M49763O49198O84095P70359P65824L08415J34361r3859p1966K02005
3332D1373704K85388N22120O40716O59203Q37855J075421J172665J265076J245913
$$ plain form
3396 50150105 51164626 53228847 56245846 60188746 65714634 73078041 80973139 86835434
3388 86835434 87266398 79989412 69026780 59483946 52640832 47846449 44322616 41730452
3380 41730452 39924027 38375023 37203031 36248669 35371988 34579317 33919075 33245108 32666510
3371 32666510 31995824 31470913 31047434 30584199 30391004 30298786 30168045 30017712 30038605 30092247
3361 30092247 30164267 30253130 30526257 30798019 31108111 31519218 31945984 32466497 32906789 33421768
3351 33421768 33890022 34377328 34815926 35270622 35723993 36164440 36630693 37130578 37575509
3342 37575509 38025272 38674470 39358565 40128924 40894748 41203163 41337524 41243665 41171699 41373704
3332 41373704 41659092 42181212 42821928 43481131 44318986 45394407 46567072 47832148 49078061
3323D9078061J118363R75011Q45743Q91798Q54005Q17147R76432J063746R64140
3314E7584446R82208J035068R59908J029559R69723J084634J108100J267820J413235
3305F7434701J518003J702413J908586K037387K490082K543674K758622L083122
3297H5476590L030833K984487L117991L373772L632933L970787M329657M294663
3289A14211713L965322L573491L271418L145733M051410N281478O471066P371729
3281A51343360P838305Q149905P981116P505064O921024O052628M408035K501928
3273B02701365P01046q40928j886829k764373l308396l282373l244919l436587
3265A84638006m014327n043289o560044p940523q833226q754375q376798p683432
$$ plain form
3323 49078061 50196424 51171435 52017178 52908976 53762981 54580128 55556560 56620306 57584446
3314 57584446 58566654 59601722 60561630 61591189 62560912 63645546 64753646 66021466 67434701
3305 67434701 68952704 70655117 72563703 74601090 77091172 79634846 82393468 85476590
3297 85476590 88507423 91491910 94609901 97983673 101616606 105587393 109917050 114211713
3289 114211713 118177035 121750526 125021944 128167677 132219087 137500565 143971631 151343360
3281 151343360 159181665 167331570 175312686 182817750 189738774 195791402 200199437 202701365
3273 202701365 203402411 202561483 200674654 197910281 194601885 191319512 188074593 184638006
3265 184638006 180623679 175580390 169020346 161079823 152246597 143492222 135115424 127431992
3257A27431992o997274o336865n862431n536973n083263m603839m215552l978453
3249H4817342l720431l516861l204869l064747k722934k482324k439380k170590
3241F1495206j952471j867584j721370j496496j494808j369762j311618j343028
3233D8938069j473475j283483j234166j290109j217183j191272j099328r78576
3225C9170477q63565q43549p89162q38053q56761p73825p86925q15888p27368
3216C1875381o23140p24849n62190n90342o35467n89498m50447n90171m88683
3207B6620594m38647m70392m32469m89075m90231m30197l14728m68824l88020
3198B2698011l77312l62789m01399k91794l30026k37758k84524l25593l05333
$$ plain form
3257 127431992 120434718 114097853 108235422 102698449 97615186 93011347 88795795 84817342
3249 84817342 81096911 77580050 74375181 71310434 68587500 66105176 63665796 61495206
3241 61495206 59542735 57675151 55953781 54457285 52962477 51592715 50281097 48938069
3233 48938069 47464594 46181111 44946945 43656836 42439653 41248381 40149053 39170477
3225 39170477 38306912 37463363 36674201 35836148 34979387 34205562 33418637 32602749 31875381
3216 31875381 31252241 30527392 29965202 29374860 28739393 28149895 27699448 27109277 26620594
3207 26620594 26181947 25711555 25279086 24790011 24299780 23869583 23554855 23086031 22698011
3198 22698011 22320699 21957910 21556511 21264717 20934691 20696933 20412409 20086816 19781483
3189A9781483l21640k62677j42692l06665k84583k41392k45901k63611k42703
3180A7469619j40071l13054j96012j97968j53518k23901k37182k02985j76051
3171A5628877j13078j76186j26246k14921n2950j45600m1715L1710q2169j95556
3161A4512166k86159j87908j79768k22132p6801r2452j37849k09041p2862j89703
3151A2857491j9777m806j52842p9882o3901j67767j03594q8931p7679j50536l3073
3140A1914703l0272j35003K2031j10898k5998L490k9430j5264K9360q436k9745
3129A1584538r8443n8775k57110r7822r1064j25631r1641p5493o7900j56833k23620
3118A0240206n6434K6218l6436j27926q2837J0151l5845N3837N4914N2570M3323
$$ plain form
3189 19781483 19459843 19197166 19054474 18747809 18463226 18221834 17975933 17712322 17469619
3180 17469619 17329548 17016494 16820482 16622514 16468996 16245095 16007913 15804928 15628877
3171 15628877 15515799 15339613 15213367 14998446 14945496 14799896 14758181 14789891 14707722 14512166
3161 14512166 14226007 14038099 13858331 13636199 13559398 13466946 13329097 13120056 13047194 12857491
3151 12857491 12837714 12832908 12680066 12600184 12536283 12368516 12264922 12175991 12098312 11947776 11914703
3140 11914703 11884431 11749428 11771459 11660561 11634563 11638053 11608623 11593359 11622719 11614283 11584538
3129 11584538 11486095 11427320 11170210 11072388 10981324 10855693 10764052 10688559 10620659 10463826 10240206
3118 10240206 10183772 10209990 10173554 10045628 9962791 9972942 9937097 9990934 10045848 10098418 10141741
3107A0141741o8104l3072p4177o5604N4880m4323O848o9857n992Q0898q7456l0683
3095I805099m9602j07163K1440j2595j13192l8829k1807k0283j66895K4314k7465
3084I293022P5024j921j3921j39508k8882K3091k5655K1810q5189K0380k5246
3073I113005q6909J8289k270j7286R3684m3703l8241l7003K3999j744J3355J48931
3061I184107M9842r0688j43123J36679K3207o6133J01800J8424l2321K1830O8658
3050I272282O0948j1616l5132J13697P1074N6091J59516R4585J35661J11138Q6674
3039A0114918Q9268J79101J57416J26038K58899J86092K10128K62068L25389L36994
3029A2246311J92649J40674Q4590Q83m1886j40601J01447J8623M3293J63446K12378
$$ plain form
3107 10141741 10073637 10040565 9966388 9900784 9955664 9911341 9918189 9848332 9842340 9923238 9835782 9805099
3095 9805099 9755497 9648334 9669774 9657179 9543987 9505158 9483351 9463068 9296173 9320487 9293022
3084 9293022 9368046 9366125 9352204 9212696 9183814 9206905 9181250 9203060 9117871 9138251 9113005
3073 9113005 9026096 9044385 9042115 9024829 9118513 9074810 9036569 8999566 9023565 9021821 9035176 9184107
3061 9184107 9233949 9143261 9000138 9136817 9160024 9093891 9195691 9214115 9181794 9203624 9272282
3050 9272282 9333230 9321614 9286482 9400179 9471253 9527344 9686860 9781445 9917106 10028244 10114918
3039 10114918 10204186 10383287 10540703 10666741 10925640 11111732 11321860 11583928 11909317 12246311
3029 12246311 12438960 12579634 12664224 12665107 12623221 12482620 12584067 12602690 12645983 12809429 13021807
3018A3021807J26296K81524K45906K28018K36030N7504Q8179M2475J29494K46816
3008A4704049J11597K94489L00185K35200K95366L88390N20346N11645M92511
2999A7853778N37280N09647P16147O48287M15146k3076j31621n0176J8458J43851
2989B0637721J17423P9548L65760K26312K98036L05199J56148K41466M71180M24632
2979B3323425N56303P41141O76573P00223O90081Q81697R37286R92323J144480
2970C0643532J209295J542596J545503J596148J886121J910129K324350K325017
2962D4982691K575994K689836K862516K809700K616005K703863K690183K258668
2954F6189456J815973J041008K81503j01766p5036J08676J87893K07438L11592
$$ plain form
3018 13021807 13148103 13429627 13675533 13903551 14139581 14197085 14285264 14327739 14457233 14704049
3008 14704049 14815646 15110135 15410320 15645520 15940886 16329276 16849622 17361267 17853778
2999 17853778 18391058 18900705 19616852 20265139 20680285 20657209 20525588 20475412 20493870 20637721
2989 20637721 20755144 20834692 21200452 21426764 21724800 22029999 22186147 22427613 22898793 23323425
2979 23323425 23879728 24620869 25297442 25997665 26687746 27569443 28506729 29499052 30643532
2970 30643532 31852827 33395423 34940926 36537074 38423195 40333324 42657674 44982691
2962 44982691 47558685 50248521 53111037 55920737 58536742 61240605 63930788 66189456
2954 66189456 68005429 69046437 69327940 69226174 69151138 69259814 69447707 69655145 69966737
2945F9966737K64018L49306L95511N31110N00217P12149J133024J461057J705460
2936G7018589J992293K290447K700172L398268M263349N143015O220416P744503
2928A10771052R267120R783384Q183505K997889n127137j0372927j0932608r672846
2920A04897432q279539o773168n436301m297431l373111k808002k275537k054585
2912F9599758j653209j443601j077894p60975k82130J31962J23106K85004M77230
2903F5399251O73247R34518Q83756J121072J324844J157536J091899N81499l49650
2894G2817972j505381k487344l234473l591552l686959l573044l024979k687844
2886D9026396k484656k204110j858286j611343j493956j304854j142250j031676
$$ plain form
2945 69966737 70230755 70580061 70975572 71506682 72006899 72719048 73852072 75313129 77018589
2936 77018589 79010882 81301329 84001501 87399769 91663118 96806133 103026549 110771052
2928 110771052 120038172 129821556 138005061 141002950 135875813 125502886 114570278 104897432
2920 104897432 96617893 89844725 84408424 80110993 76737882 73929880 71654343 69599758
2912 69599758 67946549 66502948 65425054 64664079 64381949 64513911 64637017 64922021 65399251
2903 65399251 66072498 67007016 67890772 69011844 70336688 71494224 72586123 73167622 72817972
2894 72817972 71312591 68825247 65590774 61999222 58312263 54739219 51714240 49026396
2886 49026396 46541740 44337630 42479344 40868001 39374045 38069191 36926941 35895265
2878C5895265j013955j002170r11537q39930r63930r69000q21560r51953r87669
2869B7433561q74591r08714q11655q78495q05217p35163o90921p23914o90711
2860B0314180n62905n18285m28404m77130m99266n05733m39664l13896l16232
2851A6252665l22386l42437k94081k49767l25550k77577k42137l61738l09856
2842A3527136k21067k91550l52312l05642j83958k46896k13537k47408l38762
2833A1126004k55430j17273j86860j53241j85583k98828k6867k29399k12601k37815
2823I222107q7494j69237j00879k15497o4117j63492k35756j04858j20065j19001
2813G841711o7468o9221j06887n6492m9397j50765j62607j85307j75521R625r3472
$$ plain form
2878 35895265 34881310 33879140 32967603 32127673 31163743 30194743 29373183 28421230 27433561
2869 27433561 26558970 25650256 24838601 23960106 23154889 22419726 21728805 21004891 20314180
2860 20314180 19751275 19232990 18804586 18327456 17828190 17322457 16882793 16568897 16252665
2851 16252665 15930279 15587842 15293761 15043994 14718444 14440867 14198730 13836992 13527136
2842 13527136 13306069 13014519 12662207 12356565 12172607 11925711 11712174 11464766 11126004
2833 11126004 10870574 10753301 10566441 10413200 10227617 9928789 9901922 9672523 9459922 9222107
2823 9222107 9134613 8965376 8864497 8649000 8584883 8421391 8185635 8080777 7960712 7841711
2813 7841711 7774243 7705022 7598135 7541643 7492246 7341481 7178874 6993567 6818046 6827671 6734199
2802F734199j23221j61819j09768l8134o7339j70524j31095j48754j73856p1141
2792E538548n4492r0506J7101j29116j21510M9317p2685j24676q7288j48127M7215
2781D823781m8426j26130R1501j44864j24170l950q1047r406p4555q9416r252
2770D204066L2669q9087k16591K2296n5671o3267l3720k491p5774n7348k6430
2759C638652p7856N9817j59797J3321j41600k4808k6681n2337q2436j18975K0439
2748C047739M2811n6302j0110m1243q1757K8244P4369j48855K198L3948p1316
2737B819726m4525k1489p7251j4376j05624k9595L3453m8319m171k4343o9503
2726B413983j7144l7573j31931R963l3365K8833M2023o7656n6389J25170K0507
$$ plain form
2802 6734199 6610978 6449159 6339391 6301257 6233918 6063394 5932299 5783545 5609689 5538548
2792 5538548 5484056 5393550 5410651 5281535 5160025 5209342 5136657 5011981 4924693 4776566 4823781
2781 4823781 4775355 4649225 4740726 4595862 4471692 4467742 4386695 4377289 4302734 4213318 4204066
2770 4204066 4236735 4147648 3931057 3953353 3897682 3834415 3800695 3798204 3722430 3665082 3638652
2759 3638652 3560796 3620613 3460816 3474137 3332537 3307729 3281048 3228711 3146275 3027300 3047739
2748 3047739 3090550 3034248 3024138 2982895 2901138 2929382 3003751 2854896 2857094 2891042 2819726
2737 2819726 2775201 2753712 2676461 2662085 2556461 2526866 2560319 2512000 2507829 2483486 2413983
2726 2413983 2396839 2359266 2227335 2237298 2203933 2232766 2274789 2207133 2150744 2275914 2296421
2715B296421n1992k5537o4414M1392O9701l346p9617n0713L2562J525O829r9325
2703B073486L2358Q0524j23215o0847q5994M0420J63143r476L5677J2369j18964
2692B039481j63464l3026K7295q684j54595l5961Q5687Q2826O115K4357n8021
2681A812010m0997N7562j0008P3915r382l7827Q341J09144n6678k6994K786M7622
2669A929494r228m6277M8214L830p474p4791m7184l4064o202K8286M8439j05843
2657A727200k4151L780l7837k8225N5117R0485O2397O9003q5259l2512M9021o4882
2645A784137J36086J02583O7537p429n227K523j815o8452j40663j30288Q1284
2634A820276j7999q1169K4601m7033o0861p6637J0834j16444o7636J22361K9342
$$ plain form
2715 2296421 2244429 2218892 2154478 2195870 2265571 2262225 2182608 2131895 2164457 2165982 2172811 2073486
2703 2073486 2105844 2186368 2063153 2002306 1916312 1956732 2119875 2110399 2146076 2158445 2039481
2692 2039481 1876017 1842991 1870286 1861602 1707007 1671046 1756733 1839559 1845674 1870031 1812010
2681 1812010 1771013 1828575 1818567 1892482 1883100 1845273 1853614 1962758 1906080 1879086 1881872 1929494
2669 1929494 1920266 1873989 1922203 1926033 1918559 1843768 1796584 1762520 1756318 1784604 1833043 1727200
2657 1727200 1703049 1706829 1668992 1640767 1695884 1786369 1848766 1917769 1832510 1799998 1849019 1784137
2645 1784137 1920223 2022806 2090343 2082914 2077687 2080210 2078395 2009943 1869280 1738992 1820276
2634 1820276 1802277 1721108 1745709 1698676 1637815 1561178 1572012 1455568 1387932 1510293 1539635
2623A539635o4427l0070L1209J8085Q045J5256M5765p2223M9521J2898o7104k6630
2611A459960L7893L450m837p6145o0752m0800q0035k5645k1603n359j16435J99776
2599A269468p6980l1844k1667M0971o5337L3526o887k6788j8063j4462J33040
2588A214977j26819k1145J9881j00191Q6967P0829j02980r4179j10836J81893
2578A018397o7841n7430P5091k796n0883j41795L8366J08483L7247P35m4031k6972
2566H86571j11143m950j905O1149Q5788j01580o7677R3313k2397p2996k0129j6623
2554G07421N4231J9008l3473m5849O4756p99q8404J0488J45357n6825K135r8684
2542F79362n4168N6211l1104K0876j1960l6342P7635k7833o706O5476j11032K6
$$ plain form
2623 1539635 1475208 1445138 1476347 1494432 1502477 1517733 1563498 1491275 1540796 1553694 1486590 1459960
2611 1459960 1497853 1501303 1496466 1420321 1359569 1318769 1238734 1213089 1191486 1186127 1069692 1269468
2599 1269468 1192488 1160644 1138977 1179948 1114611 1148137 1141250 1114462 1096399 1081937 1214977
2588 1214977 1088158 1067013 1086894 986703 1073670 1144499 1041519 947340 836504 1018397
2578 1018397 950556 893126 968217 965421 914538 772743 811109 919592 956839 957574 913543 886571
2566 886571 775428 770478 768573 829722 915510 813930 746253 839566 817169 744173 724044 707421
2554 707421 761652 780660 747187 701338 766094 765295 676891 687379 832736 775911 778046 679362
2542 679362 625194 681405 650301 671177 659217 622875 700510 672677 665971 731447 620415 620441
2530F20441L5675N6688m3887n7593J02801m4955L9167J9901q9537r543r3040j4821
2518E21297P9938r442j0908K1824j176K389M9430m8902k5115N3228o538K1657
2506F47682N7084l5714K6779n7945j59748m7877J4847K9536R5578L907j6252M8091
2494F05968r1614j991j3984n3988N9918K0669N8470j49554l7199K9486L9748p8696
2482C87233kJ11230n1783M8421n4274o7416N9421k3375m3372Q5821N2413n9763
2470D44554M988Q9931k03j8291r9526j17789r681R7647l8441J3957r5439l8726
2458B32981J44134k4201m9767M8007J05321K7390j18695P6599J9355p9858O628
2447C87894O0574l0988L2651p896p2900L6528J8370q8009N3250J06313J020l4548
$$ plain form
2530 620441 656116 712804 668917 611324 714125 669170 708337 728238 638701 629158 536118 521297
2518 521297 601235 591793 580885 602709 601533 603922 653352 604450 579335 632563 626025 647682
2506 647682 704766 669052 695831 637886 478138 430261 445108 474644 570222 574129 557877 605968
2494 605968 514354 512363 498379 444391 504309 524978 583448 433894 396695 426181 465929 387233
2482 387233 387231 498461 446678 495099 440825 373409 432830 409455 366083 451904 504317 444554
2470 444554 449542 539473 539270 520979 421453 303664 293983 391630 353189 367146 271707 232981
2458 232981 377115 352914 303147 351154 456475 483865 365170 441769 461124 381266 387894
2447 387894 448468 417480 450131 442235 369335 405863 424233 336224 389474 495787 496807 462259
2435D62259p8628j2008N7322n0940m1379J6019O0263p0046P3960j0955K686l9715
2423C68838l7984j2250l8991P8206k0992J7045n7124p907J17884j31587j9011
2412B56127R8806J4971l2619k3738K9160p3953J9094O7070k8195p5832j332M4023
2400B93582L4732J8859m272j2312K5806k3178J71810j06885N8106L7546l7326
2389D56468q604n5119N3136q8026k6608k4218L9135J08910O131m1770L527r6701
2377C26261l4229J07765r8647O071P2878J9559j04357L5355k8738j7641l6393
2366B47884O2414L285j55009O4950J16163J11069p8695p6611L2951q99O9446k5748
2354C71200o3113J8627J3617k8827J3309k9393j1348q8879J8791N2150K5017M2515
$$ plain form
2435 462259 383631 371623 428945 378005 336626 352645 412908 342862 416822 405867 408553 368838
2423 368838 330854 318604 279613 357819 336827 353872 296748 288841 406725 275138 256127
2412 256127 354933 369904 337285 313547 342707 268754 287848 354918 326723 250891 249559 293582
2400 293582 328314 347173 342901 330589 356395 333217 505027 398142 456248 493794 456468
2389 456468 447864 392745 445881 357855 331247 307029 346164 455074 461205 419435 422962 326261
2377 326261 292032 399797 301150 307221 380099 399658 295301 330656 301918 284277 247884
2366 247884 310298 313583 158574 223524 339687 450756 372061 295450 328401 327502 396948 371200
2354 371200 308087 326714 340331 311504 324813 295420 284072 195193 213984 266134 291151 333666
2342C33666j47170n0814N6621J0412J2007k0498K8910M1411j34003J30727k0210
2331B41059o628J2191L2220N1695J6816o4152o9316J11476J0005J0566j7157P783
2319C36558j6818j7096M2485o0786p852p455o4583M6632J0900j26011J19291Q93
2307B56158L6952q8342P6958N5620r4433P9316l98r7959l045J02341n1378R0835
2295C62625K7622l4321n1440m97Q062l9393n5835O5697J22462l5882m0035k0392
2283C08673J2588M4794M8312j01808O5359m6750o4588L887k1340K3591m494M505
2271B72729L3572O7779l0097p4l8053p948j071J2682K4575J35442P770J17572
2259E94878l4630j85390K9019j9724l7686n4194k630R0631p904N0363j1485o2788
$$ plain form
2342 333666 186496 135682 192303 202715 214722 194224 223134 264545 130542 261269 241059
2331 241059 234431 246622 278842 330537 347353 283201 213885 325361 335366 345932 328775 336558
2319 336558 319740 302644 345129 284343 276491 269036 204453 251085 261985 135974 255265 256158
2307 256158 293110 204768 281726 337346 242913 322229 321831 223872 220827 323168 271790 362625
2295 362625 390247 355926 304486 303989 312051 272658 216823 282520 404982 369100 329065 308673
2283 308673 321261 366055 414367 312559 377918 331168 266580 270467 249127 272718 268224 272729
2271 272729 306301 374080 343983 343909 305856 297908 296837 309519 334094 469536 477306 594878
2259 594878 560248 374858 403877 384153 346467 292273 289643 380274 372370 422733 411248 348460
2247C48460m0672q984Q927O1696k9156M7207K3560K5245q1737k3953J47510J15411
2235E93514n2464q2275k5888j1948L2241R7744o5117j00325L6537K9981J06050
2224E58050n8642r108K1176J0884M6682O4448n2537J15314l2392N312m2581j8924
2212F07682J25559N5319O9922j10357O4739k1518p5208P8433m2219q22J42572
2201H94102O8147n9634m3240M4090K3106l7579j1152J17013P3218p089N2846K5479
2189A139307M4177p6929K5374j3133m0034k1198N9865m444N0245Q9506m6217K0987
2177A227506M457L4620j1945J35038K5894N7184l9255k1731P1483N9028N8975
2166A601254l5522J57835J17673J6751R1900J42146J4320J52680R7193Q8163J45557
$$ plain form
2247 348460 307788 298804 307731 369427 340271 387478 411038 436283 354546 330593 478103 593514
2235 593514 541050 458775 432887 420939 453180 550924 485807 385482 422019 452000 558050
2224 558050 499408 490300 511476 522360 569042 633490 580953 696267 663875 669187 626606 607682
2212 607682 733241 788560 858482 748125 812864 791346 716138 794571 752352 751530 894102
2201 894102 962249 902615 859375 903465 926571 888992 877840 994853 1068071 1060982 1113828 1139307
2189 1139307 1183484 1106555 1131929 1118796 1078762 1057564 1117429 1112985 1163230 1252736 1206519 1227506
2177 1227506 1231963 1266583 1254638 1389676 1415570 1472754 1433499 1411768 1483251 1542279 1601254
2166 1601254 1565732 1723567 1841240 1857991 1949891 2092037 2106357 2259037 2356230 2444393 2589950
2155B589950J26475J52274K65110J34643J66847K20028J77948K40730J68711K86111
2145D528827M10854K40353L11058M61196O21038N66056N82001M29032N50616P48905
2135I449936J047265J119903J518549J947082K576012L077634L738724N022787
2127B9497892O871799P864328P341388K570967p743962j1234953q005603n217263
2119B1944593l493995k636971k001047j543711j356292j058756q56064m44070
2111H553687n25499l51285l34526n51860o37932n42763m04670l55761k51874k71970
2101D325547k21180k17391k73913j80867o2814m2090q38j72807k30320M7420j07452
2090B863295j50383J0005j07076j88698p6620j54734o4933j8686n6355p9733r0562
$$ plain form
2155 2589950 2716425 2868699 3133809 3268452 3435299 3655327 3833275 4074005 4242716 4528827
2145 4528827 4939681 5180034 5491092 5952288 6573326 7139382 7721383 8150415 8701031 9449936
2135 9449936 10497201 11617104 13135653 15082735 17658747 20736381 24475105 29497892
2127 29497892 36369691 44234019 51575407 54146374 46402412 35167459 27161856 21944593
2119 21944593 18450598 15813627 13812580 12268869 10912577 9853821 8997757 8553687
2111 8553687 8028188 7676903 7342377 6790517 6152585 5609822 5205152 4849391 4597517 4325547
2101 4325547 4104367 3886976 3613063 3432196 3369382 3327292 3326454 3153647 2923327 2970747 2863295
2090 2863295 2712912 2722917 2615841 2427143 2350523 2195789 2130856 2112170 2055815 1976082 1885520
2079A885520m6051M4419o3630q5517M9822q2921r6450J1706o5193l7224J02836
2068A617317j93047j01249M5805K3244r3219j0657q5771n400m3516p3668L2638
2057A112477L1894m186j05040j8604k8263O8622O5657j07752m4879q1572L3358
2046I21712j7476R604J8263o3904L5563M6542n8130M3540k0620j45867l3163N3544
2034G89608l4283j22162N8319K2517O5988p4533K979j9802k6703j1768o067O4628
2022G08721p1309r406J4579m9303M1644m1469j2892l3664q2887R149L3484M1184
2010E47831o7648j2982N4607o6121k8460J4487K5967K3838L509p5647o9660L1056
1998C80777N2265p430j06347k7875O2112R5380m3487K0043n7127L5912n8891N1054
$$ plain form
2079 1885520 1839469 1883888 1820258 1734741 1784563 1701642 1605192 1616898 1551705 1514481 1617317
2068 1617317 1424270 1323021 1368826 1392070 1298851 1288194 1202423 1197023 1153507 1079839 1112477
2057 1112477 1144371 1140185 1035145 1016541 988278 1056900 1122557 1014805 969926 888354 921712
2046 921712 904236 913840 932103 868199 903762 950304 892174 935714 915094 769227 736064 789608
2034 789608 755325 633163 691482 713999 779987 705454 708433 688631 661928 650160 644093 708721
2022 708721 637412 628006 642585 593282 634926 593457 580565 546901 464014 473163 506647 547831
2010 547831 480183 467201 521808 455687 427227 441714 467681 491519 495028 419381 349721 380777
1998 380777 433042 425612 319265 291390 353502 448882 405395 425438 368311 404223 345332 396386
1986C96386J4555q7703l5201N1668l972P9073l1200m1605J5247M993J5077j637
1974C75681J8242j31266n2258N3702l006J10001l6751j75500l1996J42653J36073
1963D05575k0318k8284K6691l9596O904K4050k0313R8181l9747j03564q5056L1427
1951B55950o6000N2289q1407m23n024R3425l1575J0583k9686J5366N5220m4965
1939B23753p1Q323P1334N8697n5360o3442J13055l0940m7153p6875M6622M0232
1927B88175j7362k9011J3489j00039j6938l0429P2663N644K380J9137M724O7490
1915B79923J2924j11324L1427n132q1859K1336m5617J20705l798j51840P5803
1904A42548M7748M8670K4572p2319k1330N0596M9953j22998M471l0338j0819l0275
$$ plain form
1986 396386 410941 323238 288037 339705 335733 414806 383606 342001 357248 362241 377318 375681
1974 375681 393923 262657 210399 264101 261095 371096 334345 158845 126849 269502 405575
1963 405575 385257 356973 383664 344068 350972 375022 354709 452890 413143 309579 224523 255950
1951 255950 189950 242239 160832 160409 155385 248810 217235 227818 198132 213498 268718 223753
1939 223753 223682 232005 303339 362036 306676 243234 356289 325349 278196 201321 247943 288175
1927 288175 270813 241802 255291 155252 138314 107885 180548 186192 188572 207709 212433 279923
1915 279923 292847 181523 212950 207818 125959 147295 101678 222383 218585 66745 142548
1904 142548 190296 238966 263538 191219 169889 220485 270438 147440 151911 121573 110754 80479
1892H0479R2322l0589m0704J22451m0227l9593J9135k2643J7044j0972L1281q0189
1880I7795K9660J49316J321j10502p595n5647k9014j01665j1731Q6794l5411O8930
1868H2251l73K559N4627K3408P481R1439J8674o4834L0641K1379M3021j1098N4293
1855C53468M4274P445n1912p0616j13162J7926J12914m1221r9427o1465P1083
1844A69307J9023n78M7067N0001J3628p3299N3932m111j9816n5394n0444K8679
1832A77995o4706m5628p0914M6826Q0593R9711q6824q428R2288M2754m9162j16550
1820I7955M3071J1262k3405L9643Q6759K8426m2180o4174L2840P973j64624m7808
1808E738m290M8210J03108O7931l4337j4982n3781o1696O3070O5699k7610m2007
$$ plain form
1892 80479 172801 142212 101508 223959 183732 144139 163274 140631 157675 146703 177984 97795
1880 97795 127455 276771 278092 167590 159995 104348 75334 -26331 -38062 48732 13321 82251
1868 82251 81878 84437 139064 162472 169953 261392 280066 215232 245873 267252 310273 299175 353468
1855 353468 397742 405187 353275 282659 169497 187423 300337 259116 159689 98224 169307
1844 169307 188330 187752 234819 284820 298448 225149 279081 274970 255154 199760 149316 177995
1832 177995 113289 67661 -3253 43573 124166 223877 137053 128625 220913 263667 214505 97955
1820 97955 141026 152288 128883 168526 255285 283711 241531 177357 210197 218170 53546 5738
1808 5738 1448 49658 152766 220697 186360 171378 117597 55901 118971 184670 157060 115053
1796A15053J3333l6446p0761K8246L1483Q9814o3262j2311J07322j11539p4096
1785A6836L0639N2637K159N804M781O8737N240r824n1627p1134R3762r607k9592
1772A08811O1759N4107p8583q252m2470o68K5030m2453M6391l7471L3798K632
1760A22631n4645M8803p0635P8571p4383O3595o468K2066m2065J05179P3287j62350
1748A03586n0221M8841o2807O0764q8750l0462N8708q3472P9742O2133N4101j3842
1736A38321m060n4213N4965J9070j3062l0604M9512n4322J3226l2585R5745J8489
1724B00482q3794n2435k1576o9448L915P8200N7071o7135j0958P0908j0120K9648
1712A24758l6961N7605q5889k9565L0530o9964O1920j40553Q3135N4963L1736
$$ plain form
1796 115053 128386 91940 21179 49425 80908 170722 107460 95149 202471 90932 16836
1785 16836 47475 100112 102271 108075 112856 181593 186833 177009 125382 54248 148010 138403 108811
1772 108811 170570 224677 146094 137842 95372 94704 119734 77281 123672 86201 119999 122631
1760 122631 67986 116789 46154 124725 50342 113937 107469 129535 87470 192649 265936 103586
1748 103586 53365 102206 39399 100163 11413 -19049 39659 -43813 35929 98062 152163 138321
1736 138321 134261 80048 135013 154083 141021 110417 159929 105607 118833 86248 181993 200482
1724 200482 116688 64253 42677 -26771 -22856 55344 112415 45280 34322 105230 95110 124758
1712 124758 87797 145402 59513 29948 60478 -9486 52434 -88119 -4984 49979 81715
1701H1715q4685M751J27208j2951k9957l3826J15887J5627R336q1594j81287K3496
1689d6280J88633K8096r8594J4061K558r0711O6361J44832j33589o8187P4116
1678H1296L0676o9800O698J5270Q2056j6270j48188K428R8981L8329j04195M6727
1666F4008k9960l1601J9567p8761J51412M5308k4015o209l0345n2317k828L9833
1654F4092l8643L7707O5211q2239j82047R5210J1352m0843J70810J17830l0616
1643A87824n5776q8115J080n3639Q698L4402j2022J39112p8873M859J11492q755
1631A90287j56574n0294K1529K1176J864r8483M9177j3120L3542R6120l2170l1413
1619C1641l8568O6247J19146r0937k4062o5010j118l6208k3613Q941O6538M4744
$$ plain form
1701 81715 -2970 1781 128989 116038 86081 52255 168142 183769 193105 111511 -69776 -46280
1689 -46280 142353 170449 71855 85916 88474 -2237 64124 208956 75367 7180 81296
1678 81296 111972 42172 48870 64140 146196 129926 -18262 -15834 83147 121476 17281 64008
1666 64008 34048 2447 22014 -56747 94665 139973 115958 109749 79404 27087 24259 64092
1654 64092 25449 63156 128367 46128 -135919 -40709 -29357 -70200 100610 218440 187824
1643 187824 132048 43933 45013 -8626 72 34474 22452 161564 82691 87550 199042 190287
1631 190287 33713 -16581 4948 26124 27988 -70495 -21318 -34438 -896 95224 63054 31641
1619 31641 -6927 59320 178466 87529 63467 -1543 -2661 -38869 -62482 -53541 12997 57741
1607E7741M8332n1294l3286L1139n5102k432M7349l2797K3370N3625m8004L1330
1595F9971L6237N9035m9115j271k0002l2597J0473M7479r9880r4470L6274Q4898
1583D7032P4022o6582K4094j21123J11460R5292M911l8492q6776k0754J4571Q3028
1571A20683j25618q2523M3495J38453p0895l0884K7209n2178J09818k5680r20
1560E0960j9188J004k0525j4318Q6961o8605m1594L8134R495K0494m3364O011
1548E465L8959L6053j8614l3406P7914n658l4055L0271l5427r4721M4019N783
1536A6583j22817J00868R4078m5275k3462L3836L3285j6999l9088n507K0520M4817
1524I0839O187K8103m1472o2317k8355L2893M0005p905R2087l5677J6530m3588
$$ plain form
1607 57741 106073 54779 21493 52632 -2470 -4902 42447 9650 33020 86645 38641 69971
1595 69971 106208 165243 116128 114857 94855 62258 72731 120210 20330 -74140 -37866 47032
1583 47032 121054 54472 78566 -42557 68903 164195 169106 130614 43838 23084 37655 120683
1571 120683 -4935 -87458 -43963 94490 23595 -7289 19920 -32258 77560 51880 50960
1560 50960 31772 32776 12251 -2067 84894 16289 -25305 12829 22324 42818 -546 5465
1548 5465 44424 80477 61863 28457 106371 100713 66658 96929 61502 -33219 10800 16583
1536 16583 -106234 -5366 88712 43437 19975 53811 87096 70097 31009 25502 46022 90839
1524 90839 97026 125129 83657 21340 -7015 25878 65883 57978 150065 114388 130918 87330
1512H7330m1841j8063J01708K3587j58760N1202P9060o966K5931j5065p0349m0188
1500A7586N7100L7341k9603k3499J3178j6220k1722j3705j4298R3485J1470j7663
1488I3450O0536k08043l6502J0134J44522R530n2477L4763L9241n725k1429m8306
1476A9694j7509O2338n0058n7018n1596M1471J3484N4195J5091L5711l4156l8083
1464f436o380P2101Q849Q325l0126O329J5315l985q456m5546m2542L5782P9179
1451H2409K2024k7500K7938l7246o428K6813q669q3470l6477N7381J8702K1024
1439E6501j2938k2725N2897m7862L952N4647n4509k0211j4163k504J2649Q7076
1427I2810k7437n8665J0844L6876J1032Q436M0302p8390o9405l051k8845M0501
$$ plain form
1512 87330 45489 27426 129134 152721 -6039 45163 124223 117257 143188 128123 57774 17586
1500 17586 74686 112027 82424 58925 72103 55883 34161 20456 6158 99643 111113 93450
1488 93450 153986 -54057 -90559 -80425 64097 73627 21150 55913 95154 89429 68000 19694
1476 19694 2185 64523 14465 -42553 -94149 -52678 -39194 15001 30092 65803 31647 -6436
1464 -6436 -12816 59285 68134 76459 46333 52662 67977 63992 55536 9990 -32552 3230 82409
1451 82409 104433 76933 104871 67625 61197 88010 79341 -4129 -40606 16775 35477 56501
1439 56501 43563 20838 73735 25873 29825 84472 29963 9752 -4411 -6915 5734 92810
1427 92810 65373 6708 17552 54428 65460 73896 114198 35808 -33597 -36648 -65493 -24992
1415b4992O0119O2319o3614k3515o790O0076p4549l4416N4190m4324j06036K0492
1403a21040O7753n7824O0071J30180p7787j15518m2185P9360J03968J73J01344
1392A28495l1950l7315j2966l3266q2578J2894K9188L9702Q408j26015J15179
1381I776J9797r321j0786L4463l8282L951P8236L9042q1897J355J9474N424j7014
1368E4218k2781Q908j5803K422N3645k3818m3981J2351n7049L6210o2322R8570
1356D0570k7257j765k1434J4849m7233n5834J34587l9541j001N3711n977L9198
1344H2873q1035j19783K4100j5711O7623L0910N1775O4126m4682k0939n1702j2094
1332b4539L1079L0494l8901O4032j7325J05577l5176j18111Q074M3661l1093J5849
$$ plain form
1415 -24992 35127 97446 33832 10317 3527 63603 -10946 -45362 8828 -35496 -141532 -121040
1403 -121040 -53287 -111111 -51040 79140 1353 -114165 -156350 -76990 26978 27151 128495
1392 128495 96545 59230 46264 12998 -69580 -56686 -27498 12204 20612 -105403 9776
1381 9776 29573 20252 9466 43929 5647 9598 87834 126876 44979 46334 65808 71232 54218
1368 54218 31437 40345 24542 26964 80609 56791 12810 25161 -31888 4322 -58000 40570
1356 40570 13313 11548 -9886 4963 -42270 -98104 36483 -3058 -4059 49652 43675 82873
1344 82873 1838 -117945 -93845 -109556 -41933 -11023 40752 104878 60196 39257 -12445 -24539
1332 -24539 6540 37034 -1867 62165 44840 150417 115241 -2870 5204 48865 17772 33621
1320C3621q8538l5320P2777j2858J0630J21922l6735j00766j27562J34485J20474
1309I2130q2496m517J02194n2817l8147j1296L8576L0716l5364j6027j4583m5322
1297c6953p034O0533M6809L9099k06027J7311J4203n2939J30886N8860N5128n5241
1285F4635m8607q205l7770M1974l6014o0730k2717J99091o4043j572l0559m6457
1273e0974q423J0400K256P310J24302k69k5233m3993N181J28750L55p8878n6094
1260A4690M3294l829o2205R471j6309l6262J01229L1115k6828n6236K9930N0131
1248G8191n747j38658q4844O5328R7596k7978M104n8104J4190O4798N6511Q19
1236F6206k6973k8418L4823k9324J7865l6039j5065l3044J2632J5790J3164M3635
$$ plain form
1320 33621 -54917 -90237 -17460 -30318 -19688 102234 65499 -35267 -162829 -28344 92130
1309 92130 9634 5117 107311 54494 16347 5051 43627 74343 38979 22952 8369 -36953
1297 -36953 -43987 16546 63355 102454 -103573 -86262 -72059 -124998 5888 64748 119876 64635
1285 64635 16028 7823 -29947 12027 -23987 -84717 -107434 91657 27614 26042 -4517 -50974
1273 -50974 -59397 -48997 -46741 -39431 84871 84602 59369 15376 20557 149307 149662 70784 14690
1260 14690 57984 54155 -8050 1421 -14888 -51150 50079 81194 54366 -1870 28060 78191
1248 78191 72444 -66214 -151058 -85730 11866 -16112 -12008 -70112 -55922 8876 65387 66206
1236 66206 39233 10815 45638 16314 34179 -1860 -16925 -49969 -37337 -21547 -8383 35252
1224C5252j2788K3545j7866o3873l9017j1525p3054N7002N8416m4008J14728l8678
1212a1866r0373J40283o4078K2879n02L9092J2931k8540r365K0785P4416p257
1200I8405j7702k8046n4673j3631O3530J9003j37252j4718N107J1457J3880j7178
1188g1818N2281n2671K2456J02927n6217P792p1261J0829k3460L9041r478O9106
1176A9527k8974j27153J35992Q7555L1660j17872m1051N8856m6842L2248l2970
1165b9024j4075k888K1514K8595J3889q8690J41863k773l4394r8930n5666o98
1153a21277J55197J0768l5869j8648k1489R6217K7022p2960O784R377q1693R1153
1141D4582p8227K8550m1362O9866R771q8527M7777m3109J2646J68158r3599k1015
$$ plain form
1224 35252 22464 46009 28143 -35730 -74747 -86272 -159326 -102324 -43908 -87916 26812 -11866
1212 -11866 -102239 38044 -26034 -3155 -3657 35435 48366 19826 10461 31246 105662 98405
1200 98405 80703 52657 -2016 -15647 47883 66886 -70366 -85084 -79977 -68520 -54640 -71818
1188 -71818 -19537 -72208 -49752 53175 -3042 4750 -66511 -55682 -79142 -40101 -49579 19527
1176 19527 -9447 -136600 -608 86947 118607 735 -40316 18540 -28302 3946 -29024
1165 -29024 -43099 -45987 -24473 4122 18011 -70679 71184 68411 34017 -64913 -120579 -121277
1153 -121277 33920 44688 8819 -9829 -31318 64899 91921 18961 25745 35122 -46571 44582
1141 44582 -33645 -5095 -46457 23409 33180 -55347 -7570 -50679 -38033 130125 36526 15511
1129A5511r0524K2457O2947O564k7877m6509J00415m6580j39617K5948J01367
1118a5898M0846J5751K918p8043r3495J08605k4449P789k6053j7451k8535m0047
1106a48062L1350J2966R8264J6604P0121o8838m3923k6072L0727K911Q0071J4856
1094G0975n5058o6095m2163Q630o8830O0851Q0215m7454K8384M6547j04834O9864
$$ plain form
1129 15511 -75013 -52556 10391 16955 -10922 -57431 42984 -3596 -143213 -117265 -15898
1118 -15898 24948 40699 43617 -34426 -127921 -19316 -43765 -35976 -62029 -79480 -108015 -148062
1106 -148062 -116712 -103746 -5482 11122 81243 12405 -31518 -57590 -26863 -23952 56119 70975
1094 70975 15917 -50178 -92341 -83711 -152541 -91690 -11475 -58929 -30545 16002 -88832 -18968
$$ [...]
##END NTUPLES=NMR SPECTRUM
##END=
