##TITLE=1H_TG-2347-3
 CDCl3
 8 sc, 
 10.02.2022
##JCAMPDX= 6.0         $$ Bruker NMR JCAMP-DX V2.0
##DATA TYPE= NMR SPECTRUM
##DATA CLASS= NTUPLES
##ORIGIN= UXNMR, Bruker Analytische Messtechnik GmbH
##OWNER= root
$$ XWIN-NMR		Version 3.5
$$ Thu Feb 10 12:44:38 2022 Russian Standard Time (UT+4h)  she@DPX200
##.OBSERVE FREQUENCY= 200.131346
##.OBSERVE NUCLEUS= ^1H
##.ACQUISITION MODE= SIMULTANEOUS
##.ACQUISITION SCHEME= undefined
##.AVERAGES= 8
##.DIGITISER RES= 18
##SPECTROMETER/DATA SYSTEM= spect
##.PULSE SEQUENCE= zg30
##.SOLVENT NAME= CDCl3
##.SHIFT REFERENCE= (INTERNAL, CDCl3, 0, 15.7248)
##AUDIT TRAIL= $$ (NUMBER, WHEN, WHO, WHERE, WHAT)
$$ ##TITLE= Audit trail, XWIN-NMR		Version 3.5
$$ ##JCAMPDX= 5.01
$$ ##ORIGIN= Bruker BioSpin GmbH
$$ ##OWNER= she
$$ F:/spectra/data/she/nmr/H-F/1/pdata/1/auditp.txt
$$ ##AUDIT TRAIL=  $$ (NUMBER, WHEN, WHO, WHERE, WHAT)
(   1,<2022-02-10 12:42:44.60 +0400>,<she>,<DPX200>,
      <created by zg, POWCHK disabled, PULCHK disabled
       configuration hash MD5:
       00 E9 B6 7A A2 85 ED C7 34 08 36 98 17 FE 4E 26
       data hash MD5: 16K
       70 F2 25 1D 4B 98 87 DA 6D 14 38 49 8B A4 1C B2>)
(   2,<2022-02-10 12:42:52.06 +0400>,<she>,<DPX200>,
      <Start of raw data processing
       efp BC_mod = 2 LB = 0.24 FT_mod = 6 PKNL = 1 PHC0 = -16310.38 PHC1 = 13.00078 SI = 16K 
       data hash MD5: 16K
       F8 DB 05 D2 C8 57 9A C7 CD 70 6F 00 BB 23 43 89>)
(   3,<2022-02-10 12:43:20.64 +0400>,<she>,<DPX200>,
      <pk PHC0 = 80.39667 PHC1 = -1.2 
       data hash MD5: 16K
       87 F6 34 20 E2 5A 9A 4D 3B 69 40 0B F4 CC FA 8D>)
(   4,<2022-02-10 12:43:25.00 +0400>,<she>,<DPX200>,
      <abs ABSG = 5 
       data hash MD5: 16K
       A4 77 4C C9 0D EE 5A F6 F2 35 B5 D7 62 8F DA 39>)
$$ ##END=
$$ 
$$ hash MD5
$$ 58 3F 19 35 01 E4 70 C8 05 EC 19 7E E5 64 38 F4
##$RELAX= 
##$RELAX= 
##$RELAX= 
##$RELAX= 
##$RELAX= 
##$RELAX= 
$$ Bruker specific parameters
$$ --------------------------
##$DU= <F:/spectra>
##$EXPNO= 1
##$NAME= <H-F>
##$PROCNO= 1
##$TYPE= <nmr>
##$USER= <she>
##$AMP= (0..31)
100 100 100 100 100 100 100 100 100 100 100 100 100 100 100 100 100 100 
100 100 100 100 100 100 100 100 100 100 100 100 100 100 
##$AQSEQ= 0
##$AQ_mod= 1
##$AUNM= <au_zg>
##$AUTOPOS= <>
##$BF1= 200.13
##$BF2= 200.13
##$BF3= 200.13
##$BF4= 200.13
##$BF5= 200.13
##$BF6= 200.13
##$BF7= 200.13
##$BF8= 200.13
##$BYTORDA= 1
##$CFDGTYP= 0
##$CFRGTYP= 5
##$CHEMSTR= <none>
##$CNST= (0..31)
1 1 145 1 1 1 1 1 1 1 1 1 1 1 1 1 1 1 1 1 1 1 1 1 1 1 1 1 1 1 1 1 
##$CPDPRG= <>
##$CPDPRG1= <>
##$CPDPRG2= <>
##$CPDPRG3= <>
##$CPDPRG4= <mlev>
##$CPDPRG5= <mlev>
##$CPDPRG6= <mlev>
##$CPDPRG7= <mlev>
##$CPDPRG8= <mlev>
##$CPDPRGB= <>
##$CPDPRGT= <>
##$D= (0..31)
0 1.2 0 0 0 0 0 0 0 0.06 0 0.03 0 0 0 0 0.0002 0 0 0 0 0 0 0 0 0 0 0 0 
0 0 0 
##$DATE= 1644482563
##$DBL= (0..7)
120 120 120 120 120 120 120 120 
##$DBP= (0..7)
150 150 150 150 150 150 150 150 
##$DBP07= 0
##$DBPNAM0= <>
##$DBPNAM1= <>
##$DBPNAM2= <>
##$DBPNAM3= <>
##$DBPNAM4= <>
$$ [...]
##$SUBNAM2= <"">
##$SUBNAM3= <"">
##$SUBNAM4= <"">
##$SUBNAM5= <"">
##$SUBNAM6= <"">
##$SUBNAM7= <"">
##$SUBNAM8= <"">
##$SUBNAM9= <"">
##$SW= 18.0517287032376
##$SWIBOX= (0..15)
0 0 2 0 0 0 0 0 0 0 0 0 0 0 0 0 
##$SW_h= 3612.71676300578
##$TD= 16384
##$TD0= 1
##$TE= 0
##$TE2= 300
##$TE3= 300
##$TEG= 300
##$TL= (0..7)
0 120 120 120 120 120 120 120 
##$TP= (0..7)
150 150 150 150 150 150 150 150 
##$TP07= 0
##$TPNAME0= <>
##$TPNAME1= <>
##$TPNAME2= <>
##$TPNAME3= <>
##$TPNAME4= <>
##$TPNAME5= <>
##$TPNAME6= <>
##$TPNAME7= <>
##$TPOAL= (0..7)
0.5 0.5 0.5 0.5 0.5 0.5 0.5 0.5 
##$TPOFFS= (0..7)
0 0 0 0 0 0 0 0 
##$TUNHIN= 0
##$TUNHOUT= 0
##$TUNXOUT= 0
##$USERA1= <user>
##$USERA2= <user>
##$USERA3= <user>
##$USERA4= <user>
##$USERA5= <user>
##$V9= 5
##$VALIST= <valist>
##$VCLIST= <CCCCCCCCCCCCCCC>
##$VD= 0
##$VDLIST= <DDDDDDDDDDDDDDD>
##$VPLIST= <PPPPPPPPPPPPPPP>
##$VTLIST= <TTTTTTTTTTTTTTT>
##$WBST= 1024
##$WBSW= 4
##$XGAIN= (0..3)
0 0 0 0 
##$XL= 0
##$YL= 0
##$YMAX_a= 250216
##$YMIN_a= -422533
##$ZGOPTNS= <>
##$ZL1= 120
##$ZL2= 120
##$ZL3= 120
##$ZL4= 120
##$ABSF1= 15.69969
##$ABSF2= -2.35216
##$ABSG= 5
##$ABSL= 3
##$ALPHA= 0
##$AQORDER= 0
##$ASSFAC= 0
##$ASSFACI= 0
##$ASSFACX= 0
##$ASSWID= 0
##$AUNMP= <proc_1d>
##$AZFE= 0.1
##$AZFW= 0.1
##$BCFW= 0
##$BC_mod= 2
##$BYTORDP= 0
##$COROFFS= 0
##$CY= -3
##$DATMOD= 1
##$DC= 0
##$DFILT= <>
##$DTYPP= 0
##$F1P= 0
##$F2P= 0
##$FCOR= 1
##$FTSIZE= 16384
##$FT_mod= 6
##$GAMMA= 0
##$GB= 0
##$INTBC= 1
##$INTSCL= 0
##$ISEN= 128
##$LB= 0.24
##$LEV0= 0
##$LPBIN= 0
##$MAXI= 10000
##$MC2= 0
##$MEAN= 0
##$ME_mod= 0
##$MI= 1.114404
##$NCOEF= 0
##$NC_proc= -7
##$NLEV= 6
##$NOISF1= 3.799351
##$NOISF2= 2.8
##$NSP= 0
##$NTH_PI= 0
##$NZP= 0
##$OFFSET= 15.72485
##$PC= 1
##$PHC0= -16229.98
##$PHC1= 11.80078
##$PH_mod= 1
##$PKNL= yes
##$PPARMOD= 0
##$PSCAL= 0
##$PSIGN= 0
##$REVERSE= no
##$SF= 200.130005343895
##$SI= 16384
##$SIGF1= 3
##$SIGF2= 2
##$SINO= 5.538805
##$SIOLD= 16384
##$SREGLST= <1H.CDCl3>
##$SSB= 0
##$STSI= 16384
##$STSR= 0
##$SW_p= 3612.71676300578
##$SYMM= 0
##$S_DEV= 0
##$TDeff= 16384
##$TDoff= 0
##$TI= <>
##$TILT= no
##$TM1= 0
##$TM2= 0
##$TOPLEV= 0
##$USERP1= <user>
##$USERP2= <user>
##$USERP3= <user>
##$USERP4= <user>
##$USERP5= <user>
##$WDW= 1
##$XDIM= 16384
##$YMAX_p= 537843564
##$YMIN_p= -1627497
$$ End of Bruker specific parameters
$$ ---------------------------------
##NTUPLES= NMR SPECTRUM
##VAR_NAME=  FREQUENCY,     SPECTRUM/REAL,   SPECTRUM/IMAG
##SYMBOL=    X,             R,               I
##VAR_TYPE=  INDEPENDENT,   DEPENDENT,       DEPENDENT
##VAR_FORM=  AFFN,          ASDF,            ASDF
##VAR_DIM=   16384,         16384,           16384
##UNITS=     HZ,            ARBITRARY UNITS, ARBITRARY UNITS
##FACTOR=    0.220516191357247, 1,           1
##FIRST=     3147.01425467861, 0,            0
##LAST=      -465.702508327167, 0,           0
##MIN=       -465.702508327167, -1627497,    0
##MAX=       3147.01425467861, 537843564,    0
$$ Real data points
##PAGE= N=1
##DATA TABLE= (X++(R..R)), XYDATA
$$ [...]
7015F802613o5153k26903r6419j76326l22056j13944O5496k07633o9882l74475
7005E215318j73965m3346n4774P1205j04374N4100k08314k49409n5910k82340
6995D168191l0402O7040m8421j50936m1710p7404j51180J71137j62224p5936P2372
6984C740527k46453l70380l3248J83144J39530O7299j02031j6252n6589p4147
6974C231400j49536r9028J69495r6157m488R036r0200p3290M8707j32358J9159
6963B832740m1223l54732o0590k04911K14998Q1306J47635J72142M6579k19490
6953B614454j32004j0689j1663J5565p2693k57445n1976J53280J05363j75605
6943B176587J0122L0206j86873r7580M729J42906K35031j60370j61850K12362
$$ plain form
7015 6802613 6737460 6510557 6414138 6237812 5915756 5801812 5867308 5659675 5589793 5215318
7005 5215318 5041353 4998007 4943233 5014438 4910064 4964164 4755850 4506441 4450531 4168191
6995 4168191 4137789 4204829 4156408 4005472 3963762 3886358 3735178 3906315 3744091 3668155 3740527
6984 3740527 3494074 3123694 3090446 3273590 3413120 3480419 3378388 3362136 3305547 3231400
6974 3231400 3081864 2982836 3152331 3056174 3051686 3060722 2970522 2897232 2945939 2813581 2832740
6963 2832740 2791517 2436785 2376195 2171284 2386282 2467588 2615223 2787365 2833944 2614454
6953 2614454 2482450 2471761 2460098 2475663 2402970 2145525 2093549 2246829 2352192 2176587
6943 2176587 2186709 2216915 2030042 1932462 1937191 2080097 2315128 2154758 1992908 2205270
6933B205270j79588m8131J8446L2043r6160j7273p8771M095J7173J28421j32416
6922A853109j10825p9964J51361n6916o5614R4166o4222m3487L2084P1888j58752
6911A622828q8558J82800k6944m7633r7154K7841R2447l6961m4223r45O6413J8387
6899A668298k1920j29486L9281l1769J9300l1075l289J0836L1466P7259j98600
6888A430301k24666M2695r9075R2281L18636j66453j72394k1612R6666o009j06952
6877A183418P56m0230K32723m6372o6281J62704K1612m9343k5799J30696M3059
6866A546943j01949l0141O1641j11135r9884j3341L4762L7428O6112q7627j40494
6855A162315K1054m5921P77N5255j87308k0122N2822r828J32085N0402q9835k3286
$$ plain form
6933 2205270 2025682 1977551 1995997 2028040 1931880 1914607 1835836 1839931 1857104 1985525 1853109
6922 1853109 1742284 1662320 1813681 1756765 1691151 1785317 1721095 1677608 1709692 1781580 1622828
6911 1622828 1534270 1717070 1690126 1642493 1545339 1573180 1665627 1628666 1584443 1583498 1649911 1668298
6899 1668298 1646378 1516892 1556173 1524404 1543704 1512629 1509340 1520176 1551642 1628901 1430301
6888 1430301 1205635 1248330 1149255 1241536 1560172 1393719 1221325 1199713 1296379 1290370 1183418
6877 1183418 1184174 1143944 1376667 1330295 1264014 1426718 1448330 1398987 1373188 1503884 1546943
6866 1546943 1444994 1414853 1476494 1365359 1265475 1252134 1286896 1324324 1390436 1302809 1162315
6855 1162315 1183369 1137448 1138225 1193480 1006172 986050 1038872 1029044 1161129 1211531 1121696 1098410
6843A098410k2675p2933J01333K30743j61867k00070o9866N4875J91091J0727
6833A159768r5288M1093M1430k63314p1219J00651N0811r0129j44974J41616J42630
6822A013075K26510l454r7355p7147l1985O884J6280q631r2066J48906j56435
6811I44582l3841J72158n6509k6612j7995m9450n2750Q9369l3390n6600O7595
6800I46557L8384M7872J54429L6892Q9305j3571k54730J08857J57668N4924j46710
6789A219877k19834j27089J1181m0288j89647J16455L1390J05134J09592r4141
6779I22630R3340k9433j90979j1369m5878q448J34390m456J41487N4233l1443
6768A024074J51280P0279j36031j62978j22555P6610p9331J87181k22047n8652
$$ plain form
6843 1098410 1075735 1002802 1104135 1334878 1173011 972941 903075 957950 1149041 1159768
6833 1159768 1064480 1105573 1147003 883689 812470 913121 963932 873803 728829 870445 1013075
6822 1013075 1239585 1236131 1138776 1061629 1029644 1036528 1052808 1044177 952111 1101017 944582
6811 944582 910741 1082899 1026390 999778 981783 932333 879583 968952 935562 878962 946557
6800 946557 984941 1032813 1187242 1224134 1313439 1299868 1045138 1153995 1311663 1366587 1219877
6789 1219877 1000043 872954 884135 843847 654200 770655 802045 907179 1016771 922630
6779 922630 1015970 986537 795558 784189 738311 729863 864253 859797 1001284 1055517 1024074
6768 1024074 1175354 1245633 1109602 946624 824069 900679 821348 1008529 786482 727830
6758G27830J57738N8998J4494j78403n2076K36492P1201k20541J35650j69807
6748G81576p8482K15783l9545l8581q295R2281j58381K2915m2665p193K10036
6737I49449J04565m4032p725J05776n1919j57275L8956l9829M5413k056j07987
6726H33336J60174N2484r1831J7767L3227k4650J2558K7440j26177k3660k1998
6715H48670o8739J49531J45180j45116j02860J23302j2339J41287j10084p6021
6705H92811O6777K08515J13263o2815J13722j14216k4845J5242j6713J66102k0442
6694A337401o5037j97241M6157Q3493R7920r7608M2821J1517O0350J29707J55774
6683A605254r6780j68470K07513J10974j35433J08058J0134j72369o1689K46732
$$ plain form
6758 727830 885568 944566 959060 780657 728581 965073 1036274 815733 951383 781576
6748 781576 703094 918877 879332 840751 832456 924737 766356 789271 746606 739413 949449
6737 949449 1054014 1009982 1002257 1108033 1056114 898839 937795 897966 943379 941323 833336
6726 833336 993510 1045994 954163 971930 1005157 980507 993065 1020505 894328 870668 848670
6715 848670 779931 929462 1074642 929526 826666 949968 937629 1078916 968832 892811
6705 892811 959588 1168103 1281366 1218551 1332273 1218057 1193212 1208454 1191741 1357843 1337401
6694 1337401 1272364 1075123 1121280 1204773 1302693 1205085 1247906 1259423 1319773 1449480 1605254
6683 1605254 1508474 1340004 1547517 1658491 1523058 1631116 1641250 1468881 1407192 1653924
6673A653924m7649L0741K0187k45965L20473Q2226O7660l8097k09953l7934m6314
6662A549299r4152Q4411O4446r0400l37785P4729J35681M7144j02405L9430R5203
6651A465601j85370k21255K3739J05395J74389l7816j08406n6426l4210M9031
6641A174672k13211Q1327O1705J56377M1420j05898J6218J32409j33611o5776
6631A145632p0363p5623J43171q8074P3893J10392j12163K94500k35842J19781
6621A305304n0921K0496j3975j47339J31470R6524k11588j4714K49197p0941j17118
6610A176395j30391r4467O9326J66812m9976M0696k5502K5070N7878k5489j06975
6599A103377R4410J43245k69924q4524K49758k83175J60789J31542k4327N4251
$$ plain form
6673 1653924 1606275 1637016 1657203 1411238 1731711 1813937 1881597 1843500 1633547 1595613 1549299
6662 1549299 1455147 1539558 1604004 1513604 1175819 1250548 1386229 1433373 1330968 1370398 1465601
6651 1465601 1280231 1058976 1082715 1188110 1362499 1324683 1216277 1159851 1125641 1174672
6641 1174672 961461 1042788 1104493 1260870 1302290 1196392 1212610 1345019 1211408 1145632
6631 1145632 1075269 999646 1142817 1054743 1128636 1239028 1126865 1421365 1185523 1305304
6621 1305304 1254383 1274879 1260904 1113565 1245035 1341559 1129971 1115257 1364454 1293513 1176395
6610 1176395 1046004 951537 1020863 1187675 1137699 1178395 1152893 1177963 1235841 1210352 1103377
6599 1103377 1197787 1341032 1071108 986584 1236342 953167 1113956 1245498 1221171 1275422
6589A275422j45166Q2355l41354j21146J48696J39868m6439J12570k0262j76016
6579I08528Q8223k07145q3323J36540R8473j98514r462K22665L5656J3580j00023
6568I05198L2245J52890j7535J3138o4605m6137J88446J0448k14224J72228n2874
6557A079218l3097M0856j3908J0265n3832j3657l3769l49036P4832J3502J78439
6546H99813L5702J1246O7683K58572q0589l3294j7707J75605M2355k01018j99413
6535I58955K43333J14645l7805l022j70024j21110N0669J22451j36107k64960
6525G57025O6181J92234J50994K01556m6488j46243L0127P0186j01642n2612q1572
6514A039746J77660J06509j43495L0568k8675k63292L56745j07968K9631M5486
$$ plain form
6589 1275422 1130256 1212611 871257 750111 898807 1038675 992236 1104806 1084544 908528
6579 908528 996751 789606 706283 842823 941296 742782 733320 955985 991641 1005221 905198
6568 905198 937443 1090333 1072798 1085936 1021331 975194 1163640 1174088 959864 1132092 1079218
6557 1079218 1046121 1086977 1073069 1083334 1029502 1015845 982076 633040 707872 721374 899813
6546 899813 935515 946761 1014444 1273016 1192427 1159133 1141426 1317031 1359386 1158368 958955
6535 958955 1202288 1316933 1279128 1276106 1106082 984972 1035641 1158092 1021985 757025
6525 757025 823206 1015440 1166434 1367990 1321502 1175259 1205386 1275572 1173930 1121318 1039746
6514 1039746 1217406 1323915 1180420 1210988 1182313 919021 1275766 1167798 1197429 1242915
6504A242915o0795l0817J03517J3069R0757P2808j61019k9571J6268j3658k9869
6493A213605k1583M1504L4472J55135J9720m3632r8985l03323j17217J38676O6946
6482A085318p9303J20012J49435Q2561N1623r9385K0018M2300M2411P0344j20109
6471A365225q3559n886J15497l7962n5440p9731O5782n9399o6898K11199P794
6460A376622R425k66799N6964J19490j03393k0304L9382K20828l2127M9613J18680
6449A568381J04095J36885k36853q5092J3965l7901j04087O4295M5637Q3002Q6865
6438A639192P4613K8560P1807j96798j55259M61O7527K7965M5479K8624j40383
6427A491788r104Q5341O8254p6482n9184K46566n5929M339j89294Q9618j10491
$$ plain form
6504 1242915 1182120 1151303 1254820 1267889 1358646 1431454 1270435 1240864 1257132 1243474 1213605
6493 1213605 1192022 1233526 1267998 1423133 1442853 1399221 1300236 996913 879696 1018372 1085318
6482 1085318 1006015 1126027 1275462 1358023 1409646 1310261 1330279 1372579 1414990 1485334 1365225
6471 1365225 1281666 1275780 1391277 1353315 1297875 1218144 1283926 1224527 1157629 1368828 1376622
6460 1376622 1386047 1119248 1176212 1295702 1192309 1172005 1211387 1432215 1400088 1449701 1568381
6449 1568381 1672476 1809361 1572508 1487416 1501381 1463480 1359393 1423688 1469325 1552327 1639192
6438 1639192 1713805 1742365 1814172 1617374 1462115 1462576 1530103 1558068 1603547 1632171 1491788
6427 1491788 1482684 1568025 1636279 1559797 1500613 1747179 1691250 1695589 1506295 1595913 1485422
6416A485422N7346O7184P2042J38j07214P3958J57820l3687N0011L0488k68581
6405A584927L3311J01024j05848j10123J85764J31700K36127r2801J2562j33057
6395A843586m1639K8691P8853n7117j44353O7777j00775J58131J5514l4708J07508
6384A921468J8867J35826j02828j3671l0448O6015L4365j71680J49307J58387
6374B165608K11l0747j71321j32414P321L26764j62096J5466J92806M0372j14222
6363B137748o6870L0961K01324J2878L2961j17329Q8123P1291k5694j77040m5460
6352B142893j5414Q0682J35425J16758j10732j24286Q4380J9288k9493R0671J36931
6341B527103j42233j15484J63587J01655K01700k92428q041J70693m7617j47455
$$ plain form
6416 1485422 1542768 1609952 1681994 1682132 1574918 1648876 1806696 1773009 1823020 1853508 1584927
6405 1584927 1618238 1719262 1613414 1503291 1689055 1820755 2056882 1964081 1976643 1843586
6395 1843586 1801947 1830638 1909491 1852374 1708021 1775798 1675023 1833154 1848668 1813960 1921468
6384 1921468 1940335 2076161 1973333 1959662 1929214 1995229 2029594 1857914 2007221 2165608
6374 2165608 2165819 2135072 1963751 1831337 1838658 2165422 2003326 2018792 2211598 2251970 2137748
6363 2137748 2070878 2101839 2303163 2316041 2349002 2231673 2319796 2391087 2365393 2188353 2142893
6352 2142893 2127479 2208161 2343586 2460344 2349612 2225326 2309706 2328994 2299501 2390172 2527103
6341 2527103 2384870 2269386 2432973 2534628 2736328 2443900 2435859 2606552 2558935 2411480
6331B411480Q6708m9432O9384j22233r5953q5147j35602J26667K12835J02315
6321B521022j5055m1422P7967R1204j46434m7859R4266L8246J49452L18012N8208
6310C097607l03619j20433M9470j47161K86346j36929L3680J10453J33709L5200
6300C038323q4747N3592J48214j34098J30933q2979m9687r01k2737J0643J55688
6289C162244q7283J77774N9913K93343J24759J49204J05505J34710j16823L7866
6279D041212J19480r2403r9121j07144K1150J64102j9259J4525k70939P5324q3430
6268C763497Q4792J73933j35613P9777q5729J88547N9784J25525o568P4207J01903
6257D424055j13207j49886j01034J48855N5252k06341l0322r1272R7568n0105
$$ plain form
6331 2411480 2498188 2448756 2518140 2395907 2299954 2214807 2079205 2205872 2418707 2521022
6321 2521022 2505967 2464545 2542512 2633716 2487282 2439423 2533689 2571935 2721387 3039399 3097607
6310 3097607 2793988 2673555 2723025 2575864 2862210 2725281 2758961 2869414 3003123 3038323
6300 3038323 2953576 3007168 3155382 3021284 3152217 3069238 3019551 3018650 2995913 3006556 3162244
6289 3162244 3074961 3252735 3312648 3605991 3730750 3879954 3985459 4120169 4003346 4041212
6279 4041212 4160692 4068289 3969168 3862024 3883174 4047276 4028017 4042542 3771603 3846927 3763497
6268 3763497 3848289 4022222 3886609 3966386 3880657 4069204 4128988 4254513 4247945 4322152 4424055
6257 4424055 4310848 4160962 4059928 4208783 4264035 4057694 4027372 3936100 4033668 3983563
6247C983563j58888j08495N4451j3263P9242K33200p3201l1177Q6695k02693m5488
6236C803946k9870J42408K07981j18823j19450K1410R0265P313L1702J64496q3656
6225D117722J63369L6194m4620O6496K00924j00577O417J63500m9742o3177J0137
6214D506643J9089j8671K22196j63125J10485L283j16636J32733J02022L6009
6204D834028j53197M5591J5265J45068Q9198j1502k1397Q7j09546K97456j67959
6193D963092L6422P3604K29908K11363R8636n9508k86378J11970J67888O8901
6183E615898K06572R6979l98656N0382Q8950L5441j33212J22037J70053Q1912
6173E936356n2344J26201J92947j03094P0805Q4014j43011R7228J58683J06061
$$ plain form
6247 3983563 3824675 3716180 3770631 3757368 3836610 4069810 3996609 3965432 4052127 3849434 3803946
6236 3803946 3774076 3916484 4124465 4005642 3886192 3907602 3997867 4005180 4036882 4201378 4117722
6225 4117722 4281091 4317285 4272665 4339161 4540085 4439508 4445925 4609425 4559683 4496506 4506643
6214 4506643 4525732 4507061 4729257 4566132 4676617 4679900 4563264 4695997 4798019 4834028
6204 4834028 4680831 4726422 4741687 4886755 4975953 4964451 4943054 4943141 4833595 5131051 4963092
6193 4963092 4999514 5073118 5303026 5514389 5613025 5553517 5267139 5379109 5546997 5615898
6183 5615898 5822470 5919449 5520793 5571175 5660125 5695566 5562354 5684391 5854444 5936356
6173 5936356 5884012 6010213 6203160 6100066 6170871 6254885 6111874 6209102 6367785 6473846
6163F473846p6719l983n4190J37849J41129J4717J45032Q9902N0147J22045K7065
6152G066840l9727k5798K68294J93599J16518o3959J17586R3253k02148n4352
6142G470106K51807R8697K50625J51737Q405L21007J58693j14049j11325j3151
6132H472552O9874M6348J29810K6095M2356K38348k0699m1693j76789K60997J58201
6121I205400J11937L10323N6198j4992j00600j21740r479q7156K00578k2072K28588
6110I756985o2630J0830J76495O2821N0567n7802J80697J45553q6999K86547n68
6099A0462496J05818K20985J15906K53446P6581L2319J05856R9142K67259J6342
6089A1756150M7693L7870p0492J87641k6688j47865J51011J49898L24894L2695
$$ plain form
6163 6473846 6397127 6393144 6338954 6476803 6617932 6632649 6777681 6867583 6917730 7039775 7066840
6152 7066840 7027113 7001315 7269609 7463208 7579726 7515767 7633353 7726606 7524458 7470106
6142 7470106 7721913 7820610 8071235 8222972 8231377 8552384 8711077 8597028 8485703 8472552
6132 8472552 8542426 8588774 8718584 8744679 8787035 9025383 9004684 8962991 8786202 9047199 9205400
6121 9205400 9317337 9627660 9683858 9668866 9568266 9446526 9437047 9349891 9550469 9528397 9756985
6110 9756985 9694355 9705185 9881680 9944501 9995068 9937266 10117963 10263516 10176517 10463064 10462496
6099 10462496 10568314 10789299 10905205 11158651 11235232 11267551 11373407 11472549 11739808 11756150
6089 11756150 11803843 11841713 11771221 11958862 11932174 11784309 11935320 12085218 12410112 12442807
6079A2442807K1349N2333L23368J29117J11310K51842m45n1065l5036J55728K55727
6068A3657035M25064m3503Q8828K2539J55809M3569J51415L36146K98J20853J68537
6057A5126590K40802L52891O0316K66490L71234K31062J15734J65518L88467J40137
6047A7459241l52249J99295K66071K38753K68344K14930K02820L6012M32332J23927
6037A9089476R8748L87952K23782Q8175Q32J12949L1116J93099J4485J81583J48097
6026B0570294L22539l4884K63226J63462J29103J92236K01840J67997R8833r6968
6016B1977678L66885P2129K04394L16321o554K90655k1981R4589P5690L62196
6006B3732002L17909J38209L13563J58385R1560K32269L14990K73371J1421K98416
$$ plain form
6079 12442807 12464156 12516489 12839857 12968974 13080284 13332126 13331681 13280616 13245580 13401308 13657035
6068 13657035 14082099 14038596 14127424 14149963 14305772 14349341 14500756 14836902 14837200 14958053 15126590
6057 15126590 15367392 15720283 15780599 16047089 16418323 16649385 16765119 16930637 17319104 17459241
6047 17459241 17106992 17306287 17572358 17811111 18079455 18294385 18497205 18533217 18965549 19089476
6037 19089476 19188224 19576176 19799958 19888133 19888965 20001914 20033030 20226129 20240614 20422197 20570294
6026 20570294 20892833 20857949 21121175 21284637 21413740 21605976 21807816 21975813 22074646 21977678
6016 21977678 22344563 22416692 22621086 22937407 22930853 23221508 23199527 23294116 23369806 23732002
6006 23732002 24049911 24188120 24501683 24660068 24751628 24983897 25298887 25572258 25583679 25882095
5996B5882095J27731K43996J06146J20055L12808p5313J74030K80516J93369K31048
5986B7596481R3496J74298J21628L9527K33208L38812j18892j17805J79407M04220
5976B8944380K94726R6047N5680N9474K25582K83390J32694q5256K34309J97887
5966C0438913p1955J33195J5858q8883J63063j3075Q4796K77892J12958m4823
5956C1007939J87400J95953J73926J54189j01237K33849j12237p9261m4528k12448
5946C1403545P6381R6523j10095r9897J93080J37507R2083l4866j8179O5295m900
5935C1796477J7131O4503R8664K9830p237K08881K54908M3395j67555j46887R0841
5924C2282951j44023r9263j43109J32895p6478m3587k07861J20778q6390J12768
$$ plain form
5996 25882095 26009826 26253822 26359968 26480023 26792831 26717518 26891548 27172064 27365433 27596481
5986 27596481 27689977 27864275 27985903 28025430 28258638 28597450 28478558 28360753 28540160 28944380
5976 28944380 29239106 29335153 29390833 29450307 29675889 29959279 30091973 30006717 30241026 30438913
5966 30438913 30366958 30500153 30516011 30427128 30590191 30577116 30661912 30939804 31052762 31007939
5956 31007939 31195339 31391292 31565218 31719407 31618170 31852019 31739782 31660521 31615993 31403545
5946 31403545 31479926 31576449 31466354 31366457 31559537 31697044 31789127 31754261 31736082 31801377 31796477
5935 31796477 31813608 31878111 31976775 32006605 31999368 32208249 32463157 32506552 32338997 32192110 32282951
5924 32282951 32138928 32039665 31896556 32029451 31952973 31909386 31701525 31822303 31735913 31848681
5914C1848681l7127j55074K2094J23164O2382L57312K03291k3025J39442P7055
5904C2618195K48261K43420J10572K71175P4996N6975O5359j22669R3535Q8526
5894C3748345J99290K48369K93686R0755J68733L97436L70839O06428O61163N11690
5884C7296734O18004N45485N81385N01727Q74975R07721J414051J212154J210572
5875D5162808J328567J361611J745701J860287K433129K896294K948765K899751
5867F2636913K428567J269445N6841j298221j929013k175610j697972p07029p31915
5858E7852006p71252p99094j378935j822316j716419j519692j153459j443973
5850D7246866r63904p88244q93358n11231l10311m74627k45380k88374j20410
$$ plain form
5914 31848681 31811554 31656480 31678574 31801738 31864120 32221432 32424723 32401698 32541140 32618195
5904 32618195 32866456 33109876 33220448 33491623 33566619 33623594 33688953 33566284 33659819 33748345
5894 33748345 33947635 34196004 34489690 34580445 34749178 35146614 35517453 36123881 36785044 37296734
5884 37296734 37914738 38460223 39041608 39543335 40418310 41326031 42740082 43952236 45162808
5875 45162808 46491375 47852986 49598687 51458974 53892103 56788397 59737162 62636913
5867 62636913 65065480 66334925 66391766 65093545 63164532 60988922 59290950 58583921 57852006
5858 57852006 57080754 56281660 54902725 53080409 51363990 49844298 48690839 47246866
5850 47246866 46282962 45494718 44601360 44090129 43779818 43305191 43059811 42771437 42651027
5841D2651027j77078m53408k45738j17804l8654J05603J43787J32780K40754L51157
5831D2592426m4255K69242O75182N27108N55475O88031O30714M88830K84428M01782
5821D7068963M43063K49120L14845M61225O83381Q81079J427132J871113K520506
5812E5920427L127707L136027K407165M57073j351832k415799k198024j405208
5804E7677536o27379J20345K83503M88856N76077P06753J043094J506530J809534
5795F3584849K007810K083942K008592K203354K173739K090786J745898R69576
5787G8868546N37489k20283o61955j289075j891620j856093j583681j662285j263365
5778F8977678j086043j462647j546908j120620r14663q80773n60934n15716o85706
$$ plain form
5841 42651027 42473949 42020541 41774803 41656999 41618345 41723948 41867735 42000515 42241269 42592426
5831 42592426 42548171 42817413 43492595 44019703 44575178 45263209 45893923 46382753 46667181 47068963
5821 47068963 47512026 47761146 48075991 48537216 49220597 50101676 51528808 53399921 55920427
5812 55920427 59048134 62184161 64591326 65048399 63696567 61280768 59082744 57677536
5804 57677536 57050157 57170502 57454005 57942861 58518938 59225691 60268785 61775315 63584849
5795 63584849 65592659 67676601 69685193 71888547 74062286 76153072 77898970 78868546
5787 78868546 79406035 79185752 78523797 77234722 75343102 73487009 71903328 70241043 68977678
5778 68977678 67891635 66428988 64882080 63761460 62846797 61966024 61405090 60889374 60203668
5769F0203668l92845j61716k35400j83379j13943j94249k55207n41252o00541
5760E7525136n78624r81918j398055j261592j289369j290720j129510j192368
5752D8402980r95068q04394n51300m09657k19904m5733J3328q1764R7165L25672
5742D5731325M91512N24036P30272R80628J080326J473067J599795J775250J430010
5733E5816221J537608J678911J431277J427910R30472R58470R01549Q99476O03708
5724F6185602P32386L56393K65128O56647M85740M27355J72249L87330M89850
5715G0158680O99856J066426J301277J170065R81450P04548O62775P40605J036182
5706G8521864J246447J362741J512756J354615O09545m89272j538628k826752
$$ plain form
5769 60203668 59810823 59649107 59413707 59230328 59116385 58922136 58666929 58125677 57525136
5760 57525136 56946512 55964594 54566539 53304947 52015578 50724858 49595348 48402980
5752 48402980 47407912 46603518 46052218 45642561 45422657 45376924 45390252 45308488 45405653 45731325
5742 45731325 46222837 46746873 47477145 48457773 49538099 51011166 52610961 54386211 55816221
5733 55816221 57353829 59032740 60464017 61891927 62822399 63780869 64682418 65581894 66185602
5724 66185602 66917988 67274381 67539509 68196156 68681896 69109251 69281500 69668830 70158680
5715 70158680 70858536 71924962 73226239 74396304 75377754 76082302 76745077 77485682 78521864
5706 78521864 79768311 81131052 82643808 83998423 84607968 84118696 82580068 79753316
5698G9753316l541970l582066l693554l677943l276564k883651k273498j753559
5690E5070511j585188j283213j123042o52843n92688l07335k52053l32633k92344
5681D8649172O0476L4915K39730L67301K47423M99760N17995L49059K09414P4161
5671E1249406L21798k04695q35474p02542j181018j466121j217435j303859j137848
5662D3522212p81153j024462q56514n77242k70210j82331k9756j40833J01900
5653C9761611J38501Q5162K58040j44319q0599j41850j52156j21622j26962l28260
5643C9147546l50428l41561p93478n29395l06065k52553j87270n1773l94717r3669
5633C5846637J02327P7845P6225p6678K65937K2454l45921k98119q7098l6339
$$ plain form
5698 79753316 76211346 72629280 68935726 65257783 61981219 59097568 56824070 55070511
5690 55070511 53485323 52202110 51079068 50426225 49833537 49526202 49274149 48941516 48649172
5681 48649172 48709648 48744563 48984293 49351594 49599017 50098777 50616772 50965831 51175245 51249406
5671 51249406 51571204 51366509 50531035 49828493 48647475 47181354 45963919 44660060 43522212
5662 43522212 42741059 41716597 40860083 40282841 40012631 39830300 39800544 39659711 39761611
5653 39761611 39900112 39985274 40243314 40098995 40018396 39876546 39724390 39602768 39475806 39147546
5643 39147546 38797118 38455557 37662079 37132684 36826619 36574066 36386796 36335023 35940306 35846637
5633 35846637 35948964 36026809 36103034 36026356 36292293 36314747 35968826 35670707 35583609 35547270
5623C5547270n20354o65738n89577o08951o44882m15236n11423l79345k09923
5614C1001841l68580k48714k27314n28627k07430l46094o43604n24039m85059
5605B7422380n65638n47324m56368n43323o25087l35552o51801n56981k80511
5596B2859795m62393m90922l65532j93676m31843L0037n6845l46200j11733p7191
5586B0353497P4539j70269j10945m03318l66902m41006p7115k24990k99682m168
5576A8329641j94758K61358o8674M1010M29282N12705O25236P54488M81096J237985
5566B2409369J343430J612824J851183K137669L239019M141380L993208K504956
5558D3233038q16675l812964n365282n307465l876315k700735j591672j169515
$$ plain form
5623 35547270 35026916 34361178 33771601 33162650 32517768 32102532 31591109 31211764 31001841
5614 31001841 30633261 30384547 30157233 29628606 29421176 29075082 28431478 27907439 27422380
5605 27422380 26856742 26309418 25853050 25309727 24684640 24349088 23697287 23140306 22859795
5596 22859795 22397402 21906480 21540948 21347272 20915429 20945466 20888621 20542421 20430688 20353497
5586 20353497 20428036 20257767 20146822 19743504 19376602 18935596 18858481 18633491 18333809 18329641
5576 18329641 18134883 18396241 18327567 18368577 18797859 19310564 19935800 20690288 21171384 22409369
5566 22409369 23752799 25365623 27216806 29354475 32593494 36734874 40728082 43233038
5558 43233038 42416363 38603399 33238117 27930652 24054337 21353602 19761930 18592415
5550A8592415j088157p83260p12642m85487k59121m60575l28306l64718L863L5533
5540A4149545l0620R6929j23816J62123K95367L28259M62351O94229P52554P08597
5530A7495518O51509l3460k58290m26977o37594k85929m95590k48204m58812m57877
5520A4844294j12954L1311L98449M87506O39418J069600J050185J77415j129958
5511A7455266j454095j873235j421635n24564p21146m35984m31503o4308k31323
5502A0297473j80364j96204o6769l2536p5356j12585j97069l24141O4575r72J31077
5491I307129K605j07811k15652j11058K1524p6185P7843j39464q5445M3438J40904
5480H857828r3582J08184J96364J37031j34623K82950L82753N08016L44086M48276
$$ plain form
5550 18592415 17504258 16720998 16008356 15522869 15263748 14803173 14474867 14110149 14114012 14149545
5540 14149545 14118925 14215854 14092038 14254161 14549528 14877787 15340138 16034367 16786921 17495518
5530 17495518 18147027 18113567 17855277 17428300 16790706 16504777 16009187 15760983 15302171 14844294
5520 14844294 14731340 14762651 15161100 15648606 16288024 17357624 18407809 18585224 17455266
5511 17455266 16001171 14127936 12706301 12181737 11460591 11024607 10593104 10528796 10297473
5502 10297473 10117109 9920905 9854136 9821600 9746244 9633659 9436590 9112449 9177024 9176052 9307129
5491 9307129 9309734 9201923 8986271 8875213 8896737 8820552 8898395 8758931 8673486 8716924 8857828
5480 8857828 8764246 8872430 9068794 9205825 9071202 9354152 9736905 10244921 10589007 11037283
5470A1037283O66522Q27100P40689P68929L54090l55558r12392j186370r74539
5461A0965754o89165m85308k16930M8530k32104j47271j25346j72418J12002j57384
5451H900360j67748J16190j73965j03057j6710M058j05070j0504R9151Q7097J54363
5440H784165Q7909J0385J71878J59918J08124L10262k1141j98352o5895k29810
5430I117443K5631j17533k65639N7845l8k37483o5822L52798r1043j29989K50523
5419H896693R2903J93219J01404L94348M56155J93593K19701L04160O35059L26540
5409A1813775M93757R55656P76911R76943J184904P83599K39997J55574l7772
5400A7343344k06684p8614J09023J79888K02773J78895J37195K46730O9309n1067
$$ plain form
5470 11037283 11703805 12530905 13271594 14040523 14394613 14039055 13126663 11940293 10965754
5461 10965754 10276589 9791281 9574351 9622881 9390777 9243506 9118160 8945742 9057744 8900360
5451 8900360 8732612 8848802 8674837 8571780 8555070 8559128 8454058 8443554 8542705 8629802 8784165
5440 8784165 8872074 8882459 9054337 9214255 9322379 9632641 9611500 9413148 9347253 9117443
5430 9117443 9143074 9025541 8759902 8817747 8817709 8580226 8514404 8867202 8776159 8646170 8896693
5419 8896693 8989596 9182815 9284219 9678567 10134722 10328315 10548016 10852176 11487235 11813775
5409 11813775 12307532 13263188 14040099 15017042 16201946 16985545 17225542 17381116 17343344
5400 17343344 17136660 17058046 17167069 17346957 17549730 17728625 17865820 18112550 18181859 18130792
5390A8130792K16255K86820Q5951M31393K65754M76669M67904O0904k34323n82295
5380A9605824n17946o76852j004797r34504n83016p03892n72048m16676k98502
5371A3897591k63116k99605m69680m79643p41662n93169o61978n68959m23714
5362I396065m25840m31850k93464k35817k88883l0989P9857j79600k9141j59264
5352G401074k75091j97063p2081J36381o6828l3138o1672J34494J9776l5517k34983
5341F715352M3561j33591r9638k10959j63693R0226n4366k8137q5447j97144j68597
5330E707567j35525j54125N3915J2267l3520p542k62J65890J5788j94756K72252
5319E701949r1021n1462j51673j87405r7895j81784Q8645l6040j21583O5671j19970
$$ plain form
5390 18130792 18347047 18633867 18719818 19151211 19416965 19893634 20361538 20422442 20188119 19605824
5380 19605824 19087878 18411026 17406229 16471725 15888709 15184817 14612769 14196093 13897591
5371 13897591 13634475 13334870 12865190 12385547 11643885 11050716 10388738 9819779 9396065
5362 9396065 8970225 8538375 8244911 8009094 7720211 7689222 7769079 7589479 7560338 7401074
5352 7401074 7125983 6928920 6856839 6993220 6926392 6893254 6831582 6966076 6985852 6950335 6715352
5341 6715352 6758913 6625322 6525684 6314725 6151032 6241258 6186892 6158755 6073308 5876164 5707567
5330 5707567 5572042 5417917 5471832 5484099 5450579 5443037 5442775 5608665 5624453 5429697 5701949
5319 5701949 5610928 5559466 5407793 5220388 5122493 4940709 5029354 4993314 4871731 4937402 4817432
5308D817432j47554j62206o173L1947O0821l0086p712n2206k46022j48259J58836
5297D268818O2706j63971N7857m324r7434L3634k7636j35749R6225J07612L545
5286D201283J9290m8764l0719Q7506j01714j94352p1022j44290q2022K38246J25752
5275C999194j59601j01732M257J25953K6233k03930j26244j87011K75683l159
5265C649643m13L5247n0568k01595R1497J82058j84199J12808J61255K7499J4582
5254C837814j5993J54357K45177p2824J35737L49112L75767L77544M37074N92419
5244F416184O96721J017111O98779N26774k95410r99360j176837r26745o37251
5235E319966n95336j31452j9333k51384j72865L947j16880k29874j62074l1291
$$ plain form
5308 4817432 4669878 4507672 4501499 4533446 4594267 4564181 4556469 4504263 4258241 4109982 4268818
5297 4268818 4331524 4167553 4225410 4221086 4123652 4157286 4129650 3993901 4090126 4197738 4201283
5286 4201283 4220573 4171809 4141090 4228596 4126882 3932530 3861508 3717218 3635196 3873442 3999194
5275 3999194 3839593 3737861 3742118 3868071 3894304 3690374 3564130 3377119 3652802 3649643
5265 3649643 3649230 3684477 3633909 3432314 3523811 3705869 3521670 3634478 3795733 3823232 3837814
5254 3837814 3821821 3976178 4221355 4148531 4284268 4633380 5009147 5386691 5823765 6416184
5244 6416184 7112905 8130016 8828795 9355569 9060159 8060799 6883962 5957217 5319966
5235 5319966 4724630 4593178 4573845 4322461 4149596 4153543 4036663 3806789 3644715 3613424
5225C613424J27157j2488k4520r275K25421J69817j18103k08078m8219o8152j34954
5214C512030k02381n8359J61862j5298k1206k42912j88120J27425J63929j4675
5204C222295j33928p649j31765n0936p5833k36855L45532J73015j9648l13500
5194B770728K791Q3513P8325J5044k03999J40854k11501r3017r3761m2607j0940
5183B435430K4650M8359Q8262K09562j37154P0284K05625K9323k3787J12420n4906
5172C008068j19050k7387j17823j46330K1263O6427J34728k83977J43048K42285
5162B921252q7017P5323j04802j37025J04499l5174m5769q2045J79084n7695j96333
5151B534298q3440j9194J83795N8408N981K9945r7803q7267p6703k6077q4678
$$ plain form
5225 3613424 3740581 3728093 3703573 3694298 3919719 4089536 3971433 3763355 3715136 3646984 3512030
5214 3512030 3309649 3251290 3413152 3397854 3376648 3133736 2945616 3073041 3236970 3222295
5204 3222295 3088367 3080718 2948953 2898017 2822184 2585329 2930861 3103876 3084228 2770728
5194 2770728 2773519 2857032 2935357 2950401 2746402 2887256 2675755 2582738 2488977 2446370 2435430
5183 2435430 2460080 2508439 2596701 2806263 2669109 2739393 2945018 2974341 2950554 3062974 3008068
5172 3008068 2889018 2861631 2743808 2597478 2618741 2685168 2819896 2535919 2678967 2921252
5162 2921252 2834235 2909558 2804756 2667731 2772230 2737056 2691287 2609242 2788326 2730631 2534298
5151 2534298 2450858 2431664 2615459 2673867 2679848 2709793 2611990 2524723 2448020 2421943 2337265
5140B337265N7240q0460J41554Q6411K5715L4347P8580k77571k79235N0690Q7267
5129B261803K73182O7109J14486K9720j32821j45087j77312K64526J92614m5194
5119B703026K26003N2253K4214l9102J4206k81679M2246J7113j45417j00248O2407
5108B575022K2705J23374J56926Q9492j42266L8498l319j82835j15735J2411r0769
5097B483504J37022n1463j86774m7782J54178K42933K1674O6802r5544J03094
5087B827644j27889J39930K72467r5146k6668o5543J35535Q4695l2991j20645
5077B991389k20316j51253k3289L768Q0785J67563j1985j29019j66766K2679k9170
5066B534386l2150P8333P1235j50204J09164M6110R8872M497l99064J80571N9630
$$ plain form
5140 2337265 2394505 2314045 2455599 2542010 2567725 2602072 2680652 2403081 2123846 2174536 2261803
5129 2261803 2534985 2602094 2716580 2746300 2613479 2468392 2291080 2555606 2748220 2703026
5119 2703026 2929029 2981282 3005496 2966394 2980600 2698921 2741167 2758280 2612863 2512615 2575022
5108 2575022 2597727 2721101 2878027 2967519 2825253 2863751 2860432 2677597 2561862 2574273 2483504
5097 2483504 2620526 2569063 2382289 2334507 2488685 2731618 2753292 2820094 2724550 2827644
5087 2827644 2699755 2839685 3112152 3017006 2990338 2924795 3060330 3145025 3112034 2991389
5077 2991389 2771073 2619820 2596531 2600299 2681084 2848647 2836662 2707643 2540877 2563556 2534386
5066 2534386 2502236 2580569 2651804 2501600 2610764 2656874 2755746 2760243 2361179 2541750 2601380
5055B601380K6461Q8570m8303P8019K6491j98531l05908J01979K01427P6575J3667
5044B661827j61841J36991j7769K7166K4569j42147L2199J8577r4707j9J0681
5033B495527J02485L0040r4285M4615J13514J1773K225K24619P9636k18171j27224
5022B664754L2922j01704j5608M0803r5028M4833k09393J41783L22342k484J11215
5011B934435n7941n3971P1887J75327j9482J9316r6050J0926j21865M9671J83896
5000C096149o2684L6253K8235J09113L14872j95351j18034J17803j30540j40400
4990C055416k36762O713J58258K23174q8506J50470J41038M2877M3615j32753
4980C363540J10392q3496j93168K3175K44299J59632k0951l6244P5109Q6173p3556
$$ plain form
5055 2601380 2627841 2716411 2668108 2746127 2772618 2574087 2268179 2370158 2571585 2648160 2661827
5044 2661827 2499986 2636977 2619208 2646374 2670943 2528796 2560995 2579572 2484865 2484846 2495527
5033 2495527 2598012 2628052 2533767 2578382 2691896 2703669 2705894 2930513 3010149 2791978 2664754
5022 2664754 2697676 2595972 2580364 2621167 2526139 2570972 2361579 2503362 2825704 2823220 2934435
5011 2934435 2876494 2822523 2894410 3069737 3050255 3069571 2973521 2984447 2862582 2912253 3096149
5000 3096149 3033465 3069718 3097953 3207066 3521938 3326587 3208553 3326356 3195816 3055416
4990 3055416 2818654 2825367 2983625 3206799 3118293 3268763 3409801 3452678 3496293 3363540
4980 3363540 3473932 3390436 3197268 3220443 3464742 3624374 3603423 3567179 3642288 3728461 3654905
4969C654905M618J94284J38964k2057k6043J13565O8253J17570Q6529r2767k8893
4958D208928l1978J99768K04169L2875L4795J88584l4202J0987K04116m2975K85810
4947E260877R7336R1480K16579J65064L42387K48900l0887K24196L54078M48331
4937G418341L96468K55465M67378L07565N42961M29371L28880O22522O25239N70671
4927A1964861M33406N98007K48866J03539J90310R8344J0486K11798Q2149k84191
4917A3657575j72315J86282Q5481m5961J78197O5539j2713p1817K4487L4998m88071
4906A3441682m90966l52365n43976l06328p30301m60516L8688l93587m67419m06231
4896I328681m0701K8326k62154K1390j35304j21754L42j19223j2253k96698J3946
$$ plain form
4969 3654905 3659523 3853807 3992771 3970714 3944671 4058236 4126489 4244059 4330588 4237821 4208928
4958 4208928 4176950 4376718 4580887 4613762 4648557 4837141 4802939 4813926 5018042 4975067 5260877
4947 5260877 5358213 5449693 5666272 5831336 6173723 6422623 6391736 6615932 6970010 7418341
4937 7418341 7814809 8070274 8537652 8845217 9388178 9817549 10146429 10768951 11394190 11964861
4927 11964861 12398267 12996274 13245140 13348679 13538989 13637333 13647819 13859617 13941766 13657575
4917 13657575 13485260 13671542 13757023 13711062 13889259 13954798 13942085 13870268 13894755 13929753 13441682
4906 13441682 12950716 12598351 12054375 11748047 11017746 10557230 10595918 10202331 9734912 9328681
4896 9328681 9287980 9316306 9054152 9075542 8940238 8818484 8818826 8699603 8687350 8390652 8404598
4885H404598L5721N1160k2933j77241M7588L0088N6749R6305K85725J44558J45387
4874I097705L47189K09451J90184M10163M42346L89670M26339M71269M50730O77455
4864A3112501P28552O61168L99096O46927N66231M47351M20686M53524J0625L263
4854A7449924J19691j57949M8919k98525n0886o1833k99475q9654L8719j21905
4844A6577026j00961l27869m04342m62213n47769n22681p61122o79619n98128
4835A2172322n70540l60479m86819n59155r7686j40778o14903l21970j71381l53489
4825H495122j68648k36679k48750J0396j6852k17932P5050q3994k86360j00157
4815G221196l2589j8215K4876J61721o2677l22048q6058J03539N7377j45066k93590
$$ plain form
4885 8404598 8440319 8491479 8468546 8291305 8338893 8368981 8425730 8522035 8807760 8952318 9097705
4874 9097705 9444894 9654345 9844529 10254692 10697038 11086708 11513047 11984316 12435046 13112501
4864 13112501 13841053 14502221 14901317 15548244 16114475 16561826 16982512 17436036 17446661 17449924
4854 17449924 17569615 17411666 17460585 17162060 17111174 17049341 16749866 16660212 16698931 16577026
4844 16577026 16476065 16148196 15743854 15281641 14733872 14211191 13450069 12770450 12172322
4835 12172322 11601782 11241303 10754484 10195329 10097643 9956865 9341962 9019992 8848611 8495122
4825 8495122 8326474 8089795 7841045 7851441 7834589 7616657 7691707 7607713 7321353 7221196
4815 7221196 7188607 7170392 7195268 7356989 7294312 6972264 6886206 6989745 7047122 6902056 6608466
4804F608466j3699L26156j21373k02145Q4862J14859K35195J14616R0948J38107
4794G375992K7348J0186J9552P7652K23450K12295M18810K79848N152L66315O4897
4783I081497M18146L31695M19899L91508L39384M93757L70759N63844J84386J52346
4773A2747221M6390j02686l7523j43029P7606K28394K8335N8175M4876j31340
4763A2816419J85045j44577n0580j82189k81217l8758m73303m80115m68408j73938
4753A0708379l28345j31713l17528q3358P5381j06882j57998j7340J00514m27
4743I740683J7582K93307R6018J8859j08497P2739L96668L12079L20115L89584
4733A1549137L86761M35488N19824L93909L93633Q21025Q14129N90443P04533
$$ plain form
4804 6608466 6594767 6920923 6799550 6597405 6682267 6797126 7032321 7146937 7237885 7375992
4794 7375992 7403340 7413526 7433078 7510730 7734180 7946475 8365285 8645133 8650285 9016600 9081497
4783 9081497 9499643 9831338 10251237 10642745 10982129 11475886 11846645 12410489 12594875 12747221
4773 12747221 12793611 12690925 12653402 12510373 12587979 12816373 12844708 12902883 12947759 12816419
4763 12816419 13001464 12856887 12806307 12624118 12342901 12304143 11830840 11350725 10882317 10708379
4753 10708379 10380034 10248321 9930793 9847435 9922816 9815934 9657936 9640596 9741110 9740683
4743 9740683 9758265 10051572 10147590 10166449 10057952 10130691 10527359 10839438 11159553 11549137
4733 11549137 11935898 12371386 12891210 13285119 13678752 14499777 15313906 15904349 16608882
4724A6608882Q38335N15487L51930L65622J32165J91811k38990l86337j56929
4715A8221976J02260L4670p3923j13413q7371K49970L79181R0939m7756M7400
4705A8803933n2770k95674p91909l82887o36459r23853m29102l09508j86339o62044
4695A4133388k89773l51016l13376j1476p9949J94147Q7784k5826j75388M1852
4685A3210367J93333R3204K5627J10502J94218L41120L08354K40119L70602K28327
4675A5315773J56907J93902J23835J03721M6208j08730j2761q5328q5929J58165
4665A5805763J66223J13244L02135q1778k3333k6418m94596l28286m33694l7368
4655A4961892l38993n66574n82684m90429j26798j47373k78478l6709q5606k92723
$$ plain form
4724 16608882 17447217 17962704 18314634 18680256 18812421 19004232 18765242 18378905 18221976
4715 18221976 18324236 18358906 18284983 18171570 18084199 18334169 18713350 18804289 18756533 18803933
4705 18803933 18751163 18455489 17663580 17280693 16644234 15720381 15291279 14981771 14795432 14133388
4695 14133388 13843615 13492599 13179223 13167747 13087798 13281945 13369729 13343903 13168515 13210367
4685 13210367 13403700 13496904 13522531 13633033 13827251 14168371 14476725 14716844 15087446 15315773
4675 15315773 15472680 15666582 15790417 15894138 15940346 15831616 15818855 15733527 15647598 15805763
4665 15805763 15971986 16085230 16387365 16305587 16282254 16255836 15761240 15432954 14999260 14961892
4655 14961892 14622899 14056325 13473641 12983212 12856414 12709041 12430563 12393854 12308248 12015525
4645A2015525M0568j40142k10646j47036J69905k5436K5948j2227K1065O1526
4635A1799050P2245R8865L39558K77793K8263K79042K97160K32873M61487L89509
4625A4275845L79791M46265M24762N95019N75925O41579P73760R27353O66886
4616A9707185Q37233J179043J099464J208720R61501Q70550J289483Q42063Q57663
4607B8852905Q31274M33001M59910N09529J18483J40430k06851n37798l74599
4598C0226284p01835q58798j230159r83434q30465r81640j021781r25105r28435
4589B1764632p49828p76589p88434m91889l94920l96023j74920j10183k81457
4580A7600389k03346k09373p2956K2300J6080J63598N3936K29997L52048J61786
$$ plain form
4645 12015525 12056093 11915951 11705305 11558269 11728174 11702738 11728686 11716459 11737524 11799050
4635 11799050 11871295 11970160 12309718 12587511 12615774 12894816 13191976 13424849 13886336 14275845
4625 14275845 14655636 15101901 15526663 16121682 16697607 17339186 18112946 19040299 19707185
4616 19707185 20544418 21723461 22822925 24031645 24993146 25863696 27153179 27995242 28852905
4607 28852905 29684179 30117180 30577090 31086619 31205102 31345532 31138681 30600883 30226284
4598 30226284 29524449 28665651 27435492 26452058 25621593 24639953 23618172 22693067 21764632
4589 21764632 21014804 20238215 19449781 18957892 18562972 18166949 17992029 17881846 17600389
4580 17600389 17397043 17187670 17114714 17137014 17153094 17316692 17370628 17600625 17952673 18114459
4570A8114459J32748J20204J42962j22187L3475l06264l43093k46053m94345k69428
4560A6762478m70792l71531l81419j51502j2421j58417L9690K17458K874M2951
4550A5519369j43547K21581j1000k0350j24260l58535l82817n08983l28169j61123
4540A3702166k18393j71508L0638o7124j14002k05959J88023P0121R1790P7580
4530A3383332r3718J93417R8509J49134N02189K08875K23078M89415L62016L54937
4520A5871184N15424J97582L76439L13809K89714K75184N28804O71784O32842
4511A9672766K89817J17009K15418L50764K14198J10451O9840P4390J48713r8540
4501B1164826k38990k3716l72272m82531o69065o04390m42774n72398m89625m63791
$$ plain form
4570 18114459 18247207 18367411 18510373 18388186 18421661 18115397 17772304 17526251 17031906 16762478
4560 16762478 16291686 15920155 15538736 15387234 15374813 15216396 15256086 15473544 15476418 15519369
4550 15519369 15375822 15597403 15586403 15566053 15441793 15083258 14700441 14191458 13863289 13702166
4540 13702166 13483773 13312265 13342903 13275779 13161777 12955818 13143841 13213962 13305752 13383332
4530 13383332 13289614 13483031 13581540 13730674 14232863 14441738 14664816 15154231 15516247 15871184
4520 15871184 16386608 16584190 16960629 17274438 17564152 17839336 18368140 19039924 19672766
4511 19672766 19962583 20079592 20295010 20645774 20859972 20970423 21040263 21114653 21263366 21164826
4501 21164826 20925836 20902120 20529848 20047317 19378252 18773862 18331088 17758690 17269065 16805274
4491A6805274l81576l55613l48242l06949l60321l66324k92865R2351j53953j6376
4481A4315406L30041q0354J61600j0862j24362Q0976J13410J39377M52790J10535
4471A5488557R7287M35322K58439L41272L64445L59454N16857N05397M86589K35200
4461A9088819K36961J06698J66431m0267j83286k01623o15544n90274k60272r272
4451A7698371k08397j49124j73219J5108K3661J22755J56890M1437N53842M12501
4441A8493825L30029J27799J02893l3470j05076l02588m26223l11019l68584l77008
4431A7130578l84750l82286l27520k52979n5095r8252l86064k87495L2585K4329
4421A5013051K02058J06958m1517J02621q8547J14554L38115J58309O4207L75784
$$ plain form
4491 16805274 16423698 16068085 15719843 15412894 15052573 14686249 14393384 14485735 14331782 14315406
4481 14315406 14645447 14565093 14726693 14715831 14591469 14672445 14785855 14925232 15378022 15488557
4471 15488557 15585844 16021166 16279605 16620877 16985322 17344776 17861633 18367030 18853619 19088819
4461 19088819 19325780 19432478 19598909 19558642 19375356 19173733 18558189 17967915 17707643 17698371
4451 17698371 17489974 17340850 17167631 17182739 17206400 17329155 17486045 17527482 18081324 18493825
4441 18493825 18823854 18951653 19054546 19021076 18916000 18613412 18187189 17876170 17507586 17130578
4431 17130578 16745828 16363542 16036022 15783043 15727948 15629696 15243632 14956137 14988722 15013051
4421 15013051 15215109 15322067 15280550 15383171 15294624 15409178 15747293 15905602 15969809 16345593
4411A6345593M28921M34114M15147M97184N35285O36111P02931N29688O17689
4402B1142663O25803O69408L88495K89741N0478L6296l3759n59679l21649o74029
4392B1613768n18236m27014p13717p95760m55122o65759n05014m53016l78303
4383A6701827j40704l85439j16962R5286j27627j96252Q9139j48584o5088P001
4373A5712597N9426J95386K88700j3482M52743N19578L54133L52515L75393L09161
4363A8606150L68593R6772M01146K25972L19142k947k9357j08813l83119l39103
4353A9154436n76329l57092m64108l62846l71284o7579q5663r6780K4314r3413
4343A6703656M5177N8827K77958L59713R4782L04258J09256K43182K85793K87369
$$ plain form
4411 16345593 16774514 17208628 17623775 18120959 18656244 19292355 19995286 20524974 21142663
4402 21142663 21768466 22437874 22826369 23116110 23166588 23202884 23169125 22609446 22287797 21613768
4392 21613768 21095532 20668518 19954801 19159041 18703919 18038160 17533146 17080130 16701827
4383 16701827 16561123 16175684 16058722 16154008 16026381 15830129 15919268 15770684 15705596 15712597
4373 15712597 15772023 15967409 16256109 16242627 16695370 17214948 17569081 17921596 18296989 18606150
4363 18606150 18974743 19071515 19472661 19698633 20017775 20014828 19985471 19876658 19493539 19154436
4353 19154436 18578107 18221015 17756907 17394061 17022777 16955198 16869535 16772755 16797069 16703656
4343 16703656 16748833 16807660 17085618 17445331 17540113 17844371 17953627 18196809 18482602 18769971
4333A8769971J03814P9807j54710k99156l59434k66808k49819m84803m33230k42908
4323A6462724m59416m48803j03404j10155o6258j31472k10342M6614P8036L9154
4313A5096678J57596j70387j4021L33834N9878J44045o6064K3261O9469J67808
4303A5802097L00952K01438K70852L23228L80176J07956L74166M85240L32173
4294A8578278K36057N1670O3070j56170l69319j98566l49632m45388j08767j65210
4284A7136023m69210j80143l54833l73624q0333q6733k23396J05085K61022l04823
4274A5429035j04787Q7713J55289j84116p2294j40213j81834R9532K46887P4400
4264A5409612J55581L8519K6117M9442J02561M3098L15708K03896l4811L85673
$$ plain form
4333 18769971 18873785 18953592 18798882 18499726 18140292 17873484 17623665 17138862 16705632 16462724
4323 16462724 16003308 15554505 15451101 15340946 15274688 15143216 14932874 14979488 15057524 15096678
4313 15096678 15254274 15083887 15069866 15403700 15463578 15607623 15541559 15564820 15634289 15802097
4303 15802097 16103049 16304487 16575339 16898567 17278743 17386699 17760865 18246105 18578278
4294 18578278 18814335 18866005 18929075 18772905 18403586 18205020 17855388 17410000 17301233 17136023
4284 17136023 16666813 16486670 16131837 15758213 15677880 15591147 15367751 15472836 15733858 15429035
4274 15429035 15324248 15411961 15567250 15383134 15310840 15170627 14988793 15088325 15335212 15409612
4264 15409612 15565193 15603712 15629829 15679271 15781832 15824930 16140638 16344534 16309723 16695396
4254A6695396J67043J25753K50772R6060J01968J96803L42476K78293L69278L51425
4244A8975267K83493K96435L20278K96269L9584Q9359L21230N23710J0014O9621
4234B1225260K13676K59422J59877M2469J12017M05406K99812L2808m0739L68431
4224B3078439K46827K89404L48663M31088J68205M73760L79465K15773M77325
4215B6108949L71257M72680N93455L67853O7308K26759N01384M19427K07570L73542
4205B9710184M71339M90010O97659O90093L93277Q56982P46270R04084Q35730
4196C5795628Q44891Q91842Q17465J025171P87106J046377J021701J083828J165922
4187D4479931J638756J398441J509123K125205J993908K179956K250671K554620
$$ plain form
4254 16695396 16862439 16988192 17238964 17335024 17436992 17633795 17976271 18254564 18623842 18975267
4244 18975267 19258760 19555195 19875473 20171742 20211326 20300685 20621915 21145625 21155639 21225260
4234 21225260 21438936 21698358 21858235 21900704 22012721 22418127 22717939 22750747 22710008 23078439
4224 23078439 23325266 23614670 23963333 24394421 24562626 25036386 25415851 25631624 26108949
4215 26108949 26480206 26952886 27546341 27914194 27981502 28208261 28709645 29129072 29336642 29710184
4205 29710184 30181523 30671533 31369192 32059285 32452562 33309544 34055814 34959898 35795628
4196 35795628 36640519 37532361 38349826 39374997 40162103 41208480 42230181 43314009 44479931
4187 44479931 46118687 47517128 49026251 51151456 53145364 55325320 57575991 60130611
4179F0130611K536440L004657K784044L120059L576486L954109M142675M756645
4171H8005726N519274O027180O937455Q097529R409174J0574596J2361139J4121351
4163A61053424J6212666J8415656K0991872K3837191K7723684L2135464L7060384
4156C37430341M1851731M6360671M6853981M0387206K4605435L54199k6628875
4149E11214689m8811053n8987275n7265586m8900524l8771997l0254638k3969200
4142B04254416j9026791j5545367j3061247j0980074q917746p901064o876853
4135A21945274n903023n659955n199392m489607m180569l751553l340072k939386
4127H6481717k676272k515745j916089k100916k057057j937793j671178j626544
$$ plain form
4179 60130611 62667051 65671708 68455752 71575811 75152297 79106406 83249081 88005726
4171 88005726 93525000 99552180 106489635 114587164 123996338 134570934 146932073 161053424
4163 161053424 177266090 195681746 216673618 240510809 268234493 300369957 337430341
4156 337430341 379282072 425642743 472496724 512883930 537489365 537843564 511214689
4149 511214689 462403636 403416361 346150775 297250251 258478254 228223616 204254416
4142 204254416 185227625 169682258 156621011 145640937 136723191 128822127 121945274
4135 121945274 116042251 110382296 105182904 100693297 96512728 92761175 89421103 86481717
4127 86481717 83805445 81289700 79373611 77272695 75215638 73277845 71606667 69980123
4119F9980123j871018j675317j639834j694178j482650j236397j473387j415616
4111E7491726j493006j473672j490220j601560j310875j194341j036613r53051
4103D6938388r75717o58332q55712p79821p68618m58422n08243p54100n08006
4094D0671417m97413o64225n41314l38379m6497j43400l04090P2465o3899l1379
4084C8113286N7122L9141J16018l8971J18506K74993K48515K03636O02186Q12558
4074D0546990N80091L24095J18057n31136j036353r19540r15566o50870k56689
4065C7259079n22152j54746j24107O8250k78010k5871K45582J35596p6873j72456
4055C6354292J64160K90198N9411N9363L92221N5536K19674L21798M89209N02655
$$ plain form
4119 69980123 68109105 66433788 64793954 63099776 61617126 60380729 58907342 57491726
4111 57491726 55998720 54525048 53034828 51433268 50122393 48928052 47891439 46938388
4103 46938388 45962671 45304339 44448627 43668806 42900188 42441766 41933523 41179423 40671417
4094 40671417 40174004 39509779 38968465 38630086 38583589 38440189 38136099 38208564 38144665 38113286
4084 38113286 38170408 38209549 38325567 38286596 38405102 38680095 38928610 39132246 39734432 40546990
4074 40546990 41127081 41451176 41569233 41038097 40001744 39082204 38166638 37515768 37259079
4065 37259079 36736927 36582181 36458074 36526324 36248314 36222443 36468025 36603621 36526748 36354292
4055 36354292 36518452 36808650 36868061 36927424 37319645 37375181 37594855 37916653 38405862 38908517
4045C8908517M07707L88447L27023M31208M71802L34647O97904L92550O50473
4036D3010278P32123O00165O54181P39402N55825P67235O92642Q34844Q57195
4027D9443890R75757J110535R05570R97991R65856J101660J069657J079399J315416
4018E8965731J179530J243337J354809J404372J327275J476168J431475J533196
4010F9915893J631680J692386J786920J393980J503924J614379J578641J629357
4002H2747160J636779J674016J574781J459117J579702J708923J484498J261036
3994I5126012J478107J432273J336254J334550J312111J212356J138653J043105
3986A05413421J101370Q32280R41568R03776P33636P10108P29071O39292N99498
$$ plain form
4045 38908517 39316224 39704671 40031694 40462902 40934704 41269351 41967255 42359805 43010278
4036 43010278 43742401 44342566 44996747 45736149 46291974 47059209 47751851 48586695 49443890
4027 49443890 50419647 51530182 52435752 53433743 54399599 55501259 56570916 57650315 58965731
4018 58965731 60145261 61388598 62743407 64147779 65475054 66951222 68382697 69915893
4010 69915893 71547573 73239959 75026879 76420859 77924783 79539162 81117803 82747160
4002 82747160 84383939 86057955 87632736 89091853 90671555 92380478 93864976 95126012
3994 95126012 96604119 98036392 99372646 100707196 102019307 103231663 104370316 105413421
3986 105413421 106514791 107347071 108288639 109192415 109926051 110636159 111365230 112004522 112604020
3977A12604020M66735K87541J95009K05480M8047p9644k51959j86664l59432l85396
3967A12543737m59027n37718m51157o54534p00217j029271j168266j417124j569285
3958A04557138j882225j757354j465263j578737j613372j875743j883592j814471
3950I0686381j909866j697201k022430j886156k120675j930149k027311k152434
3942G4940159j927293j772688j986321k005106j797004j919544j876271j767387
3934E9888545j720724j585469j584472j425321j419282j504347j225445j493072
3926D7930413j504454j350067r81520j164481j169790q63072j025260r64526j062718
3917C7844525q67922o18759j014246q13665o69027m98701o36807n66410p36627
$$ plain form
3977 112604020 113070755 113358296 113553305 113758785 113806832 113727188 113475229 113288565 112929133 112543737
3967 112543737 112084710 111546992 111095835 110441301 109741084 108711813 107543547 106126423 104557138
3958 104557138 102674913 100917559 99452296 97873559 96260187 94384444 92500852 90686381
3950 90686381 88776515 87079314 85056884 83170728 81050053 79119904 77092593 74940159
3942 74940159 73012866 71240178 69253857 67248751 65451747 63532203 61655932 59888545
3934 59888545 58167821 56582352 54997880 53572559 52153277 50648930 49423485 47930413
3926 47930413 46425959 45075892 44094372 42929891 41760101 40897029 39871769 38907243 37844525
3917 37844525 36976603 36357844 35343598 34529933 33860906 33362205 32725398 32158988 31422361
3908C1422361p34206j63920j93205n49850o68262l44312k15299j87345j09398
3899B8256564k22929m84703Q5261j15931m28893j77275k95447j32923l15955m2974
3889B6124795k74392j27633k10923k42105j79870k48742l27101k52110l14240
3880B3947679j16413k76933k79969k90468k57407o8158k44428j07427j58960p1371
3870B2076145P2589j25509M4108L79768o100q9668m8532l3196J70626K37703l2122
3859B2645812m11271m73951l96253j32586j41920j34156j35606r0733J24033j62147
3849B0691222K0994K45263J39448l924o3090L9912L50J44726J34494K4199J55298
3838B1528892j55611Q0531k9626R3383o734J21918p0411k844Q1391J75051K97552
$$ plain form
3908 31422361 30688155 30524235 30331030 29781180 29112918 28768606 28553307 28365962 28256564
3899 28256564 28033635 27548932 27634193 27518262 27089369 26912094 26616647 26483724 26167769 26124795
3889 26124795 25850403 25722770 25511847 25269742 25089872 24841130 24514029 24261919 23947679
3880 23947679 23831266 23554333 23274364 22983896 22726489 22658331 22413903 22306476 22147516 22076145
3870 22076145 22148734 22023225 22067333 22447101 22441001 22351333 22302801 22269605 22440231 22677934 22645812
3859 22645812 22234541 21760590 21364337 21231751 21089831 20955675 20820069 20729336 20853369 20691222
3849 20691222 20712216 20957479 21096927 21093003 21029913 21069825 21070175 21214901 21349395 21373594 21528892
3838 21528892 21373281 21453812 21424186 21517569 21510835 21632753 21562342 21559498 21640889 21815940 22113492
3827B2113492j63997k9810R4005n7758n9474n8661j29450l18395o7047j02330
3817B1220575l3670q9973M4710J27354K7331k01444j03576j26810j45138l7415
3807B0681944r5295J67709j58518l2489q4604k1872j1353J10468J83826L1542
3797B0771358J18956L2647j39289J64987K10324n1301J82740J55590R3376K06714
3787B1746102K17488k3392J38524J09472J7341l8493L0776L02611k358K86891
3777B2784962j1934Q4650M1696J47127J91493p525J30830L9092J1862N9800K06895
3766B3678948J33468K15021M04218J80628m1405O0097N8406R3716J35125J08715
3756B5026937J61851j29854K7325j2810O0971j02736K66838K03431J41139K36586
$$ plain form
3827 22113492 21949495 21919685 22013690 21955932 21896458 21837797 21708347 21389952 21322905 21220575
3817 21220575 21186905 21096932 21141642 21268996 21296327 21094883 20991307 20864497 20719359 20681944
3807 20681944 20586649 20754358 20595840 20563351 20478747 20456875 20445522 20555990 20739816 20771358
3797 20771358 20890314 20922961 20783672 20948659 21158983 21107682 21290422 21446012 21539388 21746102
3787 21746102 21963590 21940198 22078722 22188194 22205535 22167042 22197818 22500429 22498071 22784962
3777 22784962 22773028 22857678 22899374 23046501 23237994 23230469 23361299 23400391 23412253 23472053 23678948
3766 23678948 23812416 24027437 24431655 24612283 24570878 24630975 24689381 24783097 24918222 25026937
3756 25026937 25188788 25058934 25086259 25073449 25134420 25031684 25298522 25501953 25643092 25879678
3746B5879678P8820J88210Q9731J22447P1082j5096j55436J10023j39049R8095
3736B6328505K18000Q3950K86441K32974p9877J54033J52266M8155N9348L69461
3726B7853256K73744J73662K06555J39443J05105K82010K43833K76596M48302
3717C0002506K88336K78790Q6157J82945M10356N55725L98411M40775M65827J47801
3707C3257629O86156P41114N84872O12389N06147L36555N36269O03663N30586
3698C8395380N58734P96970P65821P06329O31914Q35039P30905Q23181Q22766
3689D5067039P76527J119097R04856J153398J141798J323633J058305J137502
3681E3682155J208457J219633J306866J739692J304433J645409J704749J509701
$$ plain form
3746 25879678 25958498 26146708 26236439 26358886 26429968 26414872 26259436 26369459 26230410 26328505
3736 26328505 26546505 26630455 26916896 27149870 27069993 27224026 27376292 27424447 27483795 27853256
3726 27853256 28127000 28300662 28507217 28646660 28751765 29033775 29277608 29554204 30002506
3717 30002506 30290842 30569632 30655789 30838734 31249090 31804815 32203226 32644001 33109828 33257629
3707 33257629 33943785 34684899 35269771 35882160 36388307 36724862 37261131 37864794 38395380
3698 38395380 38954114 39751084 40516905 41223234 41855148 42690187 43421092 44244273 45067039
3689 45067039 45843566 46962663 47867519 49020917 50162715 51486348 52544653 53682155
3681 53682155 54890612 56110245 57417111 59156803 60461236 62106645 63811394 65321095
3673F5321095J578214J504060J662613J818640J746899J803075J819145J853416
3665G9107157J819973J623730J701121J614247J711114J896823J841971J677418
3657I2993554J749726J549426J620669J526063J701304J553427J647698J414935
3649A05756802J428142J623925J560151J829919J883915J971420J985168K000794
3641A20040236K194819K478293K308807K324443K735213K805640L067882L358804
3633A41314137L491793L527435L874021M024836M092693M609603M704267N013701
3625A74652486N190888N135605N159110N545044N396063N258354N126872M751903
3617B16216325L942662L762941L363871K662400K382814J987531J624209J364411
$$ plain form
3673 65321095 66899309 68403369 70065982 71884622 73631521 75434596 77253741 79107157
3665 79107157 80927130 82550860 84251981 85866228 87577342 89474165 91316136 92993554
3657 92993554 94743280 96292706 97913375 99439438 101140742 102694169 104341867 105756802
3649 105756802 107184944 108808869 110369020 112198939 114082854 116054274 118039442 120040236
3641 120040236 122235055 124713348 127022155 129346598 132081811 134887451 137955333 141314137
3633 141314137 144805930 148333365 152207386 156232222 160324915 164934518 169638785 174652486
3625 174652486 179843374 184978979 190138089 195683133 201079196 206337550 211464422 216216325
3617 216216325 220158987 223921928 227285799 229948199 232331013 234318544 235942753 237307164
3609B37307164J018026M96399L58817K5786m03535r12999j143103j516399k295514
3600B32934642k763050k539845k884399l144137l210997l141082l317520k968682
3592B08964930l085968l105614k929556k885920k715949k592364k384558k393439
3584A86871562k452215k664119j926051j973486k129658j925753j932711j682993
3576A70184576j752054j565361j532980j226316j516988j398573q62756j028222
3568A59301326q76820q26727p86964n21843m89005j92203k43659j02034J65663
3559A55427734K07422K081J89888N21056M78593J118047J137341J142138J268221
3550A61492521J589705J532845J634842J860593J855167J687314J348810J443382
$$ plain form
3609 237307164 238325190 238821589 239180406 239206192 238802657 237889658 236746555 235230156 232934642
3600 232934642 230171592 227631747 224747348 221603211 218392214 215251132 211933612 208964930
3592 208964930 205878962 202773348 199843792 196957872 194241923 191649559 189265001 186871562
3584 186871562 184419347 181755228 179829177 177855691 175726033 173800280 171867569 170184576
3576 170184576 168432522 166867161 165334181 164107865 162590877 161192304 160329548 159301326
3568 159301326 158424506 157597779 156810815 156288972 155799967 155607764 155364105 155262071 155427734
3559 155427734 155635156 155637237 155827125 156348181 156826774 157944821 159082162 160224300 161492521
3550 161492521 163082226 164615071 166249913 168110506 169965673 171652987 173001797 174445179
3542A74445179J283202P20362L88251L21287q9904m64495q77193j024393j276512
3533A73425784j486412j542498j551362j795964j789763j958617k417325k454149
3525A58429694k571243k717515k900638k702731k569852k447979k910303k551169
3517A37058264j980582j713935j566180j452880q68008n96240q66379o52423j31451
3508A27230186k8801k71078r2227n831k8045K701k23653j16495J104m10762j82149
3497A25874950k99850l27689o23203p28063q16344j005559j064308j097718j504947
3488A18407269j605133j318876j694295j613900j974931j829251k151767j844838
3480A04374278j864398k231562k101892k088452k152765j894761k039403j882189
$$ plain form
3542 174445179 175728381 176448743 176836994 177158281 177068377 176603882 175726689 174702296 173425784
3533 173425784 171939372 170396874 168845512 167049548 165259785 163301168 160883843 158429694
3525 158429694 155858451 153140936 150240298 147537567 144967715 142519736 139609433 137058264
3517 137058264 135077682 133363747 131797567 130344687 129476679 128880439 128014060 127361637 127230186
3508 127230186 127201385 126930307 126838080 126832249 126804204 126806905 126583252 126466757 126467861 126057099 125874950
3497 125874950 125575100 125247411 124624208 123896145 123079801 122074242 121009934 119912216 118407269
3488 118407269 116802136 115483260 113788965 112175065 110200134 108370883 106219116 104374278
3480 104374278 102509880 100278318 98176426 96087974 93935209 92040448 90001045 88118856
3472H8118856j987055j863751k050588j882543j621090j767516j604961j567885
3464G3773467j520603j362482j197616r79121j045647j151608p79221r02655q00661
3455F4033853o63413p30138m94865m76752l81375l93825o43811l56710m76101
3446E9416863l53504l02276m36156l88290n18181m96718n12102p16180o51682
3437E5041774n85962o45865q77214p29087p65280p77718r94883r04324p92915
3428D7968526r62347j090101r37834r25496q42321r69827j298220q77220p69617
3419C9295543j128504j055584j088525r93909j112995r79568r10289p90432p19992
3410C0515745r06732q48179o31012p77933r28213q24207p74713q23122o66722
$$ plain form
3472 88118856 86131801 84268050 82217462 80334919 78713829 76946313 75341352 73773467
3464 73773467 72252864 70890382 69692766 68713645 67667998 66516390 65737169 64834514 64033853
3455 64033853 63370440 62640302 62145437 61668685 61287310 60893485 60249674 59892964 59416863
3446 59416863 59063359 58761083 58324927 57936637 57418456 56921738 56409636 55693456 55041774
3437 55041774 54455812 53809947 52932733 52203646 51438366 50660648 49665765 48761441 47968526
3428 47968526 47006179 45916078 44978244 44052748 43210427 42240600 40942380 40065160 39295543
3419 39295543 38167039 37111455 36022930 35029021 33916026 32936458 32026169 31235737 30515745
3410 30515745 29609013 28760834 28129822 27351889 26423676 25599469 24824756 24001634 23334912
3401B3334912o13899p19685m25249m85148n65040m89480m29800m23696l69091
3392A8813824l39922l52814m52451l44815l06497k57522l77051k75644j47048
3383A5960060j41292j98731n05865k46650j67359m2652K4380k52743j83657l43031
3373A3902460o242k00013j2698j61525k81122j20112l35017l60883n5657j17329
3363A2251862q5855l29440j96945j38447k98418J01803q0259K0478l0612k60189
3353A0953978l00097j58281k21847P6771l2975p6955m2363j75804J72624l08652
3343I886399j22262J20817j09568J5737o3026q7584J48295l4044k18041o1904
3333I474819R761J71790M9884J17050k07828q5202j04340k64071l7523R8888o8340
$$ plain form
3401 23334912 22721013 22001328 21576079 21090931 20525891 20036411 19606611 19182915 18813824
3392 18813824 18473902 18121088 17668637 17323822 17017325 16759803 16382752 16107108 15960060
3383 15960060 15818768 15620037 15114172 14867522 14700163 14657511 14681891 14429148 14245491 13902460
3373 13902460 13896218 13696205 13683507 13521982 13240860 13120748 12785731 12424848 12369191 12251862
3363 12251862 12166007 11836567 11639622 11501175 11202757 11304560 11224301 11244779 11214167 10953978
3353 10953978 10653881 10495600 10273753 10350524 10317549 10240594 10198231 10022427 10195051 9886399
3343 9886399 9764137 9884954 9775386 9791123 9728097 9640513 9788808 9754764 9536723 9474819
3333 9474819 9484580 9656370 9706254 9823304 9615476 9530274 9425934 9161863 9124340 9223228 9154888
3322I154888k38082j71007k39343q867J57588j00678q4465L0631k38689n504J90001
3311H446473J26049j69284K38804J96398r9744J27686J8408l93480j01509R3900
3301H483701K64049m2401q6829R4361J42890K29325k5867k24917l19440j91912
3291H322960j43192o2873j57805J868O0113q0367j87605j94555K26033Q9290m9668
3280G824199J21566o2116P3282q5470J85731K8754J07978J03925l4706q3241R8991
3269H278893K57555M5258p3543J02032J00920K77349L31686P2463l5040j13929
3259I243644J39014K37960Q5418K8760J02730L89595P9258j35996j26465j2990
3249A0030928L8141j56041k29076j90593j50202k85528o2135K89364M9512j52177
$$ plain form
3322 9154888 8916806 8745799 8506456 8497589 8655177 8554499 8470034 8500665 8261976 8256472 8446473
3311 8446473 8572522 8403238 8642042 8838440 8738696 8866382 8884790 8491310 8389801 8483701
3301 8483701 8747750 8705349 8618520 8712881 8855771 9085096 9059229 8834312 8514872 8322960
3291 8322960 8179768 8116895 7959090 7960958 8021071 7940704 7753099 7558544 7784577 7873867 7824199
3280 7824199 7945765 7883649 7956931 7871461 8057192 8085946 8193924 8297849 8263143 8179902 8278893
3269 8278893 8536448 8581706 8508163 8610195 8711115 8988464 9320150 9392613 9357573 9243644
3259 9243644 9382658 9620618 9706036 9734796 9837526 10227121 10306379 10170383 10043918 10030928
3249 10030928 10069069 9913028 9683952 9493359 9343157 9057629 8995494 9284858 9334370 9182193
3239I182193j16830k61562m03181j44623k64701j84205l07029n80198l01124J59716
3229F778456q774m8615k61673j55779K0986k03797l0125J42736J8115k93079j0604
3218E947847p5464l6737P8896L3980J7153L28662J86698J24300L28735J31369
3208G065439k31253k46354n47100m25947n03044l05430R915J04035J3191j17534
3198D815918j36994j48601L9494L05610k92009l03058O8743J13597j55474l73658
3188C933568r7105L7059J31236o2607M5354J23275J12710o6458L8128J93008K0437
3177D408605q1386K8790k30429j34154k52402k78682J434N6143k60834j28887
3167C128198J33785o4124m7950J02111m0218k12944j43059O4552q1354M729l2337
$$ plain form
3239 9182193 9065363 8803801 8400620 8255997 7991296 7807091 7500062 6919864 6618740 6778456
3229 6778456 6769682 6721067 6459394 6303615 6324601 6120804 6090679 6233415 6251530 5958451 5947847
3218 5947847 5872383 5835646 5914542 5948522 5965675 6294337 6481035 6605335 6934070 7065439
3208 7065439 6834186 6587832 6040732 5614785 5111741 4806311 4816226 4920261 4933452 4815918
3198 4815918 4678924 4530323 4569817 4875427 4583418 4280360 4349103 4462700 4307226 3933568
3188 3933568 3836463 3873522 4004758 3942151 3987505 4110780 4223490 4157032 4195160 4388168 4408605
3177 4408605 4327219 4356009 4125580 3991426 3739024 3460342 3461776 3517919 3257085 3128198
3167 3128198 3261983 3197859 3149909 3252020 3211802 2998858 2855799 2920351 2838997 2843726 2811389
3156B811389j19565r0406P1968J69513p5289L0136p3892K5742m6995k13482j08076
3145B381043m7696p1727Q84M0011J28267m2900n9836j01377q5042P9058N8967
3134B279652m276J04111j45507n5373q0757j18615K34008j91637j43456J51517
3124B029667J15250l969p0385k70885P697R2893m2218J84177J239j04819k8566
3113A910081l4260P0416p6676k11374J00766j63564J56756o1672p9762K7237K58807
3102A896755J7225j09457p1930m1559j29684P5968o6214k06575K18179j40912
3092A441796P9278M1913M8499L940j52951J48875M454j9773j33135J4275m3986
3081A433185m3605O5590j94357Q6363J43136j37994j43019N6658J63239N2460
$$ plain form
3156 2811389 2691824 2601418 2673386 2842899 2767610 2797746 2723854 2749596 2702601 2489119 2381043
3145 2381043 2333347 2261620 2262504 2302515 2430782 2387882 2328046 2226669 2141627 2220685 2279652
3134 2279652 2275376 2379487 2233980 2178607 2097850 1979235 2213243 2021606 1878150 2029667
3124 2029667 2144917 2140948 2070563 1799678 1807375 1900268 1858050 2042227 2043466 1938647 1910081
3113 1910081 1875821 1946237 1869561 1658187 1758953 1595389 1752145 1690473 1610711 1637948 1896755
3102 1896755 1913980 1804523 1732593 1691034 1561350 1637318 1571104 1364529 1582708 1441796
3092 1441796 1521074 1562987 1611486 1615426 1462475 1611350 1615804 1596031 1462896 1477171 1433185
3081 1433185 1389580 1455170 1260813 1347176 1490312 1352318 1209299 1265957 1429196 1481656
3071A481656p6703j43810n1835J12538O9288J58530N9769k7110k81068Q6884k8132
3060A360007O0257j35099r3654J06574r7205O5319q2555q2033K68173L9809j6556
3049A393037k25712n3198Q3727J5628p677o1461l4942J68940l8480K3294k10554
3038A052602P4523J2541j59014N5854J91175r0516j25982k5480j11210J04848
3028I79341r9295R9049j00264J08068P8890j08750n913r1575J08019M6219j19370
3017H94419R7868M9232o5949O5942O9020M988L1696j9615r0041k7972J52104k61772
3005H99920p2655P2158q4046M2375J17655J20182j19227K7199m0508j1154J23963
2994A075862k8548j60197l7890l4423J21066J2129R917K54417k7626Nj41461j07568
$$ plain form
3071 1481656 1404953 1261143 1209308 1321846 1391134 1549664 1609433 1582323 1301255 1388139 1360007
3060 1360007 1420264 1285165 1191511 1298085 1200880 1266199 1183644 1101611 1369784 1409593 1393037
3049 1393037 1167325 1114127 1197854 1213482 1205805 1144344 1109402 1278342 1239862 1263156 1052602
3038 1052602 1127125 1139666 980652 1036506 1227681 1137165 1011183 985703 874493 979341
3028 979341 880046 979095 878831 986899 1065789 957039 951126 859551 967570 1013789 894419
3017 894419 992287 1041519 975570 1041512 1110532 1115520 1147216 1127601 1037560 1009588 1161692 899920
3005 899920 827265 899423 815377 857752 975407 1095589 976362 1003561 963053 951899 1075862
2994 1075862 1047314 887117 849227 814804 935870 947999 957916 1212333 1184707 1184712 1043251 935683
2982I35683J01092j6118n6264j39298O1986n223L7393Q1314j162J28774j30809
2971I97368j26270P9153R1954m8151K0361L9878O8197j7724Q689K2199J4428k66041
2959H84041P4190N9984J2129j64016j36163J83719J02203m3949O1187j6266q0629
2948I36430j5706J18741J44308K03075o1150j00794M2851K1501K9646P7212k57072
2937A139042M237N1261J38589J75909k41387K8255k65102n0911J7080J41083N8926
2926A196982K11951K0968j68732p6828m0103J7418l4310q2447J30972K72419j46212
2915A302078J03983K2409M4998P455K21525J24909j0690l50989j14659m5276r3849
2904A211894M1399q9542J09382K3266J0770k3509J2319j31275Q5277m3476Q279
$$ plain form
2982 935683 1036775 1020657 964393 825095 887081 881858 919251 1000565 999403 1128177 997368
2971 997368 871098 950251 1042205 994054 1014415 1054293 1122490 1104766 1113455 1135654 1150082 884041
2959 884041 958231 1018215 1030344 866328 730165 913884 1016087 972138 1033325 1017059 936430
2948 936430 920724 1039465 1183773 1386848 1325698 1224904 1267755 1289256 1318902 1396114 1139042
2937 1139042 1143279 1194540 1333129 1509038 1267651 1295906 1030804 979893 996973 1138056 1196982
2926 1196982 1408933 1429901 1261169 1184341 1144238 1161656 1127346 1044899 1175871 1448290 1302078
2915 1302078 1406061 1428470 1473468 1480923 1702448 1827357 1816667 1465678 1351019 1305743 1211894
2904 1211894 1253293 1163751 1273133 1296399 1307169 1283660 1295979 1164704 1249981 1206505 1214784
2893A214784J29941j1780J864n4958r808o8108K3196L0952M725O1106K6093J34079
2881A482086J52751j35222k44227L3515l7117J49584M0571n0266j27625L0542
2871A294592k59490R1750K20303j78209J16349l1380P7583n181l26685o4348J95031
2860A130315J56312j35285o4829p4500j4918J6424n1125j06291j85099O7024J59425
2849H97453j57990J43265m5459l6710J30176j36974l7520l13531J78099p2346
2839E48463J37085J06950J03944k3033j77692o142o1946l0069P1731N0214k16529
2828E02976J14862r3470J34433k384N7657m9217j56309l1551N2092Q0638q111
2817F01616q5558j25634j41744o6756J3931L30968j9443L6163J43992j01355j50395
$$ plain form
2893 1214784 1344725 1332945 1334809 1279851 1270043 1201935 1225131 1256083 1260808 1321914 1348007 1482086
2881 1482086 1634837 1499615 1255388 1288903 1251786 1401370 1441941 1391675 1264050 1294592
2871 1294592 1035102 1126852 1347155 1168946 1285295 1253915 1331498 1326317 999632 935284 1130315
2860 1130315 1286627 1151342 1086513 1012013 997095 1013519 962394 856103 671004 738028 897453
2849 897453 739463 882728 837269 800559 930735 793761 756241 442710 620809 548463
2839 548463 685548 792498 896442 873409 695717 689575 627629 597560 669291 719505 502976
2828 502976 617838 524368 658801 656417 714074 664857 508548 476997 529089 609727 601616
2817 601616 516058 390424 248680 181924 195855 526823 507380 543543 687535 586180 435785
2806D35785Q2279N1552n5299o1912p0140j4901p5661J35321j82599P3920K8416
2795C46761K3364J29332r3180Q3774J997j59222k3000J4839l2988l9338l1380
2784B20959N780R6977J00234k43963J01815R3089k52780N9193K9908k7031O3515
2773B47696M191j54010J50253J4129O1490L6328j10946Q5080p6359K1473J02441
2762C81766j68462M7930J76007P746k8556P4150j30j98275K2359p2809O5129n5407
2750B51448M2808p1679j53342m1917J52024q9915r754K8751p1333J648J79794
2739B18533R8897j52820p4799N7130J04223M763L0947k11327K33700j9523l7140
2728B52584j55578m9373n5253J13535k7540J69808m5019n6585r6931Q8299P2445
$$ plain form
2806 435785 518064 569616 514317 452405 382265 367364 291703 427024 244425 318345 346761
2795 346761 370125 499457 406277 490051 492048 332826 309826 324665 291677 252339 220959
2784 220959 226739 323716 423950 179987 281802 374891 122111 181304 211212 184181 247696
2773 247696 251887 97877 248130 262259 323749 360077 249131 334211 257852 279325 381766
2762 381766 213304 261234 437241 444987 416431 490581 490451 292176 314535 241726 306855 251448
2750 251448 294256 222577 69235 27318 179342 89427 79673 108424 37091 38739 218533
2739 218533 317430 164610 89811 146941 251164 255927 286874 75547 309247 289724 252584
2728 252584 97006 47633 -7620 105915 78375 248183 203164 146579 49648 137947 210392
2717B10392J20405k29222J25929q4668m7885J39502J07137L53J37738k23219j81739
2706G4723N4703J36689j56595j22673J85420j96188k3027p543J27173M7004J5630
2695A35316J55929J63596k2232j50853j24334J11950l1763j9293J11723q6087
2685B43952p5706J67084j7967J55919j57562k24954j63397R1537Q4969L3952j10002
2674B7825r329j44177j39379J14425J65792L8503N801j10565K98344j76140j34856
2663f3756j0613P7193J5693N7168N3438m5136q3266K4884L6365O2960R7024n0901
2651A71053j47820j27080q8265o751k970l3057J95468L00735j19316M9056L0229
2640B21282j40192k016Q4160J31694j07379k25218l1434j151J55400j34508Q688
$$ plain form
2717 210392 330797 101575 227504 142836 94951 234453 341590 341943 479681 256462 74723
2706 74723 129426 266115 109520 -13153 172267 -23921 -46948 -54491 72682 119686 135316
2695 135316 291245 454841 432609 281756 157422 269372 237609 218316 330039 243952
2685 243952 168246 335330 317363 473282 315720 90766 -72631 18906 103875 137827 27825
2674 27825 18496 -125681 -265060 -150635 15157 53660 59461 -51104 247240 71100 -63756
2663 -63756 -74369 2824 18517 75685 129123 83987 721 25605 61970 124930 221954 171053
2651 171053 23233 -103847 -192112 -198863 -201833 -234890 -39422 261313 141997 191053 221282
2640 221282 81090 79074 163234 294928 187549 -37669 -69103 -70254 85146 -49362 -40674
2629d0674j0315P0505k00101r3020K73764j10477R8497O8940p8527q9411L0596
2618h0223J02673j77731J45889k1005Q7868J70857j7928J9405j21966q648m6306
2607E2885J17615J5082l1897o4684J66899k27595m5504R8849M9917K43150p0234
2596C04483q4266K8709n9291O864r1186O8812K7870R6743j22465n6628k61898
2585a42253N4958k7454L42790n1521k9950j12680k7901K40385L502n9719j01564
2574H8593P4722o7034r1770K8517N3319N9758N7416j85512o0582r185l2687J60178
2562G5733l3641P9028r7758j42974R1369M6013p9971L7965Q067L1366J33691R7701
2550B46589j78305j88387Q6744k47237K61863J13268L1769M3695J17186k09004
$$ plain form
2629 -40674 -50989 19516 -180585 -273605 159 -110318 -11821 57119 -21408 -110819 -80223
2618 -80223 22450 -155281 -9392 -30397 57471 228328 210400 229805 107839 99191 52885
2607 52885 170500 185582 153685 89001 255900 28305 -17199 81650 131567 374717 304483
2596 304483 220217 248926 189635 196499 105313 174125 201995 298738 176273 119645 -142253
2585 -142253 -87295 -114749 228041 176520 146570 33890 5989 246374 249876 190157 88593
2574 88593 163315 96281 4511 33028 86347 146105 203521 18009 -42573 -51758 -84445 75733
2562 75733 42092 121120 23362 -119612 -28243 17770 -62201 -24236 -16169 15197 148888 246589
2550 246589 68284 -120103 -33359 -280596 -18733 94535 126304 169999 287185 78181
2540G8181r2040Q0639k3621m61O0747j10747Q4772k31072P7105J3945m4420J80036
2528G3064j84486P0723P8088n1102o9678k5820Q8916j04711q3178J12609r0986
2517a86561J23492J9743J30341j80594N0420j36882J61562R2198k79502l9639
2507b45422K60212O8200R213j46460J07756J34559k78652j6050J02919Q1559J13806
2496A91640K25217j86575O7134j03152k40851p8249O4871l0859n8168K00174r3992
2485d2810l1393r2565k5841Q9543j6858R8333J53868j74982l93068M08957O9189
2474D2373Q4745j04061J995R933j01009j61870L57835n2263k31962K07998J68892
2463B22606Q2638j96054m39j07799m9496k5398J58041K1267p4148j71421K6010
$$ plain form
2540 78181 -13859 66780 43159 42698 103445 -7302 77470 -153602 -76497 -62552 -106972 73064
2528 73064 -111422 -40699 37389 -13713 -83391 -109211 -20295 -125006 -208184 -95575 -186561
2517 -186561 -63069 -43326 87015 -93579 -43159 -180041 -18479 73719 -205783 -245422
2507 -245422 14790 82990 92203 -54257 53499 188058 -90594 -106644 -3725 77834 191640
2496 191640 416857 230282 297416 194264 -46587 -124836 -59965 -90824 -148992 51182 -42810
2485 -42810 -74203 -166768 -192609 -103066 -119924 -21591 132277 -42705 -435773 -26816 42373
2474 42373 127118 23057 25052 34985 -66024 -227894 129941 77678 -154284 53714 222606
2463 222606 305244 109190 108751 952 -48544 -73942 84099 105366 31218 -140203 -114193
2452a14193J98982k0045q4336J15712J18417k2872l8968K08799J9973Q070j65784
2441B23755j1291Q9781K0971j00847j27432m8417J4963J95642k6657k02405R1859
2430A19922Q4677R9755Q172p6793q714j37425j16365k32322J70444o2881R5039
2419e6491K7116N3755K93186j93336l0289p686k6521k0728J38849o3116j21526
2408f787O6362J10544J62826j43704m0925j05203j53709R8829K29828O8365M4463
2397C30889J26584o6988j32870j69268j51737R6451J62265j98493k5827M34292
2387D05298k9113k47269j33896P4167K26062l836J60181K27845n1381P441m5542
2376E89957j65914P70K2647p5347J1945j1225j7690K6849j29266o5275R2648M5851
$$ plain form
2452 -114193 84789 64744 -19592 96120 214537 191665 152697 361496 381469 389539 223755
2441 223755 212464 302245 323216 222369 94937 46520 61483 257125 230468 28063 119922
2430 119922 204599 304354 312526 235733 227019 89594 -26771 -259093 -88649 -151530 -56491
2419 -56491 -29375 24380 317566 124230 93941 86255 59734 39006 177855 114739 -6787
2408 -6787 59575 170119 332945 189241 148316 43113 -110596 -11767 218061 286426 330889
2397 330889 457473 390485 257615 88347 -63390 33061 195326 -3167 -28994 405298
2387 405298 376185 128916 -4980 69187 295249 291413 451594 679439 628058 635499 589957
2376 589957 424043 424813 447460 372113 384058 372833 355143 381992 252726 187451 280099 325950
2364C25950J26152j13158J07648j01594j07756l9351q5745R5071q641J7358j5991
2353A99943j9333Q9721K55q8345J18389L4000K8981L9229J8800j0382k2127j86148
2341B02983m1444J59482j16138r6340K2930N0212p646L1428j3692L3281M5342
2330B70398k23112N0540J63802j05234r3016K4746M537J2769j90908P1194K7772
2319A3488J13256K32130N6872j19057j19855m8218j04279K09693M1991o3786K17122
2308D29357j17786L1803j74562j06011O4471K18110j02416k8332J52762l2962
2298C34434j09018N7995P1898k88893j05999K06476m777M4979J18039k15004N8034
2287A68164J54929J03579O2243j16153m1231l385M5532O8353J04867l4213r1718
$$ plain form
2364 325950 452102 338944 446592 344998 237242 197891 112146 207217 198576 215934 199943
2353 199943 180610 270331 270586 182241 300630 334630 363611 402840 421640 411258 389131 202983
2341 202983 161539 321021 204883 108543 131473 181685 174039 205467 191775 225056 270398
2330 270398 47286 97826 261628 156394 63378 88124 92661 105430 -85478 -14284 13488
2319 13488 126744 358874 415746 296689 176834 128616 24337 234030 276021 212235 429357
2308 429357 311571 343374 168812 62801 127272 345382 242966 214634 367396 334434
2298 334434 225416 283411 355309 66416 -39583 166893 162116 207095 325134 110130 168164
2287 168164 323093 426672 488915 372762 331531 328146 373678 442031 546898 512685 420967
2276D20967j37814j1169K77875j40850L9498k2408k28960J02690j19939o2017
2266A17873J99809j7125K9548M6691J29937M3061J49361l643P0045K8450j18816
2255F75191j83442k13037L1125J08930M1763K1173k6311j13341J26446J25804
2245E94301N9134o080j93478j42583N4618l469P4077J53746j09503j5950R5678
2234E60491M039K01383r0809r807Q5049j56580J0942j55460J1968M7342K91378
2223G99936n7551M6866K72103N4301k89682J50983O8525l1603P261J47806l8774
2212A130171p9122J09213J7555R7901J06835k07079p2027J04630J63003M5210
2202A416290p0478Q6899j34060P7361O0324K91036m0558j04k38521o5799J10802
$$ plain form
2276 420967 283153 271984 549859 409009 448507 426099 197139 299829 179890 117873
2266 117873 317682 300557 330105 376796 506733 549794 699155 695512 765557 794007 675191
2255 675191 491749 278712 309837 418767 460530 481703 455392 342051 468497 594301
2245 594301 653435 647355 453877 311294 365912 362443 436520 590266 480763 464813 560491
2234 560491 564530 765913 675104 665297 750346 593766 604708 449248 461216 508558 799936
2223 799936 742385 789251 1061354 1115655 825973 976956 1045481 1013878 1021139 1168945 1130171
2212 1130171 1051049 1160262 1177817 1275718 1382553 1175474 1103447 1208077 1371080 1416290
2202 1416290 1345812 1432711 1298651 1376012 1436336 1727372 1686814 1686710 1448189 1382390 1493192
2191A493192j8899K02082K74831j34631j82828q750K65057j03975j06519K8813
2181A708373q1971K3713O4001K03861J59787Q9510k38654J2598R4657J49648j4373
2170B171150M7099P4146j18615l1358J17258K60499J17822J27759k33180n2743
2160B479837N6250K01620J6541r6691K34223K88215J07790o0108K19451J82257
2150C629385l5133N5742J55196Q5821R7487J47707K25305M41076M02225J99375
2140E404186L97803L18654R1159N06296M60225L42286M62649N83367N58911Q16570
2130I942106R52729J066687J093585J396842R31875J189905J563176J788919K328898
2121B2254722K840277L450905M249024M805997O272219P595182J0676404J3749795
$$ plain form
2191 1493192 1474293 1676375 1951206 1816575 1633747 1624997 1890054 1786079 1679560 1708373
2181 1708373 1626402 1650115 1714116 1917977 2077764 2167274 1928620 1941218 2035875 2185523 2171150
2170 2171150 2218249 2292395 2173780 2142422 2259680 2520179 2638001 2765760 2532580 2479837
2160 2479837 2536087 2737707 2754248 2657557 2891780 3179995 3287785 3227677 3447128 3629385
2150 3629385 3594252 3649994 3805190 3891011 3988498 4136205 4361510 4802586 5204811 5404186
2140 5404186 5801989 6120643 6211802 6718098 7178323 7520609 7983258 8566625 9125536 9942106
2130 9942106 10894835 11961522 13055107 14451949 15383824 16573729 18136905 19925824 22254722
2121 22254722 25094999 28545904 32794928 37600925 43873144 51468326 62144730 75894525
2113G5894525J1630763P052203n811541j5813991j7666395j2919682q030282n924503
2105B8411097m080492l264836k009498j868153j476255j209028q09741n62039
2097A3131055o28379q68358q68878p57954r42599r24099l62452l21419k12265
2088G244652k90415k06226m08451l25760p1645k83328k97235j33143j89585k32341
2078D806523j66986L7054k84929j68941j11993m37951j5503k68723m9477m1515
2068C297559j00866j93813j84512K9320j2732j44913K652k19611j03547N571j75339
2057B199769j19569k57288O7260M8707j86952O1987r6542j51686O2345J69923
2047A797954k5856K6396n2274k01486J2792j56796K24345k71246n154L8110Q4032
$$ plain form
2113 75894525 87525288 94577491 88765950 72951959 55285564 42365882 34335600 28411097
2105 28411097 24330605 21065769 19056271 17188118 15711863 14502835 13693094 13131055
2097 13131055 12502676 11634318 10765440 10007486 9064887 8140788 7778336 7456917 7244652
2088 7244652 6954237 6748011 6339560 6013800 5942155 5658827 5361592 5228449 5038864 4806523
2078 4806523 4639537 4676591 4391662 4222721 4110728 3672777 3657274 3388551 3339074 3297559
2068 3297559 3196693 3002880 2818368 2847688 2834956 2690043 2692695 2473084 2369537 2375108 2199769
2057 2199769 2080200 1822912 1890172 1938879 1751927 1813914 1717372 1565686 1628031 1797954
2047 1797954 1772098 1798494 1746220 1544734 1557526 1400730 1625075 1353829 1348675 1386785 1470817
2036A470817n7297l5484k7858k63036Q372j59971L9521K15158p7653J07631k4980
2025A195220N7717p3404k77437p1171J16194J8728J8748O274j42952O5347K2748
2014I36012j7161o5306R0320k60J22465j36365j22450M4270j81384q0049q7400
2003E02692R95P2511j5236R8259j11195P5242R3825j71461l3910J46304J18224
1992G76250j38991j26074R6388j20743O8552K13411o871j63456m1594K0837l7779
1981E39930j38174j36112J18143J16278K1828j37884R4766q1881k74851p5602
1971D6441Q5929K91018N2402M1046j07931J2352K1133j6131j9831k29290o2721
1960A14417J46933K73005j80410p5394J8818r3773J05972j28070P5319R4494Q2309
$$ plain form
2036 1470817 1413520 1378036 1350178 1087142 1095514 935543 975064 1190222 1112569 1220200 1195220
2025 1195220 1252937 1179533 902096 830925 947119 965847 984595 990869 847917 913264 936012
2014 936012 918851 853545 943865 943605 1066070 929705 807255 851525 670141 590092 502692
2003 502692 503687 576198 560962 659221 548026 623268 717093 545632 511722 658026 776250
1992 776250 637259 511185 607573 486830 555382 768793 761922 598466 556872 577709 539930
1981 539930 401756 265644 383787 500065 521893 384009 478775 396894 122043 46441
1971 46441 132370 423388 475790 516836 408905 421257 442390 426259 406428 177138 114417
1960 114417 261350 534355 353945 278551 297369 203596 309568 181498 256817 351311 433620
1949D33620j10842k08301J00897O6825j21144j0980K44265q2150o2604J30163
1939C79749K0832k02034k43208K7814J56633J28399l898j46143J50946L3461l05257
1928b706r6236N6041N4895J45864K8367j12013j02288K79005J4310j16027J65300
1917C14512l0299P5389j58668m0056l5967k19765O3824J41042K30855j94323l51982
1906b05438K61020J69425j99191J07911j35723l3924J58873O9822N2206r6635
1896A48346P94k43508r0638K76181R4445l4157j74944n1195L15018J06599j20673
1885B26268k48879r4454o9653P0117j28765J99342J53935P1746Q8444M3217j76319
1874A34999m8818J43161l0514M1180k28037J1053K72049L0596l4334k7877J0348
$$ plain form
1949 433620 322778 114477 215374 282199 161055 150075 394340 312190 249586 379749
1939 379749 400581 198547 -44661 -16847 139786 268185 264287 118144 269090 302551 -2706
1928 -2706 -98942 -42901 11994 157858 186225 74212 -28076 250929 265239 149212 314512
1917 314512 284213 359602 200934 160878 124911 -94854 -31030 110012 340867 146544 -205438
1906 -205438 55582 225007 25816 133727 -1996 -35920 122953 192775 244981 148346
1896 148346 149140 -94368 -185006 91175 185620 151463 -23481 -74676 240342 346941 226268
1885 226268 -22611 -117065 -186718 -116601 -245366 -46024 107911 179657 268101 311318 134999
1874 134999 86181 229342 198828 240008 11971 23024 295073 325669 291335 263458 273806
1863B73806o2163m2724R7301L0151N3433k96545P4708K8373j44440K59804J01660
1852C73364r3096j01048O3603N0250j05327q3218K73641K33258r9570q8938J3751
1841D36670Q9537j72120j04355q0282Q0819l3671l06360M3841J00657J53930k5611
1830A83055N9989k3459J27730J37896k40768Q1984k2786j17619R9869J9335j69957
1819A35269O629K18q7702j50218K6849R2460J48280J12828o6074j91748Q2646
1808A09437J65757L995k60341K31757j91655k04750J85328q3269o1150K13517
1798A08626r3616m2596N3728L5816m4817l9375P3697n5468J20669o8255Q685J6784
1786G3878k10412j08378k6863J55580J9902K00584j09357n3107J03128j85090
$$ plain form
1863 273806 211643 168919 266220 296371 349804 53259 127967 156340 11900 271704 373364
1852 373364 280268 179220 242823 293073 187746 104528 378169 611427 511857 422919 436670
1841 436670 526207 354087 249732 169450 250269 216598 -89762 -45921 54736 208666 183055
1830 183055 243044 219585 347315 485211 244443 326427 303641 186022 285891 305226 135269
1819 135269 141898 142116 54414 -95804 -68955 23505 171785 284613 218539 26791 109437
1808 109437 275194 279189 18848 250605 58950 -145800 39528 -43741 -104891 108626
1798 108626 15010 -27586 26142 61958 17141 -22234 51463 -4005 116664 48409 57094 73878
1786 73878 -136534 -244912 -271775 -116195 -96293 104291 -5066 -58173 44955 -140135
1776a40135M9092q2596M3977r2411J23628O0919K7426m841J05179J9851m1856
1765F8233k8100J0060j52087j09364Q5724L6636J03426Q1853q7700q8376j45026
1754b24721K1846K39956Q0888L5747j07458Q6352j21400j45236N9520J94440n3501
1743F6433k65462J33790j28651K18244J31724k4739M1517L8642j8214P3346r5534
1732A71096k02241k00109J36496r5395J58461n3777L0743j3162q574J21151q7598
1721d2909K03774r5104k09787Q4439J29548n3226j2998K2166l4334j79393Q9948
1710i7876N0315P6071o684k17752J24968j3142k53915J02998N270J39311P1153
1699a9283N8993j0271k6737j7223k8849L7794o293k9984Q9121j00222j2322R1785
$$ plain form
1776 -140135 -91043 -173639 -129662 -222073 -98445 -37526 -10100 -14941 90238 110089 68233
1765 68233 40133 50193 -101894 -211258 -125534 -88898 14528 96381 8681 -79695 -224721
1754 -224721 -202875 37081 117969 153716 46258 132610 11210 -134026 -74506 119934 66433
1743 66433 -199029 -65239 -193890 24354 156078 131339 172856 211498 193284 266630 171096
1732 171096 -31145 -231254 -94758 -190153 -31692 -85469 -54726 -67888 -76462 44689 -42909
1721 -42909 160865 65761 -144026 -59587 69961 16735 3737 25903 -8431 -187824 -97876
1710 -97876 -47561 28510 21826 -195926 -70958 -84100 -338015 -235017 -229747 -90436 -19283
1699 -19283 39710 29439 2702 -14521 -43370 -5576 -11869 -41853 47268 -52954 -65276 26509
1687B6509n3070J63849M057j34351j51830J58695J31339k30320O0276o3951P021
1676h1776J61226l2131m5397k17106r5015K40544j06935l6625M5446J28246J13999
1665G4476j81420k46467J29490J61176j33996r2695R8728Q5114n631Q5981j01326
1654a26570R5287M7927Q4508J48862Q7429l07119l3041R7815Q4602N0540j5144
1643B15096j76516j07714L84280n4400j33313j97637j1911J50543j63879j28137
1633b23588J50996K34340q0063J52671J29534l37385r7033o1620O208l2234M3704
1622a14470j21287j45164K10250J73192j44718k1391R4582P4249j73721m1882
1612b10360N9977K21842o2099q5830K7172j0981n0170R587n5940j95664J75859
$$ plain form
1687 26509 -26561 137288 141345 6994 -144836 13859 145198 -85122 -24846 -88797 -81776
1676 -81776 79450 47319 1922 -215184 -310199 -69655 -176590 -213215 -167769 -39523 74476
1665 74476 -106944 -353411 -223921 -62745 -196741 -289436 -190708 -105594 -111225 -25244 -126570
1654 -126570 -31283 16644 101152 250014 337443 30324 -2717 95098 179700 230240 215096
1643 215096 38580 -69134 315146 260746 127433 -70204 -82115 68428 -95451 -223588
1633 -223588 -72592 161748 81685 234356 363890 26505 -70528 -132148 -125940 -158174 -114470
1622 -114470 -235757 -380921 -170671 2521 -142197 -163588 -69006 5243 -168478 -210360
1612 -210360 -150383 71459 9360 -76470 -49298 -60279 -110449 -100862 -156802 -352466 -176607
1601a76607P8536j03066M6385J52322l1708q4003k6044R035M4472k8569j41844
1590b61091J05472J4387n7121O3995M8968Q1626K3299p0589j05773L6422R9853
1579b0552j38825M0800q6098j0021J22611K4480j24649M7848m7013n6187P6847
1568a70759j37255K66692m2932m9880O2883j49J31674k87484K3082J11406p0561
1557a63283Q0366K57557q0182j97776Q8830j16668K32604J37156j41616q9741
1547G247j81577o9605J07839J17686j1697Q3421n0441l5969J09857n3395q8266
1536f4900K753P1837j35274J99173m6717J15559k6887j49819R5664k36411J07584
1525f7438O7215m4245j33460M5374K01473l9345j55216k8711o8225J19180J57540
$$ plain form
1601 -176607 -98071 -201137 -154752 -2430 -34138 -118141 -144185 -135150 -90678 -119247 -261091
1590 -261091 -155619 -141232 -198353 -134358 -85390 -3764 19535 -51054 -156827 -120405 -20552
1579 -20552 -159377 -118577 -204675 -214696 -92085 -67605 -192254 -144406 -191419 -247606 -170759
1568 -170759 -308014 -41322 -84254 -134134 -71251 -71400 60274 -227210 -204128 -92722 -163283
1557 -163283 -82917 174640 94458 -103318 -14488 -131156 101448 238604 96988 7247
1547 7247 -174330 -243935 -136096 -18410 -30107 53314 2873 -33096 76761 23366 -64900
1536 -64900 -62147 9690 -125584 73589 26872 142431 115544 -34275 61389 -175022 -67438
1525 -67438 -223 -44468 -177928 -132554 68919 29574 -125642 -154353 -222578 -103398 54142
1514E4142p398j38742Q7374k28749j14919K68875K11196J34309k98698n9934O4958
1503b7586j14358R0072p9282K48176J09243n633j73870j82862k7163j2819l551
1492a79633K44234P060j45458J9133J10840M5067j41268P0403j07146o608P1937
1481a1439J18819j58442m728N6517Q1326J04519j6801j06469p8057P6620J90020
1470B51885j04125l5702j92436J34088J37697j25740m1509l4755J57678j05278
1460D1803o8586R724n8260j54469J51489o2548K70772k72960M0171J28645P7236
1449A03017m4190q5321N4017r7617o6044m5700l6556l7555K16945l7119J42106
1438F5983J00274o7513j08179Q3912m3320l580r6612l6915j82762N9191J05929
$$ plain form
1514 54142 46744 -91998 -4624 -233373 -348292 -79417 131779 266088 -32610 -92544 -27586
1503 -27586 -141944 -51872 -131154 117022 226265 220632 46762 -136100 -163263 -176082 -179633
1492 -179633 64601 71661 -73797 -54664 56176 101243 -40025 30378 -76768 -83376 -11439
1481 -11439 107380 -51062 -55790 727 82053 186572 169771 63302 -14755 61865 251885
1470 251885 147760 112058 -80378 53710 191407 65667 24158 -10597 147081 41803
1460 41803 -26783 -17059 -75319 -229788 -78299 -140847 129925 -143035 -102864 25781 103017
1449 103017 58827 -26494 27523 -70094 -136138 -181838 -218394 -255949 -39004 -76123 65983
1438 65983 166257 98744 -9435 74477 31157 27577 -69035 -105950 -288712 -229521 -123592
1427a23592P4532M6523M7165o9996K75337j51149j11418j93974J38334l096j66718
1416b38052L78763J48970j86153M1202l3835j94380J90560j18273O0473l8918
1406A0357Q4908q8687j09027j76672R3932r6000J11443M2566j25127R54K36311
1395a5042P4222k58325Q0407l1310J07564J3669n4326j79259K56811l7341o9151
1384a12081R9099P2991J52352L6945k68454o653K9872r0072L0725r6822Q9138
1373f2960Q2489J46J31808p9693p4934j1098q6315j01557J17668J12100q9492
1362f1838j61654N8917J44936m3097j09495M9294n5796r6640K62666j8407q3738
1351a14852K18431J5153l62776K082K23198P0382r3390P4644j25358J21216J62041
$$ plain form
1427 -123592 -49060 -2537 44628 -25368 249969 98820 -12598 -206572 -68238 -71334 -238052
1416 -238052 140711 289681 103528 144730 110895 -83485 107075 -11198 49275 10357
1406 10357 95265 6578 -102449 -279121 -185189 -281189 -169746 -127180 -252307 -251353 -15042
1395 -15042 59180 -199145 -118738 -150048 -42484 -28815 -83141 -262400 -5589 -42930 -112081
1384 -112081 -12982 60009 212361 249306 -19148 -25801 4071 -86001 -55276 -152098 -62960
1373 -62960 19529 19675 151483 71790 -3144 -14242 -100557 -202114 -84446 27654 -61838
1362 -61838 -223492 -164575 -19639 -62736 -172231 -122937 -178733 -275373 -12707 -31114 -114852
1351 -114852 103579 118732 -244044 -241962 -18764 51618 -41772 32872 -92486 28730 190771
1340A90771j46303r3082R6464j15641p1472j0654Q9037j54258J57924j9114q4776
1329a61104K62904o6636P014n6167J08016j17578k0096J26063J29646k87917p556
1318h3411J10819m1266J17742Q4304j84985j10580j05798R7219J56235p8366O4390
1307B6303l06844n6935K22054R2732j16609L2809J24582j9769m4078N16J25513
1296H0274K653j44735K0023o637M851j21088J15699N7935P9366K1726o129m7149
1284E6789j02159q0788N4842j77467m4201J38961K24686o1996O2779j1152r9573
1273c9279n8068R6745J31539n3054J9445j35289n6141P3974n5782j39446q632
1262b23988L7961K765j99671K32869J1102j23573J68843k8685p3553J85677j01146
$$ plain form
1340 190771 44468 -48614 47850 -67791 -139263 -149917 -60880 -215138 -57214 -76328 -161104
1329 -161104 101800 35164 42178 -13989 94027 -23551 -43647 82416 212062 -75855 -83411
1318 -83411 27408 -13858 103884 188188 3203 -107377 -213175 -115956 40279 -38087 26303
1307 26303 -280541 -337476 -115422 -22690 -139299 -106490 18092 -1677 -45755 -45239 80274
1296 80274 82927 -61808 -41785 -48422 -43571 -164659 -48960 8975 88341 110067 103938 56789
1284 56789 -45370 -126158 -71316 -248783 -292984 -154023 70663 8667 71446 60294 -39279
1273 -39279 -97347 -602 130937 77883 97328 -37961 -94102 -20128 -75910 -215356 -223988
1262 -223988 -186027 -183262 -382933 -150064 -138962 -262535 -93692 -122377 -195930 -10253 -111399
1251a11399n9823L23782k18656j7251M390L3806K15923p0168M4936P7990j55954
1240F7576k00214K32959P5213n7698o4380n4158j46729L9384R1372J02828M0699
$$ plain form
1251 -111399 -171222 152560 -66096 -83347 -78957 -45151 170772 100604 145540 223530 67576
1240 67576 -132638 100321 175534 117836 53456 -702 -147431 -108047 -16675 86153 126852
$$ [...]
##END NTUPLES=NMR SPECTRUM
##END=
