##TITLE=1H_TG-2347-2
 CDCl3
 8 sc, 
 9.02.2022
##JCAMPDX= 6.0         $$ Bruker NMR JCAMP-DX V2.0
##DATA TYPE= NMR SPECTRUM
##DATA CLASS= NTUPLES
##ORIGIN= UXNMR, Bruker Analytische Messtechnik GmbH
##OWNER= root
$$ XWIN-NMR		Version 3.5
$$ Wed Feb  9 11:47:52 2022 Russian Standard Time (UT+4h)  she@DPX200
##.OBSERVE FREQUENCY= 200.131346
##.OBSERVE NUCLEUS= ^1H
##.ACQUISITION MODE= SIMULTANEOUS
##.ACQUISITION SCHEME= undefined
##.AVERAGES= 8
##.DIGITISER RES= 18
##SPECTROMETER/DATA SYSTEM= spect
##.PULSE SEQUENCE= zg30
##.SOLVENT NAME= CDCl3
##.SHIFT REFERENCE= (INTERNAL, CDCl3, 0, 15.7215)
##AUDIT TRAIL= $$ (NUMBER, WHEN, WHO, WHERE, WHAT)
$$ ##TITLE= Audit trail, XWIN-NMR		Version 3.5
$$ ##JCAMPDX= 5.01
$$ ##ORIGIN= Bruker BioSpin GmbH
$$ ##OWNER= she
$$ F:/spectra/data/she/nmr/H-F/1/pdata/1/auditp.txt
$$ ##AUDIT TRAIL=  $$ (NUMBER, WHEN, WHO, WHERE, WHAT)
(   1,<2022-02-09 11:45:10.60 +0400>,<she>,<DPX200>,
      <created by zg, POWCHK disabled, PULCHK disabled
       configuration hash MD5:
       00 E9 B6 7A A2 85 ED C7 34 08 36 98 17 FE 4E 26
       data hash MD5: 16K
       01 CF 48 E0 2B 18 9F D8 B8 58 50 0B 48 1E 7B D2>)
(   2,<2022-02-09 11:45:22.43 +0400>,<she>,<DPX200>,
      <Start of raw data processing
       efp BC_mod = 2 LB = 0.24 FT_mod = 6 PKNL = 1 PHC0 = -15870.67 PHC1 = 13.20078 SI = 16K 
       data hash MD5: 16K
       E6 FF 44 CD 66 BE 63 11 D5 A3 9A 57 C7 D5 F2 2D>)
(   3,<2022-02-09 11:45:48.00 +0400>,<she>,<DPX200>,
      <pk PHC0 = 0.9816336 PHC1 = -0.8 
       data hash MD5: 16K
       A5 D3 9C BA B2 40 B0 3C 8C A4 57 23 7D B9 19 8C>)
(   4,<2022-02-09 11:45:52.35 +0400>,<she>,<DPX200>,
      <abs ABSG = 5 
       data hash MD5: 16K
       D8 70 63 24 86 63 A3 87 52 FA C8 28 AA EF F3 94>)
$$ ##END=
$$ 
$$ hash MD5
$$ 3D 2C 39 98 DF 79 28 D6 B2 D5 75 09 7E E7 F5 D2
##$RELAX= 
##$RELAX= 
##$RELAX= 
##$RELAX= 
##$RELAX= 
##$RELAX= 
$$ Bruker specific parameters
$$ --------------------------
##$DU= <F:/spectra>
##$EXPNO= 1
##$NAME= <H-F>
##$PROCNO= 1
##$TYPE= <nmr>
##$USER= <she>
##$AMP= (0..31)
100 100 100 100 100 100 100 100 100 100 100 100 100 100 100 100 100 100 
100 100 100 100 100 100 100 100 100 100 100 100 100 100 
##$AQSEQ= 0
##$AQ_mod= 1
##$AUNM= <au_zg>
##$AUTOPOS= <>
##$BF1= 200.13
##$BF2= 200.13
##$BF3= 200.13
##$BF4= 200.13
##$BF5= 200.13
##$BF6= 200.13
##$BF7= 200.13
##$BF8= 200.13
##$BYTORDA= 1
##$CFDGTYP= 0
##$CFRGTYP= 5
##$CHEMSTR= <none>
##$CNST= (0..31)
1 1 145 1 1 1 1 1 1 1 1 1 1 1 1 1 1 1 1 1 1 1 1 1 1 1 1 1 1 1 1 1 
##$CPDPRG= <>
##$CPDPRG1= <>
##$CPDPRG2= <>
##$CPDPRG3= <>
##$CPDPRG4= <mlev>
##$CPDPRG5= <mlev>
##$CPDPRG6= <mlev>
##$CPDPRG7= <mlev>
##$CPDPRG8= <mlev>
##$CPDPRGB= <>
##$CPDPRGT= <>
##$D= (0..31)
0 1.2 0 0 0 0 0 0 0 0.06 0 0.03 0 0 0 0 0.0002 0 0 0 0 0 0 0 0 0 0 0 0 
0 0 0 
##$DATE= 1644392709
##$DBL= (0..7)
120 120 120 120 120 120 120 120 
##$DBP= (0..7)
150 150 150 150 150 150 150 150 
##$DBP07= 0
##$DBPNAM0= <>
##$DBPNAM1= <>
##$DBPNAM2= <>
##$DBPNAM3= <>
##$DBPNAM4= <>
$$ [...]
##$SUBNAM2= <"">
##$SUBNAM3= <"">
##$SUBNAM4= <"">
##$SUBNAM5= <"">
##$SUBNAM6= <"">
##$SUBNAM7= <"">
##$SUBNAM8= <"">
##$SUBNAM9= <"">
##$SW= 18.0517287032376
##$SWIBOX= (0..15)
0 0 2 0 0 0 0 0 0 0 0 0 0 0 0 0 
##$SW_h= 3612.71676300578
##$TD= 16384
##$TD0= 1
##$TE= 0
##$TE2= 300
##$TE3= 300
##$TEG= 300
##$TL= (0..7)
0 120 120 120 120 120 120 120 
##$TP= (0..7)
150 150 150 150 150 150 150 150 
##$TP07= 0
##$TPNAME0= <>
##$TPNAME1= <>
##$TPNAME2= <>
##$TPNAME3= <>
##$TPNAME4= <>
##$TPNAME5= <>
##$TPNAME6= <>
##$TPNAME7= <>
##$TPOAL= (0..7)
0.5 0.5 0.5 0.5 0.5 0.5 0.5 0.5 
##$TPOFFS= (0..7)
0 0 0 0 0 0 0 0 
##$TUNHIN= 0
##$TUNHOUT= 0
##$TUNXOUT= 0
##$USERA1= <user>
##$USERA2= <user>
##$USERA3= <user>
##$USERA4= <user>
##$USERA5= <user>
##$V9= 5
##$VALIST= <valist>
##$VCLIST= <CCCCCCCCCCCCCCC>
##$VD= 0
##$VDLIST= <DDDDDDDDDDDDDDD>
##$VPLIST= <PPPPPPPPPPPPPPP>
##$VTLIST= <TTTTTTTTTTTTTTT>
##$WBST= 1024
##$WBSW= 4
##$XGAIN= (0..3)
0 0 0 0 
##$XL= 0
##$YL= 0
##$YMAX_a= 226992
##$YMIN_a= -358901
##$ZGOPTNS= <>
##$ZL1= 120
##$ZL2= 120
##$ZL3= 120
##$ZL4= 120
##$ABSF1= 15.72486
##$ABSF2= -2.326989
##$ABSG= 5
##$ABSL= 3
##$ALPHA= 0
##$AQORDER= 0
##$ASSFAC= 0
##$ASSFACI= 0
##$ASSFACX= 0
##$ASSWID= 0
##$AUNMP= <proc_1d>
##$AZFE= 0.1
##$AZFW= 0.1
##$BCFW= 0
##$BC_mod= 2
##$BYTORDP= 0
##$COROFFS= 0
##$CY= -3
##$DATMOD= 1
##$DC= 0
##$DFILT= <>
##$DTYPP= 0
##$F1P= 0
##$F2P= 0
##$FCOR= 1
##$FTSIZE= 16384
##$FT_mod= 6
##$GAMMA= 0
##$GB= 0
##$INTBC= 1
##$INTSCL= 0
##$ISEN= 128
##$LB= 0.24
##$LEV0= 0
##$LPBIN= 0
##$MAXI= 10000
##$MC2= 0
##$MEAN= 0
##$ME_mod= 0
##$MI= 1.114404
##$NCOEF= 0
##$NC_proc= -7
##$NLEV= 6
##$NOISF1= 3.799351
##$NOISF2= 2.8
##$NSP= 0
##$NTH_PI= 0
##$NZP= 0
##$OFFSET= 15.72155
##$PC= 1
##$PHC0= -15869.69
##$PHC1= 12.40078
##$PH_mod= 1
##$PKNL= yes
##$PPARMOD= 0
##$PSCAL= 0
##$PSIGN= 0
##$REVERSE= no
##$SF= 200.130006005737
##$SI= 16384
##$SIGF1= 3
##$SIGF2= 2
##$SINO= 5.538805
##$SIOLD= 16384
##$SREGLST= <1H.CDCl3>
##$SSB= 0
##$STSI= 16384
##$STSR= 0
##$SW_p= 3612.71676300578
##$SYMM= 0
##$S_DEV= 0
##$TDeff= 16384
##$TDoff= 0
##$TI= <>
##$TILT= no
##$TM1= 0
##$TM2= 0
##$TOPLEV= 0
##$USERP1= <user>
##$USERP2= <user>
##$USERP3= <user>
##$USERP4= <user>
##$USERP5= <user>
##$WDW= 1
##$XDIM= 16384
##$YMAX_p= 446238938
##$YMIN_p= -2244588
$$ End of Bruker specific parameters
$$ ---------------------------------
##NTUPLES= NMR SPECTRUM
##VAR_NAME=  FREQUENCY,     SPECTRUM/REAL,   SPECTRUM/IMAG
##SYMBOL=    X,             R,               I
##VAR_TYPE=  INDEPENDENT,   DEPENDENT,       DEPENDENT
##VAR_FORM=  AFFN,          ASDF,            ASDF
##VAR_DIM=   16384,         16384,           16384
##UNITS=     HZ,            ARBITRARY UNITS, ARBITRARY UNITS
##FACTOR=    0.220516191357247, 1,           1
##FIRST=     3146.3538934765, 0,             0
##LAST=      -466.362869529279, 0,           0
##MIN=       -466.362869529279, -2244588,    0
##MAX=       3146.3538934765, 446238938,     0
$$ Real data points
##PAGE= N=1
##DATA TABLE= (X++(R..R)), XYDATA
$$ [...]
7091E0924964o801373m884217l504484k328315j899915j273780r30319n21670
7083B8780891O8724O42547J006847R19339J642270K225642K626555K808436K340690
7074D3061941P05087p16359j930122k818205l701137l924033l931919l563516
7066B3181737k745967k308195j772157j625307j106102r20557p29830q20506p09765
7057A0443351m59125n39589n20913k55767n45404m00930j18997l36129k18930
7048G047567k38878k56225k66739k85221j43500k00347k79148l14005n5680l6709
7038D971115j78280k68481J6495m3872K4181j40853k48456j76223P9720K4184
7028D059530j66846k11529p2056k25437K0083n8117j52856J4556N5721N6624R8328
$$ plain form
7091 50924964 44123591 39239374 35734890 33406575 31506660 30232880 29302561 28780891
7083 28780891 28849615 29492162 30499009 31418348 33060618 35286260 37912815 40721251 43061941
7074 43061941 43767028 43050669 41120547 38302342 34601205 30677172 26745253 23181737
7066 23181737 20435770 18127575 16355418 14730111 13624009 12703452 11973622 11153116 10443351
7057 10443351 9984226 9444637 8923724 8667957 8122553 7721623 7602626 7266497 7047567
7048 7047567 6808689 6552464 6285725 6000504 5857004 5656657 5377509 5063504 5007824 4971115
7038 4971115 4792835 4524354 4540849 4496977 4521158 4380305 4131849 3955626 4035346 4059530
7028 4059530 3892684 3681155 3609099 3383662 3403745 3345628 3192772 3207328 3263049 3319673 3418001
7017C418001j51708j30738k98405q332o0788k40684q4739j10291J22355j21m9945
7006B404605o7850k04595J8613K3920j6867k28015q7056J07392J36368o0330M9866
6995B076051j05995j6210j45080p6431K9488j87007j22944J53175k2613k00165
6985A382269J8419M969M2333j49389O5295o0453j2341n5871j43145L8557Q0853
6974A211496K3943j205M2915R6506j80547m1535n7579J38733j55457j86788l5546
6963H54936j68058R0795J82416j97314l2524n6267J39077J41799j85345K2240
6953G91755o1625j07269R3682j86704J73372p8075J34797k21656P2051l3219K5129
6942F02238m182j2587L4732J74244l8090j31436n0225p2828K66526J14180j43234
$$ plain form
7017 3418001 3266293 3135555 2837150 2828818 2768030 2527346 2442607 2332316 2454671 2454550 2404605
7006 2404605 2336755 2132160 2150773 2174693 2157826 1929811 1842755 1950147 2086515 2026185 2076051
6995 2076051 1970056 1953846 1808766 1732335 1761823 1574816 1451872 1605047 1582434 1382269
6985 1382269 1400688 1405657 1447990 1298601 1363896 1303443 1291102 1235231 1092086 1130643 1211496
6974 1211496 1235439 1234234 1277149 1373655 1193108 1151573 1093994 1232727 1077270 890482 854936
6963 854936 686878 777673 960089 762775 730251 673984 813061 954860 769515 791755
6953 791755 730130 622861 716543 529839 703211 625136 759933 538277 610328 577109 602238
6942 602238 598056 585469 620201 794445 756355 624919 574694 501866 768392 882572 739338
6931G39338p3424J10441j84640l9746j35337O7854O2062o1181j22324R8647M8726
6920E10416j66353J03256o6802n164J74983J27448j98594k26639j01594j30423
6910B0534L3555K55299M4085L4157Q742J40148J17261m3598j82554N4892j06514
6899C76007J5831m4826L9165R9813j02763M9599l2936P0969q6734O1551O8529
6888E14205n3603k5931K16055j91081j63321R3769J73703j85492P8262J23630
6878E80196j20454j62437j02693N20J68181J7051p0085Q710n8223L4843K3102
6867C18711j63079K36795m5447j36875J50596q4522j38631L1896n7028L1421L9291
6856A83128Q6949q7527J17600m6597m2644r816j8825P0925n3098r0842K8341N5475
$$ plain form
6931 739338 665914 776355 591715 551969 416632 484486 546548 485367 363043 461690 510416
6920 510416 344063 447319 380517 375353 550336 677784 479190 252551 150957 20534
6910 20534 54089 309388 353473 387630 396372 536520 653781 610183 427629 482521 376007
6899 376007 391838 347012 386177 485990 383227 432826 399890 470859 384125 445676 514205
6888 514205 460602 434671 650726 459645 296324 390093 563796 378304 456566 580196
6878 580196 459742 297305 194612 195132 363313 380364 310279 318989 260766 295609 318711
6867 318711 155632 392427 346980 210105 360701 276179 137548 169444 112416 143837 183128
6856 183128 270077 182550 300150 253553 210909 201093 182268 253193 200095 109253 137594 193069
6844A93069J32654j85669K28365j45963j91033J05874o8707J84282l5001K4649
6834B42520j760j14936k6861k9308J05677n447R7572n8860N4389r1213n0679r2342
6822B8752J9971J71170r0529o3229o209R5002R3736L4943n8060K4697P544o5410
6810A92378L090l4957m5414J18634J6444M9573l3941j62391j0882L26997K0039
6799D39570K00340N659m33231j93646R1923K12950n6112l23211P1995P9761j9302
6788G6696O1000R2238O3091M0138k12335m2526R879K1794j3180K61235p2676j59622
6776A25732j50600J03205P5068r2267J26897R7526Q8690m5606j08177J13718k9029
6765C05157j68329o0535O731L6434J48161K6643M1754m3273j93796j23028N778
$$ plain form
6844 193069 325723 140054 368419 222456 31423 137297 68590 252872 217871 242520
6834 242520 240760 125824 98963 69655 175332 169885 267457 208597 262986 171773 121094 28752
6822 28752 48723 219893 129364 66135 59926 154928 248664 283607 225547 250244 257788 192378
6810 192378 195468 160511 115097 233731 250175 299748 265807 103416 92534 419531 439570
6799 439570 639910 645569 212338 18692 110615 323565 267453 -55758 16237 95998 76696
6788 76696 137696 229934 293025 333163 120828 78302 88181 109975 96795 358030 285354 125732
6776 125732 -24868 78337 153405 61138 188035 285561 374251 328645 220468 334186 305157
6765 305157 136828 76293 83024 119458 267619 294262 336016 292743 98947 -24081 -18303
6754a8303J27679J56139L9300L9228m1369p7135M2994j89634j20910J84426K9680
6743A72095j30683J4722K6062j2145M4741j26170J49808K54336L5307k15882J19587
6732C31778k6338k01207Q7096n6885K0305M4022J40627R5830o5553k98418k9266
6721D1991J29869n0562L4776J15669J4238k9179p2086k1987J12528l7234r4395
6710A43628J23960J20477q2583J2691p50J08156Q6021J13463N5149K2531J03251
6699H05994j22274m628m2006J12306k9528j32764p3324R6608J9598j49363j05988
6688C74631j83449p2303M3181J06452j46025P4616J10610N5104k1580q8027O5788
6677C18998J38974R0498j71126J11196j16600j00272P6080k677Q2098Q4740j47677
$$ plain form
6754 -18303 109376 265515 304815 344043 302674 225539 268533 78899 -42011 142415 172095
6743 172095 41412 56134 82196 70051 114792 -11378 138430 392766 428073 212191 331778
6732 331778 305440 104233 191329 134444 154749 198771 339398 435228 369675 71257 41991
6721 41991 171860 121298 156074 271743 285981 256802 184716 162729 275257 238023 143628
6710 143628 267588 388065 305482 318173 317423 425579 511600 625063 680212 702743 805994
6699 805994 683720 679092 637086 749392 719864 587100 513776 610384 629982 480619 374631
6688 374631 191182 118879 162060 268512 122487 197103 307713 362817 341237 253210 318998
6677 318998 457972 548470 377344 488540 371940 271668 347748 345071 427169 511909 364232
6666C64232J25875j62039J05746J11713q5177j00941J84339K2192k73709k28280
6656F3951n2725J1552m9124K46242p5343Q454R0040k7530R5234N379o4689K260
6644B53701j47485J73465L4143k39834M1363J2795k5316M4845N4893o4609J6787
6633A54748Q0790Q8305L0000J0135O2954J13249k60772p0406L1229N2490o5606
6622B27116o540J17943j03435J33656l0213M1803J04836j39260k29562K67974
6612C84318K9199k63914k20820M8743J83045p6473l9346J5299K19472j4029j98519
6601F6975L9867K9973J35460j56050J73881K8664j95985o9255o1530J20783L1638
6590A44421P646j44179K59759J6516N0205q4170k47629O1743M6853L1586j40828
$$ plain form
6666 364232 490107 328068 433814 545527 460350 359409 543748 565940 292231 63951
6656 63951 11226 22778 -26346 219896 144553 153007 243047 215517 310751 316130 251441 253701
6644 253701 106216 279681 313824 73990 115353 128148 102832 147677 202570 137961 154748
6633 154748 235538 323843 353843 363978 426932 540181 279409 209003 240232 292722 227116
6622 227116 220576 338519 235084 368740 338527 380330 485166 345906 116344 384318
6612 384318 413517 149603 -71217 -22474 160571 84098 44752 60051 279523 265494 66975
6601 66975 106842 136815 272275 116225 290106 318770 122785 53530 -8000 112783 144421
6590 144421 152067 7888 267647 284163 334368 250198 2569 64312 111165 142751 1923
6579A923m5462J03340m0866m0467J12733L9983q0988j34132k485J22103J44262
6568A79944o5259n0421k3312R5336Q3333j93000P5087J13291J6244Q878L711j07521
6556A36311R2942K8066k01371J41409M4541J9324k2153j85058J5087L1856N8610
6545A59564j77950r146K40364l7253Q9676Q3145l43964N5365j7100J0696J12579
6534A65976R2755n74n1717j84657K2445j46222K36850J99103m6589J74174p4992
6523C86552m6062j73582Q3660k40833l8954J66419K24885j08826M9176p2201J90797
6512D21031k4281P2464j88420p7711j7593J13792j47299J44450j76032K7304q8511
6501E9194q9778J89222J21875j00203r3930J16273P6497N7386P4702m3693j19457
$$ plain form
6579 1923 -43539 59801 18935 -21532 91201 131184 50196 -83936 -86421 35682 179944
6568 179944 114685 64264 40952 136288 219621 26621 101708 214999 231243 240121 243832 136311
6556 136311 229253 257319 55948 197357 241898 261222 239069 54011 69098 100954 159564
6545 159564 -18386 -27532 212832 175579 265255 348400 4436 59801 42701 53397 165976
6534 165976 258731 258157 206440 21783 44228 -101994 134856 333959 287370 461544 386552
6523 386552 340490 166908 250568 9735 -29219 137200 362085 253259 302435 230234 421031
6512 421031 396750 469214 280794 203083 185490 299282 151983 296433 120401 147705 59194
6501 59194 -30584 158638 280513 180310 86380 202653 279150 336536 411238 367545 248088
6490B48088J28188k41582j79325O9487K63289j96644J08247L6185K1378N9035
6480C16346R4567j8580m9686J0193k4709k8436J23396k08713J27045k01635J9666
6469A59454p3314L0179L7155J48293r3500k488N1677J23407J9009j75669J7362
6458B41565k67978J19391J10875L7705J47567N5384k59455K5341J15719L8657
6448C64771j82734o5381J50642J21995o1287j35903j8551J19152L337J37576m0728
6437C92889k1291M4763j21308j36605n9045J85056J04893N1247j0081j17180j59009
6426A54329K02733l0170j8099Q4045J0173o8763j07007J61673P2987p5250J02986
6415D89637L268l29753K8079l8906J41282Q4694j77247O4916J7445m6045Q6192
$$ plain form
6490 248088 376276 134694 -44631 24856 288145 91501 199748 235933 257311 316346
6480 316346 410913 392333 342647 352840 328131 299695 423091 214378 341423 139788 159454
6469 159454 86140 116319 153474 301767 208267 205779 257456 380863 399872 224203 241565
6458 241565 -26413 92978 203853 241558 389125 444509 185054 210395 326114 364771
6448 364771 182037 116656 267298 389293 328006 192103 173552 292704 296041 433617 392889
6437 392889 371598 416361 295053 158448 99403 284459 389352 440599 430518 313338 154329
6426 154329 357062 326892 308793 392838 403011 334248 227241 388914 461901 386651 489637
6415 489637 492905 163152 191231 152325 293607 378301 201054 265970 283415 237370 323562
6404C23562R879O2828J46554j16853l7443k2267K18231P1246j15555j81322p1495
6393B87365L7941J56374O0268k87991K7177p8431q4793K31647q1087J45935n1408
6382C62997j35622j55941K19540J43373J4569J60320j40161p8504q5656j17180
6372A87735j33971K09421P8247J75983J21966j25099O88O2480q2664p1281O8978
6361D92483m4644R492J2565J38463L142j93834L4916o0711J39017q0619j97967
6350B52303j22477K46575L34996j37422o8432P7974N5658r3453o1670o1419P1790
6339D94423R8461l5910L2297m7935r1094K0170m8421K7684J15981Q9219K967j08904
6327E48938r3858K1235m2879K2103M7358l0845J94562R7722j88195o122L768R7231
$$ plain form
6404 323562 333441 396269 542823 425970 388527 366260 584491 655737 540182 358860 287365
6393 287365 325306 481680 541948 253957 281134 202703 117910 349557 268470 414405 362997
6382 362997 227375 71434 290974 434347 448916 609236 469075 390571 304915 187735
6372 187735 53764 263185 341432 517415 639381 514282 514970 577450 494786 423505 492483
6361 492483 447839 457331 469896 608359 611501 417667 452583 391872 530889 450270 252303
6350 252303 129826 376401 711397 573975 505543 583517 639175 545722 484052 422633 494423
6339 494423 592884 556974 589271 541336 450242 470412 421991 449675 565656 654875 657842 548938
6327 548938 455080 476315 433436 455539 502897 472052 666614 764336 576141 570019 573787 671018
6315F71018k4893j35204N0951J10412j43344P226j8075p9545o3357O9667K83881
6304G28737L957p1239r0136J37062o7659Q4437J91976L6541k13449J32971j37691
6293G35507J55602J72623j06702R3294p667l9290k6980j2848J23503J22437j58029
6282A051450M3875Q0480k07396m6792j49337j72811l2950J1482K04300Q7409K5798
6271H95508Q9263j84666m9363R0751m883J4936r1017l4889J60148N6553j34286
6260H08055q486K03343L5408L0121M5384J8798j76016o5419k02729O0749J76002
6249I25210j3277k4565j03311j1224p3558M2946N9384J41415O2722j649j25011
6238H79082J3893J89069j14216j14869O8584j01126J28802j71426p5324j09384
$$ plain form
6315 671018 646125 510921 561872 672284 528940 536166 518091 438546 375189 444856 728737
6304 728737 732694 661455 571319 708381 640722 725159 917135 953676 740227 873198 735507
6293 735507 891109 1063732 957030 1050324 1042657 1003367 976387 963539 1087042 1209479 1051450
6282 1051450 1095325 1175805 968409 921617 772280 599469 566519 578001 782301 869710 895508
6271 895508 984771 800105 750742 841493 836610 851546 760529 725640 885788 942341 808055
6260 808055 799569 1002912 1038320 1068441 1113825 1132623 956607 891188 688459 749208 925210
6249 925210 911933 887368 784057 772833 699275 742221 801605 943020 1005742 1004093 879082
6238 879082 892975 1082044 967828 852959 921543 820417 949219 777793 702469 593085
6228E93085K9326J98785k04268J48698Q9327j88424M2492L2915R1595j58379J86465
6217H61617Q3216P0871J0230j27346J71843K1095m7744o0612K69026l01555j3741
6206I36900j10917j10938J59665j93525J03080J92679R1597r6984M4302j60682
6196H55177n6009j7867J06990J213j10829J97830r7253l3554N2237J56751j5623
6185A039063Q993o6930N7706K898j84826L12892K2284o5382N321M8970R9025N5353
6173A335367j39608O7212p5087k6438j14148K4827n7123J6918l8506r8096K2306
6162I17624L30169L4145O0077j6691k39779Q6713K07212Q954K0434n6355N0782
6151A403285K7681p9753J50860O5060m8541j00640q6071J15857O2983Q05M1338
$$ plain form
6228 593085 622411 821196 616928 765626 854953 666529 709021 741936 833531 675152 861617
6217 861617 944833 1015704 1025934 898588 1070431 1091526 1043782 983170 1252196 950641 936900
6206 936900 825983 715045 874710 681185 784265 976944 1068541 971557 1015859 855177
6196 855177 799168 781301 888291 889504 778675 976505 879252 845698 897935 1054686 1039063
6185 1039063 1048056 981126 1038832 1041730 856904 1169796 1192080 1126698 1132019 1180989 1280014 1335367
6173 1335367 1195759 1262971 1187884 1161446 1047298 1072125 1015002 1031920 993414 895318 917624
6162 917624 1247793 1281938 1342015 1325324 1085545 1172258 1379470 1388424 1408858 1352503 1403285
6151 1403285 1430966 1351213 1502073 1567133 1518592 1417952 1331881 1447738 1510721 1511526 1552864
6140A552864J04615k35091m7564Q4313P524J60685M3536P3423K44961j21948Q917
6129A876235R8973J01260n6513j64984P4849J02548k01624m15025K22800Q3785
6119A722304o4793p489L26630k4256q5530R9156J49474j87867n4340Q1560J11291
6108B066140J29289j3988p7327K1245k40562J02146m1613R7465p954j0735l7868
6097A986238J25066j53074p572L0184o645n2023K39756J08278j66457p4971k3297
6086B005483J57275N5011j59732k3462m4393M1801Q5569L6968P7013k8173K5575
6075B228935n1844j621p5227N5560N0652r9626M117k0888K42325k6379j6636r9546
6063B189822O5251K46885j35664J95797k0715p822J03823J06901j14258k26469
$$ plain form
6140 1552864 1657479 1422388 1374824 1459137 1466661 1627346 1670882 1744305 1989266 1867318 1876235
6129 1876235 1975208 2076468 2019955 1854971 1929820 2032368 1830744 1415719 1638519 1722304
6119 1722304 1657511 1650022 1976652 1952396 1866866 1966022 2115496 1927629 1873289 1954849 2066140
6108 2066140 2195429 2181441 2104114 2125359 1884797 1986943 1945330 2042795 2034841 2024106 1986238
6097 1986238 2111304 1958230 1950658 1980842 1974197 1922174 2161930 2270208 2103751 2028780 2005483
6086 2005483 2162758 2217769 2058037 2034575 1990182 2031983 2117552 2154520 2231533 2203360 2228935
6075 2228935 2177091 2175470 2100243 2155803 2206455 2106829 2110946 2090058 2332383 2306004 2289368 2189822
6063 2189822 2255073 2501958 2366294 2562091 2541376 2533554 2637377 2744278 2630020 2403551
6053B403551J86767J40939p581O3478m8420k27199m9145J35679K27716R5716j75939
6042B745562j14877k462J41304J48919j30436n3667Q3080j53059J50048o7811
6032B746601O0199J54206L5882j84065j85798J5282J50571j0921j71673J70010
6022B780294j3168J36950P5837n1024K65121j32578j25820p9825N1455R32L9148
6011B947322j69470K0732O2087K49582L4567n1323o598J92353k5383J06389m5892
6000C314366k13654Q2530K17802j06727j9394J50040j47648M6105Q6776j19698
5990C290498J14574p9979J6832J56113J83209R5136L1138k2016K1633L31928J07601
5979D246667n5572k06232k2802K24787j63071K9254J11082O8674Q5861J74753
$$ plain form
6053 2403551 2590318 2731257 2723676 2787154 2738734 2511535 2462390 2598069 2825785 2921501 2745562
6042 2745562 2630685 2628223 2769527 2918446 2788010 2734343 2817423 2664364 2814412 2746601
6032 2746601 2806800 2961006 2996888 2812823 2627025 2642307 2792878 2781957 2610284 2780294
6022 2780294 2767126 2904076 2979913 2928889 3194010 3061432 2935612 2855787 2907242 2908174 2947322
6011 2947322 2777852 2798584 2860671 3110253 3144820 3093497 3086899 3279252 3253869 3360258 3314366
6000 3314366 3100712 3183242 3401044 3294317 3274923 3424963 3277315 3323420 3410196 3290498
5990 3290498 3405072 3325093 3341925 3498038 3681247 3776383 3807521 3785505 3807138 4139066 4246667
5979 4246667 4191095 3984863 3962061 4186848 4023777 4053031 4164113 4232787 4318648 4493401
5969D493401k80382n9140P3378j42795L02672j9355K9256k6111q6441J51219N6330
5958D492032j70034J21495P8677J86716K12662J86728o3293J60331m7305n9513
5948E098496o6746M6826L122Q2842j35755j55905K21637J47743J14101L57922
5938E714283J01435J94393k622j83670N4804J00163R3970K02861J45223j31201
5928F289639n6829K04568K5639O9420K79478j21309j15294M7047J12744K44409
5918F979512o2731J35304K03448P2032M8084K29004K73736J79607K4624J12417
5908H195037K19132j09257q3134J02346R4767j40670r9483J23838N9265M4318
5898H406159J35818K94400n9233q1482L31301L44723K73948O8482K28587J24863
$$ plain form
5969 4493401 4213019 4153879 4227257 4084462 4387134 4367779 4397035 4370924 4284483 4435702 4492032
5958 4492032 4321998 4443493 4522170 4708886 4921548 5108276 5044983 5205314 5158009 5098496
5948 5098496 5031750 5078576 5081698 5164540 5028785 4872880 5094517 5242260 5356361 5714283
5938 5714283 5815718 6010111 6007489 5823819 5878623 5978786 6072756 6275617 6420840 6289639
5928 6289639 6232810 6437378 6463017 6532437 6811915 6690606 6575312 6622359 6735103 6979512
5918 6979512 6916781 7052085 7255533 7327565 7375649 7604653 7878389 8057996 8082620 8195037
5908 8195037 8414169 8304912 8221778 8324124 8418891 8278221 8178738 8302576 8361841 8406159
5898 8406159 8541977 8836377 8777144 8695662 9026963 9371686 9645634 9714116 9942703 10067566
5888A0067566L20296K70347K00303L33451P20462N24638M07532M31844P10866
5879A3987305P36366J014665R92567O26346N45571K52296K6254q7597j15342j84517
5869A7793914m89515l70407k74150k87975j10976j60394k70110j01004j84829
5860A5544554k47179j91720o5376R3814p7650K16325l4170L70645K71428L52576
5850A6233247n2692l6622K88819R0857L04985M26880l0296m7854L10320K31631
5840A7719275L91405K85920L94211M83657M75005O88788P07546Q12729P35616
5831B2694152R37629N93702N05269N43584M77099M79514P75781Q48462R54945
5822B8810137J319439J438041K009078K152222K705218L274721L603763M449001
$$ plain form
5888 10067566 10387862 10658209 10858512 11191963 11912425 12437063 12844595 13276439 13987305
5879 13987305 14723671 15738336 16730903 17357249 17902820 18155116 18181370 18093773 17978431 17793914
5869 17793914 17304399 16933992 16659842 16371867 16260891 16100497 15830387 15729383 15544554
5860 15544554 15297375 15105655 15040279 15134093 15056443 15272768 15238598 15609243 15880671 16233247
5850 16233247 16180555 16143933 16432752 16523609 16828594 17255474 17225178 17177324 17487644 17719275
5840 17719275 18110680 18396600 18790811 19274468 19749473 20438261 21145807 21958536 22694152
5831 22694152 23631781 24225483 24730752 25274336 25751435 26230949 27006730 27855192 28810137
5822 28810137 30129576 31567617 33576695 35728917 38434135 41708856 45312619 49761620
5814D9761620M813626N350800N962564O445965P092344O636277N309321L640403
5806I5012920K342148O51061j646139l613149m715783n118055m757174m526478
5798G3629351l403658k276682o98809L75948J323380K855629L687724M595534
5790H0088417N699817O517556P330868P855414P377495N327621J940645j872882
5782A20264951n188678p244327q841908j0209033j0507709r294838p590334o140313
5774E5247811m645587m046655l261896k421991k046826j813029j605884j421951
5766C3983992j182215j125448j289422j075225q83476p99183r82554p97329o45721
5757B5203419n72742o31987o29966n37555l30233p7153l95033j11721k8864J78331
$$ plain form
5814 49761620 54575246 59926046 65888610 72334575 79426919 86063196 91372517 95012920
5806 95012920 97355068 98006129 96359990 92746841 88031058 82913003 78155829 73629351
5798 73629351 70225693 67949011 67250202 67626150 68949530 71805159 75492883 80088417
5790 80088417 85788234 92305790 99636658 107492072 114869567 120197188 122137833 120264951
5782 120264951 115076273 107831946 98990038 88781005 78273296 68978458 61388124 55247811
5774 55247811 50602224 46555569 43293673 40871682 38824856 37011827 35405943 33983992
5766 33983992 32801777 31676329 30386907 29311682 28428206 27629023 26646469 25849140 25203419
5757 25203419 24630677 23998690 23368724 22831169 22500936 22423783 22028750 21917029 21888165 22066496
5747B2066496j41221L1042J81524K89343N50720N87125O71525M20479N95766K78177
5737B5530976J66497J92843J42149K21218j55631j65719J2406m2254O3341N3062
5727B6018888q8786k05427J98317K61144p9122J66867M8324J6967K57166K54478
5717B6848816K23951J99828L52014K81448L34256L35297M05311M89982N25901
5708B9996804K98607L20443n4372n14984p89663r17023j118450j230679j133312
5699B4857371r92953r27699j008939o05742m82121m65487k72070m23371j14056
5690A9564933k5762Q8369j40308j11459K34017K13108K92478L42583L98779K51268
5680B1108006L62073O53283N80543N53483M49365L77853O00804P32955N23333
$$ plain form
5747 22066496 21925275 21956317 22137841 22427184 22977904 23565029 24236554 24657033 25252799 25530976
5737 25530976 25697473 25890316 26032465 26253683 26098052 25932333 25944739 25902485 25965826 26018888
5727 26018888 25930102 25724675 25922992 26184136 26105014 26271881 26320205 26337172 26594338 26848816
5717 26848816 27072767 27272595 27624609 27906057 28240313 28575610 28980921 29470903 29996804
5708 29996804 30295411 30615854 30561482 30046498 29256835 28339812 27221362 25990683 24857371
5699 24857371 23864418 22936719 21927780 21322038 20839917 20374430 20102360 19678989 19564933
5690 19564933 19539171 19627540 19487232 19375773 19609790 19822898 20115376 20457959 20856738 21108006
5680 21108006 21470079 22123362 22703905 23257388 23706753 24084606 24685410 25418365 25941698
5671B5941698M99195L43830R9038k20213K1077j32262m04176l83364l31105l66904
5661B5066814m8780J36295L30442M76087P86935P92395P95876J145307J282596
5652C0763967J367880J383236J150922J031385Q56795L00217J2114l82321o68862
5643C5815333o75894q92924o51459q6566l77049J08568M58036P55286R72749R98666
5633C6424746Q32128Q37150R23567M95888M40110J52656j89592j18940q12217
5624C8985496q40535p37706p93577n57427m27158Q4773K6819L48378N89814P44770
5614C7423647Q25912O25570J76466m44231n35964j095571j262847j443767j511680
5605C2757535j503628r85559j159597o76750p94466n68263p7997n1585K61178
$$ plain form
5671 25941698 26440893 26784723 26883761 26663548 26684625 26552363 26148187 25764823 25433718 25066814
5661 25066814 25018034 25154329 25484771 25960858 26747793 27540188 28336064 29481371 30763967
5652 30763967 32131847 33515083 34666005 35697390 36554185 36854402 36866516 36484195 35815333
5643 35815333 35139439 34246515 33595056 33508490 33131441 33240009 33698045 34453331 35426080 36424746
5633 36424746 37256874 38094024 39017591 39513479 39953589 40106245 39916653 39797713 38985496
5624 38985496 38144961 37407255 36613678 36056251 35629093 35713866 35740685 36089063 36678877 37423647
5614 37423647 38249559 38875129 39051595 38607364 38071400 36975829 35712982 34269215 32757535
5605 32757535 31253907 30268348 29108751 28432001 27637535 27069272 26991275 26939690 27200868
5596B7200868L38591N06957M98701M18334l98112m78640m34929j176818j440520
5587B5034432j384936j518477j602797j346979j086861q34285q78364o65707l97032
5578A5318994l58393k0974k85000l82250r2212J69801j44676j68259l96788l04406
5568A3335837m57853m78414p82592o01416o16135o81451l61726n31023j61793
5559H663434n06093j01152k38497j40688j07323l89311r5995j86288l32231L3396
5549F599252P1542q4393k38551k40927j96286p1611l4713r8392P8859j35588l53403
5538E295789k9438J65085M0617P884k159q5531j60247n3155j57349p6302q5353
5527D859841L9861r5609j64897r693J4515r8914J04926r2301j58882n6391j29322
$$ plain form
5596 27200868 27539459 28046416 28545117 28963451 28565339 28086699 27651770 26474952 25034432
5587 25034432 23649496 22131019 20528222 19181243 18094382 17260097 16381733 15716026 15318994
5578 15318994 14960601 14939627 14654627 14272377 14180165 14349966 14205290 14037031 13640243 13335837
5568 13335837 12877984 12399570 11616978 11015562 10399427 9717976 9356250 8825227 8663434
5559 8663434 8157341 8056189 7817692 7677004 7569681 7180370 7084375 6898087 6565856 6599252
5549 6599252 6670794 6586401 6347850 6106923 5910637 5839026 5804313 5705921 5784780 5649192 5295789
5538 5295789 5266351 5431436 5472053 5479937 5477778 5392247 5232000 5178845 5021496 4945194 4859841
5527 4859841 4899702 4804093 4639196 4629503 4644018 4545104 4650030 4557729 4398847 4342456 4213134
5516D213134q3230M2170m3115Q7375J16222J20601j60939j83404P0682l05424
5506C874072j2029K34734Q9973n423r4957k8838k70831L952L37345j96199j45306
5495C786493J48330j63604k04577K14529P826m4766O0187P7195p6771p9465L7244
5484C762621J79320M8510q5797J85008L4045n4285j2156k14519Q6004K27951j05248
5473D051454r913k94502R7682Q6718M9675M0571j26936j8281J31052n6940l3050
5462C917530j23597R0642M9736j81720l5674N4641J11775K12526o2650l2963J9269
5451D019515K9499J9475k96454J58653K9271L178L7808q7176o7179o1055p1501
5440C714034R0153j74968O9599J34042o4921J16727M4148R8793J3594m7117p6235
$$ plain form
5516 4213134 4129904 4172074 4128959 4216334 4332556 4453157 4292218 4108814 4179496 3874072
5506 3874072 3862043 4096777 4186750 4181327 4086370 4057532 3786701 3790653 4127998 3931799 3786493
5495 3786493 3934823 3771219 3566642 3781171 3788997 3744231 3804418 3881613 3804842 3725377 3762621
5484 3762621 3941941 3990451 3904654 4089662 4123707 4069422 4057266 3842747 3928751 4156702 4051454
5473 4051454 4041541 3747039 3844721 3931439 3981114 4021685 3894749 3876468 4007520 3950580 3917530
5462 3917530 3793933 3884575 3934311 3752591 3716917 3771558 3883333 4095859 4033209 4000246 4019515
5451 4019515 4049014 4068489 3772035 3930688 3959959 3963137 4000945 3913769 3846590 3785535 3714034
5440 3714034 3804187 3629219 3698818 3832860 3767939 3884666 3928814 4027607 4041201 3994084 3917849
5429C917849j20507K96892J36512j63913m7734R6665J84741k1360J48855N0070
5419D478070o237K65005J14714K41607K174K05917L53409J29984L35523P1444
5409F191610j69619j17751l064k24707L7065L50034p666L3349j06617J24420J55791
5398F262845L33320L9579j34138Q1512O9889K29J07880K03042k0862k67802j61133
5387F514361j41658l03196k63038M939l02147K5757j40399P0437j71924j96498
5377E096634K2542k57802k65510j21733O7961j99266R58J5002N3924j20052k78832
5366D013826j86551j60996K48162j44481l25864J47752J4674Q1230j98466J35235
5356C624521j26906m2751j38043J22211L18558m9529k59732L5704j10497J08827
$$ plain form
5429 3917849 3797342 4094234 4230746 4066833 4019099 4115764 4300505 4279145 4428000 4478070
5419 4478070 4471833 4736838 4851552 5093159 5095333 5301250 5654659 5784643 6120166 6191610
5409 6191610 6021991 5904240 5901176 5676469 5713534 6063568 6055902 6089251 5982634 6107054 6262845
5398 6262845 6596165 6635744 6501606 6583118 6653007 6653236 6761116 6964158 6943296 6675494 6514361
5387 6514361 6372703 6069507 5806469 5811408 5509261 5535018 5394619 5465056 5293132 5096634
5377 5096634 5119176 4861374 4595864 4474131 4542092 4342826 4343784 4358786 4412710 4292658 4013826
5366 4013826 3827275 3666279 3914441 3769960 3444096 3591848 3606522 3687752 3489286 3624521
5356 3624521 3497615 3454864 3316821 3439032 3757590 3708061 3448329 3484033 3373536 3482363
5346C482363m5149o6999J10416r4506n6016J98052j311q0040j17362K5719r474
5335C345693p4637K04060K60416K8850q5369Q371p4687j15270j32622J30530j79445
5324C315890J50733j64499k3000J82017j11156M9523k10118J51275k80368J18306
5314C178603K50351q7784j76837o938K78985j79687J7539O1194k80549O4186J68045
5303C287108j73586q7653J76093R9802j09990m7480j53626P6342K50817j68850
5293C148977l7677L3836k117R3421q2999K1873q286o8782O802J36796L3310j08263
5281C166891j82545n8739Q1555J00712j4778M0025m6327r9474J93772J24637j04317
5270C201412r18m13928M206J99545K15129p357m6349n8272j46962J30058p1419
$$ plain form
5346 3482363 3437214 3370215 3480631 3386125 3330109 3528161 3526850 3446810 3329448 3355167 3345693
5335 3345693 3271056 3475116 3735532 3764382 3679013 3687384 3612697 3497427 3364805 3495335 3315890
5324 3315890 3466623 3302124 3279124 3461141 3349985 3399508 3189390 3340665 3060297 3178603
5314 3178603 3428954 3341170 3164333 3157395 3436380 3256693 3274232 3335426 3054877 3119063 3287108
5303 3287108 3113522 3025869 3201962 3301764 3191774 3144294 2990668 3067010 3317827 3148977
5293 3148977 3111300 3145136 3143019 3236440 3153441 3175314 3167028 3098246 3105048 3241844 3275154 3166891
5281 3166891 2984346 2925607 3007162 3107874 3093096 3133121 3086794 2987320 3181092 3305729 3201412
5270 3201412 3200494 2786566 2790772 2990317 3205446 3198089 3151740 3093468 2946506 3076564 3005145
5259C005145J87570J4144q0250R4653j16022K2214j24649k2702J65698O0013k27278
5248B978536O8254K18521n4150L9224J45818j85093O1537m4186n6486K0141J86257
5237C378373r7761k48159J95865l2910j9094M9313L3017J35266p9561l7824R0605
5226C367130P3234j10313N8920j5990N316l4087j02819j03936L8531O5652L5005
5215C276643M8906j52258O9257j6764n7240J43251J98573j88382r1133r8961n3160
5204C078732M65j61927L3331K07869j6655K44430q8163k1474j70954Q6724j5315
5193C177063k16956J36065j1547P8783J15885m9646j99719k7462L31167J67697
5183C501330r5684k59152J30953j2243k4627M9424K12616P4913O2569j26046j48336
$$ plain form
5259 3005145 3192715 3206859 3126609 3221262 3105240 3127454 3002805 2980103 3145801 3205814 2978536
5248 2978536 3046790 3265311 3211161 3250385 3396203 3211110 3272647 3228461 3171975 3192116 3378373
5237 3378373 3280612 3032453 3228318 3195408 3176314 3225627 3258644 3393910 3314349 3276525 3367130
5226 3367130 3440364 3330051 3388971 3372981 3378297 3344210 3241391 3137455 3175986 3241638 3276643
5215 3276643 3325549 3173291 3242548 3225784 3168544 3311795 3510368 3321986 3230853 3131892 3078732
5204 3078732 3079197 2917270 2950601 3158470 3141815 3386245 3298082 3276608 3105654 3192378 3177063
5193 3177063 2960107 3096172 3084625 3163408 3279293 3229647 3029928 3002466 3333633 3501330
5183 3501330 3405646 3146494 3277447 3265204 3240577 3290001 3502617 3577530 3640099 3514053 3365717
5172C365717m1938j20225J31958J37795j45691K66282q578r2145q856J51637N5555
5161C691511j37635p545j1184p9110j44125K7739K90423k5596r2435r9655k0598
5150C391790J40971J8664J49845j17403l623j12864o1791j01303N7356J83538
5140C545180R4458L9904p1775j5218R1471q1802M2649J08337R3187K982J03401
5129C952774l51779K8656k1230J55715p3827J8430N7045J4495k8996r8282M009
5118C657010Q1228m1278J91541J52790o3513l1800O3061J9038j0165J04464k28443
5107C893933R89J3725j51190j3937K4543l1567o6043K00070n1975j32571K46462
5096C932439K44251q4129m1680r387Q6935M8875p0619J12344j41190j0307l9594
$$ plain form
5172 3365717 3323779 3203554 3335512 3473307 3327616 3593898 3585320 3493175 3484319 3635956 3691511
5161 3691511 3553876 3546331 3535147 3456037 3311912 3339651 3630074 3604478 3512043 3412388 3391790
5150 3391790 3532761 3551425 3701270 3583867 3580244 3467380 3405589 3304286 3361642 3545180
5140 3545180 3639638 3679542 3607767 3592549 3684020 3602218 3644867 3753204 3846391 3849373 3952774
5129 3952774 3600995 3629651 3608421 3764136 3690309 3708739 3765784 3780279 3751283 3653001 3657010
5118 3657010 3738238 3696960 3888501 4041291 3977778 3945978 4009039 4028077 4017912 4122376 3893933
5107 3893933 3894922 3908647 3757457 3743520 3768063 3736496 3670453 3870523 3818548 3685977 3932439
5096 3932439 4176690 4092561 4050881 4041494 4128429 4177304 4106685 4219029 4077839 4067532 4027938
5085D027938J3075K29731j66124k16087o0769J76330R1482J03941K47701j70935
5075D276283q9602o0288K04261p506k65117J74793k5716j58940J02057N7843Q5054
5064D293122M5729M9362q1338R2028j3536M724k03510j66833J36535J48007l7832
5053D266458K962J55450J0813j81963J59829j00078J53712N8044P500j21290o6921
5042D344516J10212l1225l928R6816K8286O3220j67698J10961J24167n7417J11027
5031D728937n1819P0062j33258N6987m0582R7638o9523M1788M342n6206k4077
5020D624289J43460q5661J01089K65674q8243j75423K9879K19444O4489k21681
5010D877316j81043n4517K08203K51002r0935l5372k6467J56487o2973L6759K6794
$$ plain form
5085 4027938 4041013 4270744 4104620 3888533 3827764 4004094 4095576 4199517 4447218 4276283
5075 4276283 4186681 4126393 4330654 4323148 4058031 4232824 4207108 4048168 4150225 4208068 4293122
5064 4293122 4338851 4388213 4306875 4398903 4385367 4390091 4186581 4019748 4156283 4304290 4266458
5053 4266458 4269420 4424870 4435683 4253720 4413549 4313471 4467183 4525227 4532727 4411437 4344516
5042 4344516 4454728 4423503 4419575 4516391 4544677 4607897 4440199 4551160 4675327 4617910 4728937
5031 4728937 4677118 4747180 4613922 4670909 4630327 4727965 4658442 4700230 4704572 4648366 4624289
5020 4624289 4767749 4682088 4783177 5048851 4960608 4785185 4815064 5034508 5098997 4877316
5010 4877316 4696273 4641756 4849959 5100961 5010026 4974654 4948187 5104674 5041701 5078460 5105254
4999E105254K7526Q4683j2991q7165J34225n8657q4752K7291K3062K76967j05932
4988E329511j7411M9058k8000r8306O3229M3995q3628Q1826J32051L2177J20948
4977E625450q2482m9032J11907J15197j8863k06432J3952J69859j2667J44841
4967E811730J00233k7537n6583P2428J40830J22478J9454l781M6961O0858L6010
4956F323081j28244O2007K430J74152K39036l1778J56037K77930J011K0575M5674
4945G141911J07522K21875J65287K9300Q7354K40652J63958N14214L31597R4505
4935I098175J0165n686k5006R1309k1504l3864j15547J8615K16731j43737L47832
4924I437483j10847N6209R4862m2987n4126K2574L5563j55228j44177k38717Q1194
$$ plain form
4999 5105254 5132780 5217463 5204472 5117307 5251532 5192875 5108123 5135414 5158476 5435443 5329511
4988 5329511 5312100 5361158 5333158 5234852 5298081 5342076 5258448 5340274 5472325 5504502 5625450
4977 5625450 5542968 5493936 5605843 5721040 5702177 5495745 5509697 5679556 5666889 5811730
4967 5811730 5911963 5884426 5827843 5900271 6041101 6163579 6183033 6179252 6226213 6287071 6323081
4956 6323081 6194837 6256844 6259274 6433426 6672462 6640684 6796721 7074651 7075662 7096237 7141911
4945 7141911 7249433 7471308 7636595 7665895 7753249 7993901 8157859 8672073 9003670 9098175
4935 9098175 9108340 9102654 9077648 9168957 9147453 9113589 8998042 9016657 9233388 9089651 9437483
4924 9437483 9326636 9382845 9477707 9434720 9380594 9403168 9438731 9283503 9139326 8900609 8981803
4913H981803k21927j64928j52321m8377r5238l5357j52708j92826L4046N6899
4903H009066L4802P3991j39462l35192j8976J0412k1932m7891l0658J16187O5464
4892G715811j66063K01059j0855K25080K1578j4794K12730O1508q2690J22715
4882H286079J37910q5361K6842J37990L90693K13920J34424K44917j4643O6317
4872I539088K13471K25210J22489K74152L60597R8807J39305J39327j40903j56019
4862A0815524L4793P8194j42644J08322J53457j75147J73950k63406k7181j28061
4852A0627801l4201K1280o8693j13930k13472k53407p2077k27776l27200K8563
4842I366888O7197q6372j61335k23129j13088n6104j080O5437j83642k32055j19833
$$ plain form
4913 8981803 8759876 8594948 8442627 8394250 8299012 8263655 8110947 7918121 7952167 8009066
4903 8009066 8043868 8117859 7978397 7643205 7624229 7634641 7612709 7564818 7534160 7650347 7715811
4892 7715811 7549748 7750807 7739952 7965032 7986610 7971816 8184546 8246054 8163364 8286079
4882 8286079 8423989 8338628 8365470 8503460 8894153 9108073 9242497 9487414 9472771 9539088
4872 9539088 9752559 9977769 10100258 10374410 10735007 10833814 10973119 11112446 10971543 10815524
4862 10815524 10850317 10928511 10785867 10894189 11047646 10872499 11046449 10783043 10755862 10627801
4852 10627801 10593600 10614880 10546187 10432257 10218785 9965378 9893301 9665525 9338325 9366888
4842 9366888 9434085 9347713 9186378 8963249 8850161 8794057 8792977 8858414 8674772 8442717 8322884
4831H322884q0091k33446j04053l7749J44463L37691R8838r3436q8852P8993j34210
4820H211032k46524J85598j36021n7015j6550N1552R4674k44289J99295K47796
4810H289548K5215K9973k34292J47867j548j09779J5503K486l0950n0199J06244
4799H190068J35125O4760j64145J42699K35885k72915j8174l5227K727K67614
4789H548417J09604j38869J09070J61679p9782n3838K7945j70736P7415J0482
4779H601387r916Q5158Q5358p6565K20580R746j79679K52984L8430J99718j49494
4768I077707j33573J9958O6735L4961L3866n0258K06332m6988K22635J1981r7035
4757I346321j6927O6530R1911m0929n7137P4841K69444J1523n598J55208J94018
$$ plain form
4831 8322884 8242793 8009347 7905294 7867545 8012008 8349699 8448537 8355101 8266249 8345242 8211032
4820 8211032 7964508 8150106 8014085 7957070 7940520 7992072 8086746 7842457 8041752 8289548
4810 8289548 8314763 8344736 8110444 8258311 8256763 8146984 8162487 8164973 8134023 8083824 8190068
4799 8190068 8325193 8389953 8225808 8368507 8604392 8331477 8313303 8278076 8280803 8548417
4789 8548417 8658021 8519152 8628222 8789901 8710119 8656281 8684226 8513490 8590905 8601387
4779 8601387 8591471 8676629 8761987 8685422 8906002 8915748 8736069 8989053 9027483 9227201 9077707
4768 9077707 8944134 8964092 9030827 9065788 9099654 9049396 9255728 9208740 9431375 9443356 9346321
4757 9346321 9329394 9395924 9487835 9446906 9389769 9464610 9734054 9745577 9739979 9895187 10089205
4746A0089205j22525M6641M6310P0127J04352L486K01427M5269O4319j0592J84100
4735A0722119J01313R2016K9437K50973Q2395J07053J47504M3813L21669K02044
4725A2100336J17387J97114M048N3587J66362K56081K11333K22682K36678K58509
4715A3824117M79569M53800K68924M60401P10840O20145Q55087R79019J186652
4706A9838554J132226J289478J358101J580330J794602J737078Q27503R9671j47988
4697B9509555l96078o90549o82768j120784p87714n63516k57673J83439K37318
4688B5431230O52150O44038R08148J207484J280792J514640J149242O15091j27351
4679C3275464p07518j045327j270889j458552j373379j365483j114842r43014
$$ plain form
4746 10089205 9966680 10013321 10059631 10129758 10234110 10237596 10439023 10484292 10548611 10538019 10722119
4735 10722119 10823432 10915448 10944885 11195858 11278253 11385306 11532810 11576623 11898292 12100336
4725 12100336 12217723 12414837 12418885 12472472 12638834 12894915 13106248 13328930 13565608 13824117
4715 13824117 14303686 14757486 15026410 15486811 16197651 16817796 17672883 18651902 19838554
4706 19838554 20970780 22260258 23618359 25198689 26993291 28730369 29557872 29657543 29509555
4697 29509555 29113477 28422928 27740160 26619376 25831662 25268146 25010473 25193912 25431230
4688 25431230 26083380 26727418 27635566 28843050 30123842 31638482 32787724 33402815 33275464
4679 33275464 32567946 31522619 30251730 28793178 27419799 26054316 24939474 23996460
4671B3996460o82975m99341l66984k66470j59682k53828L3341k1492n2780k4816
4661B1701433L41877L67543K68629P81671P26397R94764R36684J334589J331160
4652B8784747J614250K123382K237184K377920K739856K788007K306865J697908
4644D6670119M14910n58405r60943j484995j907516k308198j949716j259459q13579
4635C5842218k85177M4731O79261J143947J208556J863499J665545J713447J540850
4626D5416877O76339j42482j188233j814332k098194k308320k724437k375870
4618C3441348k108922k014731j324716j318557j133789p22539o15683p39871o19495
4609B2843045p15799n92212l73359n34595l85086l55297m34359k32866n24591
$$ plain form
4671 23996460 23313485 22814144 22447160 22180690 22021008 21767180 21800521 21779029 21726249 21701433
4661 21701433 22043310 22410853 22679482 23461153 24187550 25182314 26118998 27453587 28784747
4652 28784747 30398997 32522379 34759563 37137483 39877339 42665346 44972211 46670119
4644 46670119 47085029 46526624 45565681 44080686 42173170 39864972 37915256 36655797 35842218
4635 35842218 35557041 35601772 36281033 37424980 38633536 40497035 42162580 43876027 45416877
4626 45416877 46093216 45950734 44762501 42948169 40849975 38541655 35817218 33441348
4618 33441348 31332426 29317695 27992979 26674422 25540633 24818094 24202411 23462540 22843045
4609 22843045 22127246 21535034 21161675 20627080 20241994 19886697 19452338 19219472 18694881
4600A8694881l57312m36029l59955m77878m34272l30339k51203q9371l55668k31244
4590A5371610j18419k73736j67325j70072m1439k55950k64886R2324j48535j97418
4580A3826154j60361J31724J08248j61080j05097P6132j26892p3571R7719K30944
4570A3843920k8872l12468P5297l3076Q2140n5554J09392K03909r670J8270J6705
4559A3909993j44153J56473J22311j24725J84155N6378J55341J86901L45710j6642
4549A4831742K42450J46639L55742K87148o1948K02416L89084L68021K88632L08846
4539A7358772N74218O61100O25839Q41622P89563R89665J257011J373675J506973
4530B5978438J822413K125876K158547K297720K268932K864714K483649J555045
$$ plain form
4600 18694881 18337569 17901540 17541585 17063707 16629435 16299096 16047893 15958522 15602854 15371610
4590 15371610 15253191 14979455 14812130 14642058 14600619 14344669 14079783 14172107 14023572 13826154
4580 13826154 13665793 13797517 13905765 13744685 13639588 13715720 13588828 13515257 13612976 13843920
4570 13843920 13815048 13502580 13577877 13544801 13626941 13571387 13680779 13884688 13875018 13893288 13909993
4559 13909993 13765840 13922313 14044624 13919899 14104054 14160432 14315773 14502674 14848384 14831742
4549 14831742 15074192 15220831 15576573 15863721 15801773 16004189 16393273 16761294 17049926 17358772
4539 17358772 17932990 18594090 19219929 20061551 20851114 21840779 23097790 24471465 25978438
4530 25978438 27800851 29926727 32085274 34382994 36651926 39516640 42000289 43555334
4522D3555334M02526p88498j642943j720406k280979k625362k390638k084870
4514C0424164j291523j268940r91455m64553l70944m96340k23426j53994p3893
4505B5089096j25348j8727Q1588P9986K18845L09792N63739R42044Q23544J042878
4495B9007437J215962J392543J684534J868140K002354K287088K080650J351850
4487D2890558O02924l68511j062665j396477k071477k468071j945677j680266
4479C2500338j331734q88137m75144j77489M1878M19070P00306R79525Q98649
4470C2667262J137540J114422O76897p4915o46201j068385j427401j618796j707755
4461B9052668j856872j510433j074228q66549p27185p45983m25094k46444j47957
$$ plain form
4522 43555334 43957860 43169362 41526419 39806013 37525034 34899672 32509034 30424164
4514 30424164 29132641 27863701 26872246 26407693 26036749 25540409 25316983 25162989 25089096
4505 25089096 24963748 24945021 25026609 25106595 25325440 25635232 26198971 27141015 27964559 29007437
4495 29007437 30223399 31615942 33300476 35168616 37170970 39458058 41538708 42890558
4487 42890558 43493482 43124971 42062306 40665829 38594352 36126281 34180604 32500338
4479 32500338 31168604 30280467 29805323 29627834 29669712 30088782 30789088 31768613 32667262
4470 32667262 33804802 34919224 35596121 35521206 34875005 33806620 32379219 30760423 29052668
4461 29052668 27195796 25685363 24611135 23744586 23017401 22271418 21846324 21599880 21451923
4452B1451923k54146K874M069l2113L20270M62562R3512K57161K91166j8819K27461
4441B2805920N88942O07889O70067O61634Q49687J140655R30432J148105P82005
4432C0185336m4515n83648j177859j275994j336326j562719j763283j598212j220323
4423A9622457q35599p41371n83263k31805m35398o42886n1139l25432j73463l2851
4413A5569250q2016o4043q4640L2467j45830P1461K56678J82211O099M4390J66976
4402A5953003L61421k051r3560j3784R0837N3521n9884l29039k73750j54667j37753
4391A5394294l05793k72712l01756k22859p6242j02747l08702j09304J8450j17156
4381A3595473j50524k10695j75780J7066l9181k6126j5617M50n9160j10721j4403
$$ plain form
4452 21451923 21197777 21200651 21204720 21172607 21492877 21955439 22048951 22306112 22597278 22578459 22805920
4441 22805920 23394862 24002751 24672818 25334452 26184139 27324794 28255226 29403331 30185336
4432 30185336 30140821 29557173 28379314 27103320 25766994 24204275 22440992 20842780 19622457
4423 19622457 18786858 18045487 17462224 17230419 16795021 16152135 16100996 15775564 15602101 15569250
4413 15569250 15487234 15423191 15338551 15371018 15225188 15296649 15553327 15735538 15741637 15786027 15953003
4402 15953003 16314424 16312373 16218813 16205029 16295866 16349387 16289503 15960464 15686714 15532047 15394294
4391 15394294 15088501 14815789 14514033 14291174 14214932 14112185 13803483 13694179 13712629 13595473
4381 13595473 13444949 13234254 13058474 13075540 13036359 13010233 12994616 12995066 12935906 12825185 12810782
4370A2810782K14452P4740K03136J31063j00900j3824K21695J66197J0043L32375
4360A4049759Q9483l0702N6559J02231j10227L4372K6939k43457j36203j18573
4350A3720181j07525J3058q3864o8234p7139j40032K395O9070j7919j16893M9525
4339A3242623J6309J30208K34654j8638Q6082J39931m7370m4172J06824J96601
4329A4043052n8141p5593j0522K6119J81396j56549j79118n2517R5440r9835k38679
4318A3475053j31211j8290l5395M5999M6164L7379j58691j35077M6555K15815
4308A3388301J76132n1116R1955K83474o9317J17975N8754J64962J70146K3695
4298A4354961J11848K34785Q1852J69735J04134L02944J72013j06076j48288J93869
$$ plain form
4370 12810782 13025234 13099974 13303110 13434173 13333273 13319449 13541144 13707341 13717384 14049759
4360 14049759 14139242 14108540 14165099 14267330 14157103 14191475 14218414 13974957 13838754 13720181
4350 13720181 13612656 13625714 13541850 13473616 13396477 13256445 13258840 13327910 13309991 13193098 13242623
4339 13242623 13258932 13389140 13623794 13605156 13691238 13831169 13783799 13739627 13846451 14043052
4329 14043052 13984911 13909318 13898796 13924915 14106311 13949762 13770644 13718127 13813567 13713732 13475053
4318 13475053 13343842 13325552 13290157 13336156 13382320 13419699 13261008 13125931 13172486 13388301
4308 13388301 13564433 13513317 13605272 13888746 13819429 13937404 13996158 14161120 14331266 14354961
4298 14354961 14466809 14701594 14783446 14953181 15057315 15360259 15532272 15426196 15277908 15471777
4288A5471777N0074o3134q4359l6860k9948Q9172J20094l77238P7309K54111J13140
4277A5584138j28970j4752l4707J75101K489n8748j05121J77039l4916J40137
4267A5701690O3964M7829r1059j60359J70202J04139R5552Q291K4196n1285M3744
4256A5956904M3854K94265J54719q6475O1047J23901L77080k7768q2366M2311
4246A6857472k5801J42876O6245o4827q1041K59536P5471J43856J19462r79P8804
4235A7571074J71176K83919K52185n5816J41550J17467K73425K76000K61687L89269
4225A9681936K67227J99461J32698L15798L82848M80114L39645O88062K48881
4216B2736670L78151M38877L39561O04865P82973O06874J011260Q56373N22856
$$ plain form
4288 15471777 15521851 15458717 15374358 15337498 15307550 15396722 15516816 15139578 15216887 15470998 15584138
4277 15584138 15455168 15440416 15405709 15580810 15583299 15524551 15419430 15596469 15561553 15701690
4267 15701690 15765654 15813483 15722424 15562065 15732267 15836406 15931958 15940249 15964445 15913160 15956904
4256 15956904 16000758 16295023 16449742 16363267 16424314 16548215 16925295 16897527 16815161 16857472
4246 16857472 16831671 16974547 17040792 16975965 16894924 17154460 17229931 17373787 17493249 17492270 17571074
4235 17571074 17742250 18026169 18278354 18222538 18364088 18481555 18754980 19030980 19292667 19681936
4225 19681936 19949163 20148624 20281322 20597120 20979968 21460082 21799727 22487789 22736670
4216 22736670 23114821 23553698 23893259 24498124 25281097 25887971 26899231 27755604 28278460
4207B8278460N89817M97261M10781N59479L72285O21229N63604P06835N70951
4198C3170702N49390O55188J029407J085200Q99769R80832J430415J260890J172857
4189D2234650J483477J484048J524489J915383J598045J796671K285644K347151
4181E6669558K526147L011351L696484M083508M608910N282911O371841P026445
4173I3277155Q442013J0025449J1643948J3974860J6793243J9887045K2590426
4166A96634139K5418098K9306541L3935610M0001441M4135168M2398053K7814608
4159D39643658O595280j2776132k4741856l5327719m4258357m8408946m3935725
4152B36790203l5492224k7841049k1512277j6616185j2947791j0640846q715792
$$ plain form
4207 28278460 28868277 29365538 29776319 30335798 30708083 31329312 31892916 32599751 33170702
4198 33170702 33720092 34375280 35404687 36489887 37389656 38370488 39800903 41061793 42234650
4189 42234650 43718127 45202175 46726664 48642047 50240092 52036763 54322407 56669558
4181 56669558 59195705 62207056 65903540 69987048 74595958 79878869 86250710 93277155
4173 93277155 101719168 111744617 123388565 137363425 154156668 174043713 196634139
4166 196634139 222052237 251358778 285294388 325295829 369430997 411829050 439643658
4159 439643658 446238938 433462806 408720950 373393231 329134874 280725928 236790203
4152 236790203 201297979 173456930 151944653 135328468 122380677 111739831 103024039
4145A03024039p640318o656615n821969n173974m326039m000307l672752k932196
4137F2799869k667497k201715k422124k374850j888613j633547j780707j265797
4129D6565019j460129j237186j127660j012907j255075r72953r05708q15484p35300
4120C7042617q66407q69279r06884q49372n64216n55564n36261n14109o04769
4111C0775756p23487n36832n03115l47353n68966o94206l33986k16485l19048
4102B6532278k12197j78544o6551k31038p4245M720l29992l79309M6547K33155
4092B5344824J30173K25973J87286L23299M72666M96683P09219Q07580Q13401
4083B9511104O70251O49499o09629r41257r10303n12772j369221j745546o46150
$$ plain form
4145 103024039 95383721 88727106 82905137 77731163 73405124 69404817 65732065 62799869
4137 62799869 60132372 57930657 55508533 53133683 51245070 49611523 47830816 46565019
4129 46565019 45104890 43867704 42740044 41727137 40472062 39499109 38593401 37777917 37042617
4120 37042617 36176210 35306931 34400047 33550675 32986459 32430895 31894634 31380525 30775756
4111 30775756 30052269 29515437 29012322 28664969 28096003 27401797 27067811 26851326 26532278
4102 26532278 26320081 26141537 26074986 25843948 25769703 25774423 25444431 25065122 25111669 25344824
4092 25344824 25474997 25700970 25888256 26211555 26684221 27180904 27890123 28697703 29511104
4083 29511104 30181355 30830854 30221225 29279968 28369665 27856893 26487672 24742126 24095976
4074B4095976n48360m63975l59975j64112j78996J17943k91758l8652k59832j56597
4064B1751662Q2797j71901J91378k6545j30767K17810P0323J2659p8960j9247
4054B1899209K92055R5728N9470K18444m7422K0821L46250J10272K39715L90598
4044B3625140O5972L19828N63110K05727M29372L32759L44812K35431M82314O60472
4034B7264937N05290L58364P24023P03344N12403Q72694P86640R53668J175506
4025C3856869J104814R41244R67984J256526J526321J310456J663395J681683
4017D4309292J750407K036862J855902K228046K417171K268977K589612K409910
4009F1866179K563638K633568L110462L006046K881370L101632L085552L285692
$$ plain form
4074 24095976 23547616 23083641 22723666 22559554 22380558 22498501 22206743 22168091 21908259 21751662
4064 21751662 21834459 21662558 21853936 21827391 21696624 21914434 21984757 21997416 21918456 21899209
4054 21899209 22191264 22286992 22346462 22564906 22517484 22538305 22884555 22994827 23234542 23625140
4044 23625140 23691112 24010940 24574050 24779777 25209149 25541908 25886720 26122151 26604465 27264937
4034 27264937 27770227 28128591 28852614 29555958 30068361 30941055 31727695 32681363 33856869
4025 33856869 34961683 35902927 36870911 38127437 39653758 40964214 42627609 44309292
4017 44309292 46059699 48096561 49952463 52180509 54597680 56866657 59456269 61866179
4009 61866179 64429817 67063385 70173847 73179893 76061263 79162895 82248447 85534139
4001H5534139K957714L338092L472441L192612L661089L378024L134390L026070
3993A11694571L223037K862719K618669K351460K301847K297764K089022J981187
3985A31420276J977462J822913J510134R91005R24539P79530N21789m9281n89279
3976A39309088o37960r05212r75769j092854j270793j413369j282885j811494
3968A29918752k035517k433781k635086k713436k683942k966093l325614l287280
3960A07838003l335830l182033l243178l040228l311497l181976l058625l082298
3952H2402338l026888k989187k977292l120907k873174k897193k596966k539344
3944E9381387k591526k276604k339776k330854k198760j769426j812692j831710
$$ plain form
4001 85534139 88491853 91829945 95302386 98494998 102156087 105534111 108668501 111694571
3993 111694571 114917608 117780327 120398996 122750456 125052303 127350067 129439089 131420276
3985 131420276 133397738 135220651 136730785 137721790 138646329 139425859 139947648 139898367 139309088
3976 139309088 138671128 137765916 136790147 135697293 134426500 133013131 131730246 129918752
3968 129918752 127883235 125449454 122814368 120100932 117416990 114450897 111125283 107838003
3960 107838003 104502173 101320140 98076962 95036734 91725237 88543261 85484636 82402338
3952 82402338 79375450 76386263 73408971 70288064 67414890 64517697 61920731 59381387
3944 59381387 56789861 54513257 52173481 49842627 47643867 45874441 44061749 42230039
3936D2230039j687251j696521j493414j210306j268698j377230j235935j090552
3928C1170132p48430q24289j008491j166990q04581q11027p42864n53689n01243
3919B4008528n99719l82900n41006m55477n59056l06722o12512n63478r1819k74014
3909A9621825k07496k00045l76027m32005q0250k02413k06326l49008l46755j88085
3899A7033415J61573n3003j08728k31537k96763k92020k34628j63847n0036j65706
3889A5598720k15131m9925N4250L2149k48055l7164j81397j29660j10309P47P0998
3878A4785223o8971j78573R9966M06Q6615L61248K01624n288J30072J15575m3991
3867A5483906l30123j46683k64851k00651k19341m7483j19551l76788j49293l28441
$$ plain form
3936 42230039 40542788 38846267 37352853 36142547 34873849 33496619 32260684 31170132
3928 31170132 30421702 29597413 28588922 27421932 26617351 25806324 25063460 24509771 24008528
3919 24008528 23408809 23025909 22484903 22029426 21470370 21163648 20551136 19987658 19895839 19621825
3909 19621825 19414329 19214284 18838257 18406252 18326002 18123589 17917263 17568255 17221500 17033415
3899 17033415 17194988 17141985 17033257 16801720 16504957 16212937 15978309 15814462 15764426 15598720
3889 15598720 15383589 15333664 15387914 15420063 15172008 15134844 14953447 14823787 14713478 14714225 14785223
3878 14785223 14716252 14537679 14637645 14638051 14724666 15085914 15287538 15282250 15412322 15527897 15483906
3867 15483906 15153783 15007100 14742249 14541598 14322257 14274774 14155223 13778435 13629142 13300701
3857A3300701r655Q3292L400j67845q5425q2461Q4270j38448j14999J86730k84966
3846A2774594p9972J27862J88335o5346j45515j53805l2950M9131L3181M0909
3836A2736424j57324j7472p5697L2622K30113p535K08837L8945l22167K5644O0421
3825A2752811J37817n0577n4272J94983n5162j20058J45619m4590J93650M8762
3815A3148983O9174Q1369J64109J00776p5306M7926K9498p385J06410o0748r6134
3804A3508672j54846J27209J98918p6929m4930k4696r5290K8016J00420j22547
3794A3443997J04868J23229k44161k58562J43289J11421j4468R5903o4803j59821
3784A3280892l8511K21522M5600k42117J3654P7643J42914n9962K39531j04131
$$ plain form
3857 13300701 13291046 13374338 13377738 13209893 13124468 13042007 13126277 12987829 12872830 13059560 12774594
3846 12774594 12694622 12822484 13010819 12945473 12799958 12646153 12613203 12662334 12695515 12736424
3836 12736424 12579100 12561628 12485931 12518553 12748666 12741131 12949968 12988913 12666746 12692390 12752811
3825 12752811 12890628 12840051 12785779 12980762 12925600 12805542 12951161 12906571 13100221 13148983
3815 13148983 13218157 13299526 13463635 13564411 13489105 13537031 13566529 13559144 13665554 13604806 13508672
3804 13508672 13353826 13481035 13679953 13603024 13558094 13533398 13438108 13466124 13566544 13443997
3794 13443997 13548865 13672094 13427933 13169371 13312660 13424081 13409613 13505516 13440713 13280892
3784 13280892 13242381 13463903 13509503 13267386 13281040 13358683 13501597 13441635 13681166 13577035
3774A3577035J15642L16129n0256P8232j11123J08299m5398P9039J47988M0203
3764A4255790j07792J45401o6971Q4469K45213J74547j61419J4390J34651J29344
3754A4847623J1083O9192J18141J39884J90305K9556K7196q8317J26065K26177
3744A5696905o2464N7214Q1329J88484K29910O863L7545M3189K06278K56918K65631
3733A7007802J56727K13258J6261P2019K54518J54234K53442J16187L54176K68101
3723A8866725M7J84255j7347K97546J43458M08680M69237J83406K62168J44108
3713B0942283k477K38764M05402L24447J48550M58497L78047L14452M75080L10506
3703B3993551K74751L16233N27712M25031M12952M26532N41396P14073M77336
$$ plain form
3774 13577035 13692677 14008806 13958550 14036782 13925659 14033958 13988560 14067599 14215587 14255790
3764 14255790 14147998 14293399 14226428 14310897 14556110 14730657 14569238 14583628 14718279 14847623
3754 14847623 14858706 14927898 15046039 15185923 15376228 15405784 15432980 15344663 15470728 15696905
3744 15696905 15634441 15691655 15772984 15961468 16191378 16198241 16235786 16278975 16485253 16742171 17007802
3733 17007802 17164529 17377787 17394048 17466067 17720585 17874819 18128261 18244448 18598624 18866725
3723 18866725 18866772 19051027 19033680 19331226 19474684 19883364 20352601 20536007 20798175 20942283
3713 20942283 20939806 21178570 21583972 21908419 22056969 22515466 22893513 23207965 23683045 23993551
3703 23993551 24268302 24584535 25112247 25537278 25950230 26376762 26918158 27632231 28109567
3694B8109567N87648O26579O99001O85250Q84711J053766R70517Q54996J110864
3685C5582899J153970J575679J247122J578343J635449J453452J416374J628238
3677D7271526J710445J584356J730834J768174J712342J520150J381943J478195
3669F0157965J543529J277464J201635J414369J251136J201279J235535P49419
3661G0032331O33504O36734K79159K10186J01589M649M4154k27737j09339n1701
3651G1553529l76569k59410o2306j2021p6768k89294j57680J74547J23993j93975
3641G0424046K71611L61668M23566N07826Q23949J058568J143336J377560J858220
3632G8250350J791461K118872K432538K895439L052026L461985L505012L756387
$$ plain form
3694 28109567 28697215 29323794 30022795 30708045 31592756 32646522 33617039 34472035 35582899
3685 35582899 36736869 38312548 39559670 41138013 42773462 44226914 45643288 47271526
3677 47271526 48981971 50566327 52297161 54065335 55777677 57297827 58679770 60157965
3669 60157965 61701494 62978958 64180593 65594962 66846098 68047377 69282912 70032331
3661 70032331 70665835 71302569 71581728 71791914 71893503 71898152 71942306 71714569 71605230 71553529
3651 71553529 71176960 70917550 70855244 70843223 70766455 70477161 70319481 70494028 70618021 70424046
3641 70424046 70695657 71057325 71480891 71988717 72812666 73871234 75014570 76392130 78250350
3632 78250350 80041811 82160683 84593221 87488660 90540686 94002671 97507683 101264070
3624A01264070M018844M234088M261068M069130M202899M119355L852978L967178
3616A33989610M032580L748642L721092L504673L494811L432866L251353K792443
3608A61968070K424901K244265J550804O31392L61571J74863m65172n76659j339247
3599A66974788j197389j478665j250197j160502j311881j211487j274347j080330
3591A57009990j114297j113135j004738r75025q86450o16112l04771J17716M51239
3582A51564417R57630J057816J568192J981749K088444K592053K599924K645463
3574A67055688K735369K534286K779517K712819K642321K665522K592714K517752
3566A88235988K443812K422796K348575K290843J927751J524487J450801J168168
$$ plain form
3624 101264070 105282914 109517002 113778070 117847200 122050099 126169454 130022432 133989610
3616 133989610 138022190 141770832 145491924 148996597 152491408 155924274 159175627 161968070
3608 161968070 164392971 166637236 168188040 168819432 169181003 169355866 168890694 168314035 166974788
3599 166974788 165777399 164298734 163048537 161888035 160576154 159364667 158090320 157009990
3591 157009990 155895693 154782558 153777820 152802795 151916345 151300233 150995462 151113178 151564417
3582 151564417 152522047 153579863 155148055 157129804 159218248 161810301 164410225 167055688
3574 167055688 169791057 172325343 175104860 177817679 180460000 183125522 185718236 188235988
3566 188235988 190679800 193102596 195451171 197742014 199669765 201194252 202645053 203813221
3558B03813221P24157O13390K45038j67328p5619k35898j71215m4422M6115K43458
3548B04990897O18691J082836J864484K153036K885176L478562M191034N069157
3540B26333873O395391P174423Q282811R448167J0992490J2065475J3039691J3752714
3532C07485035J3782193J3194282J2622815J1265415Q993689P341684N343831
3525C80028944L187737J621489M76437o44467j298215j778773k292822k678458
3517C76621872l452402m721801o064198p503531r632126j1364447j3032327j4396902
3509C06454138j5507471j5849100j5802219j5406091j4340806j3451530j2541378
3502B03555543j1505613j0233668r388117q463184p629176p052565o664517o150060
$$ plain form
3558 203813221 204537378 205150768 205395806 205228478 205152859 204916961 204745746 204701324 204747439 204990897
3548 204990897 205609588 206692424 208556908 210709944 213595120 217073682 221264716 226333873
3540 226333873 232729264 239903687 248186498 257634665 268627155 280692630 293732321 307485035
3532 307485035 321267228 334461510 347084325 358349740 367343429 374685113 380028944
3525 380028944 383216681 384838170 385314607 384670140 383371925 381593152 379300330 376621872
3517 376621872 373169470 368447669 362383471 354879940 345247814 333883367 320851040 306454138
3509 306454138 290946667 275097567 259295348 243889257 229548451 216096921 203555543
3502 203555543 192049930 181816262 172428145 163964961 156335785 149283220 142618703 136468643
3494A36468643n467531m854307m878092m291163m213225l843277l858436l533730
3486A01528882l218326l286261l063891l004470k831249k737329k686007k674254
3478G8027095k410356k167767k048290k070097j926601j701626j622719j626708
3470F2452931j560004j738313j602516j196472j199950j118046j408564j018890
3462E1610176r06462r13864q80492r73486q73209r60834q77704p19349n45903
3453D3958873o60728p39957p25463o74567o47102n84653n21620o06441m57170
3444C8341172k71843m37033j101558o29289n96990r45136q65568q12944n42219
3435C2138592m88798o17988o38074n97947m80749n39770n76187n87882m16584
$$ plain form
3494 136468643 131001112 126146805 121268713 116977550 112764325 108921048 105062612 101528882
3486 101528882 98310556 95024295 91960404 88955934 86124685 83387356 80701349 78027095
3478 78027095 75616739 73448972 71400682 69330585 67403984 65702358 64079639 62452931
3470 62452931 60892927 59154614 57552098 56355626 55155676 54037630 52629066 51610176
3462 51610176 50703714 49789850 48909358 47935872 47062663 46101829 45224125 44504776 43958873
3453 43958873 43298145 42558188 41832725 41158158 40511056 39926403 39404783 38798342 38341172
3444 38341172 38069329 37632296 36530738 35901449 35304459 34359323 33493755 32680811 32138592
3435 32138592 31649794 31031806 30393732 29795785 29315036 28775266 28199079 27611197 27194613
3426B7194613m94061n13837l35843m95360n47050j22937k90744n55453j54004
3417B3685324k03592l99559k48432j9333J27620J01678k11763n68163o89091p87048
3407B0787641p98117p72848q15605o59046m96029m07098l27675n11509o45918
3398A5353796j44712j96607r0777l37342l23516k21357l13045j41672k45808k39607
3388A3099353o9012m3195p7574j10562o917j0653O7996N6764J22486k18101k17642
3377A2592943k04078l75353l84599k85931m68493k79025n7655j81772j80548j69968
3367A0005521k90739J92576J21372l28881l07201J688j32843m01285N7813j83713
3357H734308k26973K90875n4171k07258j44842K5218j42012k28327J29681Q1093
$$ plain form
3426 27194613 26700552 26186715 25850872 25355512 24808462 24685525 24394781 23839328 23685324
3417 23685324 23481732 23082173 22833741 22814408 22942028 23043706 22831943 22263780 21574689 20787641
3407 20787641 19989524 19216676 18401071 17742025 17245996 16838898 16511223 15999714 15353796
3398 15353796 15209084 15012477 14921700 14584358 14260842 14039485 13726440 13584768 13338960 13099353
3388 13099353 13030341 12987146 12909572 12799010 12792093 12781440 12849436 12906200 13028686 12810585 12592943
3377 12592943 12388865 12013512 11628913 11342982 10874489 10595464 10537809 10356037 10175489 10005521
3367 10005521 9714782 9907358 10028730 9699849 9392648 9394336 9261493 8860208 8918021 8734308
3357 8734308 8507335 8798210 8744039 8536781 8391939 8417157 8275145 8046818 8176499 8257592
3347H257592r5270k22780k6524k26518j41707j9244m2093r9547j28582n025J50578
3336G400880N6692M8635q7845j28836k10673m0232K64264N170j73280k89513M3070
3325F888332p4781j66473l8705J48868J67993k6111P4649o6912p3444j31094L6093
3314F738415m3300J61204p8755N1563N551k33482j5637l28497l4819K81711O9549
3303F573503j22734K67m3715j37187p7091N0995R6457P2193k24528K6105J99546
3292F413811n8578l8906l94189o4077J65227l9712J60932j7978K9060K68517r9778
3281F324329Q4164J68868J38735p4703O0452O3461j6931Q772J09089m9855K07923
3270G024304J55304R1860J99208j00019Q1688J04118O2682L19949J53524J58441
$$ plain form
3347 8257592 8162322 7939542 7913018 7686500 7544793 7525549 7483456 7383909 7255327 7250302 7400880
3336 7400880 7457572 7506207 7418362 7289526 7078853 7038621 7302885 7308055 7134775 6845262 6888332
3325 6888332 6813551 6647078 6608373 6757241 6925234 6899123 6973772 6906860 6833416 6702322 6738415
3314 6738415 6695115 6856319 6777564 6829127 6834678 6601196 6585559 6257062 6222243 6503954 6573503
3303 6573503 6450769 6451036 6407321 6270134 6193043 6244038 6340495 6412688 6188160 6214265 6413811
3292 6413811 6355233 6316327 5922138 5858061 6023288 5983576 6144508 6126530 6155590 6424107 6324329
3281 6324329 6408493 6577361 6716096 6641393 6701845 6765306 6748375 6757147 6866236 6816381 7024304
3270 7024304 7179608 7271468 7470676 7370657 7452345 7556463 7619145 7939094 8092618 8251059
3260H251059K29957K74991K04703K00709N3698j77145J96443k00089k42756L8379
3250H829949j3541j52115k56176k47209j78555j08701k45250k50013j45246k40471
3240F992672m9124p4873J74999J5821j29172L268l7432r4311k23562k29546l17767
3229F030973j65054J48551j29035k41507j62206J05435m1262m4411p1505j59891
3219E270088k44853k68669l7572j5465j24456k55951N943r8959J58249l12752
3209D075603P0391r269j80926m2380j50747J05733p5669m3685k31521m082J759
3198C515207k17322J40925k394j52068J3012O2084j2459k62646r1862P8682L8494
3187C109653j62167j23071k8137J07840l17947m6804j19937M0145l78J025L096
$$ plain form
3260 8251059 8481016 8756007 8960710 9161419 9215117 9037972 9234415 9034326 8791570 8829949
3250 8829949 8816408 8664293 8408117 8160908 7982353 7873652 7628402 7378389 7233143 6992672
3240 6992672 6943548 6868675 7043674 7059495 6930323 6933591 6896159 6801848 6578286 6348740 6030973
3229 6030973 5865919 6014470 5885435 5643928 5481722 5587157 5545895 5501484 5429979 5270088
3219 5270088 5025235 4756566 4718994 4703529 4579073 4323122 4329065 4230106 4388355 4075603
3209 4075603 4145994 4136725 3955799 3913419 3762672 3868405 3792736 3749051 3517530 3513448 3515207
3198 3515207 3297885 3438810 3436416 3284348 3297360 3359444 3346985 3084339 2992477 3071159 3109653
3187 3109653 2947486 2824415 2796278 2904118 2586171 2539367 2419430 2459575 2459197 2460222 2463318
3176B463318j31010O33p443J0585J2819j60590k02759n4682J63187k7567P25R2853
3164B160069r8639l131J43110J9655n4460P6763p2372Q3518o3976j8486J5562
3153B187613j78095j30417j27260k5077J25174K71608L5611N3122l7169j62107
3143B013003n0704k99233N4219O3169J45537j9299k52242J39283n5852j82931
3133A554950J19459l6673J47268j55083O6483Q6589p9305k2997j97614R0266p9661
3122A493682N8708J11981J11739m3040j35089J15995J04132j75709j7817J74639
3112A799221k39387k04370Q5539J34080N6549l6995j43704o9278k6963P7839r5896
3101A336635M4483J1495J13785m4146o4779J6653l8060K78425j13198k71717j46016
$$ plain form
3176 2463318 2332308 2332941 2325498 2336083 2348902 2188312 1985553 1930871 2094058 2066491 2067216 2160069
3164 2160069 2061430 2058299 2201409 2221064 2166604 2243367 2170995 2254513 2190537 2172051 2187613
3153 2187613 2009518 1879101 1751841 1726764 1851938 2123546 2159157 2212279 2175110 2013003
3143 2013003 1962299 1663066 1717285 1780454 1925991 1906692 1654450 1793733 1737881 1554950
3133 1554950 1674409 1637736 1785004 1629921 1696404 1782993 1703688 1680691 1483077 1573343 1493682
3122 1493682 1552390 1664371 1776110 1733070 1597981 1713976 1818108 1642399 1624582 1799221
3112 1799221 1559834 1355464 1441003 1575083 1631632 1594637 1450933 1381655 1354692 1432531 1336635
3101 1336635 1381118 1392613 1506398 1462252 1397473 1414126 1376066 1654491 1541293 1269576 1123560
3090A123560J25159M5776j52762J36568K25246k56793j66371K98232p7077j34558
3080A166980Q3012P5244M6666m5931j733j57855j17678R973P6713o5189J09096
3069A179298J19698k64881l2850J01826l855k9031J27233k28699J34969J48665
3059A252373P2285k4964j18352j21590k5609j18561n6175j0813M9091R7352J73853
3048A168890n156j8361o0912j52037O9500O9991N4976j1030o3764j13373Q4968
3037A023692J13314j09857M2284r1888k41003P4932J92666J94788j51041r4536
3027I53351J947O8713j38061J41162O1462j44234Q5083N2754l1499N5505j00701
3016A005482r0754R7686n0906j04585O8242n2949P4008Q6101j07348j32410J74150
$$ plain form
3090 1123560 1248719 1294495 1141733 1278301 1503547 1246754 1080383 1378615 1301538 1166980
3080 1166980 1249992 1325236 1371902 1325971 1324238 1166383 1048705 1058678 1135391 1070202 1179298
3069 1179298 1298996 1034115 1001265 1103091 1099236 1070205 1197438 968739 1103708 1252373
3059 1252373 1324658 1299694 1181342 1059752 1034143 915582 859407 848594 897685 995037 1168890
3048 1168890 1163734 1145373 1084461 932424 1001924 1071915 1126891 1115861 1052097 938724 1023692
3037 1023692 1137006 1027149 1069433 977545 736542 811474 1004140 1198928 1047887 953351
3027 953351 955298 1024011 885950 1027112 1088574 944340 1029423 1082177 1050678 1106183 1005482
3016 1005482 914728 1012414 961508 856923 925165 872216 946224 1032325 924977 792567 966717
3005I66717N6186J1666k46615J38592l7250K8788q1180J5806l5202Q1638J85342
2994A084488j47968m5527J26250j36556o0329J65547J54737J30222j63773J06962
2984A214053k1113J10900M3260o3148n4607J7743j13775l9713J02343O1285r2587
2973A164641o6557p1292k5574Q4966J39254n8963j33460m4801N1180j8300J53033
2962A174127J10404j67179j69406J93108J36768k90376k55746Q0857M99619J78723
2952A490899l39585M663L06276M2546j61913K24183k3199O0688J20234j34382
2942A590410j20896k64147J61730m7786J6344J80363K21928L737j80784O8779
2932A629678j21779n4887K39959J02626J44827k38001k36119L402j0879R8563
$$ plain form
3005 966717 1022903 1034569 787954 926546 889296 918084 836904 852710 817508 899146 1084488
2994 1084488 936520 890993 1017243 880687 820358 985905 1140642 1270864 1107091 1214053
2984 1214053 1192940 1303840 1347100 1283952 1229345 1247088 1133313 1093600 1195943 1257228 1164641
2973 1164641 1098084 1026792 1001218 1086184 1225438 1166475 1033015 988214 1039394 1021094 1174127
2962 1174127 1284531 1117352 947946 1141054 1277822 987446 731700 812557 1312176 1490899
2952 1490899 1151314 1155977 1462253 1504799 1342886 1567069 1543870 1604558 1724792 1590410
2942 1590410 1469514 1205367 1367097 1319311 1335655 1516018 1737946 1741683 1560899 1629678
2932 1629678 1507899 1453012 1692971 1795597 1940424 1702423 1466304 1469706 1458827 1557390
2922A557390N9579J54055J21483O0174l0017J11994r0757O3406O9786r3433J1945
2911A995605l4955j71817j18597o1178J81599k5785p595j8826j18979J02644l8009
2900A684107j46858n9292K9779j42946R9905o4524J75211J27444J37400j0269
2890A829957L2854j19849q9263K25352K8135q6461j42663j67942l906K46571j10068
2879A642717j27062k98920j23164K66245q1804j26466J78538q788M8460P360q2480
2868A294636m9183m73j38223l3419p359J2940p6837L4087o332K703Q5292M840
2856A122672k16507R9391k0403K1240k26265j40079K2481m8304J26875p6706K12158
2845H76553j76527K4488j35094j29094M0553J18749J48972k57842J40375N3598
$$ plain form
2922 1557390 1616969 1771024 1892507 1952681 1922664 2034658 1943901 2007307 2077093 1983660 1995605
2911 1995605 1960650 1788833 1670236 1609058 1790657 1764872 1757277 1738451 1619472 1722116 1684107
2900 1684107 1537249 1477957 1507736 1364790 1464695 1400171 1575382 1702826 1840226 1829957
2890 1829957 1862811 1742962 1653699 1879051 1907186 1820725 1678062 1510120 1506214 1752785 1642717
2879 1642717 1515655 1216735 1093571 1359816 1278012 1151546 1330084 1321296 1369756 1377116 1294636
2868 1294636 1245453 1244980 1106757 1073338 1065979 1078919 1002082 1036169 1029837 1032540 1117832 1122672
2856 1122672 906165 1005556 985153 1006393 780128 640049 662530 614226 741101 664395 876553
2845 876553 700026 724514 589420 460326 500879 619628 768600 510758 651133 704731
2835G04731p7109j2399J86595k7453k08648N9382J53920j04140l2071l6509j21947
2824D84352K04419K4080j69977K70219Q0197r0234j95327J67114n49j79432j18727
2813D76135K5270p1434q5718L7719m6305J11099j38312o9104J03522J72800k29087
2802B86585N2918J38723O1147j43621N8803q7341R9567M7203L242r2795m1099
2791C83332j6087j77856n446p29Q5142K52686j95841R9191j00882j22265N0996
2780B52241M2337q3059r248k7618l6056M7863J31740J28202L7390j2943o332p7250
2768C87267J0143k3365q9988R0993L0184j64796m0826P3943K08147R7529k23693
2757C55538k37840j0195J12506J06991L9584Q0293o1481j13357r4373L0754m4267
$$ plain form
2835 704731 627622 615223 801818 774365 565717 625099 779019 674879 642808 606299 484352
2824 484352 688771 712851 542874 813093 893290 803056 607729 774843 774294 594862 476135
2813 476135 501405 429971 344253 381972 335667 446766 308454 239350 342872 515672 286585
2802 286585 339503 478226 539373 395752 454555 367214 466781 513984 517226 424431 383332
2791 383332 367245 189389 183943 183214 268356 521042 325201 424392 323510 201245 252241
2780 252241 294578 211519 202271 174653 138597 186460 318200 446402 483792 470849 464517 387267
2768 387267 397410 374045 284057 375050 405234 240438 199612 273555 481702 579231 355538
2757 355538 117698 107503 220009 327000 366584 446877 385396 272039 177666 208420 164153
2746A64153j30571R1295p74N6254J06810M3767n1843Q2664j47828n6740Q8148
2735B45335P0590P5773m1172j08070J57746k0735J98208j05043j65898k62204
2725D4530m0029J47888L5747r8629M8380j5293K34373Q9845l07234m4348J89398
2714B84628j33961J42330R9018k27227m2670J64690j9242j3375l5587j8293J6257
2703B16568j1870j32360J3642L11461q4299M4580J1681j02264k4593j26674j00093
2692A5779l4998J311J25793J2049l7460n4671R0745K22394J2876r9326K3657J75765
2680D53914K9795k88503R5126K13492N0625k71785r7935q879n6198j41279m163
2669b5790J76528j66728o6580K10589N3498N5769j06722L4250j0389p3224J42661
$$ plain form
2746 164153 33582 124877 124103 180357 287167 330934 279091 361755 213927 157187 245335
2735 245335 315925 391698 350526 242456 400202 379467 577675 472632 306734 44530
2725 44530 4501 152389 188136 89507 137887 122594 356967 446812 139578 95230 284628
2714 284628 150667 292997 392015 164788 122118 286808 267566 254191 218604 200311 216568
2703 216568 204698 72338 85980 397441 313142 357722 369403 267139 242546 115872 15779
2692 15779 -19219 -17908 107885 119934 82474 27803 118548 340942 353818 254492 278149 453914
2680 453914 483709 195206 290332 503824 554449 282664 184729 175850 119652 -21627 -25790
2669 -25790 150738 -15990 -82570 128019 181517 237286 130564 164814 154425 81201 223862
2658B23862k233R5488l61127r6916K7412R8856J18347P8597R9914p7501j57237
2647D7462j08490p5621K77613J34791j69217J12300q8272j56594N7286q1502m5278
2636i5522J86156J42016n36O253J7661j1709j11877O0875j04825j17640N93J1733
2624a6822J19594J46268l278k04206K8254O9018K5666o4584j3958K1978j70687
2613f2757m5367K83754j33464j9340J65557j4325r1413n0553J49764j17293j3004
2602E1559N3064j29688N8108O2676k5592q0462o1647R613J01005n2432K04842
2591A91046k61356q7374J06323K36378n2864P0442q3870j80058K31455J39556
2581C09678o1128r9316j44615j4910J74962K2937q2443k9715j05468p3487p7336
$$ plain form
2658 223862 221629 317117 -44010 -140926 -113514 -14658 103689 182286 282200 204699 47462
2647 47462 -61028 -136649 140964 275755 106538 218838 130566 -26028 31258 -50244 -95522
2636 -95522 90634 232650 232114 238367 256028 244319 132442 193317 88492 -29148 -28555 -16822
2624 -16822 102772 249040 245762 41556 69810 138828 164494 99910 85952 107930 -62757
2613 -62757 -108124 175630 42166 22826 188383 174058 82645 32092 181856 64563 51559
2602 51559 104623 -25065 33043 95719 70127 -10335 -71982 -62369 38636 -13796 191046
2591 191046 -70310 -157684 -51361 185017 132153 202595 118725 -61333 170122 309678
2581 309678 248550 149234 4619 -10291 164671 187608 105165 75450 -30018 -103505 -180841
2570a80841J75204J27772q6661J196q5430o3432N312J27949J08522J55352k20479
2559F4464m7595L4619n5385p3807l889j0489r1198P8356J29385N3368j7805R0607
2547A50631O5582k32807q0396R3340J33886J09662j71549j12779N2134Q9189j31002
2536c4109o6555R9535m4397n4686J99001p672m9769L6288r1285q9439K15928o2863
2524D9977J9325J81236j94973N3799l0673K14368K0754M1098j58812p759p5581
2513A12759j43935P8943J04254q2053n5924Q9799P291J58555k9026n6808K27176
2502D11031l8709j89348j81186j95319P2081k4207M2907P6994O764J36167J9202
2491A36377j34811j7460P7908j18045J09426r8775O7315N2316j18712N2945N327
$$ plain form
2570 -180841 -5637 122135 35474 36670 -48760 -112192 -106880 21069 129591 284943 64464
2559 64464 16869 51488 -3897 -77704 -81593 -92082 -183280 -104924 24461 77829 60024 150631
2547 150631 216213 -16594 -96990 -3650 130236 239898 68349 -44430 7704 96893 -34109
2536 -34109 -100664 -1129 -45526 -100212 98789 91117 41348 77636 -13649 -103088 112840 49977
2524 49977 69302 250538 55565 109364 78691 293059 313813 354911 196099 188340 112759
2513 112759 -31176 47767 152021 69968 14044 103843 111134 269689 240663 183855 411031
2502 411031 372322 182974 1788 -193531 -121450 -145657 -102750 -25756 -18992 117175 136377
2491 136377 1566 -15894 62014 -56031 53395 -45380 21935 74251 -44461 8484 13811
2480A3811j7366P5003o5152j31725o8056K08607M6032J30824O0763j68622l7964
2469D6155N2228L6560J17433M7644l3936N3986l24406k81601l3095J08291J93046
2458a7695K08871n5197j27555K04196k3911N5734k5906L0667j44504j42351J21347
2447H3696j34396m2599O2386j59741L8978J92578Q4692J45691J10671K3901l06115
2436I9742o9265J07103K21808j01211l2633j78539O2061m5708k03012K24252J95385
2425B79983m6824j06477j07886J27646J15953J62471R9756m68618q7762J40703
2415A08945r4013J27699J19114j94694J18110p1572M6392J39514j81483L8248
2405A56260N5434P2448N541o6060n8783J8560J0196O247k40188l701q8296K71063
$$ plain form
2480 13811 -3555 71448 6296 -125429 -193485 15122 61154 191978 252741 84119 46155
2469 46155 98383 134943 252376 300020 266084 320070 -4336 -285937 -319032 -210741 -17695
2458 -17695 191176 135979 8424 212620 188709 244443 218537 249204 104700 -37651 83696
2447 83696 -50700 -93299 -30913 -190654 -151676 40902 125594 271285 381956 405857 99742
2436 99742 30477 137580 359388 258177 225544 47005 109066 63358 -139654 84598 279983
2425 279983 233159 126682 18796 146442 262395 424866 524622 56004 -31758 108945
2415 108945 14932 142631 261745 67051 185161 113589 159981 299495 118012 156260
2405 156260 211694 284142 289683 223623 164840 183400 193596 199843 -40345 -44046 -132342 138721
2393A38721J1766O3496M2674Q58l7201o8264j06788J73653o5223m3727K04594
2382C14559Q4496j22510m8235J71918J54950j47737j32776N9220l4723k10153
2372H9009q5132O2729q3561O4094K10664M2537j43069j32883N068J37752q2282
2361H4926j18902J33820j2554L5264R9702k01461J11398K08095R2659j63606j5903
2350B53438n7364M620j63324J42525L1214J76858K0083o0064j22059k9326j11025
2339H5576q943p9449M7530O1308p5195K40993r3895n2018J66701j11764J07258
2328B88102j35775J33218k23299n8987K02543m6986J94386j4626k23952J88340
2318C02964Q7249k185P3645j24419Q4691o1812n2577N1652j73329J1218J10954
$$ plain form
2393 138721 150487 213983 256657 257515 220314 152050 45262 218915 153692 109965 314559
2382 314559 399055 276545 228310 400228 555178 407441 274665 333885 299162 89009
2372 89009 3877 66606 -16955 47139 257803 300340 157271 24388 29456 167208 84926
2361 84926 -33976 99844 87290 122554 222256 20795 132193 340288 432947 269341 253438
2350 253438 196074 200694 37370 179895 211109 387967 408050 347986 225927 196601 85576
2339 85576 76633 -2816 44714 106022 30827 271820 177925 125907 292608 180844 288102
2328 288102 152327 285545 62246 3259 205802 158816 353202 338576 114624 302964
2318 302964 390213 388028 461673 337254 421945 360133 307556 359208 185879 197097 308051
2307C08051j40971Q8867N704j5140J4620L9860j83927O5808J00404K6985K269
2296C12530K0151j356p014J242R3691J54457J2112k83939k4300j69783P4071N2138
2284B34000m7988M2172k067K12022M9055j78380j05705l34J5207M9040k8180k9555
2272B09287l5868J09626j15587J56847L4358p2407P7350Q6501l0254n0651R7408
2261D66610q5035m0685Q4697Q2379Q5733q5169r6255r728n4958N6652n7003M9996
2249C97234K20861l2940j45519R5208Q0964k7254M1036PR7408q6764j34340j02173
2237D03728J85932J14147p8782j27815P7469J40457M2400n0178j58350n3281O2833
2226E58560J79846j0867j25470j6342J02027J84129N0250q0245q9195j46999k7229
$$ plain form
2307 308051 167080 255947 261651 246511 261131 300991 117064 182872 283276 310261 312530
2296 312530 332681 331325 324311 325553 419244 573701 585813 301874 277574 107791 181862 234000
2284 234000 186012 228184 226117 438139 487194 308814 203109 202775 217982 267022 238842 209287
2272 209287 173419 283045 167458 324305 358663 286256 363606 450107 419853 369202 466610
2261 466610 381575 340890 425587 507966 593699 508530 412275 402547 347589 404241 347238 397234
2249 397234 618095 585155 439636 534844 615808 588554 629590 629597 727005 640241 505901 403728
2237 403728 589660 703807 625025 497210 574679 715136 757536 707358 549008 495727 558560
2226 558560 738406 727539 602069 585727 687754 871883 922133 841888 752693 605694 578465
2215E78465o0494M8389p1182J84724J21135L4871k27360J32197M06814j42062
2205A005497j42787q4227L2566J7062J17128k31635j19126K04777q2181J36756
2195H53830J43978j11140J45870j35302Q377J78965j80350O6790J07133o9645
2185A008506M6795J34242o68J49644n0289O5413j71961P0544p190j37925J17555
2174A224666Q2404n1507k2396R2248J17561o0141O2246L01150K12528K8492J99327
2163B186578J0717O4177J78189j09143r78m0848k0781M10317j0770k15282J15085
2152B567261J45324K15299M4961R9985j4127J83952K94734R0486K04415J70924
2142D003214L91402J73161J08119L41496J71455K51941L21976M26328N08877J88683
$$ plain form
2215 578465 517971 566360 495178 679902 801037 835908 608548 740745 1147559 1005497
2205 1005497 862710 778483 811049 828111 945239 713604 594478 799255 717074 853830
2195 853830 997808 886668 1032538 897236 905613 1084578 904228 971018 1078151 1008506
2185 1008506 1055301 1189543 1188875 1338519 1288230 1353643 1181682 1252226 1245036 1107111 1224666
2174 1224666 1307070 1255563 1233167 1325415 1442976 1382835 1445081 1746231 1958759 1987251 2186578
2163 2186578 2197295 2261472 2439661 2330518 2329540 2288692 2267911 2678228 2667458 2452176 2567261
2152 2567261 2712585 2927884 2972845 3072830 3058703 3242655 3537389 3627875 3832290 4003214
2142 4003214 4394616 4567777 4675896 5017392 5188847 5440788 5762764 6189092 6697969 6886652
2132F886652M89298N84586R87783Q64624P37811R89927J393027J395863J917575
2123A6247146K406845K903182L113871L554464M314789N653180P428606Q117591
2115E3739674O224864k990860o423365k884559m099495r953096p601941m630004
2107B1381218l412389k251795j916663j382673r88060o40068n61501n45047p89301
2098H893721o08114p10557m60886p67831n61745q0829k60040l89356l23660l14043
2088D416660l49304q9899j55842l3125K5446m16377k2168q3529j90544k24728
2078B876590J54844j19975l17548l2988K1996L1502j14925k50589L6314L4925
2068B320146j86820j06948N0054j21748J1269j18085r1715O6251L8135k57291
$$ plain form
2132 6886652 7375950 7960536 8948319 9812943 10550754 11540681 12933708 14329571 16247146
2123 16247146 18653991 21557173 24671044 28225508 32540297 38193477 45622083 53739674
2115 53739674 59964538 56973678 50550313 47665754 43566259 33613163 26011222 21381218
2107 21381218 17968829 15717034 13800371 12417698 11429638 10789570 10228069 9683022 8893721
2098 8893721 8285607 7575050 7114164 6346333 5784588 5703759 5443719 5054363 4730703 4416660
2088 4416660 4067356 3977457 3821615 3788490 3813936 3397559 3375391 3291862 3101318 2876590
2078 2876590 3031434 2911459 2593911 2560923 2582919 2614421 2499496 2248907 2285221 2320146
2068 2320146 2133326 2026378 2076432 1954684 1965953 1847868 1756153 1822404 1860539 1603248
2058A603248K64R881m9088l7051M239o5924j81107K6445p5602l595J14195p8718
2046A267187l0475k73355o410l3029J342j7845J66093N182j23155j8594p705J52385
2034A081621j91645j1198R7944j88450j3880j24360n0676L3197p6472O9785L9428
2023F65294J5082j17881J94351M6776j11228r025m7402J78747n7664j69710k0791
2012E66549J02296j74760N4188k1708N1149J43254r1813R1477k43524J75k12186
2001B65097n4822P9735J57855K8731n6332j54542q1694J21753j902j8137O9162
1990C54904j39373J9103K53010n9813K4788j08435p1788j00389J08807N9972m1889
1979B98897k6021n1210m0145j7046R3564K7194o085j00430K9777J98612k51678
$$ plain form
2058 1603248 1603512 1613393 1564305 1527254 1531493 1465569 1284462 1310907 1235305 1231710 1345905 1267187
2046 1267187 1236712 963357 956947 923918 925260 907415 1073508 1078690 955535 936941 929236 1081621
2034 1081621 889976 878778 976722 788272 774392 650032 599356 632553 556081 625866 665294
2023 665294 680376 562495 756846 803622 692394 683369 635967 814714 757050 587340 566549
2012 566549 668845 494085 548273 526565 577714 720968 629155 720632 477108 477283 265097
2001 265097 210275 290010 447865 476596 420264 265722 184028 305781 303879 285742 354904
1990 354904 215531 234634 487644 427831 452619 344184 272396 172007 280814 340786 298897
1979 298897 272876 221666 181521 164475 258039 285233 279148 178718 208495 407107 155429
1968A55429q0601K98189n4443k64045J872K4080J40866k2971P0592k1497k54129
1957f658L6980J46653j65150k1189K70870N0469j73683m0504N6305L19409p5535
1946C97967J2195j24679j00608l9899j98649N6511k29273J20300J1264j7800P5427
1935c7244N335o7469O7151J7621R2388Q8963J34103q6282j17341k18394j32992
1924b54161j17481J65947N0041O8811j52453Q5593J27398m734J72112n404J6145
1913A51814K2377j07986R1353M2869j8873N7025k20339L0674j91072R6790J92834
1902A47466k06867K0049K44503p8923j16468J69908P3205j17378o7456r751M0163
1891I8451M5582j62150k9902m5813J34616n8833Q8246O036p451n1149M9674l3207
$$ plain form
1968 155429 74828 373017 318574 54529 56401 80481 221347 198376 268968 247471 -6658
1957 -6658 30322 176975 11825 -9364 261506 311975 138292 97788 154093 473502 397967
1946 397967 410162 285483 184875 144976 -53673 2838 -226435 -106135 -94871 -112671 -37244
1935 -37244 -31909 -99378 -32227 -14606 77782 166745 300848 214566 97225 -121169 -254161
1924 -254161 -371642 -205695 -155654 -86843 -239296 -153703 -26305 -31039 141073 135669 151814
1913 151814 174191 66205 157558 200427 181554 238579 18240 48914 -142158 -45368 147466
1902 147466 -59401 -39352 205151 126228 9760 179668 252873 135495 68039 58288 98451
1891 98451 144033 -18117 -48019 -93832 40784 -18049 70197 76233 68782 17633 67307 34100
1879C4100P2237k9211o4501m4529n7548K70010n0049j02251k067n2455j3713j4488
1867e4465J38376k74345J866J29521j0292K06804l468k899o9918n9502k1770K72907
1855B52815j69346l5276R3632J19045k00389K6615K3256Q820J4984J86259k16319
1844A04096P4506k6945M900o7892J09648J99924k49188K7620j80431J1578L9470
1833D7286j01572J72865k3973j83073R152j23023R5752o76l5529N0448j2887J1911
1821i3319m4689j75792l6865J36185Q6762K4094J89040K2239j17933n0521J14458
1810E3659J55973k58071j10885j61656j1675L40126Q025L3976K0958m6112k12784
1799a88466m299n3470p6864J87207J91278K06749p8529j1733k78074k05380M3262
$$ plain form
1879 34100 106337 77126 12625 -31904 -89452 180558 130509 28258 26191 -26264 -39977 -54465
1867 -54465 83911 -190434 -188568 -59047 -69339 137465 133997 131098 61180 1678 -20092 252815
1855 252815 83469 48193 141825 260870 60481 87096 110352 119172 134156 320415 104096
1844 104096 178602 151657 156557 88665 198313 398237 149049 176669 -3762 7816 47286
1833 47286 -54286 118579 94606 -88467 -79315 -202338 -106586 -107262 -142791 -92343 -105230 -93319
1821 -93319 -138008 -313800 -350665 -214480 -127718 -103624 85416 107655 -10278 -60799 53659
1810 53659 209632 -48439 -159324 -320980 -332655 7471 15496 49472 70430 24318 -188466
1799 -188466 -192765 -246235 -323099 -135892 55386 262135 183606 171873 -106201 -311581 -268319
1788b68319n0722P6894J02545J88153N9343K899j24278j73108J2919K41894J69453
1777B37673j80744n3040K7644q6945j08484M7511K3638m1438N956j4360n4065
1766a96654J74902l8295o8645j06187L061Q7465m0262n1165P2730Q6350j71849
1755b48549j31557P5819K76051p909j05495K6069p0012L8373K51614J0368q3087
1744C1685j91453J76496R5652j25948J0498M7615J41462l1830j15937o7867p6011
1733a05638O2053n3660J36059j8731m4758j37971n750J36957l668N6845j42156
1722a20418m9754N0854j45385K09278J39277p5134J65805o0355j11777j66633
1712a64242N1259P98j24870m0576l2091R2103J55669N9159J3542J29599k53173
$$ plain form
1788 -268319 -319041 -242147 -139602 48551 107894 110793 -13485 -186593 -173674 68220 237673
1777 237673 56929 3889 31533 -55412 -163896 -116385 -92747 -134185 -128229 -142589 -196654
1766 -196654 -21752 -60047 -128692 -234879 -231818 -144353 -184615 -235780 -163050 -76700 -248549
1755 -248549 -380106 -304287 -28236 -36145 -141640 -115571 -185583 -147210 104404 114772 31685
1744 31685 -159768 16728 112380 -13568 -3070 44545 186007 154177 38240 -29627 -105638
1733 -105638 -43585 -97245 38814 20083 -24675 -162646 -168396 -31439 -35107 21738 -120418
1722 -120418 -170172 -119318 -264703 -55425 83852 8718 174523 114168 2391 -164242
1712 -164242 -112983 -112185 -237055 -277631 -309722 -217619 -61950 -2791 10751 140350 -112823
1701a12823J2283K3778n3158O7751K4573m8189k1427O6190J71877K7584j71578
1690a3139j0786p0691L0763M0786J01191j58500l2392R587o4726K35552p0153
1679b508j40341J66388n7041j09187q292J8477r7854J42371Q2480r3904o275n6084
1667a61770J73059p6569p1924Q2336J13281n0048j96932R5399M5083k47356P29
1656b94712O5270p2582L54551J48885l00542j87010P8135R9715K38379j1698j95389
1645g6998k10784L3102J62992j7949r003j43733l2507N4895J19356K876P1102
1634d6651o6380r5073J77002p3453N5542P0609R5964r8723p2516M2691J33139
1623A22151K1651j01097J57879j01712k05072m0863m8803n5724l647K72208j90368
$$ plain form
1701 -112823 -100540 -76762 -129920 -62169 -37596 -85785 -107212 -41022 130855 158439 -13139
1690 -13139 -23925 -94616 -63853 -23067 78124 -80376 -112768 -103181 -167907 67645 -2508
1679 -2508 -142849 23539 -33502 -142689 -150981 -132504 -230358 -87987 -5507 -99411 -105686 -161770
1667 -161770 11289 -65280 -137204 -54868 58413 8365 -188567 -93168 -48085 -295441 -294712
1656 -294712 -229442 -302024 52527 201412 -99130 -286140 -208005 -108290 130089 118391 -76998
1645 -76998 -287782 -254680 -91688 -109637 -118640 -262373 -294880 -239985 -120629 -117753 -46651
1634 -46651 -113031 -208104 -31102 -104555 -49013 21596 117560 18837 -53679 -10988 122151
1623 122151 143802 42705 200584 98872 -106200 -147063 -195866 -251590 -255237 16971 -173397
1612a73397j13121K22983j4057J64782j56055L7320j33171k0727N8809j70745
1602b97379O1924j9552J15327j01817m7477Q9971K23399L1435q5490j34313J7119
1591a46853O3943k6677J36231j95510N7691O4453q785j57596M0448M356J12030
1580e6269j8082k34412R377m411n6938k9802J45481J32072K6509l0224N5914J24620
1568F3835J00958J6511k78763N9006K1452K5793j2228j28715o7340r7339k0775
1557c17605J09579J54893n1245R4859q3941j57128j1821J31765J74824n3006n7391
1546f6217p0815J8866J55832J99227O590j59281P2967p4361k35911o3696K17070
1535B71j33560J76491J20944j52987N5926O3544k306L7133r8419q9777p174m7944
$$ plain form
1612 -173397 -286518 -63535 -77592 87190 -68865 -31545 -164716 -185443 -126634 -297379
1602 -297379 -235455 -255007 -139680 -241497 -288974 -199003 24396 55831 -29659 -163972 -146853
1591 -146853 -82910 -109587 26644 -168866 -111175 -46722 -55507 -213103 -172655 -168299 -56269
1580 -56269 -74351 -308763 -299386 -303797 -360735 -390537 -245056 -112984 -86475 -116699 -60785 63835
1568 63835 164793 181304 -97459 -38453 -17001 8792 -3436 -132151 -199491 -296830 -317605
1557 -317605 -208026 -53133 -104378 -9519 -93460 -250588 -262409 -130644 44180 -8826 -66217
1546 -66217 -137032 -118166 37666 236893 243483 84202 157169 82808 -153103 -216799 271
1535 271 -133289 43202 164146 11159 67085 130629 128323 165456 67037 -22740 -29914 -77858
1523g7858j12056P9253J12040K47471j43304r8292Q5076M8277k19441j41682O9140
1512a51376J02693j53585j73050R7651J47641p8949P5662M2522j57723p6753J2570
1501c12697J88089m9278M7149O0136q4238o8830K03714j46223n7139j3703J03600
1490a29420N5755M2790k7855M703J87149N4501j35723j50528J21002K0645m4600
1479a581r7008k44961R0799J7036J68021J59552K3642j64756q0859K03583Q4985
1468A58453j44586q49r9974k12566J36711J35744K3230N2360O173n4587l1883
1457c1774Q7603L1783K2326k6870J5738k70513j08856n0266n4473K32061J31531
1446b1710j26647J41997J07122k5061N3355j68615j11670J49157n0069n2291J65502
$$ plain form
1523 -77858 -189914 -110661 1379 248850 105546 7254 92330 140607 -78834 -220516 -151376
1512 -151376 -48683 -202268 -375318 -277667 -130026 -208975 -133313 -90791 -248514 -325267 -312697
1501 -312697 -124608 -173886 -126737 -66601 -150839 -219669 -15955 -162178 -219317 -233020 -129420
1490 -129420 -73665 -30875 -58730 -54027 133122 187623 51900 -98628 22374 43019 -1581
1479 -1581 -98589 -343550 -252751 -235715 -67694 91858 115500 -49256 -130115 73468 158453
1468 158453 13867 13018 -86956 -299522 -162811 -27067 -3837 48523 54696 109 -31774
1457 -31774 55829 87612 109938 83068 98806 -171707 -280563 -330829 -385302 -153241 -21710
1446 -21710 -148357 -6360 100762 75701 129056 -39559 -151229 -2072 -52141 -104432 61070
1435F1070q0885l7620Q8712p2464p1116N776q9126M0125L0282p216k5444O5948
1423i1958q2338J75639Q3345j64759O1472q1163o0569j51320O3707P5901o418
1412a78461J96298o2308r6453K5087P07P0007J47276m1081n280j07386J65806
1401A14212K5507k15055m9902O6644O8843M3293o4274q8247K05412o0951n8168
1390a2686j42194J32409Q9319j76836m4925O408o1872k16998J51664J08696p9141
1379b46156L0147K03805k23915j01379M5063k6264R9509q4432J19894p9912j05408
1368c69048J66340J36628n7670j04172j72880L4272O8724J60364J4488p7387K18952
1357A8611j82010P8903r4178O8669M5501l4536j14207K16166P2563k24204O1223
$$ plain form
1435 61070 -19815 -57435 31277 -41187 -112303 -106527 -195653 -155528 -125246 -132462 -157906 -91958
1423 -91958 -174296 1343 84688 -80071 -18599 -99762 -160331 -311651 -247944 -172043 -178461
1412 -178461 17837 -44471 -140924 -115837 -115130 -45123 102153 61072 55792 -51594 114212
1401 114212 139719 -75336 -125238 -58594 10249 53542 -10732 -98979 106433 45482 -12686
1390 -12686 -154880 -22471 66848 -109988 -154913 -148505 -210377 -427375 -275711 -167015 -246156
1379 -246156 -216009 -12204 -236119 -337498 -292435 -318699 -219190 -303622 -183728 -263640 -369048
1368 -369048 -202708 -66080 -123750 -227922 -400802 -366530 -297806 -137442 -122954 -200341 18611
1357 18611 -163399 -84496 -178674 -110005 -64504 -99040 -213247 2919 75482 -148722 -87499
1346h7499J61937O5904j03874j92497Q7205J82914j12841R1865j6311N1429j58945
1335c0713R4234j16017k60742J87251j70828q0835N7857L52331P2226k56440j03249
1324b54925P0973J83677m594j12384J42349o1180k2364o277j55176N1082p1997
1313b40816k225J54815j35657n7563J35541Q5165J42158J07215r9776M9904j5360
1302A23401r3828Q4895K1207q9744n7621R6124k04825N1490L6312l3142J74772
1291A09041j09072L5163j39849J7536L6867o2992J32109k38992Q8987l2015K48285
1280H5068N0073k41192o081m2140J09553K0940j55190o8258J03122J00796o6538
1269a09847Q1509M0196M6343k47826j21116K8817R9990J17585J43127J12124k75747
$$ plain form
1346 -87499 74438 140342 36468 -156029 -68824 114090 1249 93114 76803 128232 -30713
1335 -30713 63521 -52496 -313238 -125987 -296815 -377650 -319793 32538 104764 -151676 -254925
1324 -254925 -183952 -275 -4869 -117253 25096 -36084 -58448 -64725 -219901 -168819 -240816
1313 -240816 -243041 -88226 -223883 -281446 -145905 -60740 81418 188633 88857 138761 123401
1302 123401 29573 114468 135675 45931 -11690 84434 -120391 -68901 -32589 -65731 109041
1291 109041 -31 35132 -104717 -87181 -50314 -113306 18803 -220189 -131202 -163217 85068
1280 85068 135141 -106051 -112132 -154272 -44719 -23779 -178969 -247227 -144105 -43309 -109847
1269 -109847 -28338 11858 58201 -189625 -310741 -281924 -181934 -64349 78778 190902 -84845
1258h4845q4198J27928P343l0326l7674J98117K7099j26071k338l9350J25264
1247H0949J94650j28811l37785j59430J42280J93197R5031j05567j51088J13986
1237f2588K87873k45446L6318p4612J164K2837j40010r2148J19566l2572N5344
1226a24274K37421k80832O9397p8918J50062J9427o4526J54658j80109o2097K6223
1215a33568L5321L1948j85369J16913J37839J92003j69597n3954r6271R6476j857
$$ plain form
1258 -84845 -169043 -41115 -33772 -64098 -101772 96345 123444 -2627 -4965 -44315 80949
1247 80949 275599 146788 -190997 -350427 -208147 -14950 80081 -25486 -176574 -62588
1237 -62588 225285 -20161 16157 -58455 -57291 -34454 -174464 -266612 -147046 -179618 -124274
1226 -124274 113147 -167685 -98288 -177206 -27144 -7717 -72243 82415 -97694 -159791 -133568
1215 -133568 -98247 -66299 -251668 -134755 3084 195087 25490 -28464 -124735 -28259 -30116
$$ [...]
##END NTUPLES=NMR SPECTRUM
##END=
