##TITLE=1H_TG-2347-1
 CDCl3
 8 sc, 
 9.02.2022
##JCAMPDX= 6.0         $$ Bruker NMR JCAMP-DX V2.0
##DATA TYPE= NMR SPECTRUM
##DATA CLASS= NTUPLES
##ORIGIN= UXNMR, Bruker Analytische Messtechnik GmbH
##OWNER= root
$$ XWIN-NMR		Version 3.5
$$ Wed Feb  9 11:40:24 2022 Russian Standard Time (UT+4h)  she@DPX200
##.OBSERVE FREQUENCY= 200.131346
##.OBSERVE NUCLEUS= ^1H
##.ACQUISITION MODE= SIMULTANEOUS
##.ACQUISITION SCHEME= undefined
##.AVERAGES= 8
##.DIGITISER RES= 18
##SPECTROMETER/DATA SYSTEM= spect
##.PULSE SEQUENCE= zg30
##.SOLVENT NAME= CDCl3
##.SHIFT REFERENCE= (INTERNAL, CDCl3, 0, 15.7248)
##AUDIT TRAIL= $$ (NUMBER, WHEN, WHO, WHERE, WHAT)
$$ ##TITLE= Audit trail, XWIN-NMR		Version 3.5
$$ ##JCAMPDX= 5.01
$$ ##ORIGIN= Bruker BioSpin GmbH
$$ ##OWNER= she
$$ F:/spectra/data/she/nmr/H-F/1/pdata/1/auditp.txt
$$ ##AUDIT TRAIL=  $$ (NUMBER, WHEN, WHO, WHERE, WHAT)
(   1,<2022-02-09 11:37:58.07 +0400>,<she>,<DPX200>,
      <created by zg, POWCHK disabled, PULCHK disabled
       configuration hash MD5:
       00 E9 B6 7A A2 85 ED C7 34 08 36 98 17 FE 4E 26
       data hash MD5: 16K
       1A 57 7E 55 36 E3 FB 26 32 E7 8C 21 9D 03 23 19>)
(   2,<2022-02-09 11:38:04.87 +0400>,<she>,<DPX200>,
      <Start of raw data processing
       efp BC_mod = 2 LB = 0.24 FT_mod = 6 PKNL = 1 PHC0 = -15864.76 PHC1 = 5.20078 SI = 16K 
       data hash MD5: 16K
       3B 31 7B 39 94 8E 54 32 38 42 0F D8 16 70 68 FB>)
(   3,<2022-02-09 11:38:28.54 +0400>,<she>,<DPX200>,
      <pk PHC0 = -5.906742 PHC1 = 8.000002 
       data hash MD5: 16K
       43 D6 6C 2F 54 E3 64 68 2C 7D 11 0C 0D 53 7E A7>)
(   4,<2022-02-09 11:38:32.89 +0400>,<she>,<DPX200>,
      <abs ABSG = 5 
       data hash MD5: 16K
       4B 5D D3 46 70 49 29 AA 01 B6 ED 78 A8 16 C3 5C>)
$$ ##END=
$$ 
$$ hash MD5
$$ 31 9B CA B5 FF EB 4F 28 24 46 43 04 81 DE 4D A2
##$RELAX= 
##$RELAX= 
##$RELAX= 
##$RELAX= 
##$RELAX= 
##$RELAX= 
$$ Bruker specific parameters
$$ --------------------------
##$DU= <F:/spectra>
##$EXPNO= 1
##$NAME= <H-F>
##$PROCNO= 1
##$TYPE= <nmr>
##$USER= <she>
##$AMP= (0..31)
100 100 100 100 100 100 100 100 100 100 100 100 100 100 100 100 100 100 
100 100 100 100 100 100 100 100 100 100 100 100 100 100 
##$AQSEQ= 0
##$AQ_mod= 1
##$AUNM= <au_zg>
##$AUTOPOS= <>
##$BF1= 200.13
##$BF2= 200.13
##$BF3= 200.13
##$BF4= 200.13
##$BF5= 200.13
##$BF6= 200.13
##$BF7= 200.13
##$BF8= 200.13
##$BYTORDA= 1
##$CFDGTYP= 0
##$CFRGTYP= 5
##$CHEMSTR= <none>
##$CNST= (0..31)
1 1 145 1 1 1 1 1 1 1 1 1 1 1 1 1 1 1 1 1 1 1 1 1 1 1 1 1 1 1 1 1 
##$CPDPRG= <>
##$CPDPRG1= <>
##$CPDPRG2= <>
##$CPDPRG3= <>
##$CPDPRG4= <mlev>
##$CPDPRG5= <mlev>
##$CPDPRG6= <mlev>
##$CPDPRG7= <mlev>
##$CPDPRG8= <mlev>
##$CPDPRGB= <>
##$CPDPRGT= <>
##$D= (0..31)
0 1.2 0 0 0 0 0 0 0 0.06 0 0.03 0 0 0 0 0.0002 0 0 0 0 0 0 0 0 0 0 0 0 
0 0 0 
##$DATE= 1644392277
##$DBL= (0..7)
120 120 120 120 120 120 120 120 
##$DBP= (0..7)
150 150 150 150 150 150 150 150 
##$DBP07= 0
##$DBPNAM0= <>
##$DBPNAM1= <>
##$DBPNAM2= <>
##$DBPNAM3= <>
##$DBPNAM4= <>
$$ [...]
##$SUBNAM2= <"">
##$SUBNAM3= <"">
##$SUBNAM4= <"">
##$SUBNAM5= <"">
##$SUBNAM6= <"">
##$SUBNAM7= <"">
##$SUBNAM8= <"">
##$SUBNAM9= <"">
##$SW= 18.0517287032376
##$SWIBOX= (0..15)
0 0 2 0 0 0 0 0 0 0 0 0 0 0 0 0 
##$SW_h= 3612.71676300578
##$TD= 16384
##$TD0= 1
##$TE= 0
##$TE2= 300
##$TE3= 300
##$TEG= 300
##$TL= (0..7)
0 120 120 120 120 120 120 120 
##$TP= (0..7)
150 150 150 150 150 150 150 150 
##$TP07= 0
##$TPNAME0= <>
##$TPNAME1= <>
##$TPNAME2= <>
##$TPNAME3= <>
##$TPNAME4= <>
##$TPNAME5= <>
##$TPNAME6= <>
##$TPNAME7= <>
##$TPOAL= (0..7)
0.5 0.5 0.5 0.5 0.5 0.5 0.5 0.5 
##$TPOFFS= (0..7)
0 0 0 0 0 0 0 0 
##$TUNHIN= 0
##$TUNHOUT= 0
##$TUNXOUT= 0
##$USERA1= <user>
##$USERA2= <user>
##$USERA3= <user>
##$USERA4= <user>
##$USERA5= <user>
##$V9= 5
##$VALIST= <valist>
##$VCLIST= <CCCCCCCCCCCCCCC>
##$VD= 0
##$VDLIST= <DDDDDDDDDDDDDDD>
##$VPLIST= <PPPPPPPPPPPPPPP>
##$VTLIST= <TTTTTTTTTTTTTTT>
##$WBST= 1024
##$WBSW= 4
##$XGAIN= (0..3)
0 0 0 0 
##$XL= 0
##$YL= 0
##$YMAX_a= 180624
##$YMIN_a= -294768
##$ZGOPTNS= <>
##$ZL1= 120
##$ZL2= 120
##$ZL3= 120
##$ZL4= 120
##$ABSF1= 15.76672
##$ABSF2= -2.285131
##$ABSG= 5
##$ABSL= 3
##$ALPHA= 0
##$AQORDER= 0
##$ASSFAC= 0
##$ASSFACI= 0
##$ASSFACX= 0
##$ASSWID= 0
##$AUNMP= <proc_1d>
##$AZFE= 0.1
##$AZFW= 0.1
##$BCFW= 0
##$BC_mod= 2
##$BYTORDP= 0
##$COROFFS= 0
##$CY= -3
##$DATMOD= 1
##$DC= 0
##$DFILT= <>
##$DTYPP= 0
##$F1P= 0
##$F2P= 0
##$FCOR= 1
##$FTSIZE= 16384
##$FT_mod= 6
##$GAMMA= 0
##$GB= 0
##$INTBC= 1
##$INTSCL= 0
##$ISEN= 128
##$LB= 0.24
##$LEV0= 0
##$LPBIN= 0
##$MAXI= 10000
##$MC2= 0
##$MEAN= 0
##$ME_mod= 0
##$MI= 1.114404
##$NCOEF= 0
##$NC_proc= -7
##$NLEV= 6
##$NOISF1= 3.799351
##$NOISF2= 2.8
##$NSP= 0
##$NTH_PI= 0
##$NZP= 0
##$OFFSET= 15.72485
##$PC= 1
##$PHC0= -15870.67
##$PHC1= 13.20078
##$PH_mod= 1
##$PKNL= yes
##$PPARMOD= 0
##$PSCAL= 0
##$PSIGN= 0
##$REVERSE= no
##$SF= 200.130005342867
##$SI= 16384
##$SIGF1= 3
##$SIGF2= 2
##$SINO= 5.538805
##$SIOLD= 16384
##$SREGLST= <1H.CDCl3>
##$SSB= 0
##$STSI= 16384
##$STSR= 0
##$SW_p= 3612.71676300578
##$SYMM= 0
##$S_DEV= 0
##$TDeff= 16384
##$TDoff= 0
##$TI= <>
##$TILT= no
##$TM1= 0
##$TM2= 0
##$TOPLEV= 0
##$USERP1= <user>
##$USERP2= <user>
##$USERP3= <user>
##$USERP4= <user>
##$USERP5= <user>
##$WDW= 1
##$XDIM= 16384
##$YMAX_p= 487309538
##$YMIN_p= -490628
$$ End of Bruker specific parameters
$$ ---------------------------------
##NTUPLES= NMR SPECTRUM
##VAR_NAME=  FREQUENCY,     SPECTRUM/REAL,   SPECTRUM/IMAG
##SYMBOL=    X,             R,               I
##VAR_TYPE=  INDEPENDENT,   DEPENDENT,       DEPENDENT
##VAR_FORM=  AFFN,          ASDF,            ASDF
##VAR_DIM=   16384,         16384,           16384
##UNITS=     HZ,            ARBITRARY UNITS, ARBITRARY UNITS
##FACTOR=    0.220516191357247, 1,           1
##FIRST=     3147.01425466245, 0,            0
##LAST=      -465.702508343332, 0,           0
##MIN=       -465.702508343332, -490628,     0
##MAX=       3147.01425466245, 487309538,    0
$$ Real data points
##PAGE= N=1
##DATA TABLE= (X++(R..R)), XYDATA
$$ [...]
7109A5417207J020969J319760J412936J944825K224726K754267L625084M607678
7101C4327452N672133P040224Q562093J0636064J2109150J2535226J0718876O169253
7093A07770471N20125n821193r996957j1652156j1042035q870909o685450n380463
7085D8841433m618392m223783l542410l100265k634403k035050j315364j077047
7077B6294719n19870J69820N21148J120510J914406K588423L315138M082161M228499
7068D3714954M070455K906385J142496r68606l268298m388044n522567n634639
7060C2052136m795327m107100l369490k220853j740403j329498j287628j164243
7052A2037594q18778q84597o89832m02806n59457o68898n15734m46257j14337
$$ plain form
7109 15417207 16438176 17757936 19170872 21115697 23340423 26094690 29719774 34327452
7101 34327452 39999585 47039809 55601902 66237966 78347116 90882342 101601218 107770471
7093 107770471 108290596 102469403 92472446 80820290 69778255 60907346 54221896 48841433
7085 48841433 44223041 39999258 36456848 33356583 30722180 28687130 27371766 26294719
7077 26294719 25774849 25944669 26465817 27586327 29500733 32089156 35404294 39486455 43714954
7068 43714954 47785409 50691794 51834290 50865684 47597386 43209342 37686775 32052136
7060 32052136 27256809 23149709 19780219 17559366 15818963 14489465 13201837 12037594
7052 12037594 11218816 10334219 9644387 9241581 8682124 8013226 7497492 7051235 6936898
7043F936898l02858j56851p2277m65959l41253l11721j88767j5217j78613k86461
7033D616921j33340k36439j72695j19441j94568j02906j86600k8540j0394p5868
7023C356130J62280k72145j320m0030j86011J28836P2311O4317o8003j884j79847
7012C034634k60421n3868j78507k19183j10845l3355j5601k50022j88638o3124
7002A661070N6426j9635r0701N462L1055k38126r4828J85870N5799o4719L241
6991A490914l8870m2854Q7005L2828j92088j46123l0493L1493j737r7333R3339
6980A186081J4309j46669k11602K0445j5540J25692P8456O2338n7796q8231j1464
6969I56019L4741J66911l67970L0861L0318N1685j67558N1920N1738n4619Q2838
$$ plain form
7043 6936898 6634040 6477189 6404912 5938953 5597700 5285979 5097212 5081995 4903382 4616921
7033 4616921 4483581 4247142 4074447 3955006 3760438 3657532 3470932 3442392 3431998 3356130
7023 3356130 3518410 3246265 3244945 3204915 3018904 3147740 3220051 3284368 3216365 3214481 3034634
7012 3034634 2774213 2720345 2541838 2322655 2211810 2178455 2162854 1912832 1724194 1661070
7002 1661070 1717496 1697861 1607160 1612622 1643677 1405551 1310723 1496593 1552392 1487673 1490914
6991 1490914 1452044 1409190 1496195 1529023 1336935 1190812 1160319 1191812 1190075 1092742 1186081
6980 1186081 1200390 1053721 842119 862564 847024 972716 1051172 1113510 1055714 967483 956019
6969 956019 990760 1157671 789701 820562 850880 902565 735007 786927 838665 784046 866884
6958H66884Q7264j26445q7819j26463J52154n1232l599R390r4769k5190K28415
6947H28590j13733k8070L8952j5661j62264n0211J21710l1938J50929j0501k5419
6936G02384r6505J08237j875j3285J579l8786j0631L8351j87021J06864j66554
6925D42758l7497P3744j27585J10677M1131R9779p0315j5277J53402l8908n4908
6914E77001r438q7376P3854k3126O8437M8362k52315k44209J78578J52274j95083
6903B86959o1646N8339J53161j16622L3723Q9008j2847p1988j84897o1610k5309
6892H6271P6747M804Q0793K56898j3k77257j75658K62413n1792P8181R587N7039
6880D08013p8584M3233M2288l5732r9808K1137j17108J7670o7458P9676q0486
$$ plain form
6958 866884 954148 827703 739884 613421 765575 714343 710744 720134 625365 600175 828590
6947 828590 714857 686787 725739 710078 547814 497603 619313 587375 738304 727803 702384
6936 702384 605879 714116 712241 698956 700535 661749 651118 689469 502448 609312 442758
6925 442758 405261 479005 351420 462097 503228 603007 532692 517415 670817 631909 577001
6914 577001 567563 480187 554041 530915 599352 647714 395399 151190 329768 482042 286959
6903 286959 225313 283652 436813 320191 353914 442922 430075 358087 173190 111580 86271
6892 86271 163018 167822 248615 505513 505500 228243 52585 314998 263206 341387 350974 408013
6880 408013 329429 372662 414950 379218 279410 300547 183439 201109 133651 213327 132841
6869A32841J65132N0914p3488M451l0731K03609n2946j31839M980n7773l1287
6858A83863K96647J71263j28830j14252m3738j01701j27463K2050p1805o5004
6848B1030Q9220J79061O8187n3196l3472n827J76339M8370j90195j66440J76581
6837C09658O3248m0301j83763K6631m1480J99138K5748Q3228q8276J69663j94726
6826C28768j51554J43771N1998k0284k14015o4246K0772q699k5355q9870K76187
6815B47473J18364k27517l5672j19356l1584J55453J28371K7609n8925p1135l5937
6804I7144O5365r5570l2780M06203O1940n7695j31664k34815K02849P6026j49252
6793B07751n0635O9940L6014n9237j2941J67556J41868k70597K1049m4823o745
$$ plain form
6869 132841 297973 348887 275399 279850 249119 452728 399782 267943 272923 215150 183863
6858 183863 480510 651773 522943 408691 364953 263252 135789 157839 86034 21030
6848 21030 110250 289311 357498 304302 270830 265003 441342 489712 299517 133077 309658
6837 309658 372906 332605 148842 175473 133993 333131 358879 442107 353831 523494 328768
6826 328768 177214 320985 372983 352699 138684 74438 95210 86511 61156 -28714 247473
6815 247473 365837 138320 102648 -16708 -48292 107161 235532 263141 204216 133081 97144
6804 97144 162509 66939 34159 440362 502302 444607 312943 78128 280977 357003 207751
6793 207751 157116 227056 263070 203833 190892 358448 500316 229719 250768 205945 199200
6782A99200j3537q0928J20569j34220K4092J36327L1832j39189J5746J67000J12419
6771D39311R9982k3303o0846j05892r566J76757j74818j97114O272Q28n3281Q2720
6759A81050J6060M0511m971j40284N3078R8595m4884j192K03502j15778n9791
6748B25896O7972l684j69401K14617j68702j12666P5228R3988O0866j37691P9628
6737B26051R8434J29376l04008q1333K7036o1941J74276M5829L9287j97922Q581
6726A03666J01837j27522N167J26256J3575R0837j00272m1652M9232m8636J4633
6715A87121j2201M4571L3564P499j00506J30120O5961P9269Q4155M8610j43344
6704D24819j21473K2231Q0707P9703j2973J5045J138J77155j48045q5363q0807
$$ plain form
6782 199200 185663 104735 225304 91084 115176 251503 283335 144146 159892 326892 439311
6771 439311 539293 515990 455144 349252 339686 516443 341625 144511 150783 151611 98330 181050
6759 181050 197110 237621 232650 92366 145444 244039 199155 197963 401465 285687 225896
6748 225896 293868 290184 120783 335400 166698 54032 129260 223248 284114 146423 226051
6737 226051 324485 453861 149853 68520 95556 33615 207891 253720 293007 95085 103666
6726 103666 205503 77981 83148 209404 222979 313816 213544 171892 221124 172488 187121
6715 187121 174920 219491 253055 260554 160048 290168 356129 435398 519553 568163 424819
6704 424819 303346 325577 406284 485987 473014 488059 489197 666352 518307 432944 352137
6693C52137M2021K51085R0176n8910k53316J77248L0297J1032k12056O5113k26859
6682B67968J11119J20254J3279K27023l26679p320p9863j15012n2115J05891m97
6671B64048m3667N3083j16006J47490J71892L3670j17183o2171J53895r6869L4369
6660D22551J33111o2015l1374n2195m7419l0480j97881J93815o3301j83616J74845
6649B56041M77j01960K59746K4634j36360K1929J22940n706q2883n7544k22950
6638G8364p0403K34869J14222K09217o3821j62447j12689j50601J22493J28807
6628C28011j22547k7575O6112J83092j7525j86381q1899Q9977K2955q1980M267
6617A76507R5417j01536J25971q1210j41726Q3442n7125j1316j27300N4073R369
$$ plain form
6693 352137 394158 645243 735419 676509 423193 600441 630738 641770 429714 494827 267968
6682 267968 379087 499341 512620 739643 412964 405644 325781 210769 158654 264545 264048
6671 264048 220381 273464 157458 304948 476840 510510 393327 331156 485051 388182 422551
6660 422551 555662 493647 462273 410078 362659 332179 134298 328113 264812 81196 256041
6649 256041 256518 154558 414304 438938 302578 324507 447447 441741 358858 301314 78364
6638 78364 7961 242830 357052 566269 502448 340001 227312 76711 199204 328011
6628 328011 205464 177889 244001 427093 409568 223187 141288 231265 254220 172240 176507
6617 176507 271924 170388 296359 215149 73423 156865 99740 88424 -38876 15197 24566
6606B4566N5884N2033k8828R2023N7308Q4748r9129j12509K37760K5113j7339
6595C71630j89449J14085q5781l5290p4482K8546J9496J60370r5568J68174j50194
6584B31537R7490J56052k96983K1950o7506J18229L291m7535j7283J4817n605
6573B08454J48568K517q6981J6447j50269j48325K19382J44081n7973O3932k03116
6562A56717L1529J93625k1992q9258j43756J73199r6986R6457q1034q1337K48926
6551C86090J39536r8623r6369k56686j17914J24865k56011N970J23204J69892
6541A23954l7151l4601R984l0980L73720j09598o7517o601l5443K536l9425K4014
6529A72892L7423K58279m7939j03312R3612l1671l10861L9818J41597N8983J03711
$$ plain form
6606 24566 80450 132483 103655 195678 252986 337734 238605 126096 363856 388969 371630
6595 371630 182181 296266 210485 175195 100713 129259 148755 309125 213557 381731 231537
6584 231537 329027 485079 188096 210046 142540 260769 264060 216525 199242 214059 208454
6573 208454 357022 359539 272558 289005 138736 -9589 209793 353874 295901 359833 156717
6562 156717 188246 381871 359879 270621 126865 300064 203078 299535 218501 137164 386090
6551 386090 525626 427003 330634 73948 -43966 80899 -175112 -169142 -45938 123954
6541 123954 86803 52202 62186 31206 404926 295328 227811 221210 185767 188303 148878 172892
6529 172892 210315 468594 420655 317343 410955 379284 68423 108241 249838 308821 412532
6518D12532j64089m665N0918q0389M089n281R8010J54295K9907j40257n477O718
6506C56311j21565j28468K8740M763Q290P5130O0727n5904N4140J08696N164P921
6494D03945k93942J5619K1671J44198j3772p7971K65738r6709j86038r4932K6976
6483A14783J89259l9994n1599k23280K4864J81677L7942L4684j69368l3149P2040
6472A37859p5603R9688R3522l9645N9194K02591R3037j02435j76668n0686j5114
6461B25740J59352J33663j24034k12908O5861N425o9105m3172O4405K80789j52126
6450C33890J0790j10122l7405L9003l6278O2313j29278j7178K27874J25959j69859
6439B99709n9981J5261L4347j04974k16021K875R4926K3683m8743K23762L7281
$$ plain form
6518 412532 248443 243778 294696 214307 218396 213115 311125 465420 495327 355070 349593 356311
6506 356311 234746 106278 135018 139781 148071 223201 283928 228024 282164 390860 396024 403945
6494 403945 110003 125622 147293 291491 277719 199748 465486 368777 182739 87807 114783
6483 114783 304042 264048 212449 -10831 14033 195710 233652 268336 98968 65819 137859
6472 137859 62256 161944 255466 215821 275015 477606 570643 468208 291540 240854 225740
6461 225740 385092 518755 394721 181813 247674 253099 183994 140822 205227 486016 333890
6450 333890 344680 234558 197153 236156 199878 262191 132913 115735 343609 469568 299709
6439 299709 239728 254989 289336 184362 -31659 -28784 66142 89825 41082 264844 302125
6428C02125l088j2636M7121J00748P4106j6717q1447p0121J58602j23900j64819
6417B09974L59444j02095p8210j3567n3935M5538K1066o4153j81823N3875k1147
6406A74967k2431N0957N3491n1698n677K58606J66753Q2067k11782j81894j08973
6395B04386J61205Q3778j77786l6605k9210J97212R705l3179r0119P8737P9894
6384D48018j82767j04873Q6081P0420j6650P9825l8769j59333J1941M8437N0721
6373B93051J23976n953p4515o714O4123j19899M9066J41916m1871k4225p233r8772
6361B92950K5340K01012J6720p71l4669q2122j45304k3496K32556K381M4000j11670
6349D16927K1301K45203k425l9036m7148J23339M5338j17065K11305n5723L4284
$$ plain form
6428 302125 299037 286401 333522 434270 508376 491659 410212 340091 498693 374793 209974
6417 209974 569418 467323 389113 375546 321611 367149 388215 324062 142239 196114 174967
6406 174967 152536 203493 256984 205286 199609 458215 624968 707035 495253 313359 204386
6395 204386 365591 449369 271583 234978 205768 402980 412685 379506 289387 368124 448018
6384 448018 265251 160378 246459 316879 300229 380054 341285 181952 193893 242330 293051
6373 293051 417027 411074 336559 329845 393968 274069 323135 465051 423180 398955 391722 292950
6361 292950 318290 519302 536022 535251 500582 418460 273156 249660 482216 484597 528597 416927
6349 416927 438228 683431 681006 641970 594822 718161 763499 646434 857739 802016 836300
6338H36300J52548j68116N6872R2820l36010n3287r8750j16909K47569n1632J2192
6327E73597k6408M7663J0122r096j35686l23249K57323J54291o2481q7444J6382
6316D15014j38611Q776K7312j43941J97142J14875J25598m5004o5988J6106L2629
6305E43908J17709o7105J6621J08869j64210J0917j37556m6753O0225K41644K11034
6294H95303n2604j71696j15469K28912K8232j4089L3951J53735K16561J13264
6284A316100L54730J74498J6353l4991p1557j25812j75125p4937k99544k82191
6274G97524L3680j07948r2936j33368r5415R5052P4488q5067l9184J31966l4703
6263E44089J72588k17333O0466K65037j17477L9871q2128k981M8324J71404l20111
$$ plain form
6338 836300 988848 820732 877604 970424 634414 581127 482377 365468 613037 561405 573597
6327 573597 547189 594852 604974 595878 460192 136943 394266 548557 486076 398632 415014
6316 415014 276403 285179 312491 168550 365692 480567 606165 561161 495173 511279 543908
6305 543908 661617 594512 611133 720002 555792 566709 429153 382400 442625 684269 895303
6294 895303 842699 671003 555534 784446 812678 798589 832540 986275 1202836 1316100
6284 1316100 1670830 1845328 1861681 1826690 1755133 1629321 1454196 1379259 1079715 797524
6274 797524 831204 723256 630320 496952 401537 496589 571077 486010 446826 578792 544089
6263 544089 716677 499344 559810 824847 707370 747241 665113 662132 710456 881860 561749
6252E61749k77890J88841J5433j01134R3714J21927K14075r5509j32436j1501
6242E77269M8822O2709j62144m0839M0717k34223R4632m409K7136O4002J14991
6231E88663J96542j05832k30286Q779J65556j5673J3683j44249m5956J34327P4288
6220F39842k4748k6018l94546P9752M0346Q5150j33544J90197K10847J09853q0560
6209F96571o1137J13360m3725R9299j38745j1586J18803k0520o0508k44053J46464
6198E94223J26599j07783J3943O9108j75008M3774J9913O6583K31880R7681j47777
6187H33136j32476Q77j50841Q4276J49965M1214m0293j9088Q0531J08596j87037
6176G68860k10035o0331J71150K03055J6105k70787n2681j0647M8987J04068q4223
$$ plain form
6252 561749 283859 472700 488133 386999 480713 602640 816715 721206 588770 577269
6242 577269 626091 688800 526656 485817 526534 292311 386943 382534 409670 473672 588663
6231 588663 785205 679373 449087 457866 623422 607749 621432 477183 431227 565554 639842
6220 639842 615094 589076 194530 274282 314628 399778 266234 456431 667278 777131 696571
6209 696571 635434 748794 705069 804368 665623 654037 772840 752320 691812 447759 594223
6198 594223 720822 613039 626982 696090 521082 564856 584769 651352 883232 980913 833136
6187 833136 700660 701537 550696 634972 784937 826151 785858 766770 847301 955897 768860
6176 768860 558825 498494 669644 872699 888804 618017 565336 554689 603676 707744 623521
6165F23521K7073j71885Q3375Q7110P8123O0321k1139J51242k7991J20124J03049
6154A112923j56217j72889q7256k65Q040L4029O5980N0703L059J2341m0611j22037
6142G07800n3350J16042K19461j46648N8328m6983M1030J79407q8436J20710J66486
6131A273847o4224J40105n0410n2023J04829m5094j47540N0132J32175P061l06190
6120A042668l3811m7035j09926J93949J2366o7702K9407J2708R6615P5844M4410
6109A249493j12684K35075N4338l8318j87397J46568J06146j39363k64696J0675
6099A059837J11258O6330M6587k53230M2511J11482j66606N3821K86051r8898
6089A259143m4180n4378q5792N7894J87369q702m8284N811L1325l50066n2800
$$ plain form
6165 623521 650594 478709 562084 649194 727317 787638 766499 917741 889750 1009874 1112923
6154 1112923 956706 783817 696561 696296 704336 738365 804345 855048 858107 870448 829837 707800
6142 707800 654450 770492 989953 843305 901633 854650 895680 1075087 986651 1107361 1273847
6131 1273847 1209623 1349728 1299318 1247295 1352124 1307030 1159490 1209622 1341797 1348858 1042668
6120 1042668 1008857 961822 851896 1045845 1058211 990509 1019916 1032624 1129239 1205083 1249493
6109 1249493 1136809 1371884 1426222 1387904 1200507 1347075 1453221 1313858 1049162 1059837
6099 1059837 1171095 1237425 1284012 1030782 1073293 1184775 1018169 1071990 1358041 1259143
6089 1259143 1214963 1160585 1074793 1132687 1320056 1311354 1263070 1268881 1300206 950140 897340
6078H97340J54256J05233R3454l6319J12900J1750N1839J56140J534j70932j26636
6067A250559O1442j03312Q5729P327Q9690m5371P4214j54917N552M2466j902N5046
6055A366523Q5129J29631k7564M6406O3566l0428J3106p1536J40563m300l9312
6044A671784J48701J7798k8714P4970J43600Q4153k00488J3545P8310k13860j1318
6033A778481K77446j81950j0859k6894J1125p530J17984k3175r3311q7039J12516
6022A866794O0669j29096J64772j8888l6126K0059J20937K885r4443j23590k9012
6011A804961q0606O5773J69461J56173k79999J28628r3770j31034K22668j7614
6001A944641N7078J43931j51440M9527J35966J11246j6600j58698J42079K6102
$$ plain form
6078 897340 1051596 1156829 1250283 1213964 1326864 1338614 1390453 1546593 1548127 1377195 1250559
6067 1250559 1312001 1208689 1294418 1301745 1391435 1346064 1420278 1265361 1270913 1313379 1311477 1366523
6055 1366523 1451652 1581283 1553719 1600125 1663691 1633263 1646369 1574833 1715396 1711096 1671784
6044 1671784 1820485 1838283 1809569 1884539 2028139 2112292 1911804 1925349 2003659 1789799 1778481
6033 1778481 2055927 1873977 1863118 1836224 1847349 1839819 1957803 1934628 1841317 1754278 1866794
6022 1866794 1927463 1798367 1963139 1944251 1908125 1928184 2049121 2052006 1957563 1833973 1804961
6011 1804961 1724355 1790128 1959589 2115762 1835763 1964391 1870621 1739587 1962255 1944641
6001 1944641 2001719 2145650 1994210 2043737 2179703 2290949 2274349 2115651 2257730 2283832
5991B283832J0189k4503j44555J17947O0548p7665q0940K00048j83207L0235N7488
5980B249417r5679J42792K61297j42981P7846J19218J2580k2562P1558m6580J12418
5969B739324n1703n0303j26228K604R3100n0249J49352J67197q3023K476J6464
5958B809011p9465K6274k43673Q8247K18339J06040j45025R0202J42651L9688
5948C052289k05555K1438J10020p1913k2115K13305J91248J50596K3277j11845
5938C350745J75186k0782j50013K46785O1346k2205j33776N316J68911P6929J76393
5927C934835M9389N3140K9614j93339O6698J56201J08997J21050j3773R1067k5173
5916D378706j08499L14601K5510K840L6554p8109L26935N2641j32022l8210J30206
$$ plain form
5991 2283832 2294021 2269518 2124963 2242910 2303458 2225793 2144853 2344901 2161694 2191929 2249417
5980 2249417 2153738 2296530 2557827 2414846 2492692 2611910 2624490 2601928 2673486 2626906 2739324
5969 2739324 2687621 2637318 2511090 2513694 2606794 2556545 2705897 2873094 2790071 2792547 2809011
5958 2809011 2729546 2755820 2512147 2600394 2818733 2924773 2779748 2869950 3012601 3052289
5948 3052289 2846734 2868172 2978192 2906279 2884164 3097469 3288717 3439313 3462590 3350745
5938 3350745 3525931 3505149 3355136 3601921 3663267 3641062 3507286 3512602 3681513 3758442 3934835
5927 3934835 3984224 4037364 4066978 3873639 3940337 4096538 4205535 4326585 4312812 4403879 4378706
5916 4378706 4270207 4584808 4610318 4613158 4649712 4571603 4898538 4951179 4819157 4780947 4911153
5905D911153J10158J39857K05026N3158J33650O8414L15158J30588J01571J93600
5895F362333J59223R1842L2314J14295J12558K21445J15497n5619K67766Q8705
5885G510359J78079M84965N05922K56033K12320L85359L26030L21046M30757N78831
5875A1189701O73384N24020O82884R25783P87809Q65691J341098J832294J614822
5866B0437486J650932J815714J550214J280858R42583J86991k622k40358l80266
5857B7241532p28706j010615r43569p57373p17338o95720n11433n98215q53165
5848B0425398p65679q37081r70617n10033o34292l46554n17664m08286j87247
5839A5247945k83157j52353J04779O9480j85540j390M0915Q3945L67450K74762
$$ plain form
5905 4911153 5021311 5161168 5366194 5419352 5553002 5621416 5936574 6067162 6168733 6362333
5895 6362333 6521556 6613398 6645712 6760007 6872565 7094010 7209507 7153888 7421654 7510359
5885 7510359 7688438 8173403 8679325 8935358 9147678 9533037 9859067 10180113 10610870 11189701
5875 11189701 11863085 12387105 13069989 13995772 14783581 15649272 16990370 18822664 20437486
5866 20437486 22088418 23904132 25454346 26735204 27677787 27864778 27862156 27621798 27241532
5857 27241532 26512826 25502211 24558642 23801269 23083931 22388211 21876778 21278563 20425398
5848 20425398 19659719 18822638 17852021 17341988 16707696 16361142 15843478 15435192 15247945
5839 15247945 14964788 14812435 14917214 14986694 14801154 14799764 14840679 14924624 15292074 15566836
5829A5566836M49067P26240O89095N80964N59856P42241P59094N04140K33603
5820B0811136L69736K62039L80809L95531L82710P33133Q00102J287167J523828
5811B6946191J697513K337049K776058L472397M071568M902648N416742O148594
5803E7768760O553119O316091N431080M066768J807330l25833k176991l923298
5795G5517026m670070n064943m886997l935706k950324j745898o97198M24304
5787E1990194J266334K037880L257179M449177N726757O993031P628571Q259060
5779I1608183P384735N335573K073661j755394n347138q423201r629322r984745
5771G1262352q687777o933012n658226m868949l648737l127734k331116j679434
$$ plain form
5829 15566836 16015903 16742143 17431238 18012202 18572058 19314299 20073393 20577533 20811136
5820 20811136 21180872 21442911 21823720 22219251 22601961 23335094 24135196 25422363 26946191
5811 26946191 28643704 30980753 33756811 37229208 41300776 46203424 51620166 57768760
5803 57768760 64321879 70637970 76069050 80135818 81943148 81617315 79440324 75517026
5795 75517026 70846956 65782013 60895016 56959310 54008986 52263088 51565890 51990194
5787 51990194 53256528 55294408 58551587 63000764 68727521 75720552 83349123 91608183
5779 91608183 98992918 104328491 106402152 104646758 99299620 90876419 81247097 71262352
5771 71262352 62574575 55641563 49983337 45114388 41465651 38337917 36006801 34327367
5763C4327367j684212j241572j242042q44701p78797m37859r06785j024952p31795
5754B5434652r82056q46758p77982o04694q48599p22718n31813l90316m42637
5745A9287079m78008k25657K271J6702J8554J27M3867J09991M96474M97757P36295
5734B0505452P16168O30640M95386M44247M98454r384K16984n8318j3426J88117
5724B3614320L71682O34876L82554L60612K45659K26310M21534L41948L45838
5715B6945333M07504K86803J48786L25738J35784j00613J2517r8882k57889l0747
5705B7774334j64458n3851L35082O59198P51946R52722Q48417N00108M28300K07944
5695C2239742k74877m95976q44864j020490j054223j482998j446357j387744r02479
$$ plain form
5763 34327367 32643155 31401583 30159541 29314840 28536043 28098184 27191399 26166447 25434652
5754 25434652 24452596 23605838 22827856 22223162 21374563 20651845 20120032 19729716 19287079
5745 19287079 18809071 18583414 18585685 18602387 18620941 18621068 18664935 18774926 19271400 19769157 20505452
5734 20505452 21221620 21852260 22347646 22791893 23290347 23280963 23497947 23439629 23426203 23614320
5724 23614320 23986002 24620878 25003432 25364044 25609703 25836013 26257547 26599495 26945333
5715 26945333 27352837 27639640 27788426 28114164 28249948 28149335 28161852 28062970 27805081 27774334
5705 27774334 27609876 27556025 27891107 28550305 29302251 30254973 31103390 31603498 32031798 32239742
5695 32239742 31964865 31468889 30624025 29603535 28549312 27066314 25619957 24232213 23329734
5686B3329734m62841o94875o85156m96640k41037j91078j42605L33380P8156J59303
5676B0986341K26748M62588L45210Q37482Q73878P57533O83777Q99248Q33274
5667B6906079P43714N19433J26223n06115o20353o79224p79366p81801n77223
5658B4351367k95408q4889k08342l0429M71698M39152P87887J082417J090277
5649B7603730J032926J363720J504590R57032P62374K38750k28003l86261q14786
5640C2034072r04627n25741l11101k49670R2278M5178K81876L95885P74203R77463
5630C2609816R00490L79795N20684M10455M57773R3115r9194k71004o87211q04480
5620C3510239o70781m58720n93480q3954R6670J13690O76746P05956M91198O45623
$$ plain form
5686 23329734 22866893 22172018 21486862 20990222 20749185 20558107 20415502 20748882 20827038 20986341
5676 20986341 21213089 21675677 22020887 22858369 23732247 24489780 25173557 26072805 26906079
5667 26906079 27649793 28169226 28295449 27789334 27168981 26489757 25710391 24928590 24351367
5658 24351367 24055959 23971070 23762728 23732299 24203997 24643149 25431036 26513453 27603730
5649 27603730 28636656 30000376 31504966 32461998 33224372 33463122 33235119 32848858 32034072
5640 32034072 31129445 30603704 30292603 30042933 30135211 30180389 30462265 30858150 31632353 32609816
5630 32609816 33510306 33890101 34410785 34821240 35279013 35372128 35272934 35001930 34314719 33510239
5620 33510239 32839458 32380738 31787258 31703304 31799974 31913664 32590410 33296366 33787564 34433187
5610C4433187M99637J89215l22208r37364j463565j471970j144536j150049j040808
5601B7591539j134227r23205r54769o85835m87500J06831R6626K77678L53879
5592B4241017L98387M57095L70539n6033n17004r23638j029275j294556j406271
5583B0240261j285088j326222j024337r31999p69478p98064m74281m57088k81105
5574A2892599j90078l88621l05267J53315N4253j60630p0201p1193k52348n14230
5564A1147599n98505o39888m78880n81678l13859m66089k73621k89990j83242
5555G321847l08007j00592l35386j82513r4094k11155k15521j22838m4859l69834
5545E337048o2957J04015j3598k43946k1151m4023p760k24201J2441p5106K7214
$$ plain form
5610 34433187 34932824 35122039 34799831 33862467 32398902 30926932 29782396 28632347 27591539
5601 27591539 26457312 25534107 24579338 23893503 23406003 23512834 23609460 23887138 24241017
5592 24241017 24639404 25096499 25467038 25411005 24894001 23970363 22941088 21646532 20240261
5583 20240261 18955173 17628951 16604614 15672615 14903137 14105073 13630792 13173704 12892599
5574 12892599 12702521 12313900 12008633 12161948 12216201 12055571 11985370 11914177 11661829 11147599
5564 11147599 10549094 9909206 9430326 8848648 8534789 8068700 7795079 7505089 7321847
5555 7321847 7013840 6913248 6577862 6395349 6301255 6090100 5874579 5751741 5706882 5337048
5545 5337048 5274091 5378106 5364508 5120562 5099411 5055388 5047628 4823427 4835868 4760762 4787976
5534D787976j88815K6435j02390O3583k3743R2631m9163K73809j99113j41103
5524D540107m2016k90350j43207k9778L01184k2576j98050j20784r4412k23273
5514C676845O8099P1530N7661j1277l196J30792j22931p0463K3709l475j45581
5503C671713j15848r3903J60445j00989J4414J48972k16945L964J6657j17923
5493C370557q3643n8190J19252J03599p2479J00516j46565Q4400O158j70992P1290
5482C323903K8450J22397k56419j38281P3797Q5025R4314N5607J03085l9222K7973
5471C480629J05551k0523J11521J35155J09896j39964j2768n7545l3243J14602
5461C793311j58995Q4402J32306k5356j14518j63989J17186K04692k7354J01136
$$ plain form
5534 4787976 4599161 4625596 4523206 4586789 4563046 4655677 4606514 4880323 4681210 4540107
5524 4540107 4498091 4207741 4064534 4034756 4335940 4313364 4115314 3994530 3900118 3676845
5514 3676845 3744944 3816474 3874135 3862858 3859662 3990454 3867523 3797060 3820769 3817294 3671713
5503 3671713 3555865 3461962 3622407 3521418 3535832 3684804 3467859 3471823 3488480 3370557
5493 3370557 3286914 3228724 3347976 3451575 3379096 3479612 3333047 3417447 3423605 3252613 3323903
5482 3323903 3352353 3474750 3218331 3080050 3153847 3238872 3333186 3388793 3491878 3452656 3480629
5471 3480629 3586180 3565657 3677178 3812333 3922229 3782265 3769497 3711952 3678709 3793311
5461 3793311 3634316 3718718 3851024 3825668 3711150 3547161 3664347 3869039 3841685 3942821
5451C942821J44764l4464R7016Q6668J16598O4587j93501j49284N7652O0312k41256
5440C951913L47626J15066k59359p3763L17719j14113k26448O1585J90316k5414
5430D285128j22723R0389J42775J12908R5759j06886Q2775L4829o9767j68061
5420D377126O4451Q4223J4383J24193P6629J1819J531J74390K56093J81821J24391
5409E491050K49286R6714K80326M82902L48079N19705M56762O26362M99155N6418
5399I106759K47151K10550N60103L65513p7262J26262Q874J66716k2015j58909
5389A0533742J77959J91362K27499L54131K52799P9019L08385J21122l8684L06769
5379A2514103K42016K01510j3346l94256n06417l97723m16512n29901m64236k95933
$$ plain form
5451 3942821 4087585 4053121 4150137 4236805 4353403 4417990 4224489 4075205 4132857 4193169 3951913
5440 3951913 4299539 4414605 4155246 4081483 4399202 4285089 4058641 4120226 4310542 4285128
5430 4285128 4162405 4252794 4395569 4508477 4604236 4497350 4580125 4614954 4545187 4377126
5420 4377126 4441577 4525800 4540183 4664376 4741005 4752824 4754355 4928745 5184838 5366659 5491050
5409 5491050 5740336 5837050 6117376 6600278 6948357 7468062 7924824 8551186 9050341 9106759
5399 9106759 9353910 9564460 10124563 10490076 10412814 10539076 10547950 10714666 10692651 10533742
5389 10533742 10711701 10903063 11130562 11484693 11737492 11816511 12124896 12246018 12207334 12514103
5379 12514103 12756119 12957629 12944283 12550027 12043610 11645887 11229375 10699474 10235238 9939305
5369I939305l00383l57534l53647j91208j46098j45712k49550k84368l43730m11195
5359G155880m56553n23778m42449l98795j71260P3458j24572j80592N891j17011
5349D820219k545j3037K8218j2445k85322R9673J35850k9919l5666O6608J5888
5338D787522j31172J19122p5294j45305j37063j36053P2262K13660n3442Q827
5328D523064j62175O0022M3973q6587j01725j77528N2114J3047r8084L22215p7824
5317D310512j61051l0845O12m847J51525j31945p1202J37079N7010k43634m0653
5306C972561N1768M1787n9427j23533p8642j95900J25069o8673L3156l6855j46913
5295C514398n5227O9010j66967K10648J65213r2010m2539R0082P1783j23447j4349
$$ plain form
5369 9939305 9638922 9281388 8927741 8736533 8590435 8444723 8195173 7910805 7567075 7155880
5359 7155880 6699327 6175549 5733100 5334305 5163045 5236503 5111931 4931339 4937230 4820219
5349 4820219 4817674 4804637 4832855 4820410 4535088 4634761 4770611 4740692 4705026 4771634 4787522
5338 4787522 4656350 4775472 4700178 4554873 4417810 4281757 4354019 4567679 4514237 4523064
5328 4523064 4360889 4420911 4464884 4378297 4276572 4099044 4151158 4164205 4066121 4388336 4310512
5317 4310512 4149461 4118616 4119228 4114381 4265906 4133961 4062759 4199838 4256848 4013214 3972561
5306 3972561 4024329 4066116 4006689 3883156 3804514 3608614 3733683 3665010 3698166 3661311 3514398
5295 3514398 3459171 3528181 3361214 3571862 3737075 3645065 3602526 3692608 3764391 3640944 3626595
5284C626595o8219O2279m1292P0269j2963M5802j62106o21J83292k0142l2982
5273C649912j44288j75130R6191j6916N5131j49325j44333J88574j7160K27825
5263C570481l3765j39053m4747k15680k9913O5605K028J59326J13328R9506j08918
5252C438198J35640L498J61980q4541P1475k06513r4670K72333j90812o637Q8860
5241C588811j4708L6L1006P0031j55149J19188J14142k41059j59892J39178j13242
5230C378342K0304K08189J01813p8533j76091o702J5823Q2889o2840J87806k9222
5219C641778k05117J45715M266p3730M0786m0006K53786q6646k59774J53165N4565
5208C628788N7300L1533j5403q8077m3302p2328L0289p019k97284Q3847J16634
$$ plain form
5284 3626595 3558376 3620655 3579363 3649632 3636669 3682471 3520365 3519744 3703036 3682894 3649912
5273 3649912 3505624 3330494 3426685 3409769 3464900 3315575 3171242 3359816 3342656 3570481
5263 3570481 3536716 3397663 3352916 3137236 3107323 3172928 3174956 3334282 3447610 3547116 3438198
5252 3438198 3573838 3577336 3739316 3654775 3726250 3519737 3425067 3697400 3506588 3499951 3588811
5241 3588811 3574103 3574139 3605145 3675176 3520027 3639215 3753357 3512298 3352406 3491584 3378342
5230 3378342 3398646 3606835 3708648 3630115 3454024 3447322 3463145 3546034 3483194 3671000 3641778
5219 3641778 3436661 3582376 3586642 3512912 3553698 3513692 3767478 3680832 3421058 3574223 3628788
5208 3628788 3686088 3717621 3702218 3614141 3570839 3498511 3528800 3521781 3224497 3308344 3424978
5197C424978J53513J73762j39507j61721Q882P3799o436n9819J26244o2177n9843
5186C471675L0830l2166l0359J23682J19257j59918P7729P3650j97961Q4705J31781
5175C692905K879j64329j04114M8476j14105m4852L92852L5394q6373j7871j03414
5164C537448K3630J04891j3137J0684m9071m6027j25957q1046J5215J45150J68470
5153C690250j12762N7686K0549M1615m8189j453J01600J11947m9818K9960Q6808
5142C928193q5818k36095Q2666Q3875j33071n7707J88779j02187J47069J31378
5132C947082j35462j04850R2219M6174R0095o6138K9638J12757q9064l7698o2484
5121C822269L2522K0502n1408j1973K83670k30904j67469k2510J33133J65005
$$ plain form
5197 3424978 3578491 3752253 3612746 3451025 3459907 3533706 3527270 3467451 3593695 3531518 3471675
5186 3471675 3502505 3470339 3439980 3563662 3682919 3523001 3600730 3674380 3476419 3561124 3692905
5175 3692905 3695784 3531455 3427341 3475817 3361712 3316860 3709712 3745106 3658733 3640862 3537448
5164 3537448 3561078 3665969 3652832 3663516 3614445 3568418 3442461 3361415 3376630 3521780 3690250
5153 3690250 3577488 3635174 3655723 3697338 3649149 3647696 3749296 3861243 3811425 3841385 3928193
5142 3928193 3842375 3606280 3688946 3772821 3639750 3582043 3770822 3668635 3815704 3947082
5132 3947082 3811620 3706770 3798989 3845163 3935258 3869120 3898758 4011515 3922451 3884753 3822269
5121 3822269 3854791 3875293 3823885 3811912 4095582 3864678 3697209 3674699 3807832 3972837
5111C972837J05758N992q2651J58921N560j5900R2222R5019k5362L0346k1004
5100D321738j030m2210J78146J25079n9924L0659j28219j27900M2941L71700o7650
5089D643330j97807j13953k3044o2859L3521K37528J69398M1340l5997j05866
5079D585591N8238J34681K06470P5487l39552l5636K81130k37061j72516K5078
5069D581910O4213j62650M7666m1275K0739k1427n1782p0248j35304J01378p5527
5058D257693J30385R8639J72934J67318N3648j44487l6746R665J22987j96833
5048D635203J11540n5356j07489N7649r4269j17545P4733o2971O3646R7545j50087
5037D452599q2461k804M823M9781J4984j6269m2396J6911J09038j23004P1151
$$ plain form
5111 3972837 4078595 4084587 4001936 4160857 4166417 4150517 4242739 4337758 4312396 4342742 4321738
5100 4321738 4320708 4278498 4456644 4581723 4521799 4552458 4424239 4296339 4339280 4710980 4643330
5089 4643330 4445523 4331570 4308526 4245667 4279188 4516716 4686114 4727454 4691457 4585591
5079 4585591 4643829 4778510 4984980 5060467 4720915 4685279 4966409 4729348 4556832 4581910
5069 4581910 4646123 4483473 4531139 4489864 4510603 4489176 4437394 4367146 4231842 4333220 4257693
5058 4257693 4388078 4486717 4659651 4826969 4880617 4736130 4699384 4709049 4832036 4635203
5048 4635203 4746743 4691387 4583898 4641547 4547278 4429733 4504466 4441495 4505141 4602686 4452599
5037 4452599 4370138 4367334 4372157 4421938 4436922 4420653 4378257 4395168 4504206 4381202 4452353
5026D452353J52530j29910j37960J1278N9198L4094k36705Q5310L6347J62803
5016D489338q2794o3070P8006o4654K42959K90044l05416o6982J95640j3693j18545
5005D580833O7524j2541R751M0549K2271J3331Q6277l1099j39559j2023J79045
4994D804359o6252J59448L3451l05851J71201J14474o9962r7476J40630j38103
4984D745919n267J65709j03265M113k1028j3798O805j2999K349J06719j07562
4973D767695n9229R3132J00105K1651Q3262j64727m1754L05655J89270J24773
4963E419833j8154J9217Q7711k74584J30936K07664k40542M0469J31325J19403
4953E623278J14139K11162j2847J07048P380L95313K88683Q5082o1385Q7768K34731
$$ plain form
5026 4452353 4604883 4474973 4337013 4348291 4407489 4441583 4204878 4290188 4326535 4489338
5016 4489338 4406544 4343474 4421480 4356826 4599785 4889829 4584413 4517431 4713071 4699378 4580833
5005 4580833 4648357 4635816 4645567 4686116 4708387 4721718 4807995 4776896 4637337 4625314 4804359
4994 4804359 4738107 4897555 4931006 4625155 4796356 4910830 4840868 4743392 4884022 4745919
4984 4745919 4740652 4906361 4803096 4807209 4786181 4772383 4779188 4766189 4768538 4875257 4767695
4973 4767695 4708466 4801598 4901703 4923354 5006616 4841889 4800135 5105790 5295060 5419833
4963 5419833 5401679 5420896 5508607 5234023 5364959 5572623 5332081 5372550 5503875 5623278
4953 5623278 5737417 5948579 5935732 6042780 6050160 6445473 6734156 6819238 6757853 6845621 7080352
4942G080352L10869L48432K83882l4325K16107J51137J23686R2430k5817j8934
4932H527819P3296n7525r1493K7542R262q3951m2322J47907L94502N8894j71696
4921H792235Q208J10019j11262l1801j73919j99681j84029j17643m62474j52087
4911G477566k05486k98205k8494L4189r7977n7317k4774J07516k1566j32398k00271
4900F552783j9673Q5731m9371j20217K080K50323j5673R0997l5403r5559j05434
4889F540584j4933j1853K84429j7367M3696J45841L77659J95465l19R2386J00595
4878G736183k0375J17249N19519K41468O1164K22287K5817M48753J2380K34717
4868I599162R8189K6921J4430p5307p4135M0441K3630K26334M4952k22906O2101
$$ plain form
4942 7080352 7391221 7739653 8023535 7989210 8205317 8356454 8480140 8572570 8546753 8527819
4932 8527819 8601115 8543590 8452097 8479639 8488901 8404950 8362628 8510535 8905037 8963931 8792235
4921 8792235 8800443 8910462 8799200 8767399 8593480 8393799 8209770 8092127 7629653 7477566
4911 7477566 7272080 6973875 6945381 6979570 6881593 6824276 6799502 6907018 6885452 6753054 6552783
4900 6552783 6533110 6618841 6569470 6449253 6451333 6701656 6685983 6776980 6741577 6646018 6540584
4889 6540584 6525651 6513798 6798227 6780860 6824556 6970397 7348056 7543521 7543202 7635588 7736183
4878 7736183 7715808 7833057 8352576 8594044 8655208 8877495 8903312 9352065 9364445 9599162
4868 9599162 9697351 9724272 9738702 9663395 9589260 9629701 9653331 9879665 9924617 9701711 9763812
4857I763812M3110j51966q8178k97334K3542j50815l65897k30584k35032r6683
4847H213975r9699k48969k88654l20540k20653j30767M8629k5973j99488l46938
4837F380923m6790P607l74032o4111J50696m643k38863o6792P4892R2426K9168
4826E940481j29626P0647p2623j84750k36861O2925J87053O1910O3545J51326
4816E914027j93884n7157m2158k03077P0510N9024P4125k3934J724p6857j43394
4805E378949j20003K3937K07638j0707r6175J26562j46936J4438J67296p319k02764
4794E334916R5635L10898J6342K7410j01245j26597q9287p8331Q2061k19063J07088
4783E359827J05928n9786M9031J22665N7641J23101J5595N2099k43486M3315j28335
$$ plain form
4857 9763812 9806922 9654956 9566778 9269444 9292986 9142171 8776274 8545690 8310658 8213975
4847 8213975 8114276 7865307 7576653 7256113 7035460 6904693 6953322 6927349 6727861 6380923
4837 6380923 6334133 6341740 5967708 5903597 6054293 6049650 5810787 5743995 5818887 5911313 5940481
4826 5940481 5810855 5881502 5808879 5624129 5387268 5450193 5637246 5699156 5762701 5914027
4816 5914027 5720143 5662986 5620828 5417751 5488261 5547285 5621410 5597476 5599200 5522343 5378949
4805 5378949 5258946 5282883 5490521 5479814 5383639 5510201 5363265 5377703 5544999 5537680 5334916
4794 5334916 5430551 5741449 5757791 5785201 5683956 5557359 5468072 5389741 5471802 5252739 5359827
4783 5359827 5465755 5405969 5455000 5577665 5635306 5758407 5774002 5826101 5582615 5625930 5497595
4772E497595q3727K32615J13530k05992K6306O993K2125K2921K0325o0437N3305
4761E645559K4193J03021j2322k3692p5570Q3198L21501k08635j21000J58955
4751E895208l4745L3838N0171M333J18940K25615l96970J49450J28140k869L4848
4740F205959l8061j43688P1216P6125J01562J6887l8534R5549R9569J82877N5902
4729F685363M8635P4574J54174p1021J19510o6350P1180J12090P1063n8154j05543
4718G035521J31507K74378J63410J11350J15153K18071N0980K50866K49504K99052
4708H899792L7473K68991R3017K95034M21292K70482O00020N92016P53710R57026
4698A3188853R78628J025026J105459J376883J668882J724047R80800N81004P5075
$$ plain form
4772 5497595 5413868 5646483 5760013 5554021 5580327 5587320 5609445 5632366 5652691 5592254 5645559
4761 5645559 5669752 5772773 5760451 5736759 5661189 5744387 6065888 5857253 5736253 5895208
4751 5895208 5860463 5894301 5944472 5948805 6067745 6293360 5896390 6045840 6173980 6171111 6205959
4740 6205959 6167898 6024210 6095426 6171551 6273113 6290000 6251466 6347015 6446584 6629461 6685363
4729 6685363 6733998 6808572 6962746 6891725 7011235 6944885 7016065 7128155 7199218 7141064 7035521
4718 7035521 7167028 7441406 7604816 7716166 7831319 8049390 8100370 8351236 8600740 8899792
4708 8899792 8937265 9206256 9299273 9594307 10015599 10286081 10886101 11478117 12231827 13188853
4698 13188853 14167481 15192507 16297966 17674849 19343731 21067778 22048578 22629582 22704657
4689B2704657m45467o49042r42845j113605q78233l94290k04940L21563M30900
4680A8828698K49777M51344P52188J309894J316156J212573J047862O38307K21111
4671B6027910j99289o11523j081747j491502j440737j272051q74921o29834o60242
4662A7766064p18456l91347m27447l64403k26334j66759j59919m2491j28065q6960
4652A5053883J81496J59748K07176M17272P72330Q21736Q81259R61726J285423
4643B0742049J762521J979818K143338K380369K664887K394201J628658Q15472
4635C6511313j785r11460j393948k053620j947174j514821j237707q86884l78692
4626B6185222L57702O66102N87254J053378J746615J981652J874593J359830R91507
$$ plain form
4689 22704657 22259190 21610148 20667303 19553698 18675465 18281175 18076235 18397798 18828698
4680 18828698 19078475 19529819 20282007 21591901 22908057 24120630 25168492 25806799 26027910
4671 26027910 25828621 25217098 24135351 22643849 21203112 19931061 19056140 18426306 17766064
4662 17766064 17047608 16656261 16228814 15864411 15638077 15471318 15311399 15268908 15140843 15053883
4652 15053883 15235379 15395127 15602303 16019575 16791905 17613641 18494900 19456626 20742049
4643 20742049 22504570 24484388 26627726 29008095 31672982 34067183 35695841 36511313
4635 36511313 36509528 35598068 34204120 32150500 30203326 28688505 27450798 26563914 26185222
4626 26185222 26542924 27209026 27796280 28849658 30596273 32577925 34452518 35812348 36803855
4617C6803855N17873m42860j199018j704147k319751k211065k008746j747047
4609B5689094j635943j214560j058903j143022q74539n11916n51662n86704l84396
4600A7727449m24460o63590m61581p55024l40964k59259n40454n55180n72616
4591A3154321m91675m22600l28421m45067m17002k36626r5648k74902j30339j04272
4581A0207769m69032l98644J1216l4114k90200k00613Q447l8743k03325O3623
4571H656384l1832M05j25201r1260m2922k19648K681N7691O6926N5209j40086
4560H188347j2362p4794j9888q157K50054N8977j10432M2089k1025O8732J87815
4549H549356J01271M8180K390P8778K33994J12400J70747R8960J2620J76254K37270
$$ plain form
4617 36803855 37321728 36878868 35679850 33975703 31655952 29444887 27436141 25689094
4609 25689094 24053151 22838591 21779688 20636666 19762127 19250211 18698549 18111845 17727449
4600 17727449 17302989 16639399 16177818 15422794 15081830 14822571 14282117 13726937 13154321
4591 13154321 12662646 12240046 11911625 11466558 11049556 10812930 10717282 10442380 10312041 10207769
4581 10207769 9738737 9340093 9351309 9317195 9026995 8826382 8834829 8796086 8592761 8656384
4571 8656384 8624552 8624957 8499756 8408496 8365574 8145926 8148607 8206298 8273224 8328433 8188347
4560 8188347 8175985 8101191 8081303 8073146 8323200 8382177 8271745 8313834 8292809 8361541 8549356
4549 8549356 8650627 8698807 8701197 8779975 9013969 9126369 9297116 9396076 9408696 9584950 9822220
4538I822220L29930J94936K55075J90926K13308N16100N50829N87929O85141P30030
4528A4076424Q05540J258555J386923J658666J917602K264875K721938K788324
4520B8878847K419561K047776J273845Q789j254814k016481k579797k239640j876287
4511B4661799j489589j421826r85372q01959n07281n05852k25623M3633j16881
4502A8651049m4536l8742o5345k29431q0615J76783K10749N5361L68817N69839
4492A9573929O84893O71284J143884J276635J517539J850305K220840K086040
4484C1025349J963716J297404N01042o64253j712703k331963k388869k127524
4476B5562199j805157j265167p96184n00165m45057R0239M58690L42655P84719
$$ plain form
4538 9822220 10152150 10347086 10602161 10793087 11006395 11522495 12073324 12661253 13346394 14076424
4528 14076424 14881964 16140519 17527442 19186108 21103710 23368585 26090523 28878847
4520 28878847 31298408 33346184 34620029 34628818 33374004 31357523 28777726 26538086 24661799
4511 24661799 23172210 21750384 20765012 19963053 19455772 18949920 18724297 18767930 18651049
4502 18651049 18606513 18567771 18502426 18272995 18192380 18369163 18579912 18635273 19004090 19573929
4492 19573929 20258822 20930106 22073990 23350625 24868164 26718469 28939309 31025349
4484 31025349 32989065 34286469 34787511 34123258 32410555 30078592 27689723 25562199
4476 25562199 23757042 22491875 21695691 21195526 20750469 20840708 21299398 21642053 22426772
4467B2426772J129352J247697J602569J150396O56293j85435q33214j707312j954878
4458B3532240j534633j204598j055080j176377j000036q35682o13265l50012j39505
4449A5623052m66012k5574J24571k6999L55493R1563M4117j7495n485O7597J45256
4438A5910084M6661n0308J95356N05619O70499P80819R25107J251699J240577
4429B1476113R71002M50511n6655r98674j477578j549630j770325j454400j207903
4420A4382461j178442m36517n10261q01288m56796k15797m53115m05441j67746
4411I757058r5219J14297l30521j61855L1372p25J71190L6867L7370q4210M0221
4400I515845o108Q8190J35686J29890J45490M847K5017J94245m0633j72799L3973
$$ plain form
4467 22426772 23556124 24803821 26406390 27556786 28213079 28027644 27194430 25487118 23532240
4458 23532240 21997607 20793009 19737929 18561552 17561516 16725834 16112569 15762557 15623052
4449 15623052 15157040 15131466 15256037 15229038 15584531 15676094 15720211 15702716 15697231 15764828 15910084
4438 15910084 15956745 15906437 16101793 16607412 17277911 18058730 18983837 20235536 21476113
4429 21476113 22447115 22897626 22840971 21842297 20364719 18815089 17044764 15590364 14382461
4420 14382461 13204019 12767502 12257241 11455953 10999157 10783360 10330245 9924804 9757058
4411 9757058 9661839 9776136 9445615 9283760 9315132 9314407 9485597 9522464 9559834 9475624 9515845
4400 9515845 9509737 9597927 9733613 9863503 10008993 10013840 10038857 10233102 10192469 10019670 10053643
4389A0053643M4406j16057K7804R8335J60986K29193j27665p3065j30732j38899
4379A0027949j57866N8405j13808l33311j6129j81823m24092j78582L9859q6472
4369H634130q6877j80348k2784j33580l31521j33034L2523P0528k09391K35438
4359G875084J53402k36167j57046R8965j11137K25132J54101J42138k7668O3305
4349H180109J41981J93335J91824P2901K14622J14630j46138O0131K51569Q8395
4339I363359j67644j68029R6672k58391j49686j33388j5755j07852m3519k51235
4329H164532n7642n1216j7089J69504j30308O8832J65639K47348Q0513J45151
4319H785264p7607J07687J78818j34798j149P6376O3834J60502k40239k66212
$$ plain form
4389 10053643 10098049 9981992 10009796 10108131 10269117 10498310 10370645 10297580 10166848 10027949
4379 10027949 9870083 9928488 9814680 9481369 9465240 9283417 8859325 8680743 8720602 8634130
4369 8634130 8547253 8366905 8344121 8210541 7879020 7745986 7778509 7849037 7639646 7875084
4359 7875084 8028486 7792319 7635273 7734238 7623101 7848233 8002334 8144472 8116804 8180109
4349 8180109 8322090 8515425 8707249 8780150 8994772 9109402 8963264 9023395 9274964 9363359
4339 9363359 9195715 9027686 9124358 8865967 8716281 8582893 8567138 8459286 8415767 8164532
4329 8164532 8106890 8055674 8038585 8208089 8077781 8146613 8312252 8559600 8640113 8785264
4319 8785264 8707657 8815344 8994162 8859364 8858215 8934591 8998425 9158927 8918688 8652476
4309H652476l0671r6326j34498j16382M5921P3597k60749j12434O2235m4434j80980
4298G857755Q6984J2132j05719R1971M028J85590P4602Q3929J15653K1768P037
4287H435730m7893j3084K69488P5764J62524N6379L02181K08730J19206J85615
4277I754640K12831J25139R3323j48867l63551J22613K48174j76189j312r1692
4267I775109m18145k35578n2708p2961l2971r0080j18867j36501k4322J45245
4257H738221k308J35323J28366J41439m9746j38584J47126J65351k7123Q4597
4247I322662K1419P8927Q5675m5827N9325M2788J72074K71341k37484Q4391J84515
4236A0039806Q9467L27269K54706M8127j62464J05451K90225K96080M21254J28355
$$ plain form
4309 8652476 8621805 8525479 8390981 8274599 8320520 8394117 8133368 8020934 8083169 8038735 7857755
4298 7857755 7944739 7956871 7851152 7943123 7947151 8132741 8207343 8291272 8406925 8428693 8435730
4287 8435730 8387837 8374753 8644241 8720005 8882529 8938908 9241089 9449819 9569025 9754640
4277 9754640 9967471 10092610 10185933 10037066 9673515 9796128 10044302 9868113 9866801 9775109
4267 9775109 9356964 9121386 9068678 8995717 8962746 8872666 8753799 8617298 8592976 8738221
4257 8738221 8735913 8871236 8999602 9141041 9091295 8952711 9099837 9265188 9238065 9322662
4247 9322662 9344081 9423008 9508683 9462856 9522181 9564969 9737043 10008384 9770900 9855291 10039806
4236 10039806 10129273 10456542 10711248 10759375 10596911 10702362 10992587 11288667 11709921 11838276
4226A1838276K52444K31422J51373L70251K69459M59236M50977K70118M96330
4217A4789886K19655K60000K95959K81240K26705J28372K61568J36829J15998
4208A6716212R7091L75687J96316K17707L52490N08448L17286L32767L32394M43619
4198A9890017N81469M69504N99671N41437N55367O36513P64424P86426P96169
4189B5620997R21054J042154Q91393J302341J220868J199454J671399J510334
4181C5379994J847232J616824J991984K362614K620251K860294K844408L201591
4173E4725192L576525M133300M509599N290099O077254P292689Q986049J1179350
4165A05770057J4103103J7441663K1483941K5586767L1349507L8486758M7336460
$$ plain form
4226 11838276 12090720 12322142 12473515 12843766 13113225 13572461 14023438 14293556 14789886
4217 14789886 15009541 15269541 15565500 15846740 16073445 16201817 16463385 16600214 16716212
4208 16716212 16813303 17188990 17385306 17603013 17955503 18463951 18781237 19114004 19446398 19890017
4198 19890017 20471486 20940990 21540661 22082098 22637465 23273978 24038402 24824828 25620997
4189 25620997 26542051 27584205 28475598 29777939 30998807 32198261 33869660 35379994
4181 35379994 37227226 38844050 40836034 43198648 45818899 48679193 51523601 54725192
4173 54725192 58301717 62435017 66944616 72234715 78311969 85604658 94590707 105770057
4165 105770057 119873160 137314823 158798764 184385531 215735038 254221796 301558256
4158C01558256N5192345N7700121M7690116K5168700o298191l6854110n5194586
4151C88962651o0248690n3474296m3839729l4304206k6850392k1111600j6913935
4144A32219803j3684479j0965863q873440p440594o527100n774556n248474m695004
4136F9010293m490034l876432l404811l124441k715973k538286k534975k112539
4128D4212802k000774j965437j530277j312023j455434j620740j468965j259225
4120C1599927j154374q92162p53986q23945p73735o75173o97322q87689n89043
4111B4352498p54188q63351p52617n74777l85680k97363o28610l16662l98593
4102A9380657n38174k87000k98000k10730j83067j77718m01994j86828k83120
$$ plain form
4158 301558256 356750601 414450722 462140838 487309538 481011347 444157237 388962651
4151 388962651 328713961 275239665 231399936 197095730 170245338 149133738 132219803
4144 132219803 118535324 107569461 98696021 91255427 84728327 78953771 73705297 69010293
4136 69010293 64520259 60643827 57239016 54114575 51398602 48860316 46325341 44212802
4128 44212802 42212028 40246591 38716314 37404291 35948857 34328117 32859152 31599927
4120 31599927 30445553 29553391 28799405 27975460 27201725 26526552 25829230 24941541 24352498
4111 24352498 23598310 22734959 21982342 21407565 21021885 20724522 20095912 19779250 19380657
4102 19380657 18842483 18555483 18257483 18046753 17863686 17685968 17283974 17097146 16814026
4093A6814026k35000k01209j95281p6115R8417r5850j26735k65641k22141l29912
4083A5164559N9923m7378k03793K9942m4185n1892j13952j11335j71412j54606
4073A4355871K4004k18987k28112j42804j57468p0225j52859j38659K34248n9541
4063A3445468j08768K24585j79019J13605J65394j16558M4841J68214k2900Q0094
4053A3814956J67220R010J57916K03371J59009J10001j938J69309J29580L98239
4043A5316673K26296J57829J46746K05237K57870K36689N59851M38497J90634
4034A7736322M74495J81660N57914L80579M20166M32479M11885M32425N68156
4025B1596081P62244N86110O71352R02078Q07938O89781J039548J193215J000535
$$ plain form
4093 16814026 16579026 16377817 16182536 16106421 16204838 16108988 15982253 15716612 15494471 15164559
4083 15164559 15224482 15177104 14973311 15003253 14959068 14907176 14793224 14681889 14510477 14355871
4073 14355871 14379875 14160888 13932776 13789972 13632504 13562279 13409420 13270761 13505009 13445468
4063 13445468 13336700 13561285 13382266 13495871 13661265 13544707 13589548 13757762 13734862 13814956
4053 13814956 13982176 13991186 14149102 14352473 14511482 14621483 14619545 14788854 14918434 15316673
4043 15316673 15542969 15700798 15847544 16052781 16310651 16547340 17107191 17545688 17736322
4034 17736322 18210817 18392477 18950391 19330970 19751136 20183615 20595500 21027925 21596081
4025 21596081 22358325 22944435 23615787 24517865 25325803 26015584 27055132 28248347 29248882
4016B9248882J047392J267230J589063J600125J516063J881050J811983J769166
4008D1730954J821895K135774K107289K535594K562661K306914K354671K615525
4000F0171277K683991K579422K823989K835312K916130L055585L074195L233648
3992H3373549L031831K678674K538959K787850K570431K394427K081743K318633
3984A03776097K351036K058261J916411J979706J852322J460690J273250J260162
3976A17927935Q66192L75491j11502j16604j25226m44771o14206q62286o22760
3967A16272263o60085j043074j321781j568682j395928k083554k365519k249928
3959A03583712k664167k686214k776205k841555k765302k859448k773514k629820
$$ plain form
4016 29248882 30296274 31563504 33152567 34752692 36268755 38149805 39961788 41730954
4008 41730954 43552849 45688623 47795912 50331506 52894167 55201081 57555752 60171277
4000 60171277 62855268 65434690 68258679 71093991 74010121 77065706 80139901 83373549
3992 83373549 86405380 89084054 91623013 94410863 96981294 99375721 101457464 103776097
3984 103776097 106127133 108185394 110101805 112081511 113933833 115394523 116667773 117927935
3976 117927935 118794127 119169618 119058116 118941512 118816286 118371515 117757309 116895023 116272263
3967 116272263 115612178 114569104 113247323 111678641 110282713 108199159 105833640 103583712
3959 103583712 100919545 98233331 95457126 92615571 89850269 86990821 84217307 81587487
3951H1587487k657955k803407k655443k564273k899961k709001k622998k390908
3943F0283541k429099k535922k577287k241182k282866j892141k051883j988282
3935D2284879j704541j789105j568405j464084j707633j500010j473051j343062
3927B9734988j310313j037636r61111j079673r71027r79277q64572j094812n97184
3918B0839383o89030q40757o64646n21040n61359n45926n84830m48047j12649
3909A5871099k95733o68299k52970l74824j81235j67007k90391l25137k20932
3900A3094571k39773m38561k43875k33519k40016m6701j34557k07229j15752j66348
3890A1028240l59796j5807m0849k73048k03168j69651j7025k23231k59051m5676
$$ plain form
3951 81587487 78929532 76126125 73470682 70906409 68006448 65297447 62674449 60283541
3943 60283541 57854442 55318520 52741233 50500051 48217185 46325044 44273161 42284879
3935 42284879 40580338 38791233 37222828 35758744 34051111 32551101 31078050 29734988
3927 29734988 28424675 27387039 26425928 25346255 24375228 23395951 22531379 21436567 20839383
3918 20839383 20150353 19309596 18644950 18123910 17562551 17016625 16431795 15983748 15871099
3909 15871099 15575366 14907067 14654097 14279273 14098038 13931031 13640640 13315503 13094571
3900 13094571 12854798 12416237 12172362 11938843 11698827 11652126 11517569 11310340 11194588 11028240
3890 11028240 10668444 10652637 10611788 10338740 10135572 9965921 9948896 9725665 9466614 9420938
3880I420938j06169j5023k36281J9823j87988j4751j7169j6847J29590P7284K08830
3869I262237l3792L00859K43090K38440M0800j48162l271j32984l24308j82015
3859I260894m29766k48459p2551L6418j63147Q3703M8318k62008q9365o5432p478
3848H091127K40057q9834j28613J26432J3500J49190j7960p4449K04253O7163
3838H580866N1051j79096j4787k33264j11827Q0668j0685m7798R2421N1169O2071
3827H320789j26618j42372n1903R4351p2865j20590m8155j18699P0849L0888j41710
3816G693965o6562r0394K0541J01808l2738O9570n3859L7806J28712j28j85114
3805G623607o8919N2654M2682j535k5160k0123j61125L5255L6665r8029Q7020
$$ plain form
3880 9420938 9314769 9299746 9063465 9083288 8895300 8880549 8863380 8846533 8976123 9053407 9262237
3869 9262237 9228445 9529304 9772394 10010834 10051634 9903472 9900201 9767217 9442909 9260894
3859 9260894 8831128 8582669 8510118 8546536 8383389 8467092 8515410 8253402 8164037 8098605 8091127
3848 8091127 8331184 8241350 8112737 8239169 8252669 8401859 8383899 8309450 8513703 8580866
3838 8580866 8631917 8452821 8438034 8204770 8092943 8173611 8162926 8115128 8207549 8258718 8320789
3827 8320789 8194171 8051799 7999896 8094247 8021382 7900792 7852637 7733938 7804787 7835675 7693965
3816 7693965 7627403 7537009 7557550 7659358 7626620 7696190 7642331 7680137 7808849 7808721 7623607
3805 7623607 7554688 7607342 7650024 7648489 7623329 7603206 7442081 7477336 7514001 7415972 7502992
3794G502992j16699p2761R8427L5857K11256j21575k81643k5119J23058J09293
3784G463086j67892j53111M598J02384l4776J72001O1152o8509m9829K6396J37701
3773G493201M2567p1169q764J74838j6457l7423m0403q6770K64091J92532J62896
3762H069139l0946P4156J56411J89982J085o3030o4398Q6307R3363M8876J18120
3751H679065L3258J15587R5496J9992N3872n9806J23935j80497J01908J28711
3741I111521j8630k4312O6252m7976J74971K034m043J59338J06883R3572o8891
3730I550719K238O7600L44712j88270K27284K94211J18372n9594O6840K07761
3720A0631873P5067R7858J24742P2680K17746J67671L55591J30278K72410J30569
$$ plain form
3794 7502992 7386293 7313532 7411959 7447816 7659072 7537497 7255854 7230735 7353793 7463086
3784 7463086 7295194 7142083 7146681 7249065 7214289 7386290 7447442 7378933 7329104 7355500 7493201
3773 7493201 7535768 7464599 7455835 7630673 7614216 7576793 7536390 7449620 7713711 7906243 8069139
3762 8069139 8038193 8112349 8268760 8458742 8459827 8396797 8332399 8418706 8512069 8560945 8679065
3751 8679065 8712323 8827910 8923406 8943398 8997270 8937464 9061399 8880902 8982810 9111521
3741 9111521 9092891 9068579 9134831 9086855 9261826 9263860 9259817 9419155 9526038 9619610 9550719
3730 9550719 9552957 9620557 9965269 9776999 10004283 10298494 10416866 10357272 10424112 10631873
3720 10631873 10706940 10804798 10929540 11002220 11219966 11387637 11743228 11873506 12145916 12276485
3710A2276485O6201K30774J50320M41414J00989L58357J37551K51139J79505K62647
3700A4455382M30958L43493M04941K52256n8703K72408O27072N51232L31285L09556
3690A7919880M67327O11726N56826O33999N39975P60400R75706J118103R39770
3681B4523712R41645R90902J097426J356300J556904J442478J440979J586219
3673C4936565J571937J483605J510937J217888J303025J567410J364862J360832
3665D6317061J374042J366484J173406J376177J280255J100159Q85347O97027
3657E5569958P05358O44242K40916M24661K865J46109M0036J4356N7898J79159
3647E8025558p1959j42179M5537J9052k08253o6697j70131j61735j18174K35203
$$ plain form
3710 12276485 12342686 12573460 12723780 13165194 13266183 13624540 13762091 14013230 14192735 14455382
3700 14455382 14886340 15229833 15634774 15887030 15828327 16100735 16727807 17279039 17610324 17919880
3690 17919880 18387207 18998933 19555759 20189758 20729733 21490133 22465839 23583942 24523712
3681 24523712 25465357 26456259 27553685 28909985 30466889 31909367 33350346 34936565
3673 34936565 36508502 37992107 39503044 40720932 42023957 43591367 44956229 46317061
3665 46317061 47691103 49057587 50230993 51607170 52887425 53987584 54872931 55569958
3657 55569958 56275316 56919558 57160474 57585135 57588000 57734109 57774145 57788501 57846399 58025558
3647 58025558 57953599 57811420 57856957 57876009 57667756 57601059 57430928 57269193 57151019 57386222
3637E7386222K7274K16188N50385L60541L56549P60878J024548J486654J382164
3628F3551403J251183J728568K122599K381716K547862K952712L122447L175253
3620H2833743L414686L456055L325916L603118L628086L305888L377143L343327
3612A10287962L334971L010511L266615L464556K902137L024708K821949K682952
3604A34796361K295518J652724J256624P45594L60013J43188m11455p14548o69921
3595A39454098o24922r26090o63308o71775r20623r51983r61964j128212r80964
3586A31624257r46568q04973q11439j009427o08828l31533O7923O17709N76144
3577A28373265J140392J139780J409013J692462J945648J946713J899490K014952
$$ plain form
3637 57386222 57413496 57629684 58180069 58540610 58897159 59658037 60682585 62169239 63551403
3628 63551403 64802586 66531154 68653753 71035469 73583331 76536043 79658490 82833743
3620 82833743 86248429 89704484 93030400 96633518 100261604 103567492 106944635 110287962
3612 110287962 113622933 116633444 119900059 123364615 126266752 129291460 132113409 134796361
3604 134796361 137091879 138744603 140001227 140746821 141106834 141250022 140838567 140124019 139454098
3595 139454098 138829176 137903086 137239778 136568003 135647380 134695397 133733433 132605221 131624257
3586 131624257 130677689 129872716 129061277 128051850 127443022 127111489 127179412 127797121 128373265
3577 128373265 129513657 130653437 132062450 133754912 135700560 137647273 139546763 141561715
3569A41561715J980375J863201J826053J825495J873554J767441J849824J855667
3561A56403325J769428J983293J749231J331154J003422P46877N30112M24058
3553A65940900J10850l30230l00344m47718m09247l22224n26011m58927j7293
3544A63239756K52320N25725J102566J597592K237616K579130L063771L593406
3536A78191882M355041N211089O350342P608060Q759050J0266705J1719251J2555743
3528B45017163J2700396J2929901J2091795J0807204R702414P480472N429892
3521C16159237L546266K066019M39736l63531o78087j019000j025966j120392
3513C18004282j396041k439819l484614n036463o893040q671709j0569938j1846551
$$ plain form
3569 141561715 143542090 145405291 147231344 149056839 150930393 152697834 154547658 156403325
3561 156403325 158172753 160156046 161905277 163236431 164239853 164986730 165516842 165940900
3553 165940900 166051750 165721520 165421176 164973458 164564211 164241987 163715976 163257049 163239756
3544 163239756 163492076 164017801 165120367 166717959 168955575 171534705 174598476 178191882
3536 178191882 182546923 187758012 194108354 201716414 210475464 220742169 232461420 245017163
3528 245017163 257717559 270647460 282739255 293546459 303248873 310729345 316159237
3521 316159237 319705503 321771522 322211258 321847727 321169640 320150640 319124674 318004282
3513 318004282 316608241 314168422 310683808 305647345 298754305 290082596 279512658 267666107
3505B67666107j2827984j3480464j3808061j3704486j2793790j2003137j0958900
3498A78089285r670070q851938q292089p325308o655847o366845n865785n034666
3490A20026737m662302m199617m139496m035376l643873l548780l035423l345392
3482H9416478l317586k987812k992566k700507k613387k409422k496606k335287
3474F7563305k281034k200281k125526j784342j631241j679854j652181j527779
3466E2681067j269269j428508j088731j130798j128764j235142r39991o88688
3458D3771176j117028q46211q84920r27919o40425o83263m69964p52916o57865
3449C6790665n22056n56348o06186q13124m39977m22384o27154n04269n88315
$$ plain form
3505 267666107 254838123 241357659 227549598 213845112 201051322 189048185 178089285
3498 178089285 168419215 159567277 151275188 143949880 137294033 130927188 125061403 120026737
3490 120026737 115364435 111164818 107025322 102989946 99346073 95797293 92761870 89416478
3482 89416478 86098892 83111080 80118514 77418007 74804620 72395198 69898592 67563305
3474 67563305 65282271 63081990 60956464 59172122 57540881 55861027 54208846 52681067
3466 52681067 51411798 49983290 48894559 47763761 46634997 45399855 44459864 43771176
3458 43771176 42654148 41807937 40923017 39995098 39354673 38671410 38201446 37448530 36790665
3449 36790665 36268609 35712261 35106075 34292951 33852974 33430590 32803436 32299167 31710852
3440C1710852m31405k79460m30346n97512m06236n38634o47339p26192l59119
3431B7294609l51994n47496p32597n07188m84145n66629l35470m03847n74680
3422B2790563m22300l78235o94666n22374n36876p40699l36024k78353k36792
3413A8644244m22325m67304l29174j48633O478q816N6940o3208j18975l38785
3403A6810442o29892j170511r50320o93768m76784l92709n70387k73517p2713
3394A1579841l49757n26523m51375j90194l41032j21281k5067k19595j35351J00790
3384I320456m59286k46860L6565j66585L613j83182j80366m6750J80119k47355
3374H010369j86507l6536p5457P7341k14774k15638j86598K1249p7628j95441
$$ plain form
3440 31710852 31279447 30999987 30569641 29972129 29565893 29027259 28379920 27653728 27294609
3431 27294609 26942615 26395119 25662522 25155334 24671189 24104560 23769090 23365243 22790563
3422 22790563 22368263 21990028 21295362 20772988 20236112 19495413 19159389 18881036 18644244
3413 18644244 18221919 17754615 17425441 17276808 17283286 17274470 17331410 17268202 17149227 16810442
3403 16810442 16180550 15010039 14059719 13365951 12889167 12496458 11926071 11652554 11579841
3394 11579841 11230084 10703561 10252186 10061992 9720960 9599679 9574612 9355017 9219666 9320456
3384 9320456 8861170 8614310 8650875 8484290 8487903 8304721 8124355 8077605 8257724 8010369
3374 8010369 7823862 7787326 7711869 7789210 7574436 7358798 7172200 7193449 7115821 6920380
3364F920380M6713k6800k01827K5544j04468k1060j31420j01660j21764l1276
3354F252362k44845j34650L5773J1790J08657k32599J33567K43290k1975k70651
3344E880719n0530L9537j17336J02841j58991j40240J22443k16917J4983J10548
3334E587057K982p9869J40468o3766p8507Q5699k6169r5793N706L2526Q1899j38537
3322E453696R6075k7434l5815N7339O8263N619J54893K8750n0270M3101o3561
3311E730656J02426L30329K9036k24750J33936J22510J24414l39638O4950O0817
3301F134686j39029K145K6271J67906J51774j06954O8194J20447L2036P5428j09097
3290F423807Q2337Q8886J10780j65962K14447L18911J56037J88725j8444K09932
$$ plain form
3364 6920380 6967093 6940293 6738466 6764010 6659542 6638482 6507062 6405402 6283638 6252362
3354 6252362 6007517 5872867 5908640 5920430 6029087 5796488 5930055 6173345 6151370 5880719
3344 5880719 5830189 5869726 5752390 5855231 5696240 5556000 5678443 5461526 5476509 5587057
3334 5587057 5590039 5510170 5650638 5586872 5508365 5594064 5567895 5472102 5477808 5510334 5592233 5453696
3322 5453696 5549771 5522337 5486522 5543861 5612124 5617743 5772636 5801386 5751116 5794217 5730656
3311 5730656 5833082 6163411 6192447 5967697 6101633 6224143 6348557 6008919 6073869 6134686
3301 6134686 5995657 5997802 6024073 6191979 6343753 6236799 6304993 6425440 6457476 6532904 6423807
3290 6423807 6506144 6595030 6705810 6539848 6754295 7073206 7229243 7417968 7399524 7609456
3280G609456N4493J72014J70103K27928K55435J84410J07291M39012N58610L41536
3270A0120288L85502N37269M69721N47061M74550K77158L42577O69540R3979J76745
3260A4094390J69076J55611P3125m9208j24961k75792p2474j59960j57085m14286
3250A3238436m46595m85399l97216m14683m59510l77822m34083m28010k37966
3241I557152l55616m11981j31803r3254l54591k11406j75282j17145j4574k06982
3231G484518l88061j78258o9620k16335k90525j75315k93644L3467j38816j73969
3221E593442P8745p6248L167k65249m25761r9643j33386j57857o6526q1704K363
3210D371343k18658j88081j3165P8365j05050k36815k18268J60347N0684j96741
$$ plain form
3280 7609456 7663949 7835963 8006066 8233994 8489429 8673839 8781130 9220142 9778752 10120288
3270 10120288 10505790 11043059 11512780 12059841 12534391 12811549 13154126 13823666 13917645 14094390
3260 14094390 14263466 14419077 14492202 14442994 14318033 14042241 13969767 13809807 13652722 13238436
3250 13238436 12791841 12306442 11909226 11494543 11035033 10657211 10223128 9795118 9557152
3241 9557152 9201536 8789555 8657752 8564498 8209907 7998501 7823219 7706074 7691500 7484518
3231 7484518 7096457 6918199 6848579 6632244 6341719 6166404 5872760 5906227 5767411 5593442
3221 5593442 5672187 5595939 5599106 5333857 4908096 4808453 4675067 4517210 4450684 4368980 4371343
3210 4371343 4152685 3964604 3951439 4029804 3924754 3687939 3469671 3630018 3680702 3483961
3200C483961j99242m3107m6838P1468j04651j44064j4963j87274q281L0777K4809
3189B862595j72552p210j2083r3118k5755n1658J40274o1868l51134j89577P4705
3178B112619J4859j12353K7118J88418o5702j20949J2223k7562J37656p549L4971
3167B193749q4459k89728j0660J27672j04893O2574k2639M7765m0563M3118j30945
3156A790991r0605P0590j3822j23207P613r457l5259j0933L9188J28438k77945
3145A475592j30846r4715J44242J85319j00794l26275q2127K31992J21610J98385
3135A622383j63201j5560j01263q5153P9838J31962j41003p1156M9508r7632M6807
3124A255530O7951J65009p389n0071J59763l01893p315J39560j04459j71180l2117
$$ plain form
3200 3483961 3284719 3241612 3194774 3266242 3161591 3017527 3002564 2815290 2807009 2837786 2862595
3189 2862595 2690043 2682833 2670750 2577632 2551877 2500219 2640493 2578625 2227491 2037914 2112619
3178 2112619 2127478 2015125 2042243 2230661 2164959 2044010 2056233 2028671 2166327 2158778 2193749
3167 2193749 2109290 1819562 1808902 1936574 1831681 1894255 1871616 1919381 1878818 1921936 1790991
3156 1790991 1700386 1770976 1757154 1633947 1641560 1632103 1596844 1585911 1625099 1753537 1475592
3145 1475592 1344746 1250031 1394273 1579592 1478798 1152523 1070396 1302388 1423998 1622383
3135 1622383 1459182 1443622 1342359 1257206 1337044 1469006 1328003 1256847 1306355 1208723 1255530
3124 1255530 1323481 1488490 1481101 1431030 1590793 1288900 1281585 1421145 1316686 1145506 1113389
3113A113389J65399j7543O660j18560J08171O4361k10095k31118Q2219O4127J79457
3102A206467m2289m4255n2416J65862Q6130j0249j0613j73739J01425j72112k46758
3091H07453J0631R3500L7452K86442j19145l07030J18842J40238p208Q9822N8775
3080A209772j81836J27662o23j51294Q5885N2314j24899O4466q0833P0411k07230
3069H63795K8980J2335Q5185J43036l6734o537l0004M0002m558j01706j85605
3058H08189J28389P0592p6863k8340K2954N3301j45618n8464o1099J1426R7178
3047H21645j71818J32441J53930j31868P8471J1470J20746j44415j17822j3130
3037G39650J27924o802J15327l2475n958n9696q9279J72406o9195K4775j41311
$$ plain form
3113 1113389 1278788 1261245 1267905 1149345 1257516 1321877 1111782 880664 962883 1027010 1206467
3102 1206467 1164178 1119923 1067507 1233369 1319499 1309250 1298637 1124898 1226323 1054211 807453
3091 807453 818084 911584 949036 1235478 1116333 809303 928145 1068383 1061175 1150997 1209772
3080 1209772 1027936 1155598 1154975 1003681 1089566 1141880 1016981 1081447 1000614 1071025 863795
3069 863795 892775 905110 990295 1133331 1096597 1090060 1060056 1100058 1095500 993794 808189
3058 808189 936578 1007170 930307 901967 924921 978222 832604 774140 713041 724467 821645
3047 821645 649827 782268 936198 804330 882801 894271 1015017 870602 752780 739650
3037 739650 867574 860772 976099 943624 937666 877970 788691 961097 891902 916677 775366
3026G75366J1691J02992J21388K1322k18432Q347j57233J39060o745j5016K28753
3015A011493r7835n052j911P70o0149P734j42466o5006K16743L6526j51471p5181
3003F74195J30913J54283N8177O6807k03779J33474L9474j46081j3146K06500
2993A100817r5976r0104P1079q3476Q5397J35530j8451j4280l7396J09547P3749
2982A236436L1269j49840K2218J4840P7325N8599M0061j75026P1982O5852R9198
2971A392914O021J06200N6714J5850R4899q1827j65219Q6892m3716j01053J06813
2960A474488J38233j2059k9499J01316J23946K42677n7361n2021P4860K94655
2950B299235J92772K19248l9023J76324J40214N3905J39778K80635J12789K3608
$$ plain form
3026 775366 787057 890049 1011437 1032759 814327 822674 665441 804501 797756 782740 1011493
3015 1011493 913658 908606 906695 907465 847316 855050 712584 647578 864321 900847 749376 674195
3003 674195 805108 959391 1017568 1084375 880596 1014070 1053544 907463 894317 1100817
2993 1100817 1004841 914737 985816 902340 987737 1123267 1104816 1090536 1053140 1162687 1236436
2982 1236436 1267705 1117865 1140083 1154923 1232248 1290847 1330908 1155882 1227864 1293716 1392914
2971 1392914 1398935 1505135 1561849 1577699 1672598 1590771 1425552 1512444 1468728 1367675 1474488
2960 1474488 1612721 1600662 1571163 1672479 1796425 2039102 1981741 1929720 2004580 2299235
2950 2299235 2492007 2711255 2672232 2848556 2988770 3042675 3182453 3463088 3575877 3599485
2940C599485J11873m7580R79r1731J25096Q4492j95743J37620J10998q3481K42936
2929C994944o7041j56687J02061m973M3395J28328J22020K98806P6902K07533
2919D745288L81888L66374K69240M66084O96329O05694L90399k03217m89056n31675
2909F697348p94099o20244l97358m18615m9556j13310k67963k72750l9165o7185
2899C657103j39019N5171k17944j33760L6908J14743J8059K2285K48617l0483
2889C631680R4294m8840K5422J26256J24733q987K4401n1752j76211j0570j76819
2878C553607m14542j81122j14403j12111j00720k46255K7311k2049k43872J5376
2868B161220p3684M9139j61367j54225j30146O7841j54412o0489q7694j05867
$$ plain form
2940 3599485 3711358 3663778 3664757 3573026 3698122 3782614 3586871 3724491 3835489 3752008 3994944
2929 3994944 3927903 3771216 3873277 3868304 3911699 4040027 4162047 4460853 4537755 4745288
2919 4745288 5127176 5493550 5762790 6228874 6925203 7530897 7921296 7718079 7229023 6697348
2909 6697348 5903249 5283005 4885647 4467032 4417476 4304166 4036203 3763453 3724288 3657103
2899 3657103 3518084 3573255 3355311 3221551 3258459 3373202 3391261 3413546 3662163 3631680
2889 3631680 3725974 3677134 3702556 3828812 3953545 3944558 3968959 3917207 3740996 3730426 3553607
2878 3553607 3139065 2957943 2843540 2731429 2630709 2384454 2411765 2389716 2145844 2161220
2868 2161220 2087536 2136675 1975308 1821083 1690937 1758778 1604366 1543877 1456183 1350316
2858A350316J88382r3106j98022O222R1310r9127j30680Q2064o9278P138l3397
2847A101822j06825L3290o4907o4386J21749l6650l3616M1916O9369k30896j49089
2836F81777O5574m5652q0098J33744r722j54157j31654K781K11197N331R7062
2825G76183M9765J01054k42879p1378k93756J82174J50229j10691o4278l8845
2815D37578K4708j25448P8163N6832p0370K00855j79103p1410M0436r263K02030
2804E85008j61533L381J23830J15616q5693j89687Q0293j19333L3366Q172p1810
2793C21610m2549K41004j874j85150J36844l973p2138N5670M5570L6549j72678
2782C58885j33783J46682p8747K210J59272j07741J00202k063l7976J01613o7427
$$ plain form
2858 1350316 1538698 1445592 1247570 1253792 1345102 1245975 1115295 1197359 1128081 1135219 1101822
2847 1101822 994997 1028287 963380 898994 1020743 984093 950477 992393 1061762 830866 681777
2836 681777 747351 701699 621601 755345 745623 591466 459812 462593 673790 679121 776183
2825 776183 825948 927002 684123 612745 318989 501163 651392 540701 476423 437578
2815 437578 462286 336838 415001 471833 401463 602318 423215 351805 392241 382978 585008
2804 585008 423475 426856 550686 666302 580609 390922 471215 351882 385248 393420 321610
2793 321610 279061 520065 518191 333041 469885 465912 393774 449444 495014 531563 358885
2782 358885 225102 371784 293037 295247 454519 346778 446980 444917 406941 508554 441127
2771D41127q0910p1037P0288o9652n7478j8944R496J68674j53010L5182J31435
2760D05171K5483L7790j09731p8931l4052O3341K66237K0761p9501R9413l17961
2749B98020o1357r748L7478j26937P067Q0611j04797n2809J0542J43975j97666
2738B4379P4463J61995l3020m0379P5831j19349j31417o1482L58375j6684p4566
2727B18146M2992j23690J64144L1444m6462M2718r1542j887j80755n5689K95556
2716B94975j3363j00507k4299J14576j3731K327k4083j28902q1708Q9731N6464
2705A71480J28684j36064J5665j1323o296m1779j48018o7118J1514p857J07482
2694A6370k679n3967J12446J21715O1053K4562K4231N2720j80801k6533o8623
$$ plain form
2771 441127 360217 289180 359468 289816 232338 213394 222890 391564 238554 273736 405171
2760 405171 430654 468444 358713 279782 245730 309071 575308 596069 516568 615981 298020
2749 298020 236663 226915 264393 137456 144523 225134 120337 67528 78070 222045 24379
2738 24379 98842 260837 227817 187438 263269 143920 12503 -48979 309396 292712 218146
2727 218146 261138 137448 301592 333036 286574 329292 237750 235863 55108 -581 294975
2716 294975 281612 181105 156806 271382 257651 259978 235895 106993 25285 115016 171480
2705 171480 300164 164100 179765 168442 162146 120367 -27651 -94769 -83255 -91112 16370
2694 16370 13691 -40276 72170 193885 254938 279500 303731 356451 175650 149117 80494
2683H0494l4106j15259J50276q0840N5279J08939J64052j06097j59759R5981j73056
2672a4096o4742K39979J03311l2120k5207K4449j9893j45597n8895M5891k2175
2661C0905K4368J21807m2432J07277O8775p061n557n6909J00859N8289j75035
2650B25286J05606j37478j55422p1210Q1593j31817J3143J30067N2986l6235J29293
2639B05812O0132n1314l7845J86453m890o589k69802R1817J7405j70699p4944
2628e4464N1126P9566J13793L4161J1728j7014j39002M1274J62475j60281J36332
2617B59694k67724l5921m5194N1041J49530j45641J9159j51280R9285K69163O8023
2606B70135j57059m9018p5759p171l3559K3790N8619J48707J25158j46364k07998
$$ plain form
2683 80494 46388 -68871 81405 565 55844 164783 328835 222738 62979 158960 -14096
2672 -14096 -78838 161141 264452 232332 207125 231574 211681 66084 7189 53080 30905
2661 30905 55273 177080 134648 241925 310700 303639 298082 241173 342032 400321 225286
2650 225286 330892 193414 37992 -33218 48375 -83442 -70299 59768 112754 76519 205812
2639 205812 265944 214630 176785 363238 358348 351759 81957 173774 191179 20480 -54464
2628 -54464 -3338 76228 190021 224182 235910 218896 79894 121168 283643 123362 259694
2617 259694 -8030 -43951 -89145 -38104 111426 -34215 -15056 -166336 -67051 202112 270135
2606 270135 113076 64058 -11701 -18872 -52431 -28641 29978 178685 303843 157479 -50519
2595e0519J95264Q2705j10204k12650R1089L7223m0590j64577M9029R4712Q4628
2584E6110q8627P8757l7143j13333L6980j9335J5938O5679j0330o8678R5581P9985
2572I1584j06580K5823j22996J68187p976K9037J90908l0048j72535m305Q5409
2561A46508J48832P780j61710j7483j546j85844K1700L997L15133j449j78750
2550I7168j5356j05438k2024J35164j04818n0891J20493j42846j2607J07468n105
2539A208q1635K60169p178r1722j3720R9690j50130j50150J51612K32703q2374
2528A68473n8867N9465R7244N183j32542k11088n8505J86602p3408l07775K4495
2517c00723K65790J33529L7171m2791j8951m4249j04477r3936N8824K3706l6377
$$ plain form
2595 -50519 144745 227450 117246 -95404 -4315 32908 -7682 -172259 -123230 -28518 56110
2584 56110 -32517 46240 9097 -104236 -67256 -86591 -70653 -4974 -15304 -83982 11599 91584
2572 91584 -14996 10827 -112169 56018 48042 77079 267987 237939 65404 61099 146508
2561 146508 295340 303120 141410 123927 122381 -63463 -41763 -37766 277367 275918 97168
2550 97168 81812 -23626 -45650 89514 -15304 -66195 54298 -88548 -101155 6313 1208
2539 1208 -80427 179742 172564 80842 67122 166812 16682 -133468 18144 250847 168473
2528 168473 109606 169071 266315 271498 138956 -72132 -130637 55965 -17443 -325218 -300723
2517 -300723 -34933 98596 135767 92976 74025 29776 -74701 -168637 -109813 -86107 -122484
2506a22484J91016K24980j80123j8095M3974j55725l835R7728p2565n5367J21659
2495G1163n1968J42253j29734j79558J81909M767j94929J86620M534k0361j50795
2484a36099J25640n4568P0405r291J02933K0458j56843J16796l02635q0284K33417
2473g0071j9757J66586R0044k55664J84688J35236k53241M2004Q4512p422r1655
2462E260j04806J61837J4965j60974n6175k3404M9297J70996J14614n5993k0772
2451I4845J4464K04435M5224k66573j31961R9162k3088o2814L3735j36518n868
2440a34957K30047j18828j61275J10255K04594p0861m6622K4653j50645n483M3387
2429g5735J42294R264l066k471j27387j89688q750N5152N7858P7451O4322o783
$$ plain form
2506 -122484 68532 293512 113389 95294 139268 -16457 -20292 77436 4871 -50496 71163
2495 71163 19195 161448 31714 -147844 34065 38832 -156097 30523 35057 14696 -136099
2484 -136099 -10459 -65027 5378 -3913 99020 119478 -37365 79431 -223204 -303488 -70071
2473 -70071 -89828 76758 166802 -88862 95826 231062 -22179 19825 104337 96915 5260
2462 5260 -99546 62291 77256 -83718 -139893 -163297 -114000 56996 171610 115617 94845
2451 94845 109309 313744 358968 92395 -39566 59596 36508 -26306 7429 -129089 -134957
2440 -134957 95090 -23738 -185013 -74758 129836 58975 12353 37006 -113639 -119122 -75735
2429 -75735 66559 75823 72757 70286 -57101 -246789 -255539 -200387 -142529 -65078 -756 -7539
2417g539J17417l4718j0265n085j32816j036J15776J3277j70854O6878K40661
2406A91696p1750j50580K2428J50584j48112n8870K8349p5143Q1306J12357j77055
2395i4790R8981o1789Q3979o0229l9701r265M8018Q1347J66181j50573k164j12178
2383e2183R9135J07678l7684J61506K5440M0401j48076J36301m9902j54759p6744
2372E1113j12562j3213J20866M4071r5155l8430J35409Q617O8463j58209j53761
2361a42791O8415J40369p110J14098J26981p701k24874j40313J8813O6516k4149
2350a1746m2872J56307r2519q4220J01737L1318M1765j00920j419N9169R3850
2339A50450q5189P6260n9615k01976P9112j46800R4235J17063J9932k83594Q5583
$$ plain form
2417 -7539 109878 75160 64895 59810 -73006 -74042 41734 55011 -115843 -48965 191696
2406 191696 119946 -30634 -8206 142378 -5734 -64604 -36255 -111398 -30092 82265 -94790
2395 -94790 4191 -57598 26381 -33848 -73549 -82814 -34796 46551 212732 62159 59995 -52183
2383 -52183 46952 154630 116946 278452 303892 344293 196217 332518 282616 127857 51113
2372 51113 -61449 -74662 46204 90275 -4880 -43310 92099 100716 169179 10970 -142791
2361 -142791 -74376 65993 58883 172981 299962 292261 67387 -72926 -54113 12403 -11746
2350 -11746 -54618 101689 9170 -75050 26687 58005 99770 -1150 -2569 56600 150450
2339 150450 65261 141521 81906 -120070 -40958 -187758 -93523 23540 43472 -240122 -154539
2328a54539R3950Q6738j46353j65777K17385P628k5062J16581Q4473r2061N7493
2317H0456j35675K4821J80766K4585j75776q1397j16012P0832K0627K29949r8487
2306B4689r1716J23397O0652r663J7805Q043j44556j25744r7446J53194J15092
2295C3747P8567J1881j71689N9460j30335j03569K01197J28904N1524J25036k80728
2284C995j80303J90068J63300j68752l4845J18951J8534Q2598j3394J03232j06815
2273A76569j13536j41439j1905J84556l6537r1165N4540K34169J0990o4298r9965
2262A01979j54786J73267j32763n924J37300l7866j69717J98599J85104l7800
2252B57393p6364M3964J11823J06146M9q9892l30034j650J10490j14802J64202
$$ plain form
2328 -154539 -60589 26149 -120204 -285981 -68596 -60968 -86030 30551 115024 22963 80456
2317 80456 -55219 -30398 150368 174953 -823 -82220 -198232 -127400 -106773 123176 24689
2306 24689 -67027 56370 117022 107359 125164 133207 -11349 -137093 -234539 -81345 33747
2295 33747 112314 124195 -47494 11966 -118369 -221938 -20741 108163 159687 284723 3995
2284 3995 -176308 13760 177060 8308 -26537 92414 110948 193546 180152 283384 176569
2273 176569 63033 -78406 -90311 94245 57708 -33457 21083 255252 266242 201944 101979
2262 101979 -52807 120460 -12303 -18227 119073 81207 -88510 110089 295193 257393
2252 257393 181029 224993 336816 442962 443011 353119 23085 21435 131925 17123 181325
2241A81325J79458j56910j35974J09007O606j8134j21201P8517Q4152k5665p3525
2230A07656M7980R7241r178j55183j33585J59993J43882o5336n4317K08909P1829
2219D19891k79411p6470p7384R7211N7672l1788P965M5800O2623J30877j14000
2208B42986n1601Q7269l1839J63280n8144M815J1659o543J62894k9283m6482n6969
2196C92042q1264L9852j1702J36683M4420N0262q5949M712M8016J7909l7823M7083
2184E64241Q9822J15772j95196M2116J32445J67647j0284q7842L6246L4562r4548
2173G94981J12249J4006L7277p4842k35240J55397J00891r3045J3920J46334N4646
2162A026574K81968j88894j10229J26602R7926j76737K4094J2869J87211Q0901
$$ plain form
2241 181325 360783 203873 67899 176906 183512 165378 44177 122694 206846 181181 107656
2230 107656 155636 252877 243699 88516 -45069 114924 258806 193470 139153 348062 419891
2219 419891 140480 64010 -13374 83837 141509 109721 117686 163486 226109 356986 242986
2208 242986 191385 278654 246815 410095 351951 356766 368425 361882 524776 495493 449011 392042
2196 392042 310778 350630 338928 475611 520031 570293 484344 489056 537072 554981 517158 564241
2184 564241 654063 769835 574639 616755 749200 916847 906563 818721 854967 889529 794981
2173 794981 907230 921236 958513 883671 648431 803828 904719 811674 825594 971928 1026574
2162 1026574 1308542 1119648 1009419 1136021 1233947 1057210 1081304 1094173 1281384 1362285
2152A362285Q0809j42893J21925J98260q7965R9390O9806P7213R9241K58911J28958
2141B265940R5599o75J09896J74079J78568L37714O2800K45277M92722K19760
2131D181680L12199M73432M34577O61916L93512J4153J36657O96248J046498J530783
2121I881655J663970K309275K945489L630111M795311N982363P677575R284966
2113D8170715P300861k98448r793179j2522241p891341n002639l287965k525704
2105A4150059j939201j440872j268945p01571o40975p17121n20016k99762j22663
2096F498933n77558o05875o31561l59630j56511p0741l49118l80450j34749j40299
2086C092441j48526k85436l5341p6619j67335k31949q7445J27583n1808k36746
$$ plain form
2152 1362285 1443094 1300201 1422126 1620386 1532421 1631811 1701617 1778830 1878071 2136982 2265940
2141 2265940 2361539 2360864 2470760 2644839 2823407 3161121 3223921 3469198 3961920 4181680
2131 4181680 4493879 4967311 5401888 6063804 6457316 6471469 6608126 7304374 8350872 9881655
2121 9881655 11545625 13854900 16800389 20430500 25225811 31208174 38885749 48170715
2113 48170715 55471576 55173128 45379949 32857708 24966367 19963728 16675763 14150059
2105 14150059 12210858 10769986 9501041 8799470 8158495 7441374 6921358 6621596 6498933
2096 6498933 5921375 5315500 4683939 4324309 4167798 4097057 3747939 3367489 3232740 3092441
2086 3092441 2943915 2658479 2623138 2546519 2379184 2147235 2059790 2187373 2135565 1898819
2076A898819k78073j78707J20152r4909M2872p846n803J34998j71663j21879p936
2065A330025r7063k179N4814j71576k48401k63068K95585K10170j961m8662n0200
2054A007484l4057k73172L36787L4248m2318K0916j47138k9846j13493j08317
2044F51094J49329p3264p4433k43079m5837J80597n5859j54225J4160O1621J88395
2033E98499Q1585o449O095j32849J04447j36325q0323L2042J13971k59625Q1335
2022D02403k36554j3902J21545N706j0942j9489J57532j10500J78057j03138r8871
2011B71847J57949p9458K351m1389n6361M5467o1855R0780O9447K4138j02720
2000C20196k3099n9865j379k4835J51975j44135j04657L5621J83714r5577J4829
$$ plain form
2076 1898819 1620746 1442039 1562191 1467282 1510154 1502308 1496505 1631503 1459840 1337961 1330025
2065 1330025 1232962 1230783 1285597 1114021 865620 602552 898137 1108307 1106346 1057684 1007484
2054 1007484 973427 700255 1037042 1071290 1028972 1049888 902750 872904 759411 651094
2044 651094 800423 727159 652726 409647 363810 544407 488548 334323 348483 410104 598499
2033 598499 680084 673635 679730 546881 651328 515003 434680 466722 580693 321068 402403
2022 402403 165849 151947 273492 279198 268256 248767 406299 295799 473856 370718 271847
2011 271847 429796 350338 352689 311300 254939 300406 238551 329331 398778 422916 320196
2000 320196 297097 237232 235853 211018 362993 218858 114201 149822 333536 237959 252788
1989B52788J02112m6130j2991L686k18886Q4959J32539o4236K6063j50747O1751
1978A70908m7512Q5463j4013j10171j04499Q7608J89998J60302k78740j91858
1968e2514J06792J23238J10058j25042J51248K5591K340r7854K21268O0597k86411
1957B39311k03465k7924K11041j03439j08330r234Q7085O0550q0162k09547J09880
1946c4234J13742k22744l2958M8479K29449j223l7531J58898k44970J25597Q0665
1935A83170j46178k87099J45730J63767j15821K94815N960j27856r7596l5794
1925a6902j70205P1492J09935k9416j8706J836r8561j60488K45986M0300j66906
1914a91635J34804L5043m0798p2635l3857J90194J08900j3350j15445M8527k0073
$$ plain form
1989 252788 354900 308770 295779 299465 80579 165538 298077 233841 259904 109157 170908
1978 170908 123396 208859 194846 84675 -19824 67784 257782 418084 139344 -52514
1968 -52514 54278 177516 287574 162532 313780 339371 341711 243857 465125 525722 239311
1957 239311 35846 7922 218963 115524 7194 -2040 85045 145595 65433 -144114 -34234
1946 -34234 79508 -143236 -176194 -127715 101734 100511 62980 221878 -23092 102505 183170
1935 183170 36992 -250107 -104377 59390 -56431 238384 244344 116488 18892 -16902
1925 -16902 -187107 -115615 -5680 -35096 -53802 -51966 -150527 -311015 -65029 -24729 -191635
1914 -191635 -56831 -21788 -62586 -135221 -169078 21116 130016 116666 1221 49748 29675
1903B9675O2893j17796k3828k365J9678k18471l2370r756J57621J11686L4575
1892A1542O9735K7262K25867j30296l83249K17473J18620p5557O1975M2780N6572
1881B42724K4155l08002M2413k9942n9679O4390n8914P4670k8362L2667J3340
1870I460j76461M590R3579Q5364N193K4584J96665r1751o4800o8839J1927j6806
1858A2705j50888j777N044L5151o7297j22863K46077K22458L9618j97727Q2262
1847A02763O1367J90261n9281j32446J4348K296m5350J32531M4978j53631j43784
1836A4052J86676l3822N5987j62475j69173j66107l905L47647N2259O4701j13356
1825G2484j21102J2499N3427l5790n408J8847p9816p871J71514R0260n0051R3747
$$ plain form
1903 29675 92568 -25228 -49056 -51421 -31743 -250214 -282584 -292340 -134719 -23033 11542
1892 11542 81277 108539 334406 204110 -179139 38334 156954 81397 143372 186152 242724
1881 242724 266879 -41123 1290 -28652 -88331 -23941 -82855 -8185 -36547 -3880 9460
1870 9460 -167001 -162411 -68832 16532 21725 46309 242974 151223 86423 17584 29511 12705
1858 12705 -138183 -139960 -134916 -99765 -167062 -289925 -43848 178610 218228 20501 102763
1847 102763 164130 354391 295110 162664 177012 179308 133958 266489 311467 157836 14052
1836 14052 200728 166906 222893 60418 -108755 -274862 -278767 68880 121139 185840 72484
1825 72484 -48618 -36119 17308 -18482 -23890 -5043 -84859 -92730 78784 169044 118993 212740
1813B12740q6683j75770M2675O7678k29114J31085K1221q7773J33751j22865M0202
1802e2853j41642L3826l9330J10953K02665j84851J66677P2913p9875j75130q4640
1791a71287P1119q879M8869J16010m0852J18385j58748J10572m899j14442J71512
1780A37360l3941j19637k097Q8944j85956k6713K9662J19827J6261J49066k981
1769A69795N1519l36335l773J59735j54427M6990J75908K4530N436J51348j41800
1758A48926k5311K08729r1988k53552q8944l1698J59117Q2454r5532n6046j62588
1747b06433K6715K36722j95172l4251j0121P3645q5459R9763K3206M8577l3112
1736e5920j03427J52246o5047J76170j61960J0400j9185Q5010L8472o9583o1680
$$ plain form
1813 212740 126057 -49713 -7038 60640 -168474 -37389 -16168 -103941 29810 -93055 -52853
1802 -52853 -194495 -160669 -199999 -89046 113619 -71232 95445 168358 88483 -86647 -171287
1791 -171287 -100168 -109047 -60178 55832 14980 133365 -25383 85189 80290 -34152 137360
1780 137360 103419 -16218 -18315 70629 -115327 -142040 -112378 7449 23710 172776 169795
1769 169795 221314 -115021 -118794 40941 -113486 -66496 109412 133942 139378 290726 148926
1758 148926 123615 332344 240356 -13196 -102140 -133838 25279 107733 12201 -43845 -206433
1747 -206433 -179718 57004 -138168 -172419 -182540 -108895 -194354 -94591 -71385 -22808 -55920
1736 -55920 -159347 -7101 -72148 104022 -57938 -47538 -66723 18287 56759 -12824 -74504
1725g4504m2489K69879J23131j25776J09287k18095j35934J07185j87421q5293
1715b60030J31022J04460j9274j83415p5350J67736J76078L8955q0524J02697
1705A02355j55537k74744K05408M5747J22873o5497j05656J99665m4061n2090
1695b1537q2076m8832m717l140J9337J41339o8011K549l8973J12658m0560l0129
1683f2092J08852J38853K9543k96262j68340R3799J53070J4641j70738j09429
1673b68103Q2092J08807R9502j93211j9156J63620k17952Q9840K161l631M4975
1662a11056J13494j80113j89501J08959j38903K80965R7823J3197k90160R8771
1652a96524l2000M1834j10671N5244K34867K09047m2211j82291J73592K9014j94834
$$ plain form
1725 -74504 -116993 152886 276017 150241 259528 41433 -94501 12684 -174737 -260030
1715 -260030 -129008 -24548 -43822 -227237 -302587 -134851 41227 80182 -342 102355
1705 102355 -53182 -327926 -122518 -76771 46102 -19395 -125051 74614 30553 -21537
1695 -21537 -103613 -152445 -157162 -160302 -140965 374 -67637 -65088 -104061 8597 -31963 -62092
1683 -62092 46760 185613 215156 -81106 -249446 -155647 -2577 12064 -158674 -268103
1673 -268103 -186011 -77204 22298 -170913 -190069 -26449 -244401 -154561 -152400 -156031 -111056
1662 -111056 2438 -177675 -367176 -258217 -397120 -116155 -18332 -5135 -295295 -196524
1652 -196524 -228524 -186690 -297361 -242117 -7250 201797 159586 -22705 150887 179901 -14933
1641a4933R5444K3991P872M6179j2627r8871O5909o3565n2237J02035j94328j66608
1629b61739O7916L826j58687K01074K6107J81582j61J51777j36728j04708L724
1618b6017p0096j15178O2814J03233L5586Q5968j53239j4698p6663O4431J64774
1607F0915j19851p6640m9182N081l1016O3761Q197m5495m4310l9944Q7777k560
1595a83267J28580n6840r5976j5160J2954k09289p474K47279J49578M0842j34301
1584a23074J0559j6293J4468J27975j04970J4828K72250j21144n3612j84381N9919
1573a03475P8103R533P8605J40431j33118r6726k7528j24751m2320O4896K58367
1562A02017J64936k66365p7082M2904n0313o7051Q2387j84345K4821L3463J15074
$$ plain form
1641 -14933 80511 104502 112374 158553 145926 47055 112964 49399 -2838 99197 -95131 -261739
1629 -261739 -193823 -189997 -348684 -147610 -121503 60079 59918 211695 74967 -29741 -26017
1618 -26017 -96113 -211291 -148477 -45244 -9658 76310 -76929 -91627 -168290 -103859 60915
1607 60915 -58936 -135576 -184758 -179677 -210693 -146932 -138735 -184230 -228540 -268484 -180707 -183267
1595 -183267 -54687 -111527 -207503 -222663 -209709 -418998 -426472 -179193 -29615 11227 -123074
1584 -123074 -112515 -128808 -114340 13635 -91335 -76507 195743 74599 20987 -163394 -103475
1573 -103475 -25372 -15839 62766 203197 70079 -26647 -54175 -178926 -221246 -156350 102017
1562 102017 266953 588 -76494 -33590 -83903 -150954 -68567 -252912 -228091 -194628 -79554
1551g9554k5136J46047r6879L9163J52404j21508L8086j05607n9964N3161J60920
1540A01133J630j9178q7962K125n5020m1412K5020J45801l8871j25388O2555j00288
1528a29855p1053J04958J03330L4229N8975j09516j31187Q8756O4230m1862L3890
1517D895M634j14550p3224J69195M3052L4694j30575j79356M3874l9432L27086
1506I0293j63164J82344k11359o7847J9425J40677j85863O1116J59618j40526
1496a15286P0175O3403m3935J59653R872j63679R2827l4987k3605J39021j09105
1485D4354j2684n9361J14090j5448r0566K9955Q1223l1382j75920j09774J35846
1474h9667J80491j64084j46287P8846j2596J96700N0592l0805j17745l7587J89431
$$ plain form
1551 -79554 -104690 41357 -55522 -16359 136045 14537 52623 -52984 -112948 -59787 101133
1540 101133 102763 83585 -4377 -2252 -57272 -98684 -73664 72137 33266 -92122 -29567 -129855
1528 -129855 -200908 -95950 7380 41609 100584 -8932 -140119 -51363 12867 -28995 4895
1517 4895 9529 -105021 -178245 -9050 34002 68696 -61879 -241235 -197361 -236793 90293
1506 90293 -72871 109473 -101886 -169733 -150308 -9631 -195494 -134378 25240 -115286
1496 -115286 -45111 18292 -25643 134010 143882 -19797 73030 38043 14438 153459 44354
1485 44354 31670 -27691 86399 70951 -19615 10340 91563 60181 -115739 -225513 -89667
1474 -89667 90824 -73260 -219547 -140701 -153297 43403 93995 63190 -54555 -92142 97289
1463I7289O0031j52055N0929j27152O6266J1150j53330R2939j5339K8260j46523
1452a87535J04324o0003k08786k7016K10751L8358J78337k16499q6099R2476Q5944
1441g5748n0826N0671j01378R3476J0672j96007n2663N0430J23733P1620m5058
1430a21078l9564L8177K17043l8958k02486J84889N7847n1430o3601j50548j60205
1419c29914j4504L07019j06909j21322K53882J71872j35449J0557O6491m6709
1409E5014j40445K15506j70944l2650M6999L3530J06018M0638K304k48161o4625
1398a56816P9071J94503k04937m2040P2966j33100j16009K03393J77285J25178
1388A99494k2997p3811j59127k4165P3137r2850J05437K19168p7431j93043o0596
$$ plain form
1463 97289 157320 5265 56194 -70958 -4692 6458 -146872 -53933 -69272 -41012 -187535
1452 -187535 -83211 -143214 -352000 -379016 -168265 -129907 48430 -168069 -254168 -161692 -75748
1441 -75748 -126574 -75903 -177281 -83805 -73133 -269140 -321803 -271373 -147640 -76020 -121078
1430 -121078 -160642 -122465 94578 55620 -146866 38023 95870 44440 -19161 -169709 -329914
1419 -329914 -344418 -37399 -144308 -265630 -11748 160124 24675 35232 101723 55014
1409 55014 -85431 130075 -40869 -73519 -26520 7010 113028 153666 155970 -92191 -156816
1398 -156816 -77745 116758 -88179 -130219 -57253 -190353 -306362 -102969 74316 199494
1388 199494 176497 102686 -56441 -80606 -7469 -100319 5118 224286 146855 -46188 -106784
1377a06784j22922K11276J02112k25208L0326N3245m5882k55078l7032K82864
1367a13083j11813K15849k4590k25514N5074J16055J11617R378J500K3437r485
1356D8425p9643k6132j94591n50R7787o7697J44293O2636K24020j72428j88815
1345a52695Q763o5507K29098r1252o8779J07424J99717j96705l5234K3243K1095
1334b0832J19299N3716o4493r326J9244Q8228K9106l453P5965j14746o6476l02061
1322a95829l9351J97171k9333P9358J02442p3432j12790Q0822N6260m4924k03102
1311a82708O8812O6652J11513K5958r9592n1243m9282J36503k638j61563j35552
1300b73140J98542L3232K4093k9359M8306l1774j83532K2049K31809K2774J02233
$$ plain form
1377 -106784 -229706 -18430 83682 -141526 -111200 -57955 -103837 -358915 -395947 -113083
1367 -113083 -224896 -9047 -33637 -259151 -204077 -88022 23595 32973 34473 57910 48425
1356 48425 -31218 -57350 -251941 -252491 -154704 -222401 -78108 -15472 208548 36120 -152695
1345 -152695 -143932 -209439 19659 -71593 -140372 -32948 166769 -29936 -65170 -41927 -20832
1334 -20832 98467 152183 87690 78364 97608 185836 214942 211489 287454 172708 106232 -195829
1322 -195829 -235180 -38009 -67342 12016 114458 41026 -71764 9058 65318 20394 -182708
1311 -182708 -113896 -47244 64269 90227 -9365 -60608 -109890 26613 23975 -137588 -273140
1300 -273140 -74598 -41366 -17273 -46632 1674 -30100 -213632 -191583 40226 63000 165233
1289A65233O045k06550L6603q3792R8298J07673j20208Q8399J23742j05516J35187
1278B45114p1222k87572P7899m7741l2562R3102j54677K60390J10757q4505O1270
1267A70253j63938k49898o7560j11397J12106L41977M4716r7403j14778j37214
1257b73136L11048j65553j77070J77219l4246P1051M3864r4075j06438l8953J7077
1246b69212j06893K8777J46603L6590J49649n2153L3755K02136j96850l2702K1251
1235c9049m4652J56674j45993k19199j17907J54582K41947j18366L3585r3125
1225a91503J20624J35835j55292p5589P4997O5589j3028j3395l5048n0463J81625
1214D4352M8550j70851R1870q9258R7969J46140l1826j66580M0784M6688q6027
$$ plain form
1289 165233 171278 -35272 1331 -82461 15837 123510 3302 91701 215443 109927 245114
1278 245114 173892 -113680 -35781 -83522 -116084 -22982 -177659 82731 193488 108983 170253
1267 170253 6315 -243583 -311143 -422540 -310434 31543 76259 -21144 -135922 -273136
1257 -273136 37912 -127641 -304711 -127492 -161738 -90687 -46823 -140898 -247336 -286289 -269212
1246 -269212 -376105 -347328 -200725 -164135 -14486 -66639 -32884 169252 -27598 -60300 -39049
1235 -39049 -83701 72973 -73020 -292219 -410126 -255544 -13597 -131963 -98378 -191503
1225 -191503 -70879 64956 -90336 -165925 -90928 -25339 -38367 -51762 -86810 -137273 44352
1214 44352 92902 -77949 13921 -75337 22632 168772 136946 -29634 11150 57838 -28189
1203b8189j27359L4568Q1823J7652j88130R361K16985j22394P9745R2670q2943
1192a6211j01324J8686K6125J06324N3168j46845n6136k36889l996J31843J15457
1181a09798J4687q253L5155O2178N9619j42370q3707J25848J70089j47946k24231
$$ plain form
1203 -28189 -155548 -120980 -39157 -21505 -209635 -200274 16711 -105683 -25938 66732 -16211
1192 -16211 -117535 -98849 -72724 33600 86768 -60077 -116213 -353102 -357098 -225255 -109798
1181 -109798 -95111 -103364 -68209 -6031 53588 -88782 -172489 -46641 123448 -24498 -248729
$$ [...]
##END NTUPLES=NMR SPECTRUM
##END=
