##TITLE=1H_TG-2346-C1
 CDCl3
 8 sc, 
 15.02.2022
##JCAMPDX= 6.0         $$ Bruker NMR JCAMP-DX V2.0
##DATA TYPE= NMR SPECTRUM
##DATA CLASS= NTUPLES
##ORIGIN= UXNMR, Bruker Analytische Messtechnik GmbH
##OWNER= root
$$ XWIN-NMR		Version 3.5
$$ Tue Feb 15 12:07:00 2022 Russian Standard Time (UT+4h)  she@DPX200
##.OBSERVE FREQUENCY= 200.131346
##.OBSERVE NUCLEUS= ^1H
##.ACQUISITION MODE= SIMULTANEOUS
##.ACQUISITION SCHEME= undefined
##.AVERAGES= 8
##.DIGITISER RES= 18
##SPECTROMETER/DATA SYSTEM= spect
##.PULSE SEQUENCE= zg30
##.SOLVENT NAME= CDCl3
##.SHIFT REFERENCE= (INTERNAL, CDCl3, 0, 15.7282)
##AUDIT TRAIL= $$ (NUMBER, WHEN, WHO, WHERE, WHAT)
$$ ##TITLE= Audit trail, XWIN-NMR		Version 3.5
$$ ##JCAMPDX= 5.01
$$ ##ORIGIN= Bruker BioSpin GmbH
$$ ##OWNER= she
$$ F:/spectra/data/she/nmr/H-F/1/pdata/1/auditp.txt
$$ ##AUDIT TRAIL=  $$ (NUMBER, WHEN, WHO, WHERE, WHAT)
(   1,<2022-02-15 12:04:32.34 +0400>,<she>,<DPX200>,
      <created by zg, POWCHK disabled, PULCHK disabled
       configuration hash MD5:
       00 E9 B6 7A A2 85 ED C7 34 08 36 98 17 FE 4E 26
       data hash MD5: 16K
       4E C7 94 4D AE EC BE 4F EE BA 8F E9 A1 B9 CA DA>)
(   2,<2022-02-15 12:04:40.20 +0400>,<she>,<DPX200>,
      <Start of raw data processing
       efp BC_mod = 2 LB = 0.24 FT_mod = 6 PKNL = 1 PHC0 = -16228.11 PHC1 = 9.40078 SI = 16K 
       data hash MD5: 16K
       9C A9 A2 9B F4 10 B0 79 1C 94 30 68 25 3E 88 2C>)
(   3,<2022-02-15 12:05:04.37 +0400>,<she>,<DPX200>,
      <pk PHC0 = -1.33287 PHC1 = 1.4 
       data hash MD5: 16K
       32 57 E3 4E 9F 5D CC 3F E5 46 05 89 CF 7E 73 FD>)
(   4,<2022-02-15 12:05:09.40 +0400>,<she>,<DPX200>,
      <abs ABSG = 5 
       data hash MD5: 16K
       8E FC F3 AA 71 E8 96 ED 7A 93 AE 8D 10 F0 6F 1C>)
$$ ##END=
$$ 
$$ hash MD5
$$ 6C EF 97 55 87 D8 A8 14 06 29 A3 B9 9F 38 FE 9E
##$RELAX= 
##$RELAX= 
##$RELAX= 
##$RELAX= 
##$RELAX= 
##$RELAX= 
$$ Bruker specific parameters
$$ --------------------------
##$DU= <F:/spectra>
##$EXPNO= 1
##$NAME= <H-F>
##$PROCNO= 1
##$TYPE= <nmr>
##$USER= <she>
##$AMP= (0..31)
100 100 100 100 100 100 100 100 100 100 100 100 100 100 100 100 100 100 
100 100 100 100 100 100 100 100 100 100 100 100 100 100 
##$AQSEQ= 0
##$AQ_mod= 1
##$AUNM= <au_zg>
##$AUTOPOS= <>
##$BF1= 200.13
##$BF2= 200.13
##$BF3= 200.13
##$BF4= 200.13
##$BF5= 200.13
##$BF6= 200.13
##$BF7= 200.13
##$BF8= 200.13
##$BYTORDA= 1
##$CFDGTYP= 0
##$CFRGTYP= 5
##$CHEMSTR= <none>
##$CNST= (0..31)
1 1 145 1 1 1 1 1 1 1 1 1 1 1 1 1 1 1 1 1 1 1 1 1 1 1 1 1 1 1 1 1 
##$CPDPRG= <>
##$CPDPRG1= <>
##$CPDPRG2= <>
##$CPDPRG3= <>
##$CPDPRG4= <mlev>
##$CPDPRG5= <mlev>
##$CPDPRG6= <mlev>
##$CPDPRG7= <mlev>
##$CPDPRG8= <mlev>
##$CPDPRGB= <>
##$CPDPRGT= <>
##$D= (0..31)
0 1.2 0 0 0 0 0 0 0 0.06 0 0.03 0 0 0 0 0.0002 0 0 0 0 0 0 0 0 0 0 0 0 
0 0 0 
##$DATE= 1644912271
##$DBL= (0..7)
120 120 120 120 120 120 120 120 
##$DBP= (0..7)
150 150 150 150 150 150 150 150 
##$DBP07= 0
##$DBPNAM0= <>
##$DBPNAM1= <>
##$DBPNAM2= <>
##$DBPNAM3= <>
##$DBPNAM4= <>
$$ [...]
##$SUBNAM2= <"">
##$SUBNAM3= <"">
##$SUBNAM4= <"">
##$SUBNAM5= <"">
##$SUBNAM6= <"">
##$SUBNAM7= <"">
##$SUBNAM8= <"">
##$SUBNAM9= <"">
##$SW= 18.0517287032376
##$SWIBOX= (0..15)
0 0 2 0 0 0 0 0 0 0 0 0 0 0 0 0 
##$SW_h= 3612.71676300578
##$TD= 16384
##$TD0= 1
##$TE= 0
##$TE2= 300
##$TE3= 300
##$TEG= 300
##$TL= (0..7)
0 120 120 120 120 120 120 120 
##$TP= (0..7)
150 150 150 150 150 150 150 150 
##$TP07= 0
##$TPNAME0= <>
##$TPNAME1= <>
##$TPNAME2= <>
##$TPNAME3= <>
##$TPNAME4= <>
##$TPNAME5= <>
##$TPNAME6= <>
##$TPNAME7= <>
##$TPOAL= (0..7)
0.5 0.5 0.5 0.5 0.5 0.5 0.5 0.5 
##$TPOFFS= (0..7)
0 0 0 0 0 0 0 0 
##$TUNHIN= 0
##$TUNHOUT= 0
##$TUNXOUT= 0
##$USERA1= <user>
##$USERA2= <user>
##$USERA3= <user>
##$USERA4= <user>
##$USERA5= <user>
##$V9= 5
##$VALIST= <valist>
##$VCLIST= <CCCCCCCCCCCCCCC>
##$VD= 0
##$VDLIST= <DDDDDDDDDDDDDDD>
##$VPLIST= <PPPPPPPPPPPPPPP>
##$VTLIST= <TTTTTTTTTTTTTTT>
##$WBST= 1024
##$WBSW= 4
##$XGAIN= (0..3)
0 0 0 0 
##$XL= 0
##$YL= 0
##$YMAX_a= 206073
##$YMIN_a= -363174
##$ZGOPTNS= <>
##$ZL1= 120
##$ZL2= 120
##$ZL3= 120
##$ZL4= 120
##$ABSF1= 15.72265
##$ABSF2= -2.3292
##$ABSG= 5
##$ABSL= 3
##$ALPHA= 0
##$AQORDER= 0
##$ASSFAC= 0
##$ASSFACI= 0
##$ASSFACX= 0
##$ASSWID= 0
##$AUNMP= <proc_1d>
##$AZFE= 0.1
##$AZFW= 0.1
##$BCFW= 0
##$BC_mod= 2
##$BYTORDP= 0
##$COROFFS= 0
##$CY= -3
##$DATMOD= 1
##$DC= 0
##$DFILT= <>
##$DTYPP= 0
##$F1P= 0
##$F2P= 0
##$FCOR= 1
##$FTSIZE= 16384
##$FT_mod= 6
##$GAMMA= 0
##$GB= 0
##$INTBC= 1
##$INTSCL= 0
##$ISEN= 128
##$LB= 0.24
##$LEV0= 0
##$LPBIN= 0
##$MAXI= 10000
##$MC2= 0
##$MEAN= 0
##$ME_mod= 0
##$MI= 1.114404
##$NCOEF= 0
##$NC_proc= -5
##$NLEV= 6
##$NOISF1= 3.799351
##$NOISF2= 2.8
##$NSP= 0
##$NTH_PI= 0
##$NZP= 0
##$OFFSET= 15.72816
##$PC= 1
##$PHC0= -16229.44
##$PHC1= 10.80078
##$PH_mod= 1
##$PKNL= yes
##$PPARMOD= 0
##$PSCAL= 0
##$PSIGN= 0
##$REVERSE= no
##$SF= 200.130004681905
##$SI= 16384
##$SIGF1= 3
##$SIGF2= 2
##$SINO= 5.538805
##$SIOLD= 16384
##$SREGLST= <1H.CDCl3>
##$SSB= 0
##$STSI= 16384
##$STSR= 0
##$SW_p= 3612.71676300578
##$SYMM= 0
##$S_DEV= 0
##$TDeff= 16384
##$TDoff= 0
##$TI= <>
##$TILT= no
##$TM1= 0
##$TM2= 0
##$TOPLEV= 0
##$USERP1= <user>
##$USERP2= <user>
##$USERP3= <user>
##$USERP4= <user>
##$USERP5= <user>
##$WDW= 1
##$XDIM= 16384
##$YMAX_p= 340461028
##$YMIN_p= -135278
$$ End of Bruker specific parameters
$$ ---------------------------------
##NTUPLES= NMR SPECTRUM
##VAR_NAME=  FREQUENCY,     SPECTRUM/REAL,   SPECTRUM/IMAG
##SYMBOL=    X,             R,               I
##VAR_TYPE=  INDEPENDENT,   DEPENDENT,       DEPENDENT
##VAR_FORM=  AFFN,          ASDF,            ASDF
##VAR_DIM=   16384,         16384,           16384
##UNITS=     HZ,            ARBITRARY UNITS, ARBITRARY UNITS
##FACTOR=    0.220516191357247, 1,           1
##FIRST=     3147.67671532133, 0,            0
##LAST=      -465.040047684451, 0,           0
##MIN=       -465.040047684451, -135278,     0
##MAX=       3147.67671532133, 340461028,    0
$$ Real data points
##PAGE= N=1
##DATA TABLE= (X++(R..R)), XYDATA
$$ [...]
7289B37487N3524m5120L1447k3739k3412r848p273R6849l489j6622O11m0269M3606
7276B93752M8689J6053K043j4075M3788k3191o8758J7697L2918k8793L0813j7149
7264C33787j1549l517p044Q6N0590j926k2638k0687R537M1809L514R532M949O019
7250C92462J4564M4082l344j4060m3745K5335L3100L5712R624J2648l8780K348
7238D69946O7455M6437k5123L1008m1021r72N5461o932J0029p344J1958Q7463
7226F98365j4939J0336K6677L3422p8017J0203j0487O00K4325L6369J0015j8519
7214G28350J4021J3610O6455P2209Q0834j9016k930J311L7321J9581Q9205j126
7202A099825O797N6089N2975j6054M4812O191M0109O1395Q5648O7826N0987N9250
$$ plain form
7289 237487 291011 245891 277338 253599 230187 220339 213066 309915 306426 289804 290415 250146 293752
7276 293752 342441 358494 360537 346462 390250 367059 298301 315998 348916 320123 350936 333787
7264 333787 322238 318721 311677 311763 362353 360427 337789 317102 326639 368448 371962 381494 386443 392462
7250 392462 407026 451108 447764 433704 389959 415294 448394 484106 493730 506378 467598 469946
7238 469946 537401 583838 558715 589723 548702 547730 603191 596259 606288 598944 610902 698365
7226 698365 683426 693762 720439 753861 675844 686047 675560 676160 700485 736854 746869 728350
7214 728350 742371 755981 822436 894645 975479 956463 953533 954844 992165 1011746 1100951 1099825
7202 1099825 1106622 1162711 1215686 1199632 1244444 1250635 1290744 1352139 1437787 1505613 1556600 1615850
7190A615850L5609J497K8175m963P5695k451N3760P0948J6244Q8198K6238P4379
7178B079179M0410O9958P5889R1154O0231P5744Q0964N5642P1978J34033J21999
7167B957181R4739R5328M2402O1370R9410J09828K8852N6240J63218Q4512J94152
7156C987232J62201J91356J58653J52650J92968K14859K31960J87442J91312K10330
7146E880963K53178J87664K02975K94699L07970L48114K94821M25262M34588M36367
7136I066601N08139N48722O03521O69224Q45941R31410J085165J337238J497998
7127A7093959J698976J988084K266821K622724L102396L671374M502056N565712
7119D2512102P152347R076982J1025902J1824010J0334637N687377j511128p911301
$$ plain form
7190 1615850 1651459 1652956 1681131 1676168 1751863 1749412 1803172 1874120 1890364 1978562 2004800 2079179
7178 2079179 2119589 2189547 2265436 2356590 2416821 2492565 2573529 2629171 2701149 2835182 2957181
7167 2957181 3051920 3147248 3189650 3251020 3350430 3460258 3489110 3545350 3708568 3793080 3987232
7156 3987232 4149433 4340789 4499442 4652092 4845060 5059919 5291879 5479321 5670633 5880963
7146 5880963 6134141 6321805 6524780 6819479 7127449 7475563 7770384 8195646 8630234 9066601
7136 9066601 9574740 10123462 10726983 11396207 12242148 13173558 14258723 15595961 17093959
7127 17093959 18792935 20781019 23047840 25670564 28772960 32444334 36946390 42512102
7119 42512102 49664449 58741431 69767333 81591343 91925980 97613357 96102229 88190928
7111H8190928j2443787j3444165j1871713r304314o976555n196614l928106l057337
7103B1968337k287476j860180j611577j330604j099979r46444p83970p21406n75813
7094A0750888n70043n11532m83525l78243l94916l22642k41367k62908k25302
7085G360410k18373j52599j59417j08108j54914r6907j06707L6004K1454K1509
7075F442352K88209K92862L83312M96780O31290P81808J044127J014504P72485
7066A2147729J64356n01235j097855j316848j334062j177113q91918o76655m57031
7057D859368l94317l00997j96416j88874k13103j27413j29300j56882j26851j29846
7047B895369p9431j13358o4461o8383q6353j12368p7884r9676r2428q2114j01142
$$ plain form
7111 88190928 75747141 62302976 50431263 41126949 34150394 28953780 25025674 21968337
7103 21968337 19680861 17820681 16209104 14878500 13778521 12832077 12048107 11326701 10750888
7094 10750888 10180845 9669313 9185788 8807545 8412629 8089987 7848620 7585712 7360410
7085 7360410 7142037 6989438 6830021 6721913 6566999 6470092 6363385 6399389 6420843 6442352
7075 6442352 6730561 7023423 7406735 7903515 8534805 9316613 10360740 11375244 12147729
7066 12147729 12312085 11810850 10712995 9396147 8062085 6884972 5993054 5316399 4859368
7057 4859368 4465051 4164054 3967638 3778764 3565661 3438248 3308948 3152066 3025215 2895369
7047 2895369 2815938 2702580 2638119 2569736 2483383 2371015 2293131 2193455 2101027 2018913 1917771
7036A917771n2306m6246l3272q1965j09169p9778k8738j6331m9200n3684p0907
7025A296175p665l7727n4967k6193n8978J5394J7036l0046n4129M138l8136J7687
7013A042589j3699k7741p3063J4870j366m7317j8730q212m1648l6385j6257m5719
7001G27322J9000K4432o6201p5457J8826P257L848q6769J4227m464k5547Q3830
6989F40304l716k5350n0315k3639J5333n3295l9045l492L6453J1989j5612Q66
6977D90481J2537J3779p7080k2917J9533K1801j8660k9513n729m4503q863K738
6965C53604M986j6522l6288J9023k6724K2654O969J3395J618K6215k020J813l0376
6952C38347m6779K1270L0727l1722k6337k305j1066n326R522j2118k8777N1960
$$ plain form
7036 1917771 1865465 1819219 1785947 1703982 1594813 1515035 1486297 1469966 1420766 1367082 1296175
7025 1296175 1288510 1250783 1195816 1169623 1110645 1126039 1143075 1113029 1058900 1063038 1024902 1042589
7013 1042589 1028890 1001149 928086 942956 941590 894273 875543 867331 825683 789298 773041 727322
7001 727322 746322 770754 704553 629096 647922 655179 659027 572258 586485 582021 556474 640304
6989 640304 636588 611238 560923 537284 552617 499322 460277 456785 493238 505227 489615 490481
6977 490481 503018 516797 439717 416800 436333 458134 439474 409961 404232 359729 350866 353604
6965 353604 358590 342068 305780 324803 298079 320733 327702 341097 342715 368930 366910 368723 338347
6952 338347 291568 312838 343565 311843 285506 283201 272135 266809 276331 264213 235436 287396
6940B87396K5566n7042o5568k5328M5628Q4536q785J8353k4529K5020J1701k4771
6928B92177l8694j9389M3016n773m2260j6566L4073P282L0135K0294m4427K3583
6916B83451m481J750N7952k5990j7989N3715k8732J6742N7488L7113K8879K3285
6904D83183j9509q5324l4190l9078j9189k6682J0325O609o0068l1179J2359j1994
6892A85263m0577j2533J5347N472M4972o371k2562M3110k2051N530m097K7998
6880B19501j3363Q437m6741K2979K2352k0860J549r001n987N1415m451l2575j9447
6867A73808m3128l9846J0142P0118k9335P406M9836q4892o462j308N632l428k8753
6854G9790P6P6505K3565l3237M201m9215k6650R942p281m7812L3407L9199J9182
$$ plain form
6940 287396 312962 255920 190352 165024 210652 295188 286403 304756 280227 305247 316948 292177
6928 292177 253483 234094 277110 271337 229077 212511 246584 253866 284001 304295 259868 283451
6916 283451 278970 280720 338672 312682 294693 348408 319676 336418 393906 431019 459898 483183
6904 483183 463674 378350 344160 305082 285893 259211 269536 276145 216077 184898 197257 185263
6892 185263 144686 132153 147500 152972 197944 191573 169011 212121 190070 195600 191503 219501
6880 219501 206138 214575 167834 190813 213165 192305 193854 184853 178866 230281 225830 193255 173808
6867 173808 130680 90834 100976 171094 141759 149165 199001 114109 107647 106339 111971 108543 79790
6854 79790 79866 156371 179936 146699 150900 101685 75035 84977 77696 29884 63291 102490 121672
6841A21672J8752l7002j5799n246N2702J1513k0591j2832j6925j9866j7779j354
6829E7245L6507O4950k5685o678K2004k9061l012L387k6060K4178R268o1378k6819
6816C8846Q1412p1470j5302O3986K785n117l38m4328O3051K1689j3418m666O016
6803A23146k8376j2018m3191N1971n014k4316j1076J6125j4181j6944k0231M146
6791B0041j720O6952P263m3893j8981J8597k298k9338j8351M7726J5323P758l4637
6778C4442j6751r077J5962J3763N4227l4955k8038k9406J3357M5841k1982M1851
6766G9234j1738j89k8869N4110m5392L646o4611k3300M8583M1743m218k7134l4836
6753a2971K8576j9617O9505o263l8338j8658K7409M2088j6381k868J9733l1617
$$ plain form
6841 121672 140424 103422 87623 82377 135079 146592 126001 113169 96244 76378 58599 57245
6829 57245 93752 158702 133017 126339 148343 119282 116270 119657 93597 117775 127043 65665 38846
6816 38846 120258 48788 33486 97472 100257 95140 94802 50474 113525 135214 121796 117130 123146
6803 123146 94770 82752 39561 91532 86518 62202 51126 67251 53070 36126 15895 20041
6791 20041 18321 85273 92536 48643 29662 48259 45961 16623 -1728 45998 61321 69079 34442
6778 34442 17691 8614 24576 38339 92566 57611 29573 167 13524 59365 37383 79234
6766 79234 67496 67307 38438 92548 47156 50802 -13809 -37109 11474 53217 48999 21865 -12971
6753 -12971 15605 -4012 65493 59230 20892 2234 29643 71731 55350 52482 72215 40598
6741D0598M860K6633K4411o0075J546K0986k0975L7751K412j0038J3470j4924
6729F6655m793M1844L9180O258q342M7451k7209l0950L9035N2716J7703L0241
6717B69789P4897M3442P9856O560M8815N3162m3513p9364m4567m9550j04736m8327
6705B06464k7321j6987J9650k8746l5404l108Q042k0711J7263k6268J191j7149
6693G6916k6431l8910K2361L8308J248k3768j8927O822J3655Q21k4406k4049L3541
6680C7181N7031j4078j0107j6246k4669m7865M4928K8512n5456K5955M3238p908
6668F0516K1249k9524o698r254K300n7615L5636K1816l83J0714l175m0511K8334
6655C3405j915n3427M717N1962J816K7300j8680k0337J9289p1025K1590M2505
$$ plain form
6741 40598 45458 72091 96502 36427 37973 58959 37984 75735 78147 68109 81579 66655
6729 66655 61862 103706 142886 149144 140802 188253 161044 130094 169129 221845 239548 269789
6717 269789 344686 388128 467984 474544 523359 576521 533008 453644 409077 359527 254791 206464
6705 206464 179143 162156 181806 153060 117656 114548 122590 101879 119142 92874 94065 76916
6693 76916 50485 11575 33936 72244 73492 49724 30797 37619 51274 52095 27689 3640 37181
6680 37181 94212 80134 70027 53781 29112 -18753 26175 54687 -769 25186 68424 60516
6668 60516 81765 52241 45543 36289 38589 -19026 16610 38426 38043 48757 45582 5071 33405
6655 33405 31490 -21937 -17220 34742 36558 63858 45178 24841 44130 -26895 -5305 37200
6643C7200j1117L611N6588J1002k448k4632m2224n4465R150N1689M7660q779O997
6630H0232m0857k6344Q881J1276o195j5825j6770K1669L8659k2887L6464J0351
6618G8654m8565j847J0894n0556m525M377m691R677J6277m3780K6088K3161J6397
6605C1561m3372J8729j9004r141K2263O1339j7905k1234r954m4271J5264J3497
6593b228K1282j82J3570j2109j1057K0439j5911k4823K4581k0369o377R337m0199
6580d4046J4922M9378m5606K0309k6198j9083N7083q518L903k936m718J8504M645
6567A7639j1972m967K6005J2390j3550j361k747M9791k3452p943m644m438K9581
6554F0332k3930K7528l8761N1103l5890n5265M0827J0148J1690k2176J282k2801
$$ plain form
6643 37200 26083 29694 86282 97284 94836 70204 27980 -26485 -17335 34354 82014 73235 80232
6630 80232 39375 13031 21912 33188 26993 11168 -5602 16067 54726 31839 68303 78654
6618 78654 30089 28242 39136 -11420 -15945 -11568 -16259 -6582 9695 -34085 -7997 15164 31561
6605 31561 -11811 6918 -12086 -21227 1036 62375 44470 23236 13282 -30989 -15725 -2228
6593 -2228 19054 18872 32442 20333 9276 29715 13804 -11019 13562 -6807 -13184 -3847 -44046
6580 -44046 -29124 20254 -25352 -5043 -31241 -50324 6759 -1759 2144 -792 -5510 12994 17639
6567 17639 5667 700 26705 39095 25545 24184 21437 71228 47776 39833 35189 30751 60332
6554 60332 36402 63930 25169 76272 40382 -14883 25944 36092 47782 25606 26888 4087
6542D087K2393J6050j9871K691R1613o1555n8160J1056l1564K4640l497K0221
6530A8104J0797R41L482J5061J4497Q482m1413M2381j0280l3049k2306J3698l84
6517B0011j4738N5217J6567J5736l1059j3484J0866o4540K1043M2737r530j5378
6505C3448L3508l9803J8459J3683L528j0831k5356k3680K9877O016j731P215k2722
6492B1611J9939J9923R750n8455L3205J1926m159l1217r274j4445J301J3109M6403
6479E9617k6927n8595q723K3020k410P956L9843K382k2583j5204j0628n21K0942
6466H169J0781L2961m0182L5124k6045J0793k4138j6278P300J3442j978j7716
6454g767J4873M643P703J6588r46k0204l359K2085l645Q864Q188J2154j3611l1246
$$ plain form
6542 4087 26480 42530 22659 25350 116963 55408 -2752 8304 -23260 1380 -2117 18104
6530 18104 28901 29842 33324 48385 62882 71364 29951 72332 62052 29003 6697 20395 20011
6517 20011 5273 60490 77057 92793 61734 48250 59116 -5424 15619 58356 48826 33448
6505 33448 66956 27153 45612 59295 62823 51992 26636 2956 32833 38849 37118 44333 21611
6492 21611 41550 61473 71223 12768 45973 57899 53740 22523 13249 -1196 105 13214 59617
6479 59617 32690 -25905 -34628 -11608 -14018 -6062 33781 36163 13580 -1624 -12252 -12773 8169
6466 8169 18950 51911 11729 46853 20808 31601 7463 -8815 -1515 11927 9949 -7767
6454 -7767 7106 11749 19452 36040 35094 14890 11531 33616 29971 38835 47023 59177 45566 14320
6440A4320L2146O3407J4915j4790J1852m9813L1008K0754N646J6340j4750P995
6428A39030L540L9281L2034K4384k2824p5919j5963k9517L4523M4319j1615j2245
6416A49028j8024O6551l896J8433P626q4622j048m841L4433j4861n3610j0680
6404H4489j3254K4621K4393k8888L5391n980j3913R272j8780o869K5599j4432
6392A01649L307J1393K8696j22m8786j1485l1960j3382R0700j2871j625J1151
6380A26665M2342j4949l1421K8588Q3644K4371R548K0373k7121o2205K0518L0420
6368B50773J7436k6151j7956r174j0690O760O2433M5917l9302k9120l9610n1600
6356A59716k3194k5449r760K2997q348j3028K358J0355q048l2631L3706J0619
$$ plain form
6440 14320 46466 109873 124788 109998 121850 72037 103045 123799 129445 145785 131035 139030
6428 139030 142570 181851 213885 238269 215445 139526 123563 94046 128569 172888 161273 149028
6416 149028 131004 197555 193659 212092 219718 135096 134048 129207 163640 148779 95169 84489
6404 84489 71235 95856 120249 91361 126752 120772 106859 116131 97351 90482 116081 101649
6392 101649 104956 116349 145045 144923 96137 84652 52692 39310 130010 117139 115514 126665
6380 126665 169007 154058 122637 151225 234869 259240 268788 289161 262040 199835 220353 250773
6368 250773 268209 242058 224102 214928 204238 210998 273431 319348 280046 250926 211316 159716
6356 159716 136522 111073 101313 124310 115962 102934 105292 115647 107599 74968 108674 119293
6344A19293L1101q814L977n03j6281n963k9254M0074m653k2123l2567Q0207m05
6331A54089q253n616j5471J507J7814k6579L5947k067l246j7108L5392q045K2873
6318A81237L2749j478K5631j8512K1423k4765N870o425Q087k9781n8788L9718
6306A74966n1413L0938l1146j5219j3125K0116J9118K3495p788l3475j5653J1492
6294A12306r015J6838j6825K2370k5219l952K1089R348K5270j552K4235j7473
6282A57420L1m1778L7131r352K1192j9395k1069M255L6268J7699k5582k598j6485
6269A37737Q652O9689M943l0722P893K6521L5638k0923k7532l2117J9506O026
6257B05311J7314L455k0780p584j3944K5999N4740l4315q448K0133p566J9488
$$ plain form
6344 119293 150394 141580 145557 145054 128773 122810 93556 133630 128977 106854 74287 154494 154089
6331 154089 145836 140220 124749 126256 144070 117491 153438 151371 148125 131017 166409 158364 181237
6318 181237 213986 212508 238139 219627 241050 216285 222155 215730 223817 194036 135248 174966
6306 174966 123553 154491 123345 108126 95001 115117 134235 157730 149942 116467 100814 112306
6294 112306 103291 120129 103304 125674 100455 96503 117592 126940 152210 150658 174893 157420
6282 157420 157451 115673 152804 143452 164644 145249 124180 128435 164703 182402 156820 154222 137737
6269 137737 146389 216078 221021 190299 198192 224713 260351 239428 211896 179779 199285 205311
6257 205311 222625 226080 205300 197716 183772 209771 264511 230196 221748 241881 234315 253803
6245B53803N362l650r090N9931k7399l4334K6332M5831J554k9960J4491J1961
6233C14832l6867q669J4918L9905j5687k6795M1222M9685J5771L5471l7315j0715
6221C75756n897N0901k2005M362l4458j8123K2859J7411m5858L379J14002k6999
6209D35330N037K5215M1112k0316j7915O08j0521M180K0198R9202K2348l6830
6197E67648n346M9157k2175K426P2850k7741J98M4557j5500K1717m3547k027J8539
6184F60756J5418M5248o7362N4884K2515n149N7841M1958j945K0965M2701O0882
6172I48712N497O0125J8836n039k2284J7472P8617M1693O045J3763Q9370K2097
6160A274904J5857K3860l16k8198L2543N9703M3543j5584K8826N5095N8873M1797
$$ plain form
6245 253803 259165 255515 246425 306356 278957 244623 270955 316786 318340 288380 302871 314832
6233 314832 277965 269296 284214 324119 308432 281637 322859 372544 388315 423786 386471 375756
6221 375756 369859 420760 398755 403117 368659 350536 373395 390806 344948 348327 462329 435330
6209 435330 440367 465582 506694 486378 468463 469071 458550 462730 482928 582130 604478 567648
6197 567648 562302 611459 589284 591710 664560 636819 637017 681574 666074 687791 644244 642217 660756
6184 660756 676174 721422 654060 708944 731459 726310 784151 826109 824164 845129 887830 948712
6172 948712 954209 1014334 1033170 1028131 1005847 1023319 1101936 1143629 1149674 1163437 1252807 1274904
6160 1274904 1290761 1314621 1314305 1286107 1318650 1378353 1421896 1406312 1435138 1490233 1549106 1590903
6148A590903L0108N5104L3968Q5500K6471N9497Q8383N7049M9296O3128M2824
6137B182231P7986Q1309R9777P3047O5815R9492Q2979O3135O8308J08967O2032
6126C065078J45776J40050J31014J16575J38333J94494J50324J57724J15823J65101
6116D520292K35764L19661K83403K81022L27227L76432M37450M79054O34828O91733
6106H586866P61016Q24760J057296J318202J596934J967407K504543L144504L331855
6097B5093383K762939J152628r74690k396484k493480j762271q97552j21106N64494
6088B0927861J377603K177170K474343J956893K16891j963593l444046l589830
6080B0133292k839933k156875j704373j223775j008076q35741o02726m33717k78934
$$ plain form
6148 1590903 1621011 1676115 1710083 1795583 1822054 1881551 1969934 2026983 2076279 2139407 2182231
6137 2182231 2260217 2341526 2441303 2514350 2580165 2679657 2762636 2825771 2894079 3003046 3065078
6126 3065078 3210854 3350904 3481918 3598493 3736826 3931320 4081644 4239368 4355191 4520292
6116 4520292 4756056 5075717 5359120 5640142 5967369 6343801 6781251 7260305 7895133 8586866
6106 8586866 9347882 10172642 11229938 12548140 14145074 16112481 18617024 21761528 25093383
6097 25093383 27856322 29008950 28034260 25637776 23144296 21382025 20484473 20363367 20927861
6088 20927861 22305464 24482634 26956977 28913870 29130761 27167168 23723122 20133292
6080 20133292 17293359 15136484 13432111 12208336 11200260 10364519 9761793 9328076 9049142
6071I049142k43356j47325j25884m8832O8377M2603K9956J02173J27886K54872
6061I109612K71672K81667M13126N21702O26008P14241Q81420J063227J258368
6052A5141043J526561J775626K186380K781947L607610M208825L993383K626386
6044C7847761l0704k483620l523660l011003j881076q71800J00615J105620K238001
6035B9490134K949610K807944J415366j271685l867704m982523m409172l443163
6027A8688807k643747k024781j627685j351197j070201p95842p39455n96165m40565
6018G399169l78184l50964l57137l17938k47966l05783k61441k24033k34129k29225
6008D492369k24558j65459j28223r7197j01189r4696q8545r0441l7614j38789
$$ plain form
6071 9049142 8805786 8658461 8532577 8483745 8552122 8594725 8624681 8726854 8854740 9109612
6061 9109612 9381284 9662951 10076077 10597779 11223787 11938028 12819448 13882675 15141043
6052 15141043 16667604 18443230 20629610 23411557 27019167 31227992 35221375 37847761
6044 37847761 37817057 35333437 31809777 28798774 26917698 26045898 26146513 27252133 29490134
6035 29490134 32439744 35247688 36663054 35391369 31523665 26541142 22131970 18688807
6027 18688807 16045060 14020279 12392594 11041397 9971196 9175354 8435899 7839734 7399169
6018 7399169 7020985 6670021 6312884 5994946 5746980 5441197 5179756 4955723 4721594 4492369
6008 4492369 4267811 4102352 3974129 3876932 3775743 3681047 3592502 3502061 3464447 3325658
5998C325658j43324q2194q6487k7726q5988j03942o6515r6677j6821o6672r610
5987B539702j9455K2284L3903q870q6211r8076m3143m1472K7706o3368q8932m2505
5975B131563l2392n0501M323l2969j00647m5805R427k7384o634Q535L0990L0121
5963A918627K4752j8756J4019n6868p1682M7212k0444J9437L5883N9173O9607
5952B020960N9632L1721J805o7606K392M8044j661k5991l2980j24096p4407k7824
5940A809989m8212L9075Q858m255O9343r099K0068O7046O7207R8085M3183r220
5928B152068M6814N1068j1620P2017J06066J57999J84256J95492J55777N5653
5918C165590j4565m6371j92408j37843q7439q5870q2233l6520q8740m6498M339
$$ plain form
5998 3325658 3182334 3100140 3013653 2985927 2899939 2795997 2729482 2632805 2615984 2549312 2539702
5987 2539702 2520247 2542531 2576434 2567564 2481353 2383277 2340134 2298662 2326368 2263000 2174068 2131563
5975 2131563 2099171 2048670 2052993 2020024 1919377 1873572 1882999 1855615 1848981 1857516 1888506 1918627
5963 1918627 1943379 1924623 1938642 1881774 1810092 1857304 1836860 1856297 1892180 1951353 2020960
5952 2020960 2080592 2112313 2114118 2046512 2048904 2096948 2095287 2069296 2036316 1912220 1837813 1809989
5940 1809989 1761777 1800852 1809710 1805455 1874798 1865699 1885767 1952813 2020020 2118105 2161288 2152068
5928 2152068 2198882 2249950 2238330 2310347 2416413 2574412 2758668 2954160 3109937 3165590
5918 3165590 3151025 3104654 2912246 2774403 2686964 2601094 2518861 2482341 2393601 2347103 2351442
5907B351442k874O3155R1718R4126J61332J25572K22638K39115L76062L43962
5897D066248J95202P7426j46076l06411l51881l20459k39893j60317p8756j2676
5887B722407l0383k4832l1404l8227l513J8806K6015P9043M8619J13249J16961
5876B996741J56193J71577K03311K36807K77483L74057M27188M98213P07508Q72958
5866F922036R87221Q41556M14857l98771j004625j094287r27548p06037n59207
5857D475195m30562l14702k33311j01738n8617p2560r4445k7219L002N8416O1575
5846C265034n720J10454J16010J48191J96716J92677K88266L41108M41285N46850
5836E640871O50679Q44178R56214P53463M18194l90091j089799j128683r92739
$$ plain form
5907 2351442 2348568 2411723 2503441 2597567 2758899 2884471 3107109 3346224 3722286 4066248
5897 4066248 4261450 4338876 4192800 3886389 3534508 3214049 2974156 2813839 2735083 2722407
5887 2722407 2692024 2667192 2635788 2597561 2594048 2612854 2638869 2717912 2766531 2879780 2996741
5876 2996741 3152934 3324511 3527822 3764629 4042112 4416169 4843357 5341570 6049078 6922036
5866 6922036 7909257 8750813 9165670 8766899 7762274 6667987 5740439 5034402 4475195
5857 4475195 4044633 3729931 3496620 3394882 3336265 3263705 3169260 3142041 3145043 3203459 3265034
5846 3265034 3259314 3369768 3485778 3633969 3830685 4023362 4311628 4652736 5094021 5640871
5836 5640871 6291550 7135728 8091942 8845405 9263599 8873508 7783709 6655026 5662287
5827E662287o81970m92066l99618l40850k09613j86740j11770r3150r7094j4689
5817C034727o8505k1491J4693M6086J17750K2897J5056N8111L1043P2947J14848
5806C438162J36041K57402K57788L40905L71433K63375J14778j26625l63092m12272
5796D277895k86457k68064j71270j36197p1205q9184m0064N4843k1734j2055O8446
5785C304954L2062P8405N8053L7962P6150P4045N5676J06590J16728P7348J19298
5774D137271N8559J35021J42008J73071K20981J83724J62348K01287J96841L09128
5764E920239L32387L88168M15579M71988N10243O64740P55385P95764J014360
5755A1268853J205742J402517J641631K114794K731985L479217L834992L252791
$$ plain form
5827 5662287 4980317 4488251 4088633 3747783 3538170 3351430 3239660 3146510 3049416 3034727
5817 3034727 2966222 2944731 2959424 3005510 3123260 3146157 3161213 3219324 3250367 3323314 3438162
5806 3438162 3574203 3831605 4089393 4430298 4801731 5065106 5179884 5053259 4690167 4277895
5796 4277895 3991438 3723374 3552104 3415907 3344702 3255518 3215454 3270297 3248563 3236508 3304954
5785 3304954 3337016 3415421 3473474 3511436 3587586 3661631 3717307 3823897 3940625 4017973 4137271
5774 4137271 4195830 4330851 4472859 4645930 4866911 5050635 5212983 5414270 5611111 5920239
5764 5920239 6252626 6640794 7056373 7528361 8038604 8703344 9458729 10254493 11268853
5755 11268853 12474595 13877112 15518743 17633537 20365522 23844739 27679731 30932522
5747C0932522J545556j029208l332508m092683l610280k708228k029240j467892
5739A4208039j078452p63808m48403k94764j01251O3204J91071L72171M95898
5730A2643705O66939Q60871J095754J262632J583614K026726K683155L485736
5722B6309132L967602L557397J819554r39562l453542m505645m041413l135071
5714A9578452k383933j781374j279176r17392o54426m17668k01771m2544J32282
5705A2032450L61858M54760P00991Q96594J122847J530836K094323K595123K525669
5696B4315451J666033J33957j833123l051424l038528k466197j886328j376232
5688A2463609j055845p16038n87394m12144k75950q5027K9592J40141K03695L80175
$$ plain form
5747 30932522 32478078 31448870 28116362 24023679 20413399 17705171 15675931 14208039
5739 14208039 13129587 12365779 11917376 11622612 11521361 11584565 11775636 12147807 12643705
5730 12643705 13310644 14171515 15267269 16529901 18113515 20140241 22823396 26309132
5722 26309132 30276734 33834131 35653685 34714123 31260581 26754936 22713523 19578452
5714 19578452 17194519 15413145 14133969 13216577 12562151 12144483 11942712 11900168 12032450
5705 12032450 12394308 12849068 13550059 14446653 15569500 17100336 19194659 21789782 24315451
5696 24315451 25981484 26115441 24282318 21230894 18192366 15726169 13839841 12463609
5688 12463609 11407764 10691726 10104332 9692188 9416238 9331211 9360803 9500944 9704639 10084814
5678A0084814N14137O13409Q04205J047855J223978J639012K267071K837767K865211
5669B3897459K059520L57592j890622l389457l566900k969241k311472j738412
5661A0448467j324778r98178q41401o83729n19997m50411m31327k89697k89538
5652D619411j91079j73880j08760j80610k15476j84778j35699j36707j07435j67104
5642C017883j67581j05850n0807o9506r7410q3850n7955l5482r8535j19031j00223
5631B031653n1822p0407j4714n6465K790N011p6884n5205p0362n667p3569j1182
5619A553177m1111n5570j3940J7526j8863l7983p699k968n9744p1584J2478j158
5607A272561r0887r218L972l0380P803l8370q56K4846l3205l3887n5333l700j3516
$$ plain form
5678 10084814 10598951 11212360 12016565 13064420 14288398 15927410 18194481 21032248 23897459
5669 23897459 25956979 26314571 24423949 21034492 17467592 14498351 12186879 10448467
5661 10448467 9123689 8125511 7284110 6600381 6080384 5629973 5198646 4908949 4619411
5652 4619411 4428332 4254452 4145692 3965082 3749606 3564828 3429129 3292422 3184987 3017883
5642 3017883 2850302 2744452 2693645 2624139 2526729 2442879 2384924 2349442 2250907 2131876 2031653
5631 2031653 1979831 1909424 1894710 1838245 1841035 1846046 1769162 1713957 1643595 1637928 1564359 1553177
5619 1553177 1512066 1456496 1442556 1460082 1441219 1403236 1395537 1392569 1332825 1261241 1273719 1272561
5607 1272561 1181674 1172456 1176428 1146048 1153851 1115481 1114625 1139471 1106266 1072379 1017046 1013346 999830
5594I99830l2426m599k2863K2095l5751j0523k1999J0124J6902j9916k6693k3504
5582H50677o3138L5342j769m516l1156n7576k2337N959N4474j1943J1105M1798
5570H06920j8766K317L1704L8646J5623K0376J6015J3931R409k9888q019m3327
5558H54941k131L4178n245j737M0298k8970j8135k3621k2873K228L3961M3673
5546I06567j4441j375R101K9924P932L4938n0486q460J8584K9121L4105Q7799
5534A083309k2267j820J1780m4079N460n8771k4340R049j4156m3701J3724J3858
5522I28046M678n830j4728O4029J5991k503L4956M4766n7790k0462L9506R785
5510A040444o369k5339j6039L165J9355o4173K7452K682K5836N5767k760k8253
$$ plain form
5594 999830 967404 962805 939942 962037 926286 915763 893764 903888 920790 900874 874181 850677
5582 850677 787539 822881 821112 816596 785440 727864 705527 711486 765960 754017 765122 806920
5570 806920 788154 790471 822175 860821 876444 896820 912835 926766 936175 906287 898268 854941
5558 854941 852810 886988 881743 880006 920304 891334 873199 849578 826705 828933 862894 906567
5546 906567 892126 890751 899852 929776 937708 972646 922160 913700 932284 961405 995510 1083309
5534 1083309 1061042 1059222 1071002 1026923 1032383 973612 949272 958321 944165 900464 914188 928046
5522 928046 932724 926894 912166 976195 992186 989683 1024639 1069405 1011615 991153 1030659 1040444
5510 1040444 1034075 1008736 992697 995862 1015217 951044 978496 981178 1007014 1062781 1060021 1031768
5498A031768M7891L6052o675J4283P383j9427R248J7599j353q363J7359M9236
5486A195001j8424J4896N1218r788M7913L9533j5382O3397Q3590p645J5447J14356
5474A574112K1717Q5537P0145O6011l401K8945N7880P883M605j7692M8767L6832
5462A981341K4383O2103K9171n6504J26818K0385l296O1757L0768K8069l5318
5451B269677k317j4340n8566l6029m51m249j3789l0048n367j0410L5943O5997
5439B196051j2987K5133k91n201K7662k3415l815m5514k2553n2680j05513k6977
5427A949900p5650o2321p8644l4560j1965l0209J5519n3604o4329j6617M4042
5416A581562N4803J3789N167q330l4833k0843p366p265k7522J4308q755L665K4439
$$ plain form
5498 1031768 1079659 1115711 1109036 1123319 1130702 1111275 1120523 1138122 1136769 1128406 1145765 1195001
5486 1195001 1176577 1191473 1242691 1232903 1280816 1320349 1304967 1368364 1451954 1444309 1459756 1574112
5474 1574112 1595829 1681366 1751511 1817522 1814121 1843066 1900946 1908829 1913434 1895742 1944509 1981341
5462 1981341 2005724 2067827 2096998 2040494 2167312 2187697 2184401 2246158 2276926 2304995 2269677
5451 2269677 2267360 2253020 2194454 2158425 2157974 2153725 2139936 2109888 2104521 2094111 2130054 2196051
5439 2196051 2183064 2208197 2207906 2202705 2230367 2206952 2203137 2157623 2135070 2082390 1976877 1949900
5427 1949900 1874250 1811929 1733285 1698725 1686760 1656551 1672070 1618466 1554137 1537520 1581562
5416 1581562 1636365 1650154 1655321 1646991 1612158 1591315 1583949 1576684 1549162 1563470 1554715 1558380 1582819
5403A582819q1721K0042n2993k1865P058J3844M0633N1587P6587J1617R0580J11186
5391A849374J62110J40301J19889J66836J17218M7496j3076p4151j02005q6920
5381B327072j76492j26954p3658j44614p9234k1965R339k5261J0876r069R8854
5370A788894O7675J765K7183n0218l9701l7109n9001o1346o2163q0244o1345j7723
5358A416667m7043o0891n6215q6412o9984r6669j7813J7350l0466p9373l0352
5347H58799J9461q77l2934K4073J14534j8500k6178k1703l198n5352o638M4352
5335H95839K528J775n0472M9396J6146q4624k7584k0342M6404j6643L9240M0970
5323H92633M169l0898N455L8822j9223L7598R789r0275l3056J1780K3566O6627
$$ plain form
5403 1582819 1501098 1521140 1468147 1446282 1453340 1467184 1507817 1559404 1635991 1647608 1738188 1849374
5391 1849374 2011484 2151785 2271674 2438510 2555728 2603224 2590148 2515997 2413992 2327072
5381 2327072 2150580 2023626 1949968 1805354 1726120 1704155 1713494 1688233 1699109 1690040 1788894
5370 1788894 1856569 1858334 1885517 1835299 1795598 1758489 1699488 1638142 1575979 1495735 1434390 1416667
5358 1416667 1369624 1308733 1252518 1166106 1096122 999453 981640 998990 968524 889151 858799
5347 858799 878260 877383 844449 868522 983056 964556 938378 916675 913477 858125 851487 895839
5335 895839 898367 900142 849670 899066 915212 830588 803004 782662 829066 812423 851663 892633
5323 892633 896802 865904 871359 910181 890958 928556 938345 848070 815014 826794 850360 916987
5311I16987j199J6442J299n0428K4393Q831l1977K6671n152J8205p8295M5534
5299H91311O9338J0882q052O296K8224L4542Q1496M3206R300M7502J2314N4464
5287A280823K9294n4653o170J2459j1033K2978o9615o3887O0611j3483j3558K1385
5275A195151k4206P0629J8292k4553l455N0873L9104P2304R4764M0667r535L7173
5263A557208M1311N7121M5800m0229J7131k8221n3448j6873J5656j09740n5059
5252A430657j5764J4542N0746O5609O8278P879Q255R260P8607O7466P639R6926
5240A890100N1431J01940Q3550L9337J2802k7735j7516K085l5435m4314l7577
5229B018668O595k3773K909n4621L1456N6806K133j1821M8411M3469K3613P3441
$$ plain form
5311 916987 915788 932230 933529 883101 907494 916325 884348 911019 905867 924072 845777 891311
5299 891311 960649 971531 963479 969775 997999 1032541 1114037 1157243 1166543 1214045 1226359 1280823
5287 1280823 1310117 1255464 1249294 1261753 1250720 1273698 1204083 1140196 1200807 1187324 1173766 1195151
5275 1195151 1170945 1241574 1259866 1235313 1231858 1282731 1321835 1394139 1488903 1529570 1520035 1557208
5263 1557208 1598519 1655640 1701440 1661211 1678342 1650121 1596673 1579800 1595456 1485716 1430657
5252 1430657 1414893 1429435 1480181 1545790 1614068 1621947 1630202 1639462 1718069 1785535 1793174 1890100
5240 1890100 1941531 2043471 2127021 2166358 2179160 2151425 2133909 2135994 2100559 2056245 2018668
5229 2018668 2025263 2001490 2004399 1949778 1981234 2038040 2040173 2028352 2076763 2120232 2143845 2217286
5217B217286P3345N3128M9549O4042O9053J07347M2365o806o995m5019J8555L2949
5205B668799j7661K5987P2675M7441N8201R5057P7050M2852R0953O5481O3221
5194C290056J24569N5847J26891J11324J10818Q7005J70176J14870O5401J41355
5184D398312J17835J64603J91160J34939K31640K93200K56970K24029L19925L52652
5174F685265M26794M75035N12836O15339P69895R81060J150287J123790R46573
5165A3686874M73756q9813k51013j22693J64966N43454Q11062J127958J641887
5156A7986438J990575J971150J557494N38521o14535p34311k36679L56837O61947
5147B3477437Q16345N94118K59443M90282Q16918J037123R38492O63719P40622
$$ plain form
5217 2217286 2290631 2343759 2393308 2457350 2526403 2633750 2676115 2669309 2662314 2617295 2635850 2668799
5205 2668799 2651138 2677125 2749800 2797241 2855442 2950499 3027549 3070401 3161354 3226835 3290056
5194 3290056 3414625 3470472 3597363 3708687 3819505 3906510 4076686 4191556 4256957 4398312
5184 4398312 4516147 4680750 4871910 5006849 5238489 5531689 5788659 6012688 6332613 6685265
5174 6685265 7112059 7587094 8099930 8715269 9485164 10466224 11616511 12740301 13686874
5165 13686874 14160630 14070817 13819804 13697111 13862077 14405531 15216593 16344551 17986438
5156 17986438 19977013 21948163 23505657 24044178 23429643 22695332 22458653 22815490 23477437
5147 23477437 24293782 24887900 25147343 25637625 26454543 27491666 28430158 29093877 29834499
5138B9834499R86019R22185P93463N09389l02895j339443j193499m15706O65466
5129C0459478J590395K060207K041069J440290K78511n45802q80158j302792j820949
5120C3320249j826466j728771j773612j379324p87312n21938o12619o99520m59992
5111B3530695K44822Q25028R11569N60349l01467j494666j698671j384670j023598
5102B0169391q28180p12151o16008l61446k03295l32793m80898r47975j471876
5093A4214769j564570j374264j136474q64722p30093o37842m88244m81445l95112
5084F542003l73098l19412k60995k23021k56935j81759j93095j87832p7911j51909
5074D316036j71617q6688r1462o4467q7477j22120j23064k5270l6866j23793j04239
$$ plain form
5138 29834499 30820518 31742703 32536166 33045555 32742660 31403217 30209718 29794012 30459478
5129 30459478 32049873 34110080 36151149 37591439 37869950 37324148 36443990 35141198 33320249
5120 33320249 31493783 29765012 27991400 26612076 25824764 25302826 24690207 23990687 23530695
5111 23530695 23775517 24600545 25512114 26072463 25770996 24276330 22577659 21192989 20169391
5102 20169391 19341211 18629060 18013052 17651606 17448311 17115518 16634620 15686645 14214769
5093 14214769 12650199 11275935 10139461 9274739 8544646 7906804 7418560 6937115 6542003
5084 6542003 6168905 5849493 5588498 5365477 5108542 4926783 4733688 4545856 4467945 4316036
5074 4316036 4144419 4057731 3966269 3901802 3814325 3692205 3569141 3543871 3507005 3383212 3278973
5063C278973j08947n9597r8905p9298m2767n1422k4098q0470p0269p2834n7308
5052B533058l7458N445j2531K2993m3356q4853L6353M302j3159l01j1587m6375
5040B352531j021m1096q9302k9638r7745n5334M959o7540j11786l1277l8338l3606
5028A760807l6239m9528n8786o4845m2913k6902L901m3823j4524o7232q1531O114
5016A284499P634j3337P40l8864l8016k7095r221o1624J0975J7243l6669n8169
5004A038096L2742k2759K0204J0350n6351l4974o4723j653m0909L2738l0532J7976
4992I00205L1684m5629n416j01187M4895L9211q468L7929j8043k4916m0785K5350
4980H34830R373p440j157j5622j1145m5072L2659Q8788K6261q6050K3881M6244
$$ plain form
5063 3278973 3170026 3110429 3011524 2932226 2889459 2838037 2813939 2733469 2663200 2590366 2533058
5052 2533058 2495600 2501045 2488514 2511507 2468151 2383298 2419651 2423953 2410794 2410493 2398906 2352531
5040 2352531 2351510 2310414 2221112 2191474 2093729 2038395 2043354 1975814 1864028 1832751 1794413 1760807
5028 1760807 1724568 1675040 1616254 1551409 1508496 1481594 1485495 1441672 1427148 1359916 1278385 1284499
5016 1284499 1292133 1278796 1279536 1240672 1202656 1175561 1166340 1104716 1115691 1132934 1096265 1038096
5004 1038096 1070838 1048079 1068283 1078633 1022282 987308 922585 920932 880023 912761 882229 900205
4992 900205 931889 886260 880844 779657 824552 863763 855295 893224 875181 850265 809480 834830
4980 834830 844203 836763 835606 819984 808839 763767 796426 885214 911475 825425 849306 895550
4968H95550p0400J869q688n8023k0760J9564J0795N4220P5160M2433M8365l0731
4956I59354n9687K3509m2952k7880k1922j6578L380j5189l8185J591O242n1991
4944G19692l8471J7852M8231L4240j9889k811L5779j126L4726M113k9383k5653
4932G77300J8242k4593J6962j0235J0293j323O8218J67J3419J6849R001R130k2520
4919H80910Q979k0809k5996r9429o7772L4891l7595M903L6274j3103k9156N3166
4907G25263J08496l6238j4500j4836l2284K655O0264K2914m7452j6232r209L5507
4895G84348K9020l322N560j1793O0631j2373m5770p434O4462K051k1031N3041
4883H97390K2014k836L4921m378o7389k0253j1057O127j8316j3942L4544M29k5335
$$ plain form
4968 895550 825150 827019 818331 760308 739548 759112 769907 824127 899287 941720 990085 959354
4956 959354 899667 923176 880224 852344 830422 813844 817224 802035 763850 765441 771683 719692
4944 719692 681221 699073 747304 781544 761655 758844 794623 793497 828223 832336 802953 777300
4932 777300 795542 770949 787911 777676 787969 786646 854864 855031 868450 885299 894300 903430 880910
4919 880910 889889 869080 843084 743655 675883 710774 673179 678082 714356 701253 672097 725263
4907 725263 833759 797521 783021 768185 735901 738556 798820 821734 774282 758050 748841 784348
4895 784348 813368 810046 815606 803813 864444 852071 806301 798867 863329 865380 844349 897390
4883 897390 919404 916568 951489 947111 879722 859469 848412 854539 836223 822281 856825 857254 831919
4870H31919J3914j8229K9348N8443L201q87r469l0199M0013M155n9909J6254J5482
4857H94036o97p8364J2933O523L9143m507l0872J1507M4415N021k9583K3793N6977
4844I50325l070k067K4430K957J9183J8703j8729K0969L6188J8013J1970M8041
4832A126913J7896j4152q649N3366N4438M9369M1920N2838J216K8746L85Q9279
4820A493565M9493j0445P3298K7958O0278J4086n539k0260M6409J4274L5422Q7210
4808A865749M5984L2382O2616K1686O7443O6694O7774R0229R7210N4514P7071
4797B549352M0211M5601M1367K544K4299R9619L1616P9666J44558R2411R8572
4786C249816R2112J05623R7893R0041J14214J28680J12839R5638J07967R7934
$$ plain form
4870 831919 845833 827604 856952 915395 918596 917709 908240 878041 918054 922209 862300 878554 894036
4857 894036 893339 814975 827908 834431 873574 869067 838195 849702 894117 899138 869555 893348 950325
4844 950325 947255 945188 969618 972575 991758 1010461 991732 1012701 1048889 1066902 1078872 1126913
4832 1126913 1144809 1130657 1122008 1175374 1229812 1279181 1321101 1373939 1375155 1403901 1404286 1493565
4820 1493565 1543058 1532613 1605911 1633869 1694147 1708233 1702694 1682434 1728843 1743117 1778539 1865749
4808 1865749 1911733 1944115 2006731 2028417 2095860 2162554 2230328 2320557 2417767 2472281 2549352
4797 2549352 2589563 2635164 2676531 2679075 2703374 2802993 2834609 2914275 3058833 3151244 3249816
4786 3249816 3341928 3447551 3545444 3635485 3749699 3878379 3991218 4086856 4194823 4292757
4776D292757J19067R9757J55501J80566J42513J81490K13211K18424L06111L07864
4766F217261L23086M09614L94827M54484M83172N91121P06239P76495Q91063J136680
4756A2384042J270978J524625J868991K463132L251602L744742L300012J961886
4748C1770010n31819k986555l436786k699719j801397j058498o04149j48275L26890
4739A8829702P24571J097836J473299J963027K541054L338543M383119N214423
4731C9565574N386552N022736L168537M63167j698111m352138o458357o235527
4723C4862433n024997l750550k716537j837100j218650o96588k32314J34604N09064
4714B0029365R57919J452199K283240L231496L628740K876925J039420k120842
$$ plain form
4776 4292757 4411824 4511581 4667082 4847648 4990161 5171651 5384862 5603286 5909397 6217261
4766 6217261 6540347 6949961 7344788 7799272 8282444 8873565 9579804 10356299 11247362 12384042
4756 12384042 13655020 15179645 17048636 19511768 22763370 26508112 29808124 31770010
4748 31770010 31238191 28251636 24814850 22115131 20313734 19255236 18651087 18502812 18829702
4739 18829702 19554273 20652109 22125408 24088435 26629489 29968032 34351151 39565574
4731 39565574 44952126 49974862 53143399 53606566 51908455 47556317 41097960 34862433
4723 34862433 29837436 26086886 23370349 21533249 20314599 19618011 19385697 19520301 20029365
4714 20029365 20987284 22439483 24722723 27954219 31582959 34459884 35499304 33378462
4706C3378462m583193m757295l927659k976724k347756j781379j373170j093850
4698A0537436r53186p55821n68520m76805l88105m00482l31016k21842k01420
4689F240239j94600k29290k41573k54037j29287j91176j41114j52679j50856r3921
4679D461706j38983j13419j15708j10002n3846j24939n9249R682p4819o4653K0172
4668C635942r3416n2224p3113r9765p6927p6024l0454m1551k6836l7022p4057
4657B954553j1588L0033l4624K3517k4726J1161n1737j1652k9554M3457K1561
4646B920401m0237j3532J3596n5050l0592q197M8595L017l1203J8714L070K0778
4634B849360J6213L9365O2228J05813l789M2472O6644Q1882O4825J781J8506K9704
$$ plain form
4706 33378462 28795269 24037974 20110315 17133591 14785835 13004456 11631286 10537436
4698 10537436 9584250 8828429 8259909 7783104 7394999 6994517 6663501 6441659 6240239
4689 6240239 6045639 5816349 5574776 5320739 5191452 5000276 4859162 4706483 4555627 4461706
4679 4461706 4322723 4209304 4093596 3983594 3929748 3804809 3745560 3755242 3680423 3615770 3635942
4668 3635942 3542526 3490302 3417189 3317424 3240497 3164473 3134019 3092468 3065632 3028610 2954553
4657 2954553 2942965 2972998 2938374 2961891 2937165 2948326 2896589 2884937 2855383 2898840 2920401
4646 2920401 2880164 2866632 2880228 2825178 2794586 2786389 2834984 2838001 2806798 2825512 2828582 2849360
4634 2849360 2865573 2904938 2967166 3072979 3069190 3111662 3178306 3260188 3325013 3326794 3345300 3375004
4622C375004j1617N0365N3298N0414N8651Q9175Q4162J30663J16131J51226Q0485
4611D227957J25697J16859R0984M7700P2237J46790J02659J54286R1487J83873
4601E360529J92401J82439K17620K50028K74410K86985K74737L64732L71191L84556
4591H159628M41475M59013N26701N91887P32875Q53588R19138J089200J265225
4582A5038730J586035J962278K401630K970480L740610M413296M299445L050249
4574C9462753O77915j910378l272113k949220j832142p47957K60907J403264K556294
4565C3649323L386410L270626J985661k70972k577261l519626k890832j705527
4557C1327802l14201R43723J786826J999900J078066p15604k481366l285462k849665
$$ plain form
4622 3375004 3363387 3413752 3467050 3517464 3576115 3665290 3749452 3880115 3996246 4147472 4227957
4611 4227957 4353654 4470513 4561497 4609197 4681434 4828224 4930883 5085169 5176656 5360529
4601 5360529 5552930 5735369 5952989 6203017 6477427 6764412 7039149 7403881 7775072 8159628
4591 8159628 8601103 9060116 9586817 10178704 10911579 11765167 12684305 13773505 15038730
4582 15038730 16624765 18587043 20988673 23959153 27699763 32113059 36412504 39462753
4574 39462753 40140668 38230290 34958177 32008957 30176815 29428858 29689765 31093029 33649323
4565 33649323 37035733 40306359 42292020 42021048 39443787 35924161 33033329 31327802
4557 31327802 31013601 31957324 33744150 35744050 36822116 36106512 33625146 30339684 27490019
4548B7490019j976252j048282j95946O56324J487792J908406J772855O60526j359959
4539B9395483l098064l768939l440132k664643k087654j630845j230852j005499
4531A0468855q52818p43392n95854n32714m04890l80652k89128k42269k12422
4522F214716j85417k11526j54824j37851j56746j49281j05202j40492k12294k16463
4512D544620j62962j32704j74466j71926j19737j27141r1315p6031q1883r3684
4502C312771o9797j36702n9045l5391j02621n5315l3670K2951m9239k8967N0622
4491B815597l3872l1699q9556n5910o543q6766r8608m4761n7067J3374N4l6K164
4478B326371q4969j61789j8417K7754l3916n0812K135n8847k2249l96K2737K6108
$$ plain form
4548 27490019 25513767 24465485 24269539 24925863 26413655 28322061 30094916 30755442 29395483
4539 29395483 26297419 22528480 19088348 16423705 14336051 12705206 11474354 10468855
4531 10468855 9616037 8872645 8276791 7744077 7339187 6958535 6669407 6427138 6214716
4522 6214716 6029299 5817773 5662949 5525098 5368352 5219071 5113869 4973377 4761083 4544620
4512 4544620 4381658 4248954 4074488 3902562 3782825 3655684 3564369 3488338 3406455 3312771
4502 3312771 3242974 3106272 3047227 3011836 2909215 2853900 2820230 2843181 2793942 2764975 2815597
4491 2815597 2781725 2750026 2660470 2604560 2598017 2511251 2412643 2367882 2310815 2324189 2324243 2324207 2326371
4478 2326371 2241402 2079613 2061196 2088950 2055034 2004222 2006357 1947510 1925261 1924865 1947602 1973710
4466A973710o3230n2838m7758l6542L3985K350K6723j0150j4202P7024J6776k7145
4454A878703q317K3172M8252P2025R3649J27342J29860J55865K31583K09207J32648
4443C093989j2834j05030k12358l06202k22048j62059j55930j07891n2628r016
4433A747993r7919o5909k2877K1216J1130r1263k1357J1682L46m3824l2632N1315
4421A467901K3748K1859O9304L7773K5382K7638J12113P9999J59196J57041J13951
4410B295905M2318o7471p3870K6591K8821n395k0041j42286j94323j20164j05572
4399A664513n9203l0275p8408j5246Q722L4531k9605K4450Q6453Q6019Q3153J18312
4387A893416J45696K16586K82294K35539J09647p8607j57866j81014j18549j01574
$$ plain form
4466 1973710 1910480 1857642 1809884 1773342 1807327 1809677 1836400 1826250 1812048 1889072 1905848 1878703
4454 1878703 1870386 1893558 1941810 2013835 2107484 2234826 2364686 2520551 2752134 2961341 3093989
4443 3093989 3081155 2976125 2763767 2457565 2235517 2073458 1917528 1809637 1757009 1747993
4433 1747993 1650074 1584165 1561288 1582504 1593634 1502371 1481014 1492696 1493042 1449218 1416586 1467901
4421 1467901 1491649 1513508 1582812 1620585 1645967 1673605 1785718 1865717 2024913 2181954 2295905
4410 2295905 2338223 2270752 2196882 2223473 2252294 2246899 2226858 2084572 1890249 1770085 1664513
4399 1664513 1605310 1575035 1496627 1481381 1490103 1524634 1495029 1519479 1605932 1691951 1775104 1893416
4387 1893416 2039112 2255698 2537992 2773531 2883178 2804571 2646705 2465691 2347142 2245568
4377B245568q3697J3674l3837L8743J34372R8121K27104L02301K17166L4199n4099
4366C139615k82546k52791k49148j83633j70474j31305q9225q2727m1777j3386
4356A642603m9596k5153m2682q1669N1468K9625M757K9150N0906O8997m533P027
4344A680900n0982o6616n8812J1059K4190r134l6122N6942K6319K9014N7843P9001
4332A743602J33551O8838K4257J4789j7690Q2426P4266N4687P1537J12615O7445
4321B430323J04013R9241J38507J91994J81816K34008K34237K05052J63421P5319
4311D057931O109L155k5368k2084p3407n673j00410j41640q1396o2522j72496
4300C382199j25950j96039j44287j10351r8899k7045P2345L290n4917j738O8042
$$ plain form
4377 2245568 2161871 2175545 2141708 2180451 2314823 2412944 2640048 2942349 3159515 3193714 3139615
4366 3139615 2857069 2604278 2355130 2171497 2001023 1869718 1780493 1697766 1655989 1642603
4356 1642603 1593007 1567854 1525172 1443503 1494971 1524596 1529353 1558503 1609409 1678406 1673873 1680900
4344 1680900 1629918 1563302 1504490 1515549 1539739 1530605 1494483 1551425 1577744 1606758 1664601 1743602
4332 1743602 1877153 1945991 1970248 1985037 1967347 2049773 2124039 2178726 2250263 2362878 2430323
4321 2430323 2534336 2633577 2772084 2964078 3145894 3379902 3614139 3819191 3982612 4057931
4311 4057931 4064040 4067195 4041827 4019743 3946336 3940663 3840253 3698613 3617217 3554695 3382199
4300 3382199 3256249 3060210 2915923 2805572 2706673 2679628 2751973 2755263 2700346 2698608 2766650
4289B766650J51518J52835J42962K28321K13782J88440J75288K1356p0320j48610
4279C822222k35050j64325j37337j16738o6225j0521m3400L6774M2461n2473l642
4268C071746J1806j3676J3900k6032j2612R0222M7117l584Q0942K8286Q4006R1247
4256C463368J21625J35338J93125K16167K16617K80393K68632J83233O3116m1421
4246E100193j24958j06320n2841O124N3434Q5996J06227J14960J90014J83855
4236E556684J84962J93455K33481O5158J53013J55615J72930J45588K28532K57795
4226G347213M05944L91208L10897J86947k0450p9186p1871N255R2115Q4613J61823
4215H814508J97130L21448K44985K73909K65045K95083K90391K98836K80116K24246
$$ plain form
4289 2766650 2918168 3071003 3213965 3442286 3656068 3844508 4019796 4041152 3970832 3822222
4279 3822222 3587172 3422847 3285510 3168772 3102547 3092026 3048626 3085400 3127861 3075388 3071746
4268 3071746 3083552 3069876 3083776 3057744 3045132 3135354 3182471 3178887 3259829 3288115 3372121 3463368
4256 3463368 3584993 3720331 3913456 4129623 4346240 4626633 4895265 5078498 5141614 5100193
4246 5100193 4975235 4868915 4816074 4822198 4875632 4961628 5067855 5182815 5372829 5556684
4236 5556684 5741646 5935101 6168582 6233740 6386753 6542368 6715298 6860886 7089418 7347213
4226 7347213 7753157 8144365 8455262 8642209 8621759 8542573 8470702 8475957 8568072 8652685 8814508
4215 8814508 9011638 9333086 9578071 9851980 10117025 10412108 10702499 11001335 11281451 11505697
4205A1505697K52193K30661K76151L60293M07707M41566M97410M81764N22317
4196A4975759N58158O14540O92320Q39786P55493O94187O19143O72169P06986
4187B1128541Q01241Q46591R69082J018589J176486J248472J400161J532049J719664
4178C1840876J850776J961631K138322K557145L075220L579234L993622M505869
4170E5502695N048479N865392O835380Q073064R430554J1332829J3515739J6254042
4162A31858174J9663565K5368309L3031281M1286149M3612035L5756888R884627
4155C40461028k0732587m4147387n1528465m3294597l3389624k4772407j8892498
4148A03703463j4301199j1305761q785940p193112n740894m779289l806638l285354
$$ plain form
4205 11505697 11757890 11988551 12264702 12624995 13032702 13474268 13971678 14453442 14975759
4196 14975759 15533917 16148457 16840777 17680563 18436056 19130243 19749386 20421555 21128541
4187 21128541 21929782 22776373 23745455 24764044 25940530 27189002 28589163 30121212 31840876
4178 31840876 33691652 35653283 37791605 40348750 43423970 47003204 50996826 55502695
4170 55502695 60551174 66416566 73251946 81325010 90755564 102088393 115604132 131858174
4162 131858174 151521739 176890048 209921329 251207478 294819513 330576401 340461028
4155 340461028 319728441 275581054 224052589 180757992 147368368 122595961 103703463
4148 103703463 89402264 78096503 69310563 62117451 56376557 51597268 47790630 44505276
4140D4505276k730088k426773k205305k141162k034424j896524j705850j587176
4132B7777974j350682j246756j151940j050743r19951r27743q88181r09524r07528
4123A8424926r46646q31424q09046n97583n93473l61717m23513m15411l96844
4114A3049269l86003l53610l32853l42927k81189l30306m43717l84740l50945
4105I842979l17345k18194k60250j97056k38467k06749k24228j32777j27956j11513
4095G808444j70541j52549j21520j29113j37610j54656j37467j54187j43662j05275
4085F401864j45651k19759k49360j32406j60925j74699j65469j61649j26422j47964
4075D717560j35014j89460j50487j16331j50884j28690j13646j29242q9514j27933
$$ plain form
4140 44505276 41775188 39348415 37143110 35001948 32967524 31071000 29365150 27777974
4132 27777974 26427292 25180536 24028596 22977853 22057902 21130159 20241978 19332454 18424926
4123 18424926 17478280 16646856 15837810 15240227 14646754 14285037 13861524 13446113 13049269
4114 13049269 12663266 12309656 11976803 11633876 11352687 11022381 10578664 10193924 9842979
4105 9842979 9525634 9307440 9047190 8850134 8611667 8404918 8180690 8047913 7919957 7808444
4095 7808444 7637903 7485354 7363834 7234721 7097111 6942455 6804988 6650801 6507139 6401864
4085 6401864 6256213 6036454 5787094 5654688 5493763 5319064 5153595 4991946 4865524 4717560
4075 4717560 4582546 4393086 4242599 4126268 3975384 3846694 3733048 3603806 3514292 3386359
4065C386359j15178m9232M467p524K845j8952p2661q118j2884k2029k2803j07625
4053B956665n6782j22961r5290o6242n1722n1960k2960o1979J7760o8456o7797
4042B308276m8968n5630j5156j0660n3665R752K1603j1853r821n0402R033N6941
4030B149450K347l6400o8447m1640j08375k4050J0671j7937J4693K4861l7376
4019A867797K9923m7504J4917p9219O834J1430o1342K4175k227j13087k3614J4709
4007A642792n2726n5882l8401K6669k384J7164J1065O706N1893J7157j6778j0671
3995A596604L407M9211L6529O1644j1519M7775N4553M3846O5778P5575M5425R3391
3983B162219K0350M9853K24121J63528J72601J80147K40730L11908K98613L00705
$$ plain form
4065 3386359 3271181 3221949 3226416 3218892 3221737 3202785 3130124 3122006 3109122 3087093 3064290 2956665
4053 2956665 2899883 2776922 2681632 2615390 2563668 2511708 2488748 2426769 2444529 2376073 2308276
4042 2308276 2259308 2203678 2188522 2177862 2124197 2133949 2155552 2143699 2133878 2083476 2092509 2149450
4030 2149450 2151797 2115397 2046950 2005310 1896935 1872885 1883556 1865619 1880312 1905173 1867797
4019 1867797 1897720 1850216 1865133 1785914 1792748 1804178 1742836 1767011 1764784 1651697 1628083 1642792
4007 1642792 1590066 1534184 1495783 1522452 1520068 1537232 1548297 1555003 1606896 1624053 1607275 1596604
3995 1596604 1600011 1649222 1685751 1747395 1735876 1783651 1838204 1882050 1947828 2023403 2068828 2162219
3983 2162219 2182569 2232422 2456543 2620071 2792672 2972819 3213549 3525457 3824070 4124775
3973D124775K72958K57427K11437J10827n747o1970j43675j99390j12766k10053
3963D243823j88933k21896k58203k52954k49460k51105k22136j39649j09425j02865
3953B247197j66412p4592r7019j29752p9815q9581q0227l4640j0067k7085r9946
3942A358061p0094J4742j1621m9936j04365q484k1732l9739j1430l2173m6572
3931I76657o7878J3224M496j9112J0545J8790r312J9066n2827L6182k1903k5941
3919H81987j2505m5855l5227L4093J9667n3749j657K6698q798j2121K522O313
3907H01368R487n8781K3393j3464k5878q012k9145k2390p089K6044n2955m126
3895F38452K2498N4529J033p0389N4406k720k1569Q040P208J6946k601J1515l5992
$$ plain form
3973 4124775 4397733 4655160 4866597 4977424 4971677 4909707 4766032 4566642 4453876 4243823
3963 4243823 4054890 3832994 3574791 3321837 3072377 2821272 2599136 2459487 2350062 2247197
3953 2247197 2080785 2006193 1909174 1779422 1699607 1610026 1529799 1495159 1485092 1458007 1358061
3942 1358061 1287967 1302709 1291088 1241152 1136787 1128303 1106571 1066832 1055402 1023229 976657
3931 976657 908779 922003 926499 907387 917932 936722 927410 946476 893649 929831 907928 881987
3919 881987 869482 823627 788400 822493 842160 788411 786754 813452 804654 792533 795055 801368
3907 801368 810855 752074 775467 762003 736125 728113 698968 676578 669489 695533 642578 638452
3895 638452 660950 715479 716512 646123 700529 697809 676240 684280 691488 708434 705833 717348 681356
3882F81356k1788L747J8930N4020K6333j2071N6936M3127Q6925J35520J61399
3871A234434N5356J17699J72237K60110K39000R8370l4077k04750k95863k55901
3861A386615j86892j98779j11800q1963j0362l0589r456o0855l4409J5103m6460
3850F30153k7922k4602l1312m2475n5575K1450L5775j8869n0566J5823J9248l9672
3838D31456k6626m485N09k4693r936l7088N3278k949n0249M9710P613J3003j5923
3825C83620o9850k3336K0499J6130R445M6828L0612n9773J9108m0272j7748L777
3813C19040o195N6583m2073o7139k248L3147K5768K3387k1085L476j3764k8673
3801B80224N095M508L5841o645N535j384j3739k723k7833k1586k4319L666J4940
$$ plain form
3882 681356 659568 663315 682245 736265 762598 750527 807463 850590 937515 1073035 1234434
3871 1234434 1289790 1407489 1579726 1839836 2078836 2177206 2143129 1938379 1642516 1386615
3861 1386615 1199723 1000944 889144 807181 796819 766230 756774 695919 661510 676613 630153
3850 630153 602231 577629 546317 503842 448267 469717 505492 486623 436057 451880 471128 431456
3838 431456 404830 400345 400854 376161 366225 329137 382415 379466 329217 378927 386540 399543 383620
3825 383620 313770 290434 310933 327063 336508 383336 413948 354175 373283 333011 315263 319040
3813 319040 312845 369428 327355 260216 257968 291115 316883 340270 319185 322661 308897 280224
3801 280224 285319 289827 325668 319023 324558 323174 309435 306712 278879 257293 232974 236640 251580
3788B51580J6894k0825K5539k11m2977k6490O2606l0023k3141M5386K2782l277
3776B77843n4383l5636j0328M5943J7209j9052J851l1540K3890M8175m0951k4544
3764A98477J5398K9172k5489K7888k4014N9506o56p136M5198n9318J1418l3037
3752B37407k5763L5776j2618j6836l9527M6747Q83k8955K4029J786j1566j4770
3740A96593R110J4392k4809K7869j1195P300k7014K3618L2169k6980J6571k8967
3728B08657m4059l515M861Q084K5675K136Q348j0962Q085K1570q0759Q212L4253
3715A90586l655Q01n1754j59J773m045p696K4199K0593j9820J3481j5926M9450
3702A97828L2715m1136k9099J9196N5303k6702n490j8543J595j6871l4751L1381
$$ plain form
3788 251580 268474 247649 273188 272977 230000 203510 266116 236093 212952 258338 281120 277843
3776 277843 223460 187824 177496 223439 240648 221596 223447 191907 215797 263972 223021 198477
3764 198477 213875 243047 217558 245446 221432 280938 280282 273146 318344 259026 270444 237407
3752 237407 211644 247420 234802 217966 178439 225186 226069 197114 221143 222929 211363 196593
3740 196593 205703 220095 195286 223155 211960 219260 192246 215864 248033 221053 237624 208657
3728 208657 164598 161083 165944 174028 199703 201839 210187 199225 207310 228880 148121 156333 190586
3715 190586 186931 187732 135978 135819 137592 133547 125851 150050 170643 150823 164304 148378 197828
3702 197828 230543 189407 160308 179504 234807 208105 202615 184072 185667 168796 134045 165426
3690A65426O4154k1334j1354k235L2362J4178R944R748N136j3697k636m0443j1497
3677A97752K6759J7963k0291J8731k085j5503m8796o951M9553L2593l24k7848
3665B21553K7228k5114l4377J3667l825j4646k8058M4237l7271l214M6344j4495
3653A92029j2478M713l9037J2294P1613l9215l9355M7793K4313r8767R687K786
3641A36376J2729N109j2292N329N2300k1731m462l2983o531J1503O3766n726J9037
3628B22424K964k7174j6441k3812J6239J9284L6609k8645j9516J9091J4571j0892
3616B04702l11j5371P364p624k4138N5457K616o8259K5495k8932k9939l1597L9084
3603A28547J3573P3098K7684m9107p53l4410L6337N1013n5686Q195L8740m2013
$$ plain form
3690 165426 229580 208246 196892 194657 227019 241197 251141 260889 266025 252328 249692 209249 197752
3677 197752 224511 242474 222183 240914 238829 223326 174530 167579 217132 249725 249401 221553
3665 221553 248781 223667 189290 202957 199132 184486 156428 200665 163394 160180 206524 192029
3653 192029 179551 184264 145227 157521 229134 189919 150564 198357 222670 123903 133590 136376
3641 136376 149105 154214 141922 147251 199551 177820 173358 140375 133844 145347 209113 203387 222424
3628 222424 225388 198214 181773 157961 174200 193484 230093 201448 181932 201023 215594 204702
3616 204702 204391 189020 196384 188760 164622 220079 222695 154436 179931 150999 121060 89463 128547
3603 128547 142120 215218 242902 193795 193042 158632 194969 245982 190296 198491 237231 195218
3591A95218J8568R661K8863J8381j5490o064m355K2271N0253k9402o0908K3177
3579B50173K2512l2523O358J6472l1862q105j0581P228J0844J6023j3506j3876
3567B19157K1658K7680K4002m2221p09j2672j2071K009L2632K2822L6404k8999
3555B89692l1390K7850m9663l9809K5425Q967j1480J9638M1682J711l9521j3712
3543B29390K8620O9802m4692J0124m3537k4827N5106N913n2305N996l8600m619
3531A96371R7656J3883K0429L1311k5876k8807k8741K2482N4901l892k4938j5851
3519C08928L0655L0106L3556j728m0446J9868L0702q9091r85M1788j3196L4906
3507C85063r857j8015L5423j893N8688o469n3000L9836L9804N4040J8022j6529
$$ plain form
3591 195218 213786 223447 252310 270691 255201 249137 244782 267053 317306 287904 226996 250173
3579 250173 272685 240162 246520 262992 231130 223025 212444 219672 230516 246539 233033 219157
3567 219157 240815 268495 292497 250276 249567 236895 224824 226833 259465 282287 318691 289692
3555 289692 258302 286152 236489 196680 222105 231072 219592 239230 280912 282623 243102 229390
3543 229390 258010 327812 283120 293244 249707 224880 279986 285899 233594 239590 200990 196371
3531 196371 294027 307910 328339 359650 333774 304967 276226 298708 353609 349717 324779 308928
3519 308928 339583 369689 403245 401517 361071 380939 411641 322550 321565 363353 350157 385063
3507 385063 375206 357191 392614 390721 449409 442940 389940 429776 469580 523620 541642 525113
3495E25113K1746J4649j6421O6476M720l8200m1135k863O2833N3046p2677J4943
3483E92230J6856l5800J8514N4486J8406M5450K024j844M7707M328L4373J3282
3471H10012L9389K1397j4275j650N5116j3542P4301N4456k0498K8554N8030L7817
3459A129107N0668j5046N3681N8323K2491O5823K1011Q0643L7548M8788J26008
3448A679045Q1798N1420K7617J71089J64082J93596J71738K30228K32415K68243
3438C271271L45132M14499N17806O77980Q37539J009123J001940P64609K00365
3429I040264o71575j155191j014162q34106o63587m35892l30720k05539j31259
3420C598233q5630l7543j1874q691Q4346J09628P1521J21309K10309K89168L24464
$$ plain form
3495 525113 546859 561508 545087 611563 616283 578083 536948 534085 596918 649964 577287 592230
3483 592230 609086 573286 591800 646286 664692 710142 712166 710322 758029 762357 796730 810012
3471 810012 849401 870798 856523 854873 909989 896447 970748 1025204 1004706 1033260 1091290 1129107
3459 1129107 1179775 1164729 1218410 1276733 1299224 1365047 1386058 1466701 1504249 1553037 1679045
3448 1679045 1760843 1812263 1839880 2010969 2175051 2368647 2540385 2770613 3003028 3271271
3438 3271271 3616403 4030902 4548708 5226688 6064227 7073350 8075290 8839899 9040264
3429 9040264 8368689 7213498 6199336 5365230 4701643 4265751 3935031 3729492 3598233
3420 3598233 3512603 3475060 3463186 3454495 3538841 3648469 3719990 3841299 4051608 4340776 4665240
3409D665240L45566M41225N45884O10892P22838R35018J197163J653975K035519
3400A3153320J997732J533553K35689j706146k426044k217728j721311j228956
3392G620109j007133p07636n20907m61463l78106k62474k26252j37154j20246
3383C798738q2080o4773L8808K5257L5709M8103J38662J96333K23000K70947K37567
3372D866271L60007N45805P85739Q51131Q87300O00046K9221p53403j167069j021178
3362E983870p99872o58299m13504l78385k60400k11884k46748k12707j73617j26731
3352B501723o5675j28326j17392p1556l4313m4681L3007l5524j3450r487L4839
3341B049165m4919K0592J17141J5847J29876L3758K2592r531n1171l7646r2018
$$ plain form
3409 4665240 5010806 5452031 5997915 6608807 7331645 8266663 9463826 11117801 13153320
3400 13153320 15151052 16684605 16920294 15214148 12788104 10570376 8849065 7620109
3392 7620109 6612976 5905340 5384433 4922970 4544864 4282390 4056138 3918984 3798738
3383 3798738 3716658 3651885 3690693 3715950 3751659 3799762 3938424 4134757 4357757 4628704 4866271
3372 4866271 5226278 5772083 6557822 7408953 8296253 8896299 8925520 8172117 7005048 5983870
3362 5983870 5183998 4525699 4112195 3733810 3473410 3261526 3014778 2802071 2628454 2501723
3352 2501723 2436048 2307722 2190330 2118774 2084461 2039780 2072787 2037263 2023813 2014326 2049165
3341 2049165 2004246 2024838 2141979 2157826 2287702 2321460 2344052 2334521 2283350 2245704 2153686
3330B153686m8521k9111m9162M3473j355j2211j04278j04379j744p106o854j7856
3318A814582L6899K0921O733K5185J9129J08307J15347O2744J27946Q0297J37196
3307B555286J70493J65201K54496K19957M7122j7686l5999k19542j91477j68526
3297B779325j73637j49722j08013o2998m3941r389J4276q669O0240r303J5000
3286B303169O6728O6868O6037J08487O0270O5103R6336J39086J20656J25175Q2989
3275C300904J21567J59182K29150K12464K13194J14108n0611o4357j19129m8122
3265D068350p1975p2414l20J4681O4528J01854Q7901N6976Q8737M7914N1235L9039
3253D476506L1922J4867k9861m3622k2080j24748k12910j83677j45463j95864
$$ plain form
3330 2153686 2105165 2076054 2026892 2070365 2069010 2056799 1952521 1848142 1846398 1839292 1832438 1814582
3318 1814582 1851481 1872402 1879135 1904320 1923449 2031756 2147103 2209847 2337793 2418090 2555286
3307 2555286 2725779 2890980 3145476 3365433 3412555 3394869 3358870 3139328 2947851 2779325
3297 2779325 2605688 2455966 2347953 2284955 2241014 2231625 2245901 2237232 2297472 2288169 2303169
3286 2303169 2369897 2436765 2502802 2611289 2671559 2736662 2832998 2972084 3092740 3217915 3300904
3275 3300904 3422471 3581653 3810803 4023267 4236461 4350569 4299958 4235601 4116472 4068350
3265 4068350 3996375 3923961 3923641 3938322 4002850 4104704 4192605 4249581 4338318 4386232 4437467 4476506
3253 4476506 4508428 4523295 4493434 4449812 4427732 4302984 4090074 3906397 3760934 3565070
3243C565070k08647j59109q3872j19537o9059j03043j32687j10388j38823j76947
3233B262958q4456m2189j29382m9321n6252m4475l4352n6935m1152K26n5231n8197
3221A611242p5886J1831K7954N8604J977r258j3675n4882j59193n8992j60p4522
3209A265040q2511k4803k8306k5620k8139m9049K9581n3741J5464J5380m830M3163
3197A071629k693l8174Q862K4962M505J7979p9083l6307n7528l8933O54k2543
3185H53330J9668L8777m6468Q842l8878r2433p2614L151J7017m0139k138J2323
3173F60438O4086k5171n3672K3190k8490k2410J0861j3530l399m6249N2719N1030
3161F69403m7512J7666l069p2253K133q1084n0440J2712k9858J9039l1526m6200
$$ plain form
3243 3565070 3356423 3197314 3113442 2993905 2924846 2821803 2689116 2578728 2439905 2262958
3233 2262958 2178502 2136313 2006931 1957610 1901358 1856883 1822531 1765596 1724444 1724670 1669439 1611242
3221 1611242 1535356 1547187 1575141 1633745 1635722 1626464 1612789 1557907 1398714 1339722 1339562 1265040
3209 1265040 1182529 1157726 1129420 1103800 1075661 1026612 1056193 1002452 1017916 1033296 1028466 1071629
3197 1071629 1068936 1030762 1039624 1064586 1069091 1087070 1007987 971680 914152 875219 875873 853330
3185 853330 872998 911775 865307 874149 835271 742838 670224 673375 690392 650253 648115 660438
3173 660438 724524 699353 645681 668871 640381 617971 628832 615302 611903 565654 618373 669403
3161 669403 621891 639557 636488 564235 566368 485284 434844 447556 417698 436737 405211 359011
3149C59011J6277M3690K2065J4982q71p363K3722k9046n7049n735j5765n86j4440
3136C48892K0109J6304k2349k9096j2825J6731J398o319K9308O111j1193J8763
3124C75834j2043n0952J8152P751l550J7849j3114l6871j6194L5063k3378j458
3112B97089N3960K5905k6797J7695r269j1599o5403j2447L1901k9583N0625M650
3100C26727k5810l9082l5001j0648J4667L7286L0150m3204j06k570j3395p163
3088B31851L1319J6649j1119J855J0103k8806L0796L1688m1166n0894m3191K5257
3076B04342L0895n180J6281j9405k751k1432J313K5208K3285J9410n5095l3508
3064A83363K5494l162Q729N6814m5284J5393o510m9469k9177k3861L2469P4719
$$ plain form
3149 359011 375288 418978 441043 456025 455154 447791 471513 442467 385418 379683 363918 363332 348892
3136 348892 369001 385305 362956 333860 321035 337766 339164 332845 362153 368264 357071 375834
3124 375834 363791 312839 330991 338742 335192 353041 339927 303056 286862 321925 298547 297089
3112 297089 351049 376954 350157 367852 358583 346984 281581 269134 301035 271452 322077 326727
3100 326727 300917 261835 226834 216186 230853 268139 298289 255085 254979 252409 239014 231851
3088 231851 263170 279819 268700 270555 280658 251852 282648 314336 273170 222276 179085 204342
3076 204342 235237 230057 246338 226933 224182 202750 204063 229271 252556 271966 216871 183363
3064 183363 208857 205695 214424 271238 225954 241347 234837 185368 156191 132330 164799 239518
3052B39518p8427o569N2907m1288p56L716l6531N9627N403P336J3943j0764l452
3039B04663J1608L4384M0750m9693k2101n0478j5295L3537l6996N58O9107m7114
3027A72930k5260L4296L219L1835N6055O275m0497l3736l4086k0954m651Q7024
3015B32450K1027q464j3068k3275L978J587K1950J6878j5915j1761p146J779M7572
3002B67592O395n5418M072N0571m2617J3456J2521J9545Q481l5483k9260Q397
2990B28252J8072L4294J1288J6098K2844K456p63j9549L2331O220L2895Q817l292
2977C89963m4232K1486j2982L6220n941K0656j3144l8051M186l7494J5832k753
2965C33746j3517o19L288j1913K5046O0877K6083l3714m8688K7910N1569K8485
$$ plain form
3052 239518 161091 154522 207429 166141 165385 169101 132570 192197 197600 204936 218879 208115 204663
3039 204663 216271 250655 291405 241712 219611 169133 153838 187375 150379 150937 220044 172930
3027 172930 147670 181966 185185 217020 273075 279350 238853 205117 171031 150077 145426 232450
3015 232450 253477 245013 231945 208670 212648 214235 236185 253063 237148 225387 218241 220020 267592
3002 267592 273987 218569 222641 273212 230595 244051 256572 276117 284598 249115 219855 228252
2990 228252 246324 280618 291906 308004 330848 333304 332541 312992 345323 351543 384438 393255 389963
2977 389963 345731 367217 354235 390455 384514 405170 392026 353975 358161 320667 336499 333746
2965 333746 320229 319610 322898 310985 336031 396908 422991 389277 340589 368499 420068 448553
2953D48553N2747L0339J0823L9964N9665L1847J3189J9160K0731L7552J7400O6912
2941H48882L2616J9061K4947M6200L8076m9618l3384M1168q771K0122M081l3782
2929I49598M1915N758K5511r972m6341j4194O3527K3037K7789L9074N020K3257
2917A133979j748Q0213P3379N0752J4706J26197P1085J09688J09639R7450l1965
2906A833375j35356q7725j44397j64146j20487q0397k0271k4587j6004j1572j7741
2895A010692j2541l4864j0578k219j2717j1173K9990l0517L064j3919k0199J7164
2883I12183P120l746M2081K6906j76J4233l8492l9145l9732o4728n5953k5335
2871G35216P899o3715k0369j5094n0856k7203K6134m5545o370O063j5596j2270
$$ plain form
2953 448553 501300 531639 542462 582426 642091 673938 687127 706287 727018 764570 781970 848882
2941 848882 881498 900559 925506 971706 1009782 960164 926780 967948 959177 979299 983380 949598
2929 949598 991513 997271 1022782 1012810 966469 952275 1015802 1038839 1066628 1105702 1110722 1133979
2917 1133979 1132231 1212444 1285823 1336575 1351281 1477478 1548563 1658251 1767890 1865340 1833375
2906 1833375 1698019 1610294 1465897 1301751 1181264 1100867 1080596 1056009 1040005 1028433 1010692
2895 1010692 998151 963287 952709 950490 937773 926600 956590 926073 929137 915218 895019 912183
2883 912183 919303 915557 957638 984544 984368 998601 960109 920964 881232 816504 760551 735216
2871 735216 743115 679400 659031 643937 593081 565878 592012 546467 540097 546160 530564 518294
2859E18294M1007n2371r2721J6427m3078j07456J7650L8069l8172j1977N359K3927
2847C14958m511k6760J4418j7281p55k357q837k3348Q627l4550j1197J3118j7629
2834B03896k7709j0149k9067J940J9943l4320K4597L4333J2698M0236l0288m0387
2822A65723l2082j5724L542J8954J0370j9759K0389j3067k9393K8961R7L371J4002
2809A55384q1078k1392K4254K5109l671M0264l4595m8618n919L066L7216k1834
2797F8186j7392j521k0770n321O8352L6861m1577Q447m0958K8071n8402M277M2142
2784G0395l7069L5244K6812l4458K0251J3521l6529k3022N7178J1789l0343j0433
2772F3336J7369j2477q258J5939M179j9916J2705Q24j0467m2362q476N4967j4662
$$ plain form
2859 518294 559301 506930 414209 430636 387558 280102 297752 335821 297649 285672 291031 314958
2847 314958 310447 283687 298105 280824 280069 277712 268875 245527 254154 219604 208407 221525 203896
2834 203896 176187 166038 136971 138911 158854 124534 149131 183464 196162 236398 206110 165723
2822 165723 133641 117917 121459 140413 150783 131024 151413 138346 108953 137914 138011 141382 155384
2809 155384 74306 52914 77168 102277 98606 138870 104275 55657 49738 52804 90020 68186
2797 68186 50794 49273 28503 23182 91534 128395 86818 95265 54307 82378 23976 28253 70395
2784 70395 33326 68570 95382 60924 81175 94696 58167 35145 92323 104112 73769 63336
2772 63336 80705 68228 59970 75909 80088 60172 72877 73701 63234 20872 12396 67363 52701
2759E2701n468m0789K9980j4936j6730K3148J5052k8479J2170M2936l2741n7615
2747b0771N753P315K9416L0646n223m8830l517k035j6797K3688Q3131m550l2860
2734D5366J937k3253j8042l8520N8821J3338l5518k976j2785R3047K7971j6854
2722I2532k1930l7399J0314K3989m576k3685J3712n051k9669l8403K101L2573
2710A4508J3036N879M8080j8172l0709r216P179n481j682l2516l7815N7027K4621
2697C4739n519J9360j1686k7125N859k0319k509K1657j6753j6128M7458n1366
2685b2332n2521J0751L4048K3863J7811J7793m8360j0712Q429M16L139L3169K6914
2672D2408M223Q126l530l7657J11L8049l1070r275K5827j6150l4861j4773J9001
$$ plain form
2759 52701 47233 6444 36424 21488 4758 27906 42958 14479 26649 69585 36844 -20771
2747 -20771 -15018 -7703 21713 52359 47136 -1694 -5211 -7246 -24043 -355 82776 78226 45366
2734 45366 47303 24050 6008 -32512 26309 39647 4129 1153 -11632 81415 109386 92532
2722 92532 70602 33203 43517 67506 62930 39245 52957 47906 18237 -20166 -18065 14508
2710 14508 27544 33423 81503 63331 32622 23406 30585 25104 23422 -9094 -46909 10118 34739
2697 34739 29220 48580 36894 9769 15628 -4691 -7200 14457 -2296 -18424 29034 -22332
2685 -22332 -74853 -64102 -30054 -6191 11620 29413 -18947 -29659 -21230 -20814 -17675 15494 42408
2672 42408 46631 54757 51227 13570 13681 51730 20660 11385 37212 21062 -13799 -28572 -9571
2659i571M3465K8129l4788J8830k2007L1032l7261k7211K4902J2379J2731k1875
2647A8755q575K8317m1260K3426L410o0661K3015k2854J8338l9408K1514N0507
2635A4524J2217m0099p641L6059j1595L2464K7276m8813K156O49J0230l0106J4370
2622A1691L7521n5657J8716j1956o658J5489L5424J672j2315m5037K1201K7827
2610C7918K0928N637m9815j4723l696l162P037j8593j0855M6505j1670K8295j3341
2597B0465m0805j5814Q07K3864K9380K5693j6423J2264J9231N2631l2181k8568
2585E0544k4301l6773M187m036L523K5269k9616J7541P7360k4945k4264O376k0999
2572A9866K6203j1465K673m5340r313M4588o495l3958o731L8126k17J064j4565
$$ plain form
2659 -9571 33894 62023 27235 46065 24058 55090 17829 -9382 15520 27899 40630 18755
2647 18755 10180 38497 -2763 20663 24073 -36588 -13573 -36427 -18089 -57497 -35983 14524
2635 14524 26741 -13358 -20999 15060 3465 35929 63205 14392 16548 17197 27427 -2679 11691
2622 11691 49212 -6445 12271 315 -6343 9146 44570 46242 33927 -11110 10091 37918
2610 37918 58846 64483 14668 -55 -3751 -6913 124 -18469 -29324 17181 5511 33806 20465
2597 20465 -20340 -36154 -35347 -11483 17897 43590 27167 39431 58662 111293 79112 50544
2585 50544 26243 -10530 -6343 -10379 -6856 18413 -11203 6338 83698 58753 34489 40865 19866
2572 19866 46069 34604 37277 -8063 -17376 27212 20717 -13241 -19972 18154 17937 19001 4436
2559D436L3787l0751k9627M1575L0395l6784L6513j6886j516K779m2224m7402
2547e5705m168K1157q664l0689Q959N0755J6547m226J3394J4614K3189n1735j4684
2534b1256P533J0248j1910J0399j1397j093L3734N252k6134L9902m4470l1086
2522d0278L102L5322R635L8009J1518l6222K9512k5426j4385L5275J1362m6671
2510A0753L060K5198l5933k8707j471k7131L6941M4043k6079l9160K7249k767
2498a4004L0604l796j7557L095K0224k1780J8548p2856j572P5971O257Q48J337
2485B5319O611j5141p0349O7223J8866K4189j3217l4578L2106R424O152k6147
2473C0458n945l979j9135J3327M7571o1440L5966N0392r96l9653m5144N081M665
$$ plain form
2559 4436 38223 7472 -22155 19420 49815 13031 49544 32658 31142 33921 -8303 -55705
2547 -55705 -59873 -38716 -47380 -78069 -69110 -18355 -1808 -6034 7360 21974 45163 -6572 -21256
2534 -21256 -13723 -3475 -15385 -4986 -16383 -17476 16258 21510 -4624 35278 -9192 -40278
2522 -40278 -37176 -1854 7781 45790 57308 21086 50598 25172 10787 46062 57424 10753
2510 10753 13813 39011 3078 -25629 -27100 -54231 -17290 26753 674 -38486 -11237 -14004
2498 -14004 16600 12804 -4753 -1658 18566 -3214 15334 -57522 -59094 16877 23134 23982 25319
2485 25319 31930 16789 -53560 13663 32529 56718 43501 8923 41029 50453 56605 30458
2473 30458 24513 20534 1399 14726 62297 857 36823 87215 86219 46566 1422 6503 11168
2460A1168R68j7556J5749J1705l8631k4369M4155L909k3678j9855J5819J2202
2448h414n674m5300k1211K8821N841K9811J8921L7400k121m9793J3901L5558l5824
2435A916m4436L3297P009M2570J5744k3350l4053k7619j7032R641K5908J3383
2423B978K0552Q155k4155m2756l444o639K2996O716j8532J5139m0395L8359J7898
2410c128k7878O4194o760o6333j9747J1068J5727J4652K230N4017Q318q229k6933
2397A1198k8405k3715L9340K2545o0764M2629N7865m0244m3846M1248j5606N5715
2385E7960n7247l0942J9909P334Q2886O093m1755J0079O4948J1924j0451l4184
2373H6554L3984j9612p648l7504m6006O9410O0061m4901L6062j2401k1152p2051
$$ plain form
2460 11168 12136 -5420 10329 22034 -16597 -40966 3189 7098 -16580 -36435 -20616 -8414
2448 -8414 -14088 -59388 -80599 -51778 -45937 -16126 2795 40195 38074 -11719 2182 37740 1916
2435 1916 -42520 -9223 -2214 40356 56100 32750 -1303 -28922 -45954 -36313 -10405 2978
2423 2978 23530 31685 7530 -35226 -38670 -45309 -22313 -15597 -34129 -18990 -59385 -21026 -3128
2410 -3128 -31006 33188 26428 -39905 -59652 -48584 -32857 -18205 -15975 38042 46360 38131 11198
2397 11198 -17207 -40922 -1582 20963 -39801 2828 60693 20449 -23397 17851 2245 57960
2385 57960 713 -30229 -10320 -2986 79900 85993 44238 54317 119265 131189 120738 86554
2373 86554 120538 100926 93278 55774 9768 79178 139239 94338 130400 117999 96847 24796
2361B4796l571N518m6534k4523J1622J9823j1421M1k4673L0898L7981J9038m2807
2348c812J0672K8046j394k7668P437L3266o9204Q436M0107K2325K9891n0395p6302
2335d8595N53P9302K4943M618k8634k1246J281k4630j0949K2435j8181N6006L0414
2322F7317l4709j2229J6376m9060m7554j6M3004O18j1647j5674J911K1369M1348
2309B1054O5211m0952j1312K7364l9493r918K1798j4204J4197l2741l0080N273
2297b3803k1384j721K0141J0665Q994k6462L9788p54o030j479O1108j1051l4858
2284A3154n051M4896J308j4157J0436k4451J4431j2630N487M6991L4997l7356
2272G8055n9936J5609J615O454J9626m2940L0664N9160J469P405j382k4695m9176
$$ plain form
2361 24796 21225 26743 -19791 -44314 -32692 -12869 -24290 -24249 -48922 -18024 19957 38995 -3812
2348 -3812 6860 34906 33512 5844 13281 46547 -22657 -14221 25886 48211 78102 27707 -48595
2335 -48595 -48042 31260 56203 60821 32187 10941 12222 -12408 -23357 -922 -19103 36903 67317
2322 67317 32608 20379 36755 -12305 -59859 -59875 -16871 -16253 -27900 -43574 -41663 -20294 21054
2309 21054 86265 45313 34001 61365 21872 11954 33752 19548 33745 1004 -29076 -23803
2297 -23803 -45187 -46908 -26767 -16102 -7108 -33570 6218 5464 -566 -2045 59063 48012 13154
2284 13154 8103 52999 54307 40150 50586 26135 40566 27936 33423 80414 115411 78055
2272 78055 18119 33728 35343 41797 61423 18483 49147 108307 109776 117181 115799 91104 41928
2259D1928J0056R550J6240k9635K0474r762L5356M978o2613k441O0028K5448l7127
2246H2480J3736j7463q087j7541J3286L6895L5309m4816k5635J6629m248O3472
2234A44017r545j3578L7218m9689J1845K2310J6631K3871o349k0235k6541l3449
2222I6506J2395k907Q151O4391j0195m1660L9945p569M048l9470L5701K9671K2676
2209B11683l5646P840O269K332o496k5200L1109k8624R016N2288M9091J8662l511
2196B88813p538r531o3010l440P6321n568M6404P140J5180K8718k0230j4154J4314
2183C53419l6428L3065L7456J5982j5539m028J7076R407R413M4199q955M1116
2171D96183O905p770P822P0283K3810m461L5723P527L2388K9503N8826j6460J0971
$$ plain form
2259 41928 51984 61534 77774 48139 68613 58851 94207 99185 36572 34131 94159 119607 82480
2246 82480 96216 78753 70666 53125 66411 103306 138615 93799 68164 84793 80545 144017
2234 144017 134472 120894 158112 108423 120268 142578 159209 183080 176731 156496 129955 96506
2222 96506 108901 105994 114145 178536 168341 126681 166626 159057 163105 123635 159336 189007 211683
2209 211683 176037 183877 190146 192478 185982 160782 191891 163267 172283 224571 273662 292324 288813
2196 288813 281275 271744 208734 205294 281615 276047 322451 329591 344771 373489 353259 339105 353419
2183 353419 316991 350056 387512 403494 387955 383927 401003 410410 419823 464022 455067 496183
2171 496183 503088 495318 503140 573423 597233 592772 628495 636022 668410 697913 756739 740279 751250
2158G51250O0072J6151k9429L820L9637M406N4281N9871L8031J7484N4212P1575
2146A141361N5069N2605P3065K8149K0886P5312M6745P6884O0131J03531N1957
2135A785695R3036J45612J43772J07176J37560J38270J66312J97037K66952L39366
2125C520788L73349L66646L21512K25177M12994M62286N97851P32825Q99360J196920
2115I109708J454886J607120K351860L272108M104872L712502K343313k352579
2107B5603790n419959m398909l246062k252460j789118j320170j033371p32158
2099E411583n41440l95787l54718j82985j81853j37173k52474k62723k83512j69116
2089B649802k00641j94124j55187j05961n8084j31391o3723k633j43622j20891
$$ plain form
2158 751250 811322 827473 798044 801864 841501 845907 900188 960059 998090 1015574 1069786 1141361
2146 1141361 1196430 1249035 1322100 1350249 1371135 1446447 1493192 1570076 1630207 1733738 1785695
2135 1785695 1878731 2024343 2168115 2275291 2412851 2551121 2717433 2914470 3181422 3520788
2125 3520788 3894137 4260783 4582295 4807472 5220466 5682752 6280603 7013428 7912788 9109708
2115 9109708 10564594 12171714 14523574 17795682 21900554 25613056 27956369 25603790
2107 25603790 20183831 15784922 12538860 10286400 8497282 7177112 6143741 5411583
2099 5411583 4870143 4474356 4119638 3936653 3754800 3617627 3365153 3102430 2818918 2649802
2089 2649802 2449161 2255037 2099850 1993889 1935805 1804414 1740691 1738058 1594436 1473545
2079A473545m2375q5803o4269k3582o5156m0651o1434q063p066m8024m4885j09289
2067H72948m2319P123J3285P118k1645n0501o8836R820j4878m6561J0676L1252
2055G07482n2102m5412J8670m8304j5033j6343r504K4630J6608o5946l6078O063
2043D84731m998Q175K4366n4091n3428M1038n923l4138j2906m376J025L4691N403
2030D29569n8240l2729k55n7267L3866J4608m6723J8051M2345n2465j7098j9247
2018B54415j7691k7857J0137l6510l6147N9826K7754k3785m1899N0519J1729n7952
2006A72539k0870K6687p504j2879L27j7649J4435j2640J185l047J1793k5458j1383
1993A15536m340K8473k3279l4311j4073O8049P192o1387J1890r39R614K6455n016
$$ plain form
2079 1473545 1431170 1345367 1281098 1257516 1192360 1151709 1090275 1082212 1075146 1027122 982237 872948
2067 872948 830629 837752 851037 858155 836510 786009 717173 726993 712115 665554 676230 707482
2055 707482 655380 609968 628638 580334 565301 548958 539454 564084 580692 514746 478668 484731
2043 484731 479733 487908 512274 458183 404755 445793 439870 405732 392826 388450 389475 424166 429569
2030 429569 371329 338600 338345 281078 314944 329552 282829 300880 343225 290760 273662 254415
2018 254415 236724 208867 219004 182494 146347 206173 233927 210142 168243 218762 230491 172539
2006 172539 151669 178356 170852 157973 158300 140651 155086 142446 143631 140584 152377 126919 115536
1993 115536 111196 139669 116390 82079 68006 136055 143247 81860 93750 92811 102425 128880 123864
1980A23864k4054o112K3007K8249m3001J0085J2372j004l2727L285J9381k8108
1968H5237L7281l6441n5835K9019L7090l5380j8237R280j8553J0665j3400M64
1956C1190j9260k4043Q5589R0259k9785n3844k0898R483J714k7628k119K4888
1944F5546m4600l9412j0940L9369j7095K3245K8296m462K2274k1215n3600M7614
1932C5020M7964m9702L2010K1828R387j8111n7179l9073O2140L2557k3977n65
1920E2299r152j2790J992J8912J765J3700k3827L1487K4181l6762m435l1281n157
1907B0932k224j5635p543L4236K8751q911l3404j0419L7281n842L9963J0357n1128
1894C6414j8185M531J4821K0129l822j5433j3396M0843m2051L7445J0086R5m4189
$$ plain form
1980 123864 99810 93698 116705 144954 101953 112038 124410 123406 90679 93964 113345 85237
1968 85237 122518 86077 30242 59261 96351 60971 42734 52014 33461 44126 30726 31190
1956 31190 11930 -12113 73476 163735 133950 80106 59208 68691 70405 42777 40658 65546
1944 65546 20946 -18466 -29406 9963 -7132 16113 44409 39947 62221 41006 -12594 35020
1932 35020 82984 33282 65292 87120 96507 78396 21217 -17856 44284 76841 52864 52299
1920 52299 43147 30357 32349 51261 53026 66726 42899 74386 98567 61805 57370 26089 20932
1907 20932 18708 3073 -4470 29766 58517 49606 16202 5783 43064 37222 77185 87542 36414
1894 36414 18229 22760 37581 57710 53888 38455 25059 65902 23851 61296 71382 71477 27288
1881B7288M121k8386J7559j4734J4280P788k4992o031P874O2750j5631J2623j431
1868F3078n1698l37o901l8915L2949L8149j3615K366K0006k0923j4078j760K7242
1855C5563J4425K5670k3419L7234j731n7951k8349K1441N5679o3612K1793Q3953
1843A20696l0564K4497M0667j4195j2181j1034K2990q773q2989m7649J9038K7819
1831D8322K0677R953k9460Q277l9620k1913N091J0357O981j0242j9304K3235k9524
1818a7170L8399p907k4324P4992K3265k7217j3374n490n695m099O731l7838L8290
1805C8563l1606o0601M1513k734J6733M8J5195K50k0320K5897l17j6254l836K4153
1791B6684j5611m1682L7881N360l8174k448M7687k7181k8038L1357j1814m3185
$$ plain form
1881 27288 31409 3023 20582 5848 20128 27916 2924 -3107 4767 67517 51886 64509 63078
1868 63078 11380 11043 4142 -34773 -1824 36325 22710 25076 45082 24159 10081 8321 35563
1855 35563 49988 75658 52239 89473 87742 29791 1442 22883 78562 14950 36743 120696
1843 120696 90132 114629 155296 141101 128920 117886 140876 132103 49114 1465 20503 48322
1831 48322 68999 78952 49492 57769 18149 -3764 1327 11684 18665 8423 -10881 12354 -17170
1818 -17170 21229 13322 -11002 63990 87255 60038 46664 41174 35479 31380 38111 273 38563
1805 38563 6957 -53644 -12131 -14865 1868 1916 17111 17361 -2959 22938 22621 6367 2531 26684
1791 26684 11073 -30609 7272 12632 -25542 -27990 19697 -7484 -35522 -4165 -15979 -59164
1779e9164l9561L9281K5267r280q139P609L2928J5370K342L9661l598o5278L5529
1766A2967l9673l1546K7502O952R678j6533J3973j593k4309P373M8450K7527K370
1753D3138j2471k0585Q653j0670j2088j8065J4508L7391j5650l4571l317J5164
1741h563N785J2190J0246N311k3008J7740R742J6848j2999l2474N764Q053J8434
1728C3069J8335P698p7909m4946J9004M7058L0217m7386l7801l6494M5936L2490
1716a0729j1042j4447L9916k0678j8787R699M762o507n371N0937J6541K8881j1871
1703E1304j7476l5491l4829j3454L4033o023K9839n722m2245K8710j013J3590
1691A223j5029M819l467j927j1739M1927j442j7534K2755k08m7267J5778n376
$$ plain form
1779 -59164 -98725 -59444 -34177 -43457 -51596 -43987 -11059 4311 6653 46314 42716 -22562 12967
1766 12967 -26706 -58252 -30750 -23798 -14120 -30653 -16680 -18273 -42582 -35209 13241 40768 43138
1753 43138 30667 10082 18735 8065 -4023 -22088 -7580 29811 14161 -20410 -23727 -8563
1741 -8563 -2778 9412 19658 24969 1961 19701 29443 46291 33292 818 6582 14635 33069
1728 33069 51404 59102 -18807 -63753 -44749 2309 32526 -14860 -52661 -89155 -43219 -10729
1716 -10729 -21771 -36218 3698 -16980 -35767 -26068 -21306 -27813 -33184 17753 34294 63175 51304
1703 51304 33828 -1663 -36492 -49946 -15913 -21936 7903 2181 -40064 -11354 -12367 1223
1691 1223 -13806 -8987 -12454 -14381 -26120 15807 14365 -3169 19586 19378 -27889 -12111 -17487
1678a7487m8901L8077l1123O2209j8184K2592j2395k3969n189J6959J3525n586
1666i472K9626K252j7734O436R453l6328O1023J7910J1662k7785l3165P221k5347
1653d248m563l0205K0492K1101K0630K9165m1167j1429M5151m0009k9056K9214
1641E076J8694o5790J2689J0106l4595Q307k0269N6120P4887l7254J7376j3574
1629C1773n5606k337M1283q340j1007j9733L8297n114l1175l877M7986L2708j1610
1616D3248j9952j8365Q615m3497L005j2289N818k2481K1422M055L737N0219K004
1603B5539l6540K683j7367j5765k999J8900o729M5455J5327K7101P359l0095J0794
1590D3663J9441m0692q287O3273l3030j933J7226n6728M07O814j7302M1193k6475
$$ plain form
1678 -17487 -66388 -28311 -59434 2775 -15409 7183 -5212 -29181 -34370 -17411 -3886 -9472
1666 -9472 20154 22406 4672 11108 20561 -15767 45256 63166 74828 47043 13878 21099 -4248
1653 -4248 -8811 -39016 -18524 2577 23207 52372 11205 -224 44927 4918 -24138 5076
1641 5076 23770 -42020 -29331 -19225 -53820 -45513 -65782 -9662 65225 27971 45347 31773
1629 31773 -23833 -26170 15113 6773 -4234 -23967 14330 9216 -21959 -25836 22150 54858 43248
1616 43248 23296 4931 13546 -29951 -26946 -39235 -33417 -55898 -34476 -30421 -26684 23535 25539
1603 25539 -11001 -8318 -25685 -41450 -44449 -25549 -32278 13177 28504 55605 62964 32869 43663
1590 43663 63104 22412 14125 77398 44368 42435 59661 2933 3340 10154 -7148 34045 7570
1577G570r187n85P246J113O533J7321m1448L969J482J1463J5134K108J3674n0504
1563a4111j3928o700l333j3428N0738J7142j3605k3693k2100J1462K738J0980
1551a7838m407n204J0283L0529K4707K6044n2786m5432N0071L2050m4656J689
1539E050m268L8533L791J04q2332L588k9936M8362j523J2048n449m766R75N711
1525a0112O3791j5866l8756k586K1989P701m3000l8020J0080M2436p810L567N4504
1512D7918j5736J3524l4835k7666K8150j6642j7543j7728j564J7689m0184K6842
1500c7775L4348K1587K2337O274l3209j772J1204k7514O0555p105l4942q150n1856
1487d6018N3781l7424k0357j2747P3789L2860l6026k127m667J4461k990J2723
$$ plain form
1577 7570 -1617 -2202 5044 6157 12690 30011 -11437 -7468 -5986 5477 20611 22719 36393 -14111
1563 -14111 -28039 -34739 -38072 -51500 -762 16380 2775 -20918 -43018 -31556 -28818 -17838
1551 -17838 -22245 -27449 -17166 13363 38070 64114 11328 -34104 15967 48017 3361 5050
1539 5050 782 39315 43106 43210 -39122 -35534 -65470 -17108 -18631 -6583 -12032 -16798 -15823 -10112
1525 -10112 53679 37813 -943 -3529 18460 26161 -16839 -54859 -44779 -2343 -10153 -6586 47918
1512 47918 32182 45706 10871 -16795 11355 -5287 -22830 -40558 -42122 -24433 -64617 -37775
1500 -37775 -3427 18160 40497 46771 13562 11790 22994 -4520 56035 48930 13988 5838 -46018
1487 -46018 7763 -29661 -50018 -62765 11024 43884 7858 5731 1064 15525 12535 25258
1475B5258K2292n329J939p0453N205J8424P377j8698l333M4143j3375r6449K6189
1462e6810L7182r372M3256n3772L693J6399L074o635J6331o4814j3921P2865K425
1449a0099l3640N7076j2669j1904m636m7937P321q376N875R045K6376r30J6758
1436g740M844J6916J9061j8961N082m670k8291O919l303l7869L672K0422m2244
1423f6162K3100N2099J0807P793j0652m4765K2233P640K9902j4001K13Q193J4406
1410D0806m0469J6226K4501m9578j1077J4966m115n8764k9285P5803L0913K1238
1398C1165l2242j991K9287J636j8823k450M5578m9171l6906n2875K9389K0557
1386c6846j1959j2785N7201K9574j3663m9738J0414K7524n2805K6985J6980N0401
$$ plain form
1475 25258 47550 42221 44160 -26293 -21088 -2664 4713 -13985 -17318 26825 13450 -82999 -56810
1462 -56810 -19628 -29000 14256 -39516 -35823 -19424 -16350 -22985 -6654 -71468 -85389 -12524 -10099
1449 -10099 -43739 13337 668 -11236 -15872 -63809 -56488 -64864 -58989 -49944 -23568 -24498 -7740
1436 -7740 -2896 14020 33081 14120 19202 14532 -13759 -6840 -10143 -48012 -44340 -23918 -66162
1423 -66162 -43062 9037 19844 27637 16985 -27780 -5547 2093 31995 17994 18207 26400 40806
1410 40806 337 16563 41064 -8514 -19591 -4625 -8740 -67504 -96789 -20986 9927 31165
1398 31165 -1077 -3068 26219 27855 9032 6582 52160 2989 -33917 -86792 -57403 -36846
1386 -36846 -48805 -61590 -4389 25185 11522 -38216 -27802 -278 -53083 -26098 -9118 41283
1374D1283N287j0743l6886l6114J7649m8724L9427N170j9294J3567L5585R621
1362A5828j8624M835j7363J2365k6873k8680k9800L8487K4218p921n434J2318
1350b6644N3845l6072L6792l2704j647J6222K5155k1696l0599l2068Q1347J2075
1338D4006r2852K0886L7561J9304J2375j9006m3028K3358J7379l1579M250N9280
1326E1934k842j4465j4511m3106p03m8693J7259M3527j3592j5403J3087O127K4893
1313C512k996j8445n8131M8810L1434p876M4201q670j9868j1694l3004j4693J9683
1300b7737K010M5980J7143j8857O678l0198j5132j8067k7295q459O3518K2103
1288A1687J110q794o4038K070J1520L9017J588m3661O546M9016K0889R112o9470
$$ plain form
1374 41283 46570 35827 -1059 -37173 -19524 -68248 -28821 -23651 -42945 -29378 6207 15828
1362 15828 -2796 2039 -15324 -2959 -29832 -58512 -88312 -49825 -25607 -33528 -38962 -26644
1350 -26644 27201 -8871 27921 -4783 -6430 9792 34947 13251 -17348 -49416 31931 44006
1338 44006 -48846 -27960 9601 28905 41280 22274 -20754 2604 19983 -11596 -7346 51934
1326 51934 49092 34627 20116 -22990 -23693 -72386 -55127 -11600 -25192 -40595 -27508 -21381 3512
1313 3512 516 -17929 -76060 -27250 4184 -3692 40509 31839 11971 277 -32727 -47420 -27737
1300 -27737 -25727 20253 37396 18539 25217 -4981 -20113 -38180 -65475 -73934 -10416 11687
1288 11687 12797 4003 -60035 -57965 -46445 -7428 -5840 -49501 -42955 6061 26950 36062 -33408
1275c3408J6432K5167m9578j478N031P946J2506j5158Q606k9087M142N2767Q501
1262A2389l8511Q499j5945K5957k0694l6008K7985j3220N705M1112Q472m6845
1250d1104P764M8743j1707k0410q692J3731K502m0865M2255L9915l0659m818P907
1237D562L849O995P489m3358q501L7107j5975J2682K606o0040N0998R72j9268
1224a9882p7710l7686O9018K9231N709j9755k4038N3937O740M273j1212J9286
1212b089L3894m2720l2098j1987L3911N2251L3297O1715m6679k8603j5737m952
1200C0203L4113J9162l1303l7201K7219N848k1456j9319N3115N293p7845m9494
1188f1665m714k1612K3430j7619k0914M0326N41N8391l717n1849L3955k2142K6630
$$ plain form
1275 -33408 -16976 8191 -41387 -42865 -37834 -29888 -17382 -32540 -23934 -53021 -48879 3888 12389
1262 12389 -26122 -17623 -33568 -7611 -28305 -64313 -36328 -49548 -43843 -2731 5741 -41104
1250 -41104 -33340 15403 3696 -16714 -25406 -11675 -9173 -50038 -7783 32132 1473 -3345 4562
1237 4562 8411 15406 22895 -20463 -28964 8143 -7832 4850 7456 -52584 -1586 -614 -19882
1224 -19882 -97592 -135278 -66260 -37029 -31320 -51075 -75113 -21176 -14436 -10163 -21375 -2089
1212 -2089 31805 -10915 -43013 -55000 -21089 31162 64459 126174 79495 50892 35155 30203
1200 30203 64316 83478 52175 14974 42193 48041 26585 7266 60381 65674 -12171 -61665
1188 -61665 -66379 -87991 -64561 -82180 -103094 -62768 -62227 -3836 -7553 -59402 -25447 -47589 -20959
1175b0959P98l6879N6075k343R143J484k0946L1104K3741N823p1891M21J4243
1162a0186K2434L9732l3802q102O050l7893Q404J802J0987J7434L8401l4081o3552
1149d2372K4100M3469j3255L130k3972n741q087J3152J3429K9563J9808l1416
1137B1808J3504K303J711J0686r2303N2009K4186k5392P29L3k1901j8640M701
1124b6566k269j3250j2156Q303L4341j8488p95J9889L9783K5299l0787r032K2051
1111C6323m834M998j7382k3768j9417l4559K2997L2894L1574p830k1942m080k0639
1098b5665J0206k297j0898L6517l749N6700m0042j4929M537J7348l5917j6085
1086b4274j0746j2491n002O7265Q172k5069j1988J8847J7092l666J2237m2690
$$ plain form
1175 -20959 -20161 -57040 -965 -3308 5835 7319 -13627 17477 41218 47041 -24850 -24429 -10186
1162 -10186 12248 51980 18178 10076 16126 -21767 -13363 -11561 -574 16860 55261 21180 -42372
1149 -42372 -18272 25197 11942 15072 -8900 -14641 -22728 -9576 3853 33416 53224 21808
1137 21808 35312 37615 39326 50012 -42291 9718 33904 8512 9241 9274 -12627 -31267 -26566
1124 -26566 -28835 -42085 -54241 -45938 -11597 -30085 -30880 -10991 28792 54091 23304 14272 36323
1111 36323 31489 36487 19105 -4663 -24080 -58639 -35642 -2748 28826 20996 -946 -5026 -25665
1098 -25665 -15459 -17756 -28654 7863 4114 60814 20772 5843 10380 27728 -8189 -24274
1086 -24274 -35020 -47511 -52513 14752 22924 -2145 -14133 4714 21806 18140 30377 -12313
1074a2313K2467l0312k9243O9774o1287j4439M8010K936L5662q611L6724j3720
1062D5648q3464R097Q7751m5237m5416J2373K3309N6615k1969o047k8204k7834
1050b3378k5451q674O5896r52k6285L9010k534k0480J0622L9802J6196n4003n9056
1037d9287K2521l1015L2760N3701P862l7351m015J9843m6264K9539k2946l7186
1025f1838M9679J80n0179K6964P5131j9545K2248l0605j903J0766q345M614j4281
1012B886N0558k1804l8332k3627j7385l8889N6790j893j7640K4917P2965m2172
1000F374n9711L0444N350j247j3863J0453j2972l479M0656K0488N4913m1406l5037
987I63K5993k0244k5938j3942n643N148m518N309j4135L1349N2019j5665p135
$$ plain form
1074 -12313 10154 -20158 -49401 20373 -40914 -55353 -7343 -4407 31255 22644 59368 45648
1062 45648 -37816 -28719 59032 13795 -31621 -19248 4061 60676 38707 32660 4456 -23378
1050 -23378 -48829 -57503 8393 7441 -18844 20166 17632 -2848 7774 47576 63772 9769 -49287
1037 -49287 -26766 -57781 -25021 28680 36542 -809 -4824 15019 -31245 -1706 -24652 -61838
1025 -61838 -12159 -11979 -62158 -35194 39937 20392 42640 12035 10132 20898 12553 17167 2886
1012 2886 53444 31640 -6692 -30319 -47704 -86593 -29803 -31696 -49336 -24419 48546 6374
1000 6374 -53337 -22893 -17543 -18790 -32653 -22200 -35172 -38651 2005 22493 77406 36000 963
987 963 26956 6712 -19226 -33168 -38811 -33663 -38181 -32872 -47007 -15658 36361 20696 13561
974A3561j1362l2359N4992k8507m9706j978m3916N005N0578N776P396K1807j1496
961b0209k5692N3604K0178L1829p1288m0495L2316l913K322l9535K9603k6407
949e7687K2213j3094J1658K6201L8285l6052O680J0219j8507j6094N719J9467
937i92l3200J4157R157m5349L9417M178j4426j122N088K5179K3917l7251O776
924d471N179k8064M8624K1186J9697m5206k9477J588m036L5770J3201l0854j1644
911h507o944j4192M2295l3198N0497J0522J2369k9576m4124J7722N7114J289k8032
898B7235k7189l859K9765j0478L4816k9925k0311J7609k956o940o345K904Q72
885E198n4150N9276j3957J1414m344j0371K4019n4170k1643Q098n935M0306J0805
$$ plain form
974 13561 2199 -30160 24832 -3675 -53381 -55359 -99275 -94270 -43692 -37916 -30520 -8713 -20209
961 -20209 -45901 7703 27881 59710 -11578 -52073 -19757 -23670 -21348 -60883 -31280 -57687
949 -57687 -35474 -48568 -36910 -10709 27576 -8476 -1796 8423 -10084 -26178 -20459 -992
937 -992 -34192 -20035 -10878 -56227 -16810 -12632 -27058 -28180 -23092 2087 26004 -11247 -4471
924 -4471 708 -27356 21268 42454 62151 16945 -12532 -10944 -14980 20790 33991 3137 -8507
911 -8507 -15451 -29643 12652 -20546 29951 40473 52842 23266 -20858 -3136 53978 55267 27235
898 27235 46 -3813 25952 15474 50290 20365 54 17663 14707 7767 1422 4326 5198
885 5198 -48952 10324 -3633 7781 3437 -6934 17085 -37085 -58728 -50630 -56565 -16259 -5454
872e454K8923o364k9097k6177R837J7085J7895N432L452J0442l3768j4174L8719
859A6751j8338M3000r42J6399n1684j968K5328r8321J4666N5916k893P104L5032
846D0050o713q764Q809j7734n8942k2865N5284M8903M77k2752m7405J0097j2315
833c3870j7230M2193N883l7181j1914R90J4889M6155j7689n0811j8952N0942m21
820b7016j2033P0854k9947K034K4094L7943K8564n4084n1725L3625k0635l3842
808c2168Q297J9532K2679M2719q145k05L777l1694k3738m1231P469L0692m2606
795d4622K8222J5679k5143j6165M9728j4981j3799k1918r956j0202j7674O1768
783a9063N6767J4515N722o4887j0361M759M1159M6997k278l8073n9687J5735p957
$$ plain form
872 -5454 23469 17105 -11992 -38169 -28332 -11247 6648 12080 15532 25974 -7794 -21968 16751
859 16751 -1587 41413 40471 56870 5186 3218 28546 -69775 -55109 807 -2086 5018 40050
846 40050 33337 24573 33382 15648 -43294 -66159 -10875 38028 38505 15753 -31652 -21555 -33870
833 -33870 -51100 -8907 -3024 -40205 -52119 -51129 -36240 9915 -7774 -58585 -77537 -26595 -27016
820 -27016 -39049 31805 1858 3892 27986 65929 94493 40409 -11316 22309 1674 -32168
808 -32168 -23871 -4339 18340 61059 52914 52709 56486 24792 1054 -40177 -32708 -2016 -44622
795 -44622 -16400 -721 -25864 -42029 7699 -7282 -21081 -42999 -52955 -63157 -80831 -19063
783 -19063 37704 52219 57941 -6946 -17307 -12548 28611 75608 73330 35257 -24430 -8695 -16652
770a6652k2244L415M0783j2799j7811K2567m837k8461P947k421J8416L7553L5800
757F1256L531j2282m8303M989k4420K6964m313K0862j9979l7300M6770J4401o2033
744b9857J3828P414m947k4494P210m9257j435O5830J6229L0709J2583L482m4213
731C082J5348p566k680l7793M3131K4613L7156l547o7838K0022K97k3810j9582
718a9167K2143L3577j3252m7735j2082L7372K6236l6036k4023k7032n8525K4996
$$ plain form
770 -16652 -38896 -35481 5302 -7497 -25308 -2741 -7578 -36039 -28092 -30513 -12097 25456 61256
757 61256 64787 52505 4202 9191 -15229 11735 7422 28284 8305 -28995 17775 32176 -29857
744 -29857 -16029 -8615 -13562 -38056 -30846 -80103 -81538 -15708 521 31230 43813 47295 3082
731 3082 18430 10864 8184 -29609 13522 38135 75291 71744 3906 23928 24225 415 -19167
718 -19167 2976 36553 23301 -24434 -36516 856 27092 -8944 -32967 -59999 -118524 -93528
$$ [...]
##END NTUPLES=NMR SPECTRUM
##END=
