##TITLE=1H_TG-2346-C
 CDCl3
 8 sc, 
 15.02.2022
##JCAMPDX= 6.0         $$ Bruker NMR JCAMP-DX V2.0
##DATA TYPE= NMR SPECTRUM
##DATA CLASS= NTUPLES
##ORIGIN= UXNMR, Bruker Analytische Messtechnik GmbH
##OWNER= root
$$ XWIN-NMR		Version 3.5
$$ Tue Feb 15 10:57:27 2022 Russian Standard Time (UT+4h)  she@DPX200
##.OBSERVE FREQUENCY= 200.131346
##.OBSERVE NUCLEUS= ^1H
##.ACQUISITION MODE= SIMULTANEOUS
##.ACQUISITION SCHEME= undefined
##.AVERAGES= 8
##.DIGITISER RES= 18
##SPECTROMETER/DATA SYSTEM= spect
##.PULSE SEQUENCE= zg30
##.SOLVENT NAME= CDCl3
##.SHIFT REFERENCE= (INTERNAL, CDCl3, 0, 15.7226)
##AUDIT TRAIL= $$ (NUMBER, WHEN, WHO, WHERE, WHAT)
$$ ##TITLE= Audit trail, XWIN-NMR		Version 3.5
$$ ##JCAMPDX= 5.01
$$ ##ORIGIN= Bruker BioSpin GmbH
$$ ##OWNER= she
$$ F:/spectra/data/she/nmr/H-F/1/pdata/1/auditp.txt
$$ ##AUDIT TRAIL=  $$ (NUMBER, WHEN, WHO, WHERE, WHAT)
(   1,<2022-02-15 10:55:06.17 +0400>,<she>,<DPX200>,
      <created by zg, POWCHK disabled, PULCHK disabled
       configuration hash MD5:
       00 E9 B6 7A A2 85 ED C7 34 08 36 98 17 FE 4E 26
       data hash MD5: 16K
       B7 88 A7 CE 86 2A 0C A1 02 E4 1A AD EF 7A 23 DC>)
(   2,<2022-02-15 10:55:09.45 +0400>,<she>,<DPX200>,
      <Start of raw data processing
       efp BC_mod = 2 LB = 0.24 FT_mod = 6 PKNL = 1 PHC0 = -16229.84 PHC1 = 11.80078 SI = 16K 
       data hash MD5: 16K
       C9 A4 75 2C EC 8E 4E A6 27 13 CC 04 44 32 1A 0D>)
(   3,<2022-02-15 10:55:27.95 +0400>,<she>,<DPX200>,
      <pk PHC0 = 1.728052 PHC1 = -2.4 
       data hash MD5: 16K
       EC 7C A9 13 A0 5C 6D 58 C5 02 AB 79 B4 5F 84 9E>)
(   4,<2022-02-15 10:55:31.32 +0400>,<she>,<DPX200>,
      <abs ABSG = 5 
       data hash MD5: 16K
       CA C5 43 9E 5C 18 F8 50 96 2F 5A 5C F2 E6 24 F3>)
$$ ##END=
$$ 
$$ hash MD5
$$ E2 91 C6 0E E0 46 E3 7B C6 FE 48 41 83 53 74 CA
##$RELAX= 
##$RELAX= 
##$RELAX= 
##$RELAX= 
##$RELAX= 
##$RELAX= 
$$ Bruker specific parameters
$$ --------------------------
##$DU= <F:/spectra>
##$EXPNO= 1
##$NAME= <H-F>
##$PROCNO= 1
##$TYPE= <nmr>
##$USER= <she>
##$AMP= (0..31)
100 100 100 100 100 100 100 100 100 100 100 100 100 100 100 100 100 100 
100 100 100 100 100 100 100 100 100 100 100 100 100 100 
##$AQSEQ= 0
##$AQ_mod= 1
##$AUNM= <au_zg>
##$AUTOPOS= <>
##$BF1= 200.13
##$BF2= 200.13
##$BF3= 200.13
##$BF4= 200.13
##$BF5= 200.13
##$BF6= 200.13
##$BF7= 200.13
##$BF8= 200.13
##$BYTORDA= 1
##$CFDGTYP= 0
##$CFRGTYP= 5
##$CHEMSTR= <none>
##$CNST= (0..31)
1 1 145 1 1 1 1 1 1 1 1 1 1 1 1 1 1 1 1 1 1 1 1 1 1 1 1 1 1 1 1 1 
##$CPDPRG= <>
##$CPDPRG1= <>
##$CPDPRG2= <>
##$CPDPRG3= <>
##$CPDPRG4= <mlev>
##$CPDPRG5= <mlev>
##$CPDPRG6= <mlev>
##$CPDPRG7= <mlev>
##$CPDPRG8= <mlev>
##$CPDPRGB= <>
##$CPDPRGT= <>
##$D= (0..31)
0 1.2 0 0 0 0 0 0 0 0.06 0 0.03 0 0 0 0 0.0002 0 0 0 0 0 0 0 0 0 0 0 0 
0 0 0 
##$DATE= 1644908105
##$DBL= (0..7)
120 120 120 120 120 120 120 120 
##$DBP= (0..7)
150 150 150 150 150 150 150 150 
##$DBP07= 0
##$DBPNAM0= <>
##$DBPNAM1= <>
##$DBPNAM2= <>
##$DBPNAM3= <>
##$DBPNAM4= <>
$$ [...]
##$SUBNAM2= <"">
##$SUBNAM3= <"">
##$SUBNAM4= <"">
##$SUBNAM5= <"">
##$SUBNAM6= <"">
##$SUBNAM7= <"">
##$SUBNAM8= <"">
##$SUBNAM9= <"">
##$SW= 18.0517287032376
##$SWIBOX= (0..15)
0 0 2 0 0 0 0 0 0 0 0 0 0 0 0 0 
##$SW_h= 3612.71676300578
##$TD= 16384
##$TD0= 1
##$TE= 0
##$TE2= 300
##$TE3= 300
##$TEG= 300
##$TL= (0..7)
0 120 120 120 120 120 120 120 
##$TP= (0..7)
150 150 150 150 150 150 150 150 
##$TP07= 0
##$TPNAME0= <>
##$TPNAME1= <>
##$TPNAME2= <>
##$TPNAME3= <>
##$TPNAME4= <>
##$TPNAME5= <>
##$TPNAME6= <>
##$TPNAME7= <>
##$TPOAL= (0..7)
0.5 0.5 0.5 0.5 0.5 0.5 0.5 0.5 
##$TPOFFS= (0..7)
0 0 0 0 0 0 0 0 
##$TUNHIN= 0
##$TUNHOUT= 0
##$TUNXOUT= 0
##$USERA1= <user>
##$USERA2= <user>
##$USERA3= <user>
##$USERA4= <user>
##$USERA5= <user>
##$V9= 5
##$VALIST= <valist>
##$VCLIST= <CCCCCCCCCCCCCCC>
##$VD= 0
##$VDLIST= <DDDDDDDDDDDDDDD>
##$VPLIST= <PPPPPPPPPPPPPPP>
##$VTLIST= <TTTTTTTTTTTTTTT>
##$WBST= 1024
##$WBSW= 4
##$XGAIN= (0..3)
0 0 0 0 
##$XL= 0
##$YL= 0
##$YMAX_a= 232527
##$YMIN_a= -448901
##$ZGOPTNS= <>
##$ZL1= 120
##$ZL2= 120
##$ZL3= 120
##$ZL4= 120
##$ABSF1= 15.72375
##$ABSF2= -2.328099
##$ABSG= 5
##$ABSL= 3
##$ALPHA= 0
##$AQORDER= 0
##$ASSFAC= 0
##$ASSFACI= 0
##$ASSFACX= 0
##$ASSWID= 0
##$AUNMP= <proc_1d>
##$AZFE= 0.1
##$AZFW= 0.1
##$BCFW= 0
##$BC_mod= 2
##$BYTORDP= 0
##$COROFFS= 0
##$CY= -3
##$DATMOD= 1
##$DC= 0
##$DFILT= <>
##$DTYPP= 0
##$F1P= 0
##$F2P= 0
##$FCOR= 1
##$FTSIZE= 16384
##$FT_mod= 6
##$GAMMA= 0
##$GB= 0
##$INTBC= 1
##$INTSCL= 0
##$ISEN= 128
##$LB= 0.24
##$LEV0= 0
##$LPBIN= 0
##$MAXI= 10000
##$MC2= 0
##$MEAN= 0
##$ME_mod= 0
##$MI= 1.114404
##$NCOEF= 0
##$NC_proc= -6
##$NLEV= 6
##$NOISF1= 3.799351
##$NOISF2= 2.8
##$NSP= 0
##$NTH_PI= 0
##$NZP= 0
##$OFFSET= 15.72265
##$PC= 1
##$PHC0= -16228.11
##$PHC1= 9.40078
##$PH_mod= 1
##$PKNL= yes
##$PPARMOD= 0
##$PSCAL= 0
##$PSIGN= 0
##$REVERSE= no
##$SF= 200.130005784456
##$SI= 16384
##$SIGF1= 3
##$SIGF2= 2
##$SINO= 5.538805
##$SIOLD= 16384
##$SREGLST= <1H.CDCl3>
##$SSB= 0
##$STSI= 16384
##$STSR= 0
##$SW_p= 3612.71676300578
##$SYMM= 0
##$S_DEV= 0
##$TDeff= 16384
##$TDoff= 0
##$TI= <>
##$TILT= no
##$TM1= 0
##$TM2= 0
##$TOPLEV= 0
##$USERP1= <user>
##$USERP2= <user>
##$USERP3= <user>
##$USERP4= <user>
##$USERP5= <user>
##$WDW= 1
##$XDIM= 16384
##$YMAX_p= 433511045
##$YMIN_p= -266861
$$ End of Bruker specific parameters
$$ ---------------------------------
##NTUPLES= NMR SPECTRUM
##VAR_NAME=  FREQUENCY,     SPECTRUM/REAL,   SPECTRUM/IMAG
##SYMBOL=    X,             R,               I
##VAR_TYPE=  INDEPENDENT,   DEPENDENT,       DEPENDENT
##VAR_FORM=  AFFN,          ASDF,            ASDF
##VAR_DIM=   16384,         16384,           16384
##UNITS=     HZ,            ARBITRARY UNITS, ARBITRARY UNITS
##FACTOR=    0.220516191357247, 1,           1
##FIRST=     3146.57395024759, 0,            0
##LAST=      -466.142812758192, 0,           0
##MIN=       -466.142812758192, -266861,     0
##MAX=       3146.57395024759, 433511045,    0
$$ Real data points
##PAGE= N=1
##DATA TABLE= (X++(R..R)), XYDATA
$$ [...]
7136C282287O6040J1606R0029K45958J55217J16759N0279P1679J52832J20308
$$ 3282287 3348327 3359933 3449962 3695920 3851137 3967896 4018175 4089854 4242686 4362994
7126D362994J44643J84539K92601L41864K20175K12284K09350P7209J23845K4459
$$ 4362994 4507637 4692176 4984777 5326641 5546816 5759100 5968450 6045659 6169504 6193963
7116F193963m9126j16636j5415J65672L3629J29435R2796Q6192J33231J47414
$$ 6193963 6144837 6028201 6012786 6178458 6212087 6341522 6434318 6520510 6653741 6801155
7106F801155K42500J40905K82036K51188L00691L18241L96704N93360O23398N64578
$$ 6801155 7043655 7184560 7466596 7717784 8018475 8336716 8733420 9326780 9950178 10514756
7096A0514756L40527N37920N43481M99877N54254P41433Q17815J061199J024085
$$ 10514756 10855283 11393203 11936684 12436561 12990815 13732248 14550063 15611262 16635347
7087A6635347J399562J707845K051244K383971K815364L216611L849116M499080
$$ 16635347 18034909 19742754 21793998 24177969 26993333 30209944 34059060 38558140
7079C8558140N579391O864357Q882950J1118756J3893758J5415057J4993543J1205858
$$ 38558140 44137531 51001888 59884838 71003594 84897352 100312409 115305952 126511810
7071A26511810M838233j851010r459010j3696158j6089528j5204630j2758182
$$ 126511810 131350043 129499033 120040023 106343865 90254337 75049707 62291525
7064F2291525r801624p259850n687159m532885l572228l026434k546486k177756
$$ 62291525 52489901 45230051 39542892 35010007 31437779 28411345 25864859 23687103
7056B3687103k061678j764263j534313j407844j063796j006273r60425p73404
$$ 23687103 21625425 19861162 18326849 16919005 15855209 14848936 13888511 13115107
7048A3115107q37123o57435p35977n25438m45718m87068m36985l27597j72057
$$ 13115107 12277984 11620549 10884572 10359134 9913416 9426348 8989363 8661766 8489709
7039H489709m84364m26401l22918m00190k38122k68070m44575k67965k47963r8218
$$ 8489709 8005345 7578944 7256026 6855836 6617714 6349644 5905069 5637104 5389141 5290923
7029E290923j31115k34532k43588k02339n5632k02850j45230n4190j11088q1547
$$ 5290923 5159808 4925276 4681688 4479349 4423717 4220867 4075637 4021447 3910359 3828812
7019C828812j39556R46P3652n436o1191j52141J6778j2078j61132l5587r9900
$$ 3828812 3689256 3690202 3763854 3758418 3697227 3545086 3561864 3549786 3388654 3353067 3253167
7008C253167j43586j04757o5957N3031l9336R359n3951j9267r1257m7234p3176
$$ 3253167 3109581 3004824 2938867 2991898 2952562 2961921 2907970 2888703 2797446 2750212 2677036
6997B677036q8557q6291k0143n4213m461j25865J6076L2600m2841o0206K8607
$$ 2677036 2588479 2502188 2482045 2427832 2423371 2297506 2313582 2346182 2303341 2243135 2271742
6986B271742j6488j3402l5736j37070Q293j42135n5274N1414n8676k0132l5053
$$ 2271742 2255254 2241852 2206116 2069046 2077339 1935204 1879930 1931344 1872668 1852536 1817483
6975A817483j18579K053m980l2817K4740q4799N131J02517J8056k03672l952K0648
$$ 1817483 1698904 1700957 1695977 1663160 1687900 1603101 1608232 1710749 1728805 1525133 1521181 1541829
6963A541829j57446n4896j1535O044L8810Q4966q8765j31648o1112N8343p139
$$ 1541829 1384383 1329487 1317952 1323996 1362806 1447772 1359007 1227359 1166247 1224590 1217451
6952A217451p1115J11803j73K768J5428J28449J9791l6545l2231n9993k6694Q5814
$$ 1217451 1146336 1258139 1257966 1260734 1276162 1404611 1424402 1387857 1355626 1295633 1268939 1354753
6940A354753n794j4976l8793l3016n4341N4683m1819j54191N4598K5501j8248
$$ 1354753 1348959 1333983 1295190 1262174 1207833 1262516 1220697 1066506 1121104 1146605 1128357
6929A128357p9099l9307K2024J852l719L3213l2447j616K4915l506M6279M1419
$$ 1128357 1049258 1009951 1031975 1033827 1030108 1063321 1030874 1029258 1054173 1050667 1096946 1138365
6917A138365m793n822R3447R1066j28698m0461q6609r3142N406K4369k9850O0849
$$ 1138365 1133572 1127750 1221197 1312263 1183565 1143104 1056495 963353 968759 993128 963278 1024127
6905A024127j03063q2777N6907j00322o6671n2152o5389N7586K1237O019P6990
$$ 1024127 921064 838287 895194 794872 728201 676049 610660 668246 689483 695502 772492
6894G72492L5263j28399N0216n1469q4708J6574J131m4489Q6990J892j14965m664
$$ 772492 807755 679356 729572 678103 593395 609969 611100 566611 653601 655493 540528 535864
6882E35864O1705M0833j656P4048J01078n5325r7966J6798J421O4073N5735j09874
$$ 535864 597569 638402 636746 710794 811872 756547 658581 675379 676800 740873 796608 686734
6870F86734o4881O9075Q3221N0140n6602j09321N4613n679J093N9925l9783j34295
$$ 686734 621853 690928 774149 824289 767687 658366 712979 707300 708393 768318 728535 594240
6858E94240k2915L0674K9272o5760j06362J2608j8689o4890O1035j0575r623L1204
$$ 594240 571325 601999 631271 565511 459149 471757 453068 388178 449213 438638 429015 460219
6846D60219r7280L8338P9681r8828J414m1828Q2793P0373l3514k8712Q837K2480
$$ 460219 362939 401277 480958 382130 383544 341716 424509 494882 461368 432656 441493 463973
6834D63973M8461q6365r4441P2576k5562o2630J3593j6165n3085L6426Q111J12548
$$ 463973 512434 426069 331628 404204 378642 316012 329605 313440 260355 296781 304892 417440
6822D17440l55o6189k0459N9040J7222Q486Q5798Q1422p742J547n2881k5322m6878
$$ 417440 417085 350896 330437 389477 406699 415185 500983 582405 574663 576210 523329 498007 451129
6809D51129O4799m024n5638n7587R778K5411q7657m2357j13588L1091M8329n3886
$$ 451129 515928 511904 456266 398679 408457 433868 346211 303854 190266 221357 269686 215800
6797B15800O839o0657O8477R4728q6860k4295J51092n1201j8677P2683o496n3732
$$ 215800 222639 161982 230459 325187 238327 214032 365124 313923 295246 367929 361433 307701
6785C07701l7827j5908M3719O9623m7817l9753R1867j18795j8534k575l3725Q066
$$ 307701 269874 253966 297685 367308 319491 279738 371605 252810 234276 231701 197976 206042
6773B06042R3340m0287l9077J0886J2013J4989L6201R142J308l9256n4354O5543
$$ 206042 299382 259095 220018 230904 242917 257906 294107 303249 304557 265301 210947 276490
6761B76490J8738j0301n3455k709R5416m0230K8969N4118o2937l0051O8431P1042
$$ 276490 295228 284927 231472 228763 324179 283949 312918 367036 304099 274048 342479 413521
6749D13521q4514l3510q1389N3041K1868k5756M3355n5184P8708J20960J8456
$$ 413521 329007 295497 214108 267149 289017 263261 306616 251432 330140 451100 469556
6738D69556j5378M0195J10531J16252J42831R5203l1441k9428j9044j40461j21360
$$ 469556 454178 494373 604904 721156 863987 959190 927749 898321 879277 738816 617456
6727F17456r6385k7331M0222j02781q5344m287O45M8952r8354O3603l9492N2955
$$ 617456 521071 493740 533962 431181 345837 341550 342195 391147 292793 356396 316904 369859
6715C69859r1013l6285M9578J3994L6486L0431m0255J3826k8020j32763p872M8822
$$ 369859 278846 242561 292139 306133 342619 373050 332795 346621 318601 185838 177966 226788
6703B26788Q8543J0821j31189J7781Q6848J04370m2974j32315R1607j02191m4917
$$ 226788 315331 326152 194963 212744 299592 403962 360988 228673 320280 218089 173172
6692A73172J06069P7364l2124m1930O6467N7273k3863k9412J19277M8343j16805
$$ 173172 279241 356605 324481 282551 349018 406291 382428 353016 472293 520636 403831
6681D03831m0265j4924P6260J28429N7099K2063o8904L3992O8366N1423P2727
$$ 403831 363566 348642 424902 553331 610430 632493 563589 597581 665947 717370 790097
6670G90097L3853R497r2022o5414j54940n0609o1776l5460O7315N1359j14953
$$ 790097 823950 833447 741425 676011 521071 470462 408686 373226 440541 491900 376947
6659C76947j02602N9427n3773K5687j8313j09598l1050P0709m8860l3532J34791
$$ 376947 274345 333772 279999 305686 287373 177775 146725 217434 168574 135042 269833
6648B69833M5718j08476o297o5688m3299J157K4995M2390m435J5243N9809p2411
$$ 269833 315551 207075 200778 135090 91791 92948 117943 160333 155898 171141 230950 158539
6636A58539Q6320R7790j11999n5628k6844J00929m2853k1020k5183Q1450R7997
$$ 158539 244859 342649 230650 175022 148178 249107 206254 185234 160051 241501 339498
6625C39498r3524R648l5355J2802o8555l8552k2200L8113Q4793P988J45808J5137
$$ 339498 245974 255622 220267 233069 164514 125962 103762 141875 226668 234656 380464 395601
6613C95601m114j9686k100M4498L3325q7522n976M6380Q2212n7525j0558p336
$$ 395601 391487 371801 369701 414199 447524 360002 354026 400406 482618 425093 414535 407199
6601D07199J30287m7075l6153L6121j09137n442K7798N8828q6776K987j6700p8979
$$ 407199 537486 490411 454258 490379 381242 375800 403598 462426 375650 378637 361937 282958
6589B82958Q081J35717r5271R506k1125k5884o9091K579J00949O7926Q0218n887
$$ 282958 291039 426756 331485 340991 319866 293982 224891 227470 328419 396345 476563 470676
6577D70676o4538M0021M1816P1319N0900l889q4513Q8007J85899P8792J15587
$$ 470676 406138 446159 487975 559294 610194 606305 521792 609799 795698 874490 990077
6566I90077J47609N8452M876O4118m320j03048j42611r7259R2291P2988O4066
$$ 990077 1137686 1196138 1201014 1265132 1260812 1157764 1015153 917894 1010185 1083173 1147239
6555A147239J11975P268J58016J45097J58885L19682N56107L69147K60479j51110
$$ 1147239 1259214 1266482 1424498 1569595 1728480 2048162 2604269 2973416 3233895 3082785
6545C082785j63053k74235m88421l99194l35335j55612j70977j68872j06191m6143
$$ 3082785 2919732 2645497 2157076 1757882 1422547 1266935 1095958 927086 820895 774752
6535G74752j262j73900o210n9361p6573K5655p6014j16821n6076N9811L9816J0378
$$ 774752 773490 599590 593380 534019 457446 483101 407087 290266 234190 294001 333817 344195
6523C44195O6133j5567n4893l4647n372J13k6674J8283j0674j7645j12707J06534
$$ 344195 410328 394761 339868 305221 299849 299962 273288 291571 280897 263252 150545 257079
6511B57079K2209o8946p2836J14103O389o9220M1168j69613L7668N2086K1220
$$ 257079 279288 210342 137506 251609 257998 188778 229946 60333 98001 150087 171307
6500A71307m395j3817j07583M5662Q2450j4454m1995m728K3483K3862p1425L404
$$ 171307 166912 153095 45512 91174 173624 159170 117175 112447 135930 159792 88367 91771
6488I1771J16615L5810l324m4811p3053p0308J9435m8344Q144N3090J1n3685o4794
$$ 91771 208386 244196 240872 196061 123008 52700 72135 23791 31935 85025 85036 31351 -33443
6475c3443L698L7388J0808o6973M7716P1237p8374J03300N369p3104J08208m7377
$$ -33443 -29745 7643 18451 -48522 -806 70431 -7943 95357 100726 27622 135830 88453
6463H8453k1135R4750j25182N7993o8885O772R8922N1451m9582j6624J02137m9827
$$ 88453 67318 162068 36886 94879 25994 32766 131688 183139 133557 116933 219070 169243
6451A69243n7760j01375k3238J06729K1514O0355P9036l2763J8831M8751j51015
$$ 169243 111483 10108 -13130 93599 115113 175468 254504 221741 240572 289323 138308
6440A38308j1781R201m1582n474j8988J4599R3255O7347j08116j37275M7428K4565
$$ 138308 126527 135728 94146 88672 69684 84283 177538 244885 136769 -506 46922 71487
6428G1487J911k4613K4007o995o304o0547L1874K6984j9695J02440K7095m459
$$ 71487 73398 48785 72792 65797 59493 -1054 30820 57804 38109 140549 167644 163185
6416A63185P6j1373m0550n2704k9622j9310M4453J13056p156n0191p9529M1536
$$ 163185 163261 151888 111338 58634 29012 9702 54155 167211 160055 109864 30335 71871
6404G1871J63657O2242l3790o2519r3638M5564L8381k0491O5405n9351k2761Q6155
$$ 71871 235528 297770 263980 201461 107823 153387 191768 171277 236682 177331 154570 240725
6392B40725l336J7661P510k6774o9781L6610J44358P6114j27564j42368J5372
$$ 240725 237389 255050 262560 235786 166005 202615 346973 423087 295523 153155 168527
6381A68527O6748o5395P6845P608P9527m5622J4953J0138k206P1593q8284J31095
$$ 168527 235275 169880 246725 254333 333860 288238 303191 313329 311123 382716 294432 425527
6369D25527K4996m2099M5445q878k6943l1128r1198O8119N0337l1021j01920m449
$$ 425527 450523 408424 453869 444991 418048 386920 295722 363841 414178 383157 281237 276788
6357B76788P3161p1848Q8858N5097Q1475m9542k6234J8255l0792L3970J01283
$$ 276788 349949 278101 366959 422056 503531 453989 427755 446010 415218 449188 550471
6346E50471L821p6361m7297p534Q9107N4045o395k3595j04099P3143L5388k5453
$$ 550471 554292 477931 430634 423100 512207 566252 559857 536262 432163 505306 540694 515241
6334E15241N3966N917J6259M3215L6229m3655N9318N4818k4336O4700J11255r6634
$$ 515241 569207 575124 591383 634598 670827 627172 686490 741308 716972 781672 892927 796293
6322G96293K3084N0771Q7938j05087j85J23161m0150k0702r7054J9023r43j28011
$$ 796293 819377 870148 958086 852999 852814 975975 935825 915123 818069 837092 836149 708138
6310G08138n5012L09l4945n2086J5336J7791J26985q3405L6281K8318j721K6667
$$ 708138 653126 653435 618490 566404 581740 599531 726516 643111 679392 707710 705989 732656
6298G32656j2828N0483O1532n1740m5394j4555q0248M6655r5958o550M0438P204
$$ 732656 719828 770311 831843 780103 734709 720154 639906 686561 590603 584053 624491 631695
6286F31695r6566p5905q2548j7558M074M0889O6148k0711k3812P931j26415m5030
$$ 631695 535129 459224 376676 359118 363192 404081 470229 449518 425706 433637 307222 262192
6274B62192K5143P601K0183L8353L6357o331p0481k4016J6653k9857J4936P88
$$ 262192 287335 294936 315119 353472 389829 383498 313017 289001 305654 275797 290733 291521
6262B91521l5470n1049J12366J18533k8833p9237j3114o7658k2911J24448l7073
$$ 291521 256051 205002 317368 435901 407068 327831 314717 247059 224148 348596 311523
6251C11523r7160K6302l78O2648N8370p4505N820n7233M2527P0714m0317m3283
$$ 311523 214363 240665 240287 302935 361305 286800 292620 235387 277914 348628 308311 265028
6239B65028Q4520M5340k6348M622j7029O7795M7937j2523Q7668l748k2465j0742
$$ 265028 349548 394888 368540 373162 356133 423928 471865 459342 547010 543262 520797 510055
6227E10055l6762k8582p520M4431Q4696j74158l4017k1112J2967O3071J6263j8302
$$ 510055 473293 444711 437191 481622 566318 392160 358143 337031 349998 413069 429332 411030
6215D11030k477O1447m6007M1872M176l2720M0552R4432l404j13614l1275J57190
$$ 411030 408553 470000 423993 465865 470041 437321 477873 572305 568901 455287 424012 581202
6203E81202R766Q0404J34370P0547k1846l4715O1306K414n467q345n6253n8083
$$ 581202 590968 671372 805742 876289 854443 819728 881034 883448 877981 869636 813383 755300
6191G55300n3259j1727j38159Q851k5148k4509P2402R1721l2284m6911J4098K9022
$$ 755300 702041 690314 552155 561006 535858 511349 583751 675472 643188 596277 610375 639397
6179F39397p1749o50Q8841K0061O247P3037Q0122P1300M2853L9426Q540P8813
$$ 639397 567648 566998 655839 675900 682147 755184 835306 906606 949459 988885 997425 1076238
6167A076238Q4950J460m1086q2258o1852j05019o6866J41306K2619l4516l6622
$$ 1076238 1161188 1162648 1121562 1039304 977452 872433 805567 946873 969492 934976 898354
6156H98354M5311m8205l1377j2390R8810j3219l2987p1109J1041J07011N9533
$$ 898354 943665 895460 864083 851693 950503 937284 904297 833188 844229 951240 1010773
6145A010773p7262M5610K2116L3718R3498M4748Q4564l4005l7505r182M0899l5893
$$ 1010773 933511 979121 1001237 1034955 1128453 1173201 1257765 1223760 1186255 1177073 1217972 1182079
6133A182079N6096j4443N7073K8454n5408m2773N494K28073j9079n3382J2888
$$ 1182079 1238175 1223732 1280805 1309259 1253851 1211078 1216572 1444645 1425566 1372184 1385072
6122A385072k8495o2760N402Q9000p8316M9948k7547N9090p1087O704M4876k160
$$ 1385072 1356577 1293817 1299219 1388219 1309903 1359851 1332304 1391394 1320307 1327011 1371887 1369727
6110A369727j3214Q98m1393J25090K68267Q6725M349O4574Q2672N223J1165O084
$$ 1369727 1356513 1357411 1316018 1441108 1709375 1796100 1800449 1865023 1947695 1952918 1964083 1970167
6098A970167j79251J27524N1503o1985L3733J27704o1084P2368L7173j0019Q7900
$$ 1970167 1790916 1918440 1969943 1907958 1941691 2069395 2008311 2080679 2117852 2107833 2195733
6087B195733P1466r609q9288o6455L9061j4607K7951r6742m673J8585k8684J623
$$ 2195733 2267199 2257590 2168302 2101847 2140908 2126301 2154252 2057510 2052837 2071422 2042738 2044361
6075B044361O4330K0830O5084J45612L8070J68123J06788l4838K7132J9776J15949
$$ 2044361 2108691 2129521 2194605 2340217 2378287 2546410 2653198 2618360 2645492 2665268 2781217
6064B781217P9622K1105N0006J57378J51612K02477L45957K46466K31650L03822
$$ 2781217 2860839 2881944 2931950 3089328 3240940 3443417 3789374 4035840 4267490 4571312
6054D571312L08060L24303J18950q9735k16962k64506k29027l45567j25520n5615
$$ 4571312 4879372 5203675 5322625 5232890 5015928 4751422 4522395 4176828 4051308 3995693
6044C995693l4460o0641l4939k4647O4797l2400p5733J00248Q6354K7877J01478
$$ 3995693 3961233 3900592 3865653 3841006 3905803 3873403 3797670 3897918 3984272 4012149 4113627
6033D113627M5891J04954J87049K04383K60267K96741L12480O84380N78078N77526
$$ 4113627 4159518 4264472 4451521 4655904 4916171 5212912 5525392 6209772 6787850 7365376
6023G365376N00807Q8305l00895m46631o75820n29580m56817k29810j15896k01865
$$ 7365376 7866183 7954488 7653593 7206962 6531142 6001562 5544745 5314935 5199039 4997174
6013D997174r6542p7326p343j13611k5486P837o2491N6150L4539J07917P9290
$$ 4997174 4900632 4823306 4815963 4702352 4676866 4684703 4622212 4678362 4712901 4820818 4900108
6002D900108P6378L6632J15473J48681J30384L32325K59561L58644M07819K98166
$$ 4900108 4976486 5013118 5128591 5277272 5407656 5739981 5999542 6358186 6766005 7064171
5992G064171K00295j5278k20672k27739l66983m73872j99507q433j86923o8814
$$ 7064171 7264466 7249188 7028516 6800777 6433794 5959922 5760415 5751982 5565059 5496245
5982E496245M4508M8653j8470L3447J2056J46639J6656K2973J37124K1697J25244
$$ 5496245 5540753 5589406 5570936 5604383 5616439 5763078 5779734 5802707 5939831 5961528 6086772
5971F086772P5461L1708O8431J28072Q2331K70196K99778K68316J69434K12953
$$ 6086772 6162233 6193941 6262372 6390444 6472775 6742971 7042749 7311065 7480499 7693452
5961G693452K91322L1370L265O2274q6438M394l6792l5075r0657M6055J9055l2496
$$ 7693452 7984774 8016144 8019409 8081683 7995245 7999639 7962847 7927772 7837115 7883170 7902225 7869729
5949G869729K33559R9164Q8606J81782R8831J58104L5344J02908J38314O0705
$$ 7869729 8103288 8202452 8291058 8472840 8571671 8729775 8765119 8868027 9006341 9067046
5939I067046J51941J64062J65882K06699L45659L22782L23230L37952K20300L02305
$$ 9067046 9218987 9383049 9548931 9755630 10101289 10424071 10747301 11085253 11305553 11607858
5929A1607858L16153K17553J45490P4044J06113R8312P1706Q8912J97742K47907
$$ 11607858 11924011 12141564 12287054 12361098 12467211 12565523 12637229 12726141 12923883 13171790
5919A3171790L77225N42658N72868P77526P82902R16049R83086J054296J391518
$$ 13171790 13549015 14091673 14664541 15442067 16224969 17141018 18124104 19178400 20569918
5910B0569918J717893J978148K552155L379969M191804M161314L349136J381629
$$ 20569918 22287811 24265959 26818114 30198083 34389887 38551201 41900337 43281966
5902D3281966l30297r78030k471285l691209l207842k499394j841083j363078
$$ 43281966 42951669 41973639 39502354 35811145 32603303 30103909 28262826 26899748
5894B6899748j176479p15660m56134j80134k8042J97612L32541O11323Q57321
$$ 26899748 25723269 25007609 24551475 24371341 24343299 24540911 24873452 25484775 26342096
5885B6342096J182789J626520J981408K294169K653178L305678M191291M683998
$$ 26342096 27524885 29151405 31132813 33426982 36080160 39385838 43577129 48261127
5877D8261127N793348P457899R895313J2745151J3175994R992118L883796k852014
$$ 48261127 54054475 61512374 71407687 84152838 97328832 107320950 111204746 108352732
5869A08352732m473057q972341j3651382j2032117q921215o546250n165067l938178
$$ 108352732 103879675 94907334 81255952 69223835 60302620 53756370 48591303 44653125
5861D4653125l109940k495201j864866j328591j169408p42595l91237J04627M32939
$$ 44653125 41543185 39047984 37183118 35854527 34685119 33942524 33551287 33655914 34088853
5852C4088853R83751J421585J830328K346669L164081L790383M429854N488483
$$ 34088853 35072604 36494189 38324517 40671186 43835267 47625650 52055504 57543987
5844E7543987P231121R866378J2825080J3128084R740944L409907l570539n167724
$$ 57543987 64775108 74641486 87466566 100594650 110335594 113745501 110174962 105007238
5836A05007238r646342j4660946j3012886r685765o974577n671244m473045l739699
$$ 105007238 95360896 80699950 67687064 58001299 51026722 45355478 40882433 37142734
5828C7142734l066700k458927k039491j681675j371873j064690q53923n72270
$$ 37142734 34076034 31617107 29577616 27895941 26524068 25459378 24605455 24033185
5820B4033185j55764p6330J73515L06639O98886J009780J215536J498891K303046
$$ 24033185 23877421 23801091 23974606 24281245 24980131 25989911 27205447 28704338 31007384
5811C1007384L160905L886887M012591K821182P90158j344523k065633l585396
$$ 31007384 34168289 38055176 42067767 44888949 45679107 44334584 42268951 38683555
5803C8683555m991636m561759l473475k680710k300739j806436j605195j374422
$$ 38683555 33691919 29130160 25656685 22975975 20675236 18868800 17263605 15889183
5795A5889183j174315p79525q85509o36679n86527n61426l91094l08417l91183
$$ 15889183 14714868 13935343 13049834 12413155 11826628 11265202 10874108 10565691 10174508
5786A0174508l66037k54679k59675l40301k33990k53301j58768j46551j45632
$$ 10174508 9808471 9553792 9294117 8953816 8719826 8466525 8307757 8161206 8015574
5777H015574j53002o5639r7518k51134j47509r3397j64848l18985n3820k37539
$$ 8015574 7862572 7796933 7699415 7448281 7300772 7207375 7042527 6723542 6669722 6432183
5767F432183k93299j86478j01447j12970j07755q4317j53714O7288r2243l1955
$$ 6432183 6138884 5952406 5850959 5737989 5630234 5545917 5392203 5459491 5367248 5335293
5757E335293p6512J1842q476j32907r8138q4083o267j46276k2123l1297j31564
$$ 5335293 5258781 5270623 5262147 5129240 5031102 4947019 4940752 4794476 4772353 4741056 4609492
5746D609492j35819k4862j00199m4990m0221j20848l5302K7153l6976j56181q9539
$$ 4609492 4473673 4448811 4348612 4303622 4263401 4142553 4107251 4134404 4097428 3941247 3851708
5735C851708R2252m5857j8745L5742k8482M8527l9664n8833J09441l6471j63015
$$ 3851708 3943960 3898103 3879358 3915100 3886618 3935145 3895481 3836648 3946089 3909618 3746603
5724C746603j25472j15510m1110p0572j89608p8953j04996j0669m977r7210O8230
$$ 3746603 3621131 3505621 3464511 3393939 3204331 3125378 3020382 3009713 3004736 2907526 2975756
5713B975756j6388o8114m1410j37062O0933m0861P934n3965p8637J9777j03336
$$ 2975756 2959368 2891254 2849844 2712782 2773715 2732854 2740788 2686823 2608186 2627963 2524627
5702B524627M5361k3095m6986o6155p3590K003N31O6078P6846p9878k5209K8786
$$ 2524627 2569988 2546893 2499907 2433752 2360162 2362165 2362696 2428774 2505620 2425742 2400533 2429319
5690B429319P1227m7427q1760j04482q0326l4378n2819n7221q6165O4187k4597
$$ 2429319 2500546 2453119 2371359 2266877 2186551 2152173 2099354 2042133 1955968 2020155 1995558
5679A995558K3342L1291o8478O2561m8056j53526q0290k3180L1263k5775j1187
$$ 1995558 2018900 2050191 1981713 2044274 1996218 1842692 1762402 1739222 1770485 1744710 1733523
5668A733523O0515k5013k1367P0025o9492m6034N9335k7185J43152k5865j0723
$$ 1733523 1794038 1769025 1747658 1817683 1748191 1702157 1761492 1734307 1877459 1851594 1840871
5657A840871j1903j24776m4216q0525N5056j9364p1452m2308P1318n0220k444
$$ 1840871 1828968 1704192 1659976 1579451 1634507 1615143 1543691 1501383 1572701 1522481 1520037
5646A520037J9927M6820o1717N9389J4572j4207l8104l6843J2565q7867L6764
$$ 1520037 1539964 1586784 1525067 1584456 1599028 1584821 1546717 1509874 1522439 1434572 1471336
5635A471336N4198o2389p4423k9171j8495P5157p3778n0801N0517J43384n4555
$$ 1471336 1525534 1463145 1388722 1359551 1341056 1416213 1342435 1291634 1342151 1485535 1430980
5624A430980m2107N9043l8702L6341j0686M1076k8490m4797K0510L2446K4642
$$ 1430980 1388873 1447916 1409214 1445555 1434869 1475945 1447455 1402658 1423168 1455614 1480256
5613A480256L2970L2186M3391L6779n3239M3664k7683p8021q0729n4883k1140
$$ 1480256 1513226 1545412 1588803 1625582 1572343 1616007 1588324 1510303 1429574 1374691 1353551
5602A353551r12l8881q2334L4549O493j4320l8957J16578M3670O57q4487m7350
$$ 1353551 1352639 1313758 1231424 1265973 1272466 1258146 1219189 1335767 1379437 1380094 1295607 1248257
5590A248257j2420M7850k3840m1L1367l3221K600N7987l1493l3859J5134O4283
$$ 1248257 1235837 1283687 1259847 1259806 1291173 1257952 1260552 1318539 1287046 1253187 1268321 1332604
5578A332604P2416p4802P0472j506J45304O4740J4445M9475K3091R7535J5608
$$ 1332604 1405020 1330218 1400690 1399184 1544488 1609228 1623673 1673148 1696239 1793774 1809382
5567A809382O437O4994m2385M4618Q8421j3037m404j06826j08937P1806k5585
$$ 1809382 1815819 1880813 1838428 1883046 1971467 1958430 1954026 1847200 1738263 1810069 1784484
5556A784484j62816m786J4545k7525N4476R8474R8048k5405J29259J25700J79054
$$ 1784484 1621668 1616882 1631427 1603902 1658378 1756852 1854900 1829495 1958754 2084454 2263508
5545B263508K44159J08707J7931L9753L9484l2983j25776p9260j97695q9560j02203
$$ 2263508 2507667 2616374 2634305 2674058 2713542 2680559 2554783 2475523 2277828 2188268 2086065
5534B086065r1669k7919j09661n5892p9428j11585R489m1629N1987q0609R273
$$ 2086065 1994396 1966477 1856816 1800924 1721496 1609911 1619400 1577771 1629758 1549149 1558422
5523A558422K3599j8586R9899j5881K1571J055J53381j8824o5214k1719O3018
$$ 1558422 1582021 1563435 1663334 1647453 1669024 1670079 1823460 1804636 1739422 1717703 1780721
5512A780721J72467j6518j198N8545L5771O813N5341j0447j4627o1115r2617o4585
$$ 1780721 1953188 1936670 1935472 1994017 2029788 2036601 2091942 2081495 2066868 2005753 1913136 1848551
5500A848551o6920j5192k3571k9265N7702p1923j1095J29044k7314p6497J9204
$$ 1848551 1781631 1766439 1742868 1713603 1771305 1699382 1688287 1817331 1790017 1713520 1732724
5489A732724R4659J8839R0360L6665P8559n260N9970k0502m3137N0381J5573r7479
$$ 1732724 1827383 1846222 1936582 1973247 2051806 2046546 2106516 2086014 2042877 2093258 2108831 2011352
5477B011352R6396J07882R2142J10543n473n9310j11270O5091L481m234J4462
$$ 2011352 2107748 2215630 2307772 2418315 2412842 2353532 2242262 2307353 2310834 2306600 2321062
5466B321062m7070j96063n2597N4637N4456j8444L2265O1828l906K6900j0630
$$ 2321062 2273992 2077929 2025332 2079969 2134425 2115981 2148246 2210074 2206168 2233068 2222438
5455B222438J46611J13977R1915m3505N2496N3986j2337j55701j30686r2753N3621
$$ 2222438 2369049 2483026 2574941 2531436 2583932 2637918 2625581 2469880 2339194 2246441 2300062
5444B300062O0410O3622O6794J6363N696j06915j13531j43717n9067m8114R6259
$$ 2300062 2360472 2424094 2490888 2507251 2512947 2406032 2292501 2148784 2089717 2041603 2137862
5433B137862o7611r7561n2234Q2072J40447j9375k6253P5937j6729O6590P2470
$$ 2137862 2070251 1972690 1920456 2002528 2142975 2123600 2097347 2173284 2156555 2223145 2295615
5422B295615Q4569R6614p9146q3975k1359M5249r8722O7604K8900j9923n8726
$$ 2295615 2380184 2476798 2397652 2313677 2292318 2337567 2238845 2306449 2335349 2315426 2256700
5411B256700k4471J21508m3230K505N0250r2213k5030M239r7871j08587k5916
$$ 2256700 2232229 2353737 2310507 2313012 2363262 2271049 2246019 2250258 2152387 2043800 2017884
5400B017884j40476j265K0944r8550N0216O3900J09245N7872q831r7642Q3045
$$ 2017884 1877408 1876143 1897087 1798537 1848753 1912653 2021898 2079770 2070939 1973297 2056342
5389B056342k6894r3000O2505P14J5379q8689j3361q2325R0054N6221P5814J007
$$ 2056342 2029448 1936448 1998953 1999667 2015046 1926357 1912996 1830671 1920725 1976946 2052760 2053767
5377B053767j03776j24898k961K8128q9785M7813j5275j1591n3132j6307j2246
$$ 2053767 1949991 1825093 1822132 1850260 1760475 1808288 1793013 1781422 1728290 1711983 1699737
5366A699737M6848k2471j5513J9414R3083j2111q030K6665M5196m0764p9583K8763
$$ 1699737 1746585 1724114 1708601 1728015 1821098 1808987 1800957 1827622 1872818 1832054 1752471 1781234
5354A781234n1268n850p827J8812O809j5942J9317J12790n2795n3600L7567M1837
$$ 1781234 1729966 1724116 1716289 1735101 1741910 1725968 1745285 1858075 1805280 1751680 1789247 1831084
5342A831084j5672L1250M3630j8516l0355m6389R1097o5995j35663P7344R7995
$$ 1831084 1815412 1846662 1890292 1871776 1841421 1795032 1886129 1820134 1684471 1761815 1859810
5331A859810L445J4793L7616O6404j8044k1551o0519r2583L0901n576L1169J50797
$$ 1859810 1863255 1878048 1915664 1982068 1964024 1942473 1881954 1789371 1820272 1814696 1845865 1996662
5319A996662O9874R5792P1147m1551p1363O3396J2551j1199m7770J4683k0644
$$ 1996662 2066536 2162328 2233475 2191924 2120561 2183957 2196508 2185309 2137539 2152222 2131578
5308B131578k9555R357J3422J3250j23154O6515K2724R1095P3643q366J3037j7952
$$ 2131578 2102023 2111380 2124802 2138052 2014898 2081413 2104137 2195232 2268875 2260509 2273546 2255594
5296B255594R595M6309R5387N1670Q5740p2730J46465O3994m6226j8090q3537
$$ 2255594 2265189 2311498 2406885 2458555 2544295 2471565 2618030 2682024 2635798 2617708 2534171
5285B534171J3270J2245J02358r162R4325K608N138L7358L8919k4804m2593j00627
$$ 2534171 2547441 2559686 2662044 2652882 2747207 2749815 2754953 2792311 2831230 2806426 2763833 2663206
5273B663206r4167J09979p3782R169J6742q128J6840N6563m5766L7552K6890J04691
$$ 2663206 2569039 2679018 2605236 2614405 2631147 2623019 2639859 2696422 2650656 2688208 2715098 2819789
5261B819789M8363O7721N4904N6210L5410N0200j5951r9226O1971n887k06023
$$ 2819789 2868152 2935873 2990777 3046987 3082397 3132597 3116646 3017420 3079391 3073504 2867481
5250B867481j13742K0951K7349k0059m9562L7662m1594k1296m8274O3814Q4193
$$ 2867481 2753739 2774690 2802039 2781980 2732418 2770080 2728486 2707190 2658916 2722730 2806923
5239B806923J5996l6863N6380M9106M7828l5111Q6946m3417q0258O0299O6266
$$ 2806923 2822919 2786056 2842436 2891542 2939370 2904259 2991205 2947788 2867530 2927829 2994095
5228B994095M782p5834q635m1524p9062k6774N6515m5943O5099J10613L3050k6395
$$ 2994095 2998877 2923043 2914408 2872884 2793822 2767048 2823563 2777620 2842719 2953332 2986382 2959987
5216B959987J03132R681L0649J72375J0510q7024J1205J25189P4565l0086O3948
$$ 2959987 3063119 3072800 3103449 3275824 3286334 3199310 3210515 3335704 3410269 3380183 3444131
5205C444131j06547m7661N5978l1293m0460Q0123p9215L9228P4644q5523N2811
$$ 3444131 3337584 3289923 3345901 3314608 3274148 3354271 3275056 3314284 3388928 3303405 3356216
5194C356216P4715L2899o7835Q9680K8258R4208N6711O8625Q9756K1983K2550
$$ 3356216 3430931 3463830 3395995 3485675 3513933 3608141 3664852 3733477 3823233 3845216 3867766
5183C867766O1137N8628J2606m7879n2309K2631R8922M4950O5888J55533Q3510
$$ 3867766 3928903 3987531 4000137 3952258 3899949 3922580 4021502 4066452 4132340 4287873 4371383
5172D371383K5372J96327N4022J76025N2197R7294P4012K22629N1667O6360J37022
$$ 4371383 4396755 4593082 4647104 4823129 4875326 4972620 5046632 5269261 5320928 5387288 5524310
5161E524310J98216J36609M9240L59666K24312J77066K80993K65505M12550M81632
$$ 5524310 5722526 5859135 5908375 6268041 6492353 6669419 6950412 7215917 7628467 8110099
5151H110099N49520N34717N99789M90182K72870K63738J64580j9229o663k5126
$$ 8110099 8659619 9194336 9794125 10284307 10557177 10820915 10985495 10966266 10959603 10934477
5141A0934477n6036j28099j41060M5681J50063J50718J10837R7239Q4095J70069
$$ 10934477 10878441 10750342 10609282 10654963 10805026 10955744 11066581 11163820 11247915 11417984
5131A1417984J86062J66051J87204K17000J9004k6454p3321J65122J59878J53277
$$ 11417984 11604046 11770097 11957301 12174301 12193305 12166851 12093530 12258652 12418530 12571807
5121A2571807J62708J73363K29670K99020L08114L76931N98284P55216J090005
$$ 12571807 12734515 12907878 13137548 13436568 13744682 14121613 14719897 15475113 16565118
5112A6565118J434307J569755J371918R87770Q57270J094952P30837m70271r09620
$$ 16565118 17999425 19569180 20941098 21928868 22786138 23881090 24611927 24141656 23232036
5103B3232036p60346p00396q90352j024972o99119l24793Q7867L36426M92984
$$ 23232036 22471690 21771294 20880942 19855970 19156851 18832058 18919925 19256351 19749335
5094A9749335O29026P06290R50843J080629J194765J694559K465082L142058L692553
$$ 19749335 20378361 21084651 22035494 23116123 24310888 26005447 28470529 31612587 35305140
5085C5305140L423973K579557J939121K311126J675461o66207k280121j995863
$$ 35305140 38729113 41308670 43247791 45558917 47234378 46568171 44288050 42292187
5077D2292187j465177j872984k044255j251573j55667J020432J509288J602126
$$ 42292187 40827010 38954026 36909771 35658198 35502531 36522963 38032251 39634377
5069C9634377J122438O24187J029038J202065P64370J708157K991736L653810
$$ 39634377 40756815 41381002 42410040 43612105 44376475 46084632 49076368 52730178
5061E2730178L513214L250994M527826O814454P437813P217296N290547J359023
$$ 52730178 56243392 59494386 64022212 70836666 78274479 85491775 90782322 92141345
5053I2141345Q71911J238135o41652j883064j969926j566683n08861l76289j614438
$$ 92141345 93013256 94251391 93609739 91726675 89756749 88190066 87681205 87304916 85690478
5044H5690478m589500o584039m223293l881494m999701m192897l393270l230959
$$ 85690478 81100978 74516939 70293646 66412152 61412451 57219554 53826284 50595325
5036E0595325k308943j958275k421924j389050J02474J180521J269512P62597
$$ 50595325 48286382 46328107 43906183 42517133 42619607 43800128 45069640 45832237
5028D5832237J52358p04172k008449k020891k351016k630177j693236q66412o04494
$$ 45832237 45984595 45280423 43271974 41251083 38900067 36269890 34576654 33710242 33105748
5019C3105748p70829j294833p36590n26699n82541p05411p70149j244785j017775
$$ 33105748 32334919 31040086 30303496 29776797 29194256 28488845 27718696 26473911 25456136
5010B5456136r23279j547717j378642p36838k18350L76112N51567K88475l21477
$$ 25456136 24532857 22985140 21606498 20869660 20651310 21027422 21578989 21867464 21545987
5001B1545987q71146o33410j157023j889513j413636j049720q96863p47174o72900
$$ 21545987 20674841 20041431 18884408 16994895 15581259 14531539 13634676 12887502 12214602
4992A2214602m45512m31404k69596l85772l50837k19198j96563k09025j19162
$$ 12214602 11769090 11337686 11068090 10682318 10331481 10112283 9915720 9706695 9587533
4983I587533k54832k38201j4286k14829p8859L4296m7200M494j16595n9384k3874
$$ 9587533 9332701 9094500 9080214 8865385 8786526 8820822 8773622 8778116 8661521 8602137 8578263
4972H578263r2188p9925r926o0478P5637k375j44208j0654N0871p2592K2500k365
$$ 8578263 8486075 8406150 8396224 8335746 8411383 8409008 8264800 8254146 8305017 8232425 8254925 8252560
4960H252560o7457N4728M109P1818M4948J81566J00669r5309J32403J53505J65100
$$ 8252560 8185103 8239831 8243940 8315758 8360706 8542272 8642941 8547632 8680035 8833540 8998640
4949H998640J45022K16315R4168K50515K46644J97631L39914M25584N29242N88386
$$ 8998640 9143662 9359977 9454145 9704660 9951304 10148935 10488849 10914433 11443675 12032061
4939A2032061O86520Q72784J110746J349293J698290J798334J935722J889642
$$ 12032061 12718581 13591365 14702111 16051404 17749694 19548028 21483750 23373392
4931B3373392J922511K333671K242826K045334J691643M67551k92475j986298
$$ 23373392 25295903 27629574 29872400 31917734 33609377 34076928 33784453 31798155
4923C1798155k928156k781184k750773k299327j747764j194946r74297n64068
$$ 31798155 28869999 26088815 23338042 21038715 19290951 18096005 17121708 16557640
4915A6557640k57294r0468j65014J2672R3926K08163K16093L49439M63771Q56477
$$ 16557640 16300346 16209878 16044864 16057536 16151462 16359625 16575718 16925157 17388928 18245405
4905A8245405J085329J028475J066667O62602M42186N13707J99760N42480J201743
$$ 18245405 19330734 20359209 21425876 22088478 22530664 23044371 23244131 23786611 24988354
4896B4988354J334133J276499R93182Q22309Q05395P13738J433539K651339M230481
$$ 24988354 26322487 27598986 28592168 29414477 30219872 30933610 32367149 35018488 39248969
4887C9248969M624117L904875K104930p12475k281751m593923m988295l356658
$$ 39248969 43873086 47777961 49882891 49170416 46888665 42294742 37306447 33949789
4879C3949789j967828r71439n6866N86623J576995K845742M024914L810443K894821
$$ 33949789 31981961 31010522 30953656 31540279 33117274 35963016 39987930 43798373 46693194
4870D6693194M59987j713556l294199m990338m359991k705961j716770r83687
$$ 46693194 47153181 45439625 42145426 37155088 32795097 30089136 28372366 27388679
4862B7388679p66169r09696q39743j130460j150751q24949m76314l61363m17011
$$ 27388679 26622510 25712814 24873071 23742611 22591860 21766911 21290597 20929234 20512223
4853B0512223o58374o51369q94184p71744o46505m29086l27832k93702j54563
$$ 20512223 19853849 19202480 18308296 17536552 16890047 16460961 16133129 15839427 15684864
4844A5684864Q3017J26216L30865L42384N41130O35832P37495R47622J063017
$$ 15684864 15767881 15894097 16224962 16567346 17108476 17744308 18481803 19429425 20492442
4835B0492442J451981J911994K128716K661252L091085L515810L652789K827461
$$ 20492442 21944423 23856417 25985133 28646385 31737470 35253280 38906069 41733530
4827D1733530J424344r8515L67383Q71840p81586j447897j321278q37492j178090
$$ 41733530 43157874 43059359 43426742 44298582 43516996 42069099 40747821 39910329 38732239
4818C8732239j259904o71051m02477L60046J132181J649604J611093K014262K379608
$$ 38732239 37472335 36801284 36398807 36758853 37891034 39540638 41151731 43165993 45545601
4809D5545601K164739L233362L905882K438258j0391j533465k34347j256212l648398
$$ 45545601 47710340 50943702 54849584 57287842 57277451 55743986 55509639 54253427 50605029
4800E0605029l745469k609498q77365n65832q10447q65683o89714o20389j438434
$$ 50605029 46859560 44250062 43372697 42806865 41996418 41130735 40441021 39820632 38382198
4791C8382198r17038k63783o27422m55764k20794O06046N67489j117441k766051
$$ 38382198 37465160 37201377 36573955 36118191 35897397 36503443 37070932 35953491 33187440
4782C3187440k400423j884705l302909l457114k581177j925711j440712j244892
$$ 33187440 30787017 28902312 25599403 22142289 19561112 17635401 16194689 14949797
4774A4949797r89830r57282p52168n78514m54708n43098n09115l54821l70015
$$ 14949797 13959967 13002685 12250517 11672003 11217295 10674197 10165082 9810261 9440246
4765I440246k96746l49587j38275k94272k27840j44039j52167k48768k42413j84441
$$ 9440246 9143500 8793913 8655638 8361366 8133526 7989487 7837320 7588552 7346139 7161698
4755G161698k38909k51461k01999k01053p5592j72005j56887q1091J1331j72557
$$ 7161698 6922789 6671328 6469329 6268276 6192684 6020679 5863792 5782701 5794032 5621475
4745E621475j93741p1931m8896n6196j33758N2205N5945q3788k7540K9290m1802
$$ 5621475 5427734 5355803 5306907 5250711 5116953 5169158 5225103 5141315 5113775 5143065 5101263
4734E101263l3510j7393j36195j56032j3505n3609m1630L3515j0475p5211l4428
$$ 5101263 5067753 5050360 4914165 4758133 4744628 4691019 4649389 4682904 4672429 4597218 4562790
4723D562790p4972q7719J47378k9343p1860P8396q4045k8349p6783j77164j02867
$$ 4562790 4487818 4400099 4547477 4518134 4446274 4524670 4440625 4412276 4335493 4158329 4055462
4712D055462J1779m8607j03836j63727p5015j4200M344o8954n4946J355r8445
$$ 4055462 4067241 4018634 3914798 3751071 3676056 3661856 3666200 3597246 3542300 3543655 3445210
4701C445210K2766K8534N4419J07932j8743k9990p7610j08284j6605m781j6983
$$ 3445210 3467976 3496510 3550929 3658861 3640118 3610128 3532518 3424234 3407629 3402848 3385865
4690C385865j25326r5291M6339p421m8824J03164J07124N1422l642j60206J910
$$ 3385865 3260539 3165248 3211587 3204166 3155342 3258506 3365630 3417052 3413410 3253204 3255114
4679C255114j8822m6065P3958r0200n1793L160K9996j79061j07570j1571q1309
$$ 3255114 3236292 3190227 3264185 3173985 3122192 3125352 3155348 2976287 2868717 2857146 2775837
4668B775837o177K1908p1415j2769L8274P4700L0495J01057m8004m2766M0695
$$ 2775837 2769660 2791568 2720153 2707384 2745658 2820358 2850853 2951910 2903906 2861140 2901835
4657B901835M0701K0932j6700P9390n9652o7957J0886o1164q7003o970P069j4292
$$ 2901835 2942536 2963468 2946768 3026158 2966506 2898549 2909435 2848271 2761268 2754298 2761367 2747075
4645B747075n0265N9443K1966q252L4866P9334K9180O6149O724M6372k746j8445
$$ 2747075 2696810 2756253 2778219 2769967 2804833 2884167 2913347 2979496 2986220 3032592 3029846 3011401
4633C011401j00607j145q4593o7305o8165q3099q220K1071k7784q3649Q033R7372
$$ 3011401 2910794 2909649 2825056 2757751 2689586 2606487 2598267 2619338 2591554 2507905 2515938 2613310
4621B613310N8628K8417K1170J2387J33546o6883r9431R7383j0727j44334j4665
$$ 2613310 2671938 2700355 2721525 2733912 2867458 2800575 2701144 2798527 2787800 2643466 2628801
4610B628801R5731q3570J48782l4441l0419N774l5967m2884N9632J3868K125J33826
$$ 2628801 2724532 2640962 2789744 2755303 2724884 2730658 2694691 2651807 2711439 2725307 2727432 2861258
4598B861258k1009Q8529J8390l746K344K086o7431n47N7408K831J03715Q1325
$$ 2861258 2840249 2928778 2947168 2943422 2945766 2947852 2880421 2879874 2937282 2940113 3043828 3125153
4586C125153K8564J20600Q9391O6428J1115J80960l7101n1362J27283J4548l9356
$$ 3125153 3153717 3274317 3363708 3430136 3441251 3622211 3585110 3533748 3661031 3675579 3636223
4575C636223Q2651J91653p979N0780N6791M6357J3255j09445q2547P318R1847
$$ 3636223 3718874 3910527 3902548 3953328 4010119 4056476 4069731 3960286 3877739 3885057 3976904
4564C976904P5397J33613O8627J00848J14972j177J8307m0984P5333M6537M2402
$$ 3976904 4052301 4185914 4254541 4355389 4470361 4469184 4487491 4446507 4521840 4568377 4610779
4553D610779K02330K31798O9482Q798M7457O4754O5598J10840J33383J68037R0774
$$ 4610779 4813109 5044907 5114389 5123187 5170644 5235398 5300996 5411836 5545219 5713256 5804030
4542E804030J54730R9579R2121J7920M9473P2841m2947J6433J7867K55040J15348
$$ 5804030 5958760 6058339 6150460 6168380 6217853 6290694 6247747 6264180 6282047 6537087 6652435
4531F652435J36086L12430J04962K11482L29176J63473J37733M9376K86634L15413
$$ 6652435 6788521 7100951 7205913 7417395 7746571 7910044 8047777 8097153 8383787 8699200
4521H699200J82348J87442J88434K35219M38349K43167L55955M13239M62666N23784
$$ 8699200 8881548 9068990 9257424 9492643 9930992 10174159 10530114 10943353 11406019 11929803
4511A1929803O66245Q57879P94460J004694J172727J506374J672425J951080K409228
$$ 11929803 12596048 13453927 14248387 15253081 16425808 17932182 19604607 21555687 23964915
4502B3964915K972337L945912M892757N184487M551351L050722J619312K19092
$$ 23964915 26937252 30883164 35775921 40960408 45511759 48562481 50181793 50400885
4494E0400885j191656j599407j205170K58205K313422L210322K077486l41383
$$ 50400885 49209229 47609822 46404652 46662857 48976279 52186601 54264087 53922704
4486E3922704j800555j739222l267835m423670l349173j548855k3407J299220
$$ 53922704 52122149 50382927 47115092 42691422 39342249 37793394 37769987 39069207
4478C9069207K229889K607717K174982J278754O31051L18179k01703r48217q27288
$$ 39069207 41299096 43906813 46081795 47360549 47991600 48309779 48108076 47159859 46332571
4469D6332571K62930P57967K15965m7286j904655l519167l166022l641312m717075
$$ 46332571 46595501 47353468 47569433 47522147 45617492 42098325 38932303 35290991 30573916
4460C0573916l945989k916354k161880j563039j275300j036065q11478o07176
$$ 30573916 26627927 23711573 21549693 19986654 18711354 17675289 16863811 16256635
4452A6256635n22069k71514k82592l65514l58053n10640n76747o57922o95862
$$ 16256635 15734566 15463052 15180460 14814946 14456893 13946253 13369506 12711584 12015722
4443A2015722o16288p28374m54475m24517m03885m10905k32703j89943l17419
$$ 12015722 11399434 10671060 10216585 9792068 9388183 8977278 8744575 8554632 8237213
4434H237213k27332k20622k76542k50851j93572j74144j64624j19129j66786j29793
$$ 8237213 8009881 7789259 7512717 7261866 7068294 6894150 6729526 6610397 6443611 6313818
4424F313818J5345j2010r3047k23487j0475L3633j01166j14120n6753j40126k1623
$$ 6313818 6329163 6317153 6224106 6000619 5990144 6023777 5922611 5808491 5751738 5611612 5589989
4413E589989j34961m1274L250r0006j6566m1029Q047o79J8575j05106k8254n1722
$$ 5589989 5455028 5413754 5417004 5326998 5310432 5269403 5277450 5276771 5295346 5190240 5161986 5110264
4401E110264p0363r6970N5575j1615j5049r7507l0577P8052K1383K8037l9869
$$ 5110264 5039901 4942931 4998506 4986891 4971842 4874335 4843758 4921810 4943193 4971230 4931361
4390D931361o7425N3526n546j091j025r934J32581M4073L7849K8515J67656K92910
$$ 4931361 4863936 4917462 4911916 4910825 4909800 4899866 5032447 5076520 5114369 5142884 5310540 5603450
4378E603450M13076M43658M92861M79397J87313j97279k11478n73635n91897n25703
$$ 5603450 6016526 6460184 6953045 7432442 7619755 7422476 7210998 6637363 6045466 5519763
4368E519763l79655j70064k76121k09950j56542k32697j26595r381r5272j08405
$$ 5519763 5140108 4970044 4693923 4483973 4327431 4094734 3968139 3958758 3863486 3755081
4358C755081l8164M16l0328q1303K3047j19669k5018L5931R6837J8002n1140N1772
$$ 3755081 3716917 3717333 3687005 3605702 3628749 3509080 3484062 3519993 3616830 3634832 3583692 3635464
4346C635464M449J6265N4281j38538p7605n6742J1020L260Q2765J05343o097L4508
$$ 3635464 3639913 3656178 3710459 3571921 3494316 3437574 3448594 3451854 3534619 3639962 3633865 3668373
4334C668373O4514k5338K1182K1458N783K0001R0195M6667P0635J19449J82531
$$ 3668373 3732887 3707549 3728731 3750189 3755972 3775973 3866168 3912835 3983470 4102919 4285450
4323D285450P8986J70553J48887N3381l7108J27001o2939k37034k862o622j1733
$$ 4285450 4364436 4534989 4683876 4737257 4700149 4827150 4764211 4527177 4524315 4517693 4505960
4312D505960n3605n865l8431N6001O8573M4418M8360N9222M26M4866P82K8401
$$ 4505960 4452355 4446490 4408059 4464060 4532633 4577051 4625411 4684633 4685059 4729925 4730707 4759108
4300D759108R1547j3096J00995P7889O8417J05413N595J62711K36087J02929J12721
$$ 4759108 4850655 4837559 4938554 5016443 5084860 5190273 5195868 5358579 5594666 5697595 5810316
4289E810316J49472Q9254N4590J34069J97280L38006L22092K92757L40964L40801
$$ 5810316 5959788 6049042 6103632 6237701 6434981 6772987 7095079 7387836 7728800 8069601
4279H069601R2989j00742j47599l46409k61039j43175q3892q2402p187r0852J4765
$$ 8069601 8162590 8061848 7914249 7567840 7306801 7163626 7079734 6997332 6990145 6899293 6914058
4268F914058j0026M3623R3892J08705J79422L77860J48945L89830L75276L83954
$$ 6914058 6904032 6947655 7041547 7150252 7329674 7707534 7856479 8246309 8621585 9005539
4258I005539L33501K89725L04884L09559M18747N70945O18246O76533P41979Q34165
$$ 9005539 9339040 9628765 9933649 10243208 10661955 11232900 11851146 12527679 13269658 14103823
4248A4103823M34768M5714j96337j8690m97404o24481m43429k07759j58259j08382
$$ 14103823 14538591 14584305 14387968 14369278 13871874 13247393 12803964 12596205 12437946 12329564
4238A2329564j14651N6971p7396j12081K3812M2080J04260K88473J39027J75313
$$ 12329564 12214913 12271884 12194488 12082407 12106219 12148299 12252559 12541032 12680059 12855372
4228A2855372L49711L24642l4999K50958J33983J35233J69332K24657J12421K18557
$$ 12855372 13205083 13529725 13494726 13745684 13879667 14014900 14184232 14408889 14521310 14739867
4218A4739867K44036L68555M71192M69742M66413L44663M63955L71547L90786
$$ 14739867 14983903 15352458 15823650 16293392 16759805 17104468 17568423 17939970 18330756
4209A8330756M94591M47028N26289M95595L60547L51035L58161L94512M39598
$$ 18330756 18825347 19272375 19798664 20294259 20654806 21005841 21364002 21758514 22198112
4200B2198112M32254N92017O66388N54820O74197P60563R34024J294047J534134
$$ 22198112 22630366 23222383 23888771 24443591 25117788 25878351 26812375 28106422 29640556
4191B9640556J735416J779303J628860J575922J356019J543310J653729K034563
$$ 29640556 31375972 33155275 34784135 36360057 37716076 39259386 40913115 42947678
4183D2947678K282244K643502K878767L400474M174542M675159N655224O896512
$$ 42947678 45229922 47873424 50752191 54152665 58327207 63002366 68657590 75554102
4175G5554102P954247R431201J0916176J3372131J6079854J9316647K3409104
$$ 75554102 83508349 92939550 103855726 117227857 133307711 152624358 176033462
4168A76033462K9650030L9767782N0824045N4560694N0350962K7130559N193511
$$ 176033462 205683492 245451274 296275319 350836013 401186975 428317534 433511045
4161D33511045k4803225m6852493n6486932n6558750m2647018l1888071k3619402
$$ 433511045 408707820 361855327 305368395 248809645 206162627 174274556 150655154
4154A50655154j8977583j4852763j2429689j0148254q783560p068592o321194
$$ 150655154 131677571 116824808 104395119 94246865 85463305 78394713 72073519
4147G2073519n366141m918912m195672m063238l462461l258621k808977k783816
$$ 72073519 66707378 61788466 57592794 53529556 50067095 46808474 43999497 41215681
4139D1215681k240090k171721j841343j682597j423800j330458j092947j122515
$$ 41215681 38975591 36803870 34962527 33279930 31856130 30525672 29432725 28310210
4131B8310210r51169j162840j060301j258079j094178j084092p88202q82848p68539
$$ 28310210 27359041 26196201 25135900 23877821 22783643 21699551 20911349 20028501 19259962
4122A9259962p77570r14988q95026p84604o91089n73895n22467k62335k91399
$$ 19259962 18482392 17567404 16672378 15887774 15196685 14622790 14100323 13837988 13546589
4113A3546589k28809l23939j30918j12396j03261k39260j75972j51734j86384
$$ 13546589 13317780 12993841 12862923 12750527 12647266 12408006 12232034 12080300 11893916
4104A1893916k58030l25629k39740j57137j98208O6198j58240r7226q1463n7159
$$ 11893916 11635886 11310257 11070517 10913380 10715172 10781370 10623130 10525904 10444441 10387282
4094A0387282j01962j39093k19698j22006k17269j65956j48618j55081q6621r7802
$$ 10387282 10285320 10146227 9926529 9804523 9587254 9421298 9272680 9117599 9030978 8933176
4084H933176j27007q2993j22461k08628m5828R676j43756k41931k48186j88045
$$ 8933176 8806169 8723176 8600715 8392087 8346259 8355935 8212179 7970248 7722062 7534017
4074G534017k18144k47041j47175j11041j65579k40312n4104r9990N844Q635N1918
$$ 7534017 7315873 7068832 6921657 6810616 6645037 6404725 6350621 6250631 6256475 6265110 6317028
4063F317028k3289j00393j90920r5524m2654j44808r3799k74925j32722q6153
$$ 6317028 6293739 6193346 6002426 5906902 5864248 5719440 5625641 5350716 5217994 5131841
4053E131841k29108j22386k33805L680K6475p1167j12303P454O3584J45585O7891
$$ 5131841 4902733 4780347 4546542 4550222 4576697 4505530 4393227 4400681 4464265 4609850 4677741
4042D677741k1828m2370Q6529J9016M9819j02872q0510J493k2103j23440p5425
$$ 4677741 4655913 4613543 4700072 4719088 4768907 4666035 4585525 4587018 4564915 4441475 4366050
4031D366050j96627j62534r5459o9494n1354j01548p3851k3040l1059n1719r7366
$$ 4366050 4169423 4006889 3911430 3841936 3790582 3689034 3615183 3592143 3561084 3509365 3411999
4020C411999q0450N088j05809k8067J378l8382o3723L7724J3305j15708M852j07401
$$ 3411999 3331549 3336637 3230828 3202761 3204139 3165757 3102034 3139758 3153063 3037355 3042207 2934806
4008B934806m0068J40082R5748j61821p6131L8121M5282K9994N753r6584R3918
$$ 2934806 2894738 3034820 3130568 2968747 2892616 2930737 2976019 3006013 3011766 2915182 3009100
3997C009100J20483L0338q3935P851k5732K2288q3632L7420J33906N5060J46239
$$ 3009100 3129583 3159921 3075986 3083837 3058105 3080393 2996761 3034181 3168087 3223147 3369386
3986C369386Q5386r1703R6433l787Q1913K2082r6189k4625L6971j02663R0254
$$ 3369386 3454772 3363069 3459502 3455715 3537628 3559710 3463521 3438896 3475867 3373204 3463458
3975C463458R5793j0531K9917Q1493M3439n7028K5735K8014M1803N463j8746O3939
$$ 3463458 3559251 3548720 3578637 3660130 3703569 3646541 3672276 3700290 3742093 3747556 3728810 3792749
3963C792749Q650J2815j45695j42660P3272p410j10290l8340l2406Q353j013o5906
$$ 3792749 3801399 3814214 3668519 3525859 3599131 3591721 3481431 3443091 3410685 3419038 3418025 3352119
3951C352119j16377j561M323L3256p175o1697R1495J3735N3401p4204l7332r5390
$$ 3352119 3235742 3234181 3238504 3271760 3264585 3202888 3294383 3308118 3361519 3287315 3249983 3154593
3939C154593J08310n2546J98N5512R2277o3250k0542m7511N4254M0246J4822P6083
$$ 3154593 3262903 3210357 3210555 3266067 3358344 3295094 3274552 3227041 3281295 3321541 3336363 3412446
3927C412446J05320J826J28432J31178J36756N6314J32481P6560J05041K95057
$$ 3412446 3517766 3519592 3648024 3779202 3915958 3972272 4104753 4181313 4286354 4581411
3917D581411J54826J52424J96871J27628J63652K20043R8277J98849J99449J04369
$$ 4581411 4736237 4888661 5085532 5213160 5376812 5596855 5695132 5893981 6093430 6197799
3907F197799R7468J04028L4677R8857j75007j44050o0142k2602q374r8347M1722
$$ 6197799 6295267 6399295 6433972 6532829 6357822 6213772 6153630 6131028 6122654 6024307 6066029
3896F066029l7058k7877J7491r3804K6016k6851k16941j28974q1313j32332r6721
$$ 6066029 6028971 6001094 6018585 5924781 5950797 5923946 5707005 5578031 5496718 5364386 5267665
3885E267665l5362l1589l7229j22310J6729o6913j33434P2150J58248K34643K45316
$$ 5267665 5232303 5200714 5163485 5041175 5057904 4990991 4857557 4929707 5087955 5322598 5567914
3874E567914K02281P4012m7079j40393k80552k74040m32839k90476k92136j69693
$$ 5567914 5770195 5844207 5797128 5656735 5376183 5102143 4669304 4378828 4086692 3916999
3864C916999j09990j78570j27482j93813o0620M476j46242j3844j19352r7225
$$ 3916999 3807009 3628439 3500957 3307144 3246524 3251000 3104758 3090914 2971562 2874337
3854B874337N4895j7930J38010Q757q5062L7979M4943J4039r9190J4798j70782
$$ 2874337 2929232 2911302 3049312 3058069 2973007 3010986 3055929 3069968 2970778 2985576 2814794
3843B814794j51958m1863j45081o511J21707j2938L4090l6975n2118r3019m1235
$$ 2814794 2662836 2620973 2475892 2469381 2591088 2578150 2612240 2575265 2523147 2430128 2388893
3832B388893j1515n0315J23297m5089m9453J4214L5625M0576L2992j7713L4960
$$ 2388893 2377378 2327063 2450360 2405271 2355818 2370032 2405657 2446233 2479225 2461512 2496472
3821B496472K02990M7793p2574o1436j8960O5871P5335K678R576J09762J22208
$$ 2496472 2699462 2747255 2674681 2613245 2594285 2660156 2735491 2738169 2747745 2857507 2979715
3810B979715J60200J34757O7828L0529n9446p5005k9895k04699j13465j8933m1474
$$ 2979715 3139915 3274672 3342500 3373029 3313583 3238578 3208683 3003984 2890519 2871586 2830112
3799B830112k6044m8409o4622N1088k1623o0714l4403K8737L3923K9396m3146
$$ 2830112 2804068 2755659 2691037 2742125 2720502 2659788 2625385 2654122 2688045 2717441 2674295
3788B674295Q9649M5262j4040L1121Q5649N9562m6702Q4282P1839J45700P8103
$$ 2674295 2763944 2809206 2795166 2826287 2911936 2971498 2924796 3009078 3080917 3226617 3304720
3777C304720O821J1246J09052k0357r9116n268r7872p9909j36884K9381k5027
$$ 3304720 3311541 3322787 3431839 3411482 3312366 3307098 3209226 3129317 2992433 3021814 2996787
3766B996787K01887j1708o4944k2078Q6016J13456j3770l6445J38979J42963J92444
$$ 2996787 3198674 3186966 3122022 3099944 3185960 3299416 3285646 3249201 3388180 3531143 3723587
3755C723587J11966J02811L20507K58934N1531p8437q9523n263j38663j35603
$$ 3723587 3835553 3938364 4258871 4517805 4569336 4490899 4401376 4396113 4257450 4121847
3745D121847j08012q6676q5875K2928j2984j9698j13937k886r025r0637n418o4761
$$ 4121847 4013835 3927159 3841284 3864212 3851228 3831530 3717593 3714707 3705682 3615045 3609627 3544866
3733C544866K945L2205P1974K54O3491P9648K5183R6711P4137R7040J42920j3731
$$ 3544866 3547811 3580016 3651990 3652244 3715735 3795383 3820566 3917277 3991414 4088454 4231374 4217643
3721D217643m0658r2357n9591J11947J89042O7639N7311J48856J93748K21565
$$ 4217643 4176985 4084628 4025037 4136984 4326026 4393665 4450976 4599832 4793580 5015145
3711E015145K58652R4577K9669k615j0803j80882j0590p4489j06578j3432q6144
$$ 5015145 5273797 5368374 5398043 5395428 5384625 5203743 5193153 5118664 5012086 4998654 4912510
3700D912510L5920M0677R7714J05029J81557J76296J42188J40618k7771j7607
$$ 4912510 4948430 4989107 5086821 5191850 5373407 5549703 5691891 5832509 5804738 5787131
3690E787131r3129q0019j39834n2441M939N9384J19986K48375J74855J57460R8124
$$ 5787131 5694002 5613983 5474149 5421708 5426647 5486031 5606017 5854392 6029247 6186707 6284831
3679F284831P5486M7804K5577K181k3192Q467k6703q3345k24701q9048Q4907N7772
$$ 6284831 6360317 6408121 6433698 6435879 6412687 6421154 6394451 6311106 6086405 5997357 6082264 6140036
3667F140036J17992l5881R883m8458l4099n2333L4161k30297p7411k6073q3097
$$ 6140036 6258028 6222147 6232030 6183572 6149473 6097140 6131301 5901004 5823593 5797520 5714423
3656E714423J7873r3025p3747N4752J56409J49029J73530P7170l5533K09371J18676
$$ 5714423 5732296 5639271 5565524 5620276 5776685 5925714 6099244 6176414 6140881 6350252 6468928
3645F468928J33549J21526N3722P3032l1922m5568j55242p2660j84133k0379j71410
$$ 6468928 6602477 6724003 6777725 6850757 6818835 6773267 6618025 6545365 6361232 6340853 6169443
3634F169443j89089q6541j34149K876p2276j57054j18276j3037J3050p2803Q4690
$$ 6169443 5980354 5893813 5759664 5762540 5690264 5533210 5414934 5401897 5414947 5342144 5426834
3623E426834N2863l4844j67082j6969J22718M7386O5880J09226l3501P1736J50577
$$ 5426834 5479697 5444853 5277771 5260802 5383520 5430906 5496786 5606012 5572511 5644247 5794824
3612E794824M3385P9834k1958j61131l6751j8666q9795j5092j77249M071N4204
$$ 5794824 5838209 5918043 5896085 5734954 5698203 5679537 5589742 5574650 5397401 5401472 5455676
3601E455676L5549j07178j0551O4296j4924j1341N0181p6986P391J08022O0016
$$ 5455676 5491225 5384047 5373496 5437792 5422868 5411527 5461708 5384722 5392113 5500135 5560151
3590E560151p154M8614O3826j22976k4038L9341J19603L4677L5427O1050k2286
$$ 5560151 5552997 5601611 5665437 5542461 5518423 5557764 5677367 5712044 5747471 5808521 5786235
3579E786235O0067J77189o8295p4347o260R772P2239J47028m6045Q6953Nr666
$$ 5786235 5846302 6023491 5955196 5880849 5874589 5884361 5956600 6103628 6057583 6144536 6144541 6134875
3567F134875O7490R3507m956Q9197O323P2144J20607K6750J15071J5031p639O1571
$$ 6134875 6202365 6295872 6290916 6380113 6386436 6458580 6579187 6605937 6721008 6736039 6728400 6789971
3555F789971L9051j1034J41418J60339m1662R6804M0504N1597j0032J7293N9332
$$ 6789971 6829022 6817988 6959406 7119745 7078083 7174887 7215391 7266988 7256956 7274249 7333581
3544G333581J8725l335N7344n4263l6874P1848R6124n5160J06788N6974K7449
$$ 7333581 7352306 7348971 7406315 7352052 7315178 7387026 7483150 7427990 7534778 7591752 7619201
3533G619201Q5675K48469N8889P5142M105J11912K00225J66201J20372O514J35557
$$ 7619201 7704876 7953345 8012234 8087376 8091481 8203393 8403618 8569819 8690191 8696705 8832262
3522H832262P0968J18365O9400J00676J13055J34285J21971Q7382P5830J33577
$$ 8832262 8903230 9021595 9090995 9191671 9304726 9439011 9560982 9648364 9724194 9857771
3512I857771J68258J58118O2371J05496P9166P0657J54424R2372J4138K35072
$$ 9857771 10026029 10184147 10246518 10352014 10431180 10501837 10656261 10748633 10762771 10997843
3502A0997843K30164K50580K32399J22384P3553J77123R3619J58987J59774M7391
$$ 10997843 11228007 11478587 11710986 11833370 11906923 12084046 12177665 12336652 12496426 12543817
3492A2543817J33711K80973J20833J31465L39235M33083K73451K45546K83726
$$ 12543817 12677528 12958501 13079334 13210799 13550034 13983117 14256568 14502114 14785840
3483A4785840K57908L22014K65160J35375L07738L45581L27848L49175L87975
$$ 14785840 15043748 15365762 15630922 15766297 16074035 16419616 16747464 17096639 17484614
3474A7484614L43135M95789N59146M96888L87921N45617N30844N06472L23093
$$ 17484614 17827749 18323538 18882684 19379572 19767493 20313110 20843954 21350426 21673519
3465B1673519N30432L34645M26989M83666O68035O54525O62706Q25175R94459
$$ 21673519 22203951 22538596 22965585 23449251 24117286 24771811 25434517 26259692 27254151
3456B7254151J037902J238442J402922J512060J842132K373891K627163K888101
$$ 27254151 28292053 29530495 30933417 32445477 34287609 36661500 39288663 42176764
3448D2176764L272473L983391M623657N342717O350608Q341735J1073146J4270089
$$ 42176764 45449237 49432628 54056285 59399002 65749610 74091345 85164491 99434580
3440I9434580J4582884J1274781M600901k070191m040313r640901j3843828j1578065
$$ 99434580 114017464 125292245 129893146 127822955 123782642 114141741 100297913 88719848
3432H8719848q511407o092158m565372l399304k626524j765729j327025q51950
$$ 88719848 80208441 74116283 69550911 66151607 63525083 61759354 60432329 59580379
3424E9580379l90680J35617O71141J445269K300850L381359M117515M720346N795027
$$ 59580379 59189699 59325316 59996457 61441726 63742576 67123935 71241450 75961796 81756823
3415H1756823P185479Q680062J0297695J2545404J6708789K2134910K8798378
$$ 81756823 88942302 97622364 107920059 120465463 137174252 159309162 188107540
3408A88107540K8548768K1271314O020033q069979j0456350k3524058l1055703
$$ 188107540 216656308 237927622 243947655 235877676 225421326 201897268 170841565
3401A70841565k5449716j8719175j3713938j0718543q449879o657817n191154
$$ 170841565 145391849 126672674 112958736 102240193 93790314 87132497 81941343
3394H1941343m114890l197637k339104j514852o37504K39785J246221K291446
$$ 81941343 77826453 74628816 72289712 70774860 70137356 70377141 71623362 73914808
3386G3914808K668388K505163J722323J564622J417847J576262K832747N221956
$$ 73914808 76583196 79088359 80810682 82375304 83793151 85369413 88202160 93424116
3378I3424116P999142J1120230J1638976Q404004K114337m145457o083241j1419623
$$ 93424116 101423258 112543488 124182464 132586468 134700805 130555348 124472107 113052484
3370A13052484j5046243j2823195r641330p175888n741371m467175l908836l324367
$$ 113052484 98006241 85183046 75541716 68365828 62624457 58157282 54248446 50924079
3362E0924079k924936k729019k206088j709901j415433j156122j063469p75749
$$ 50924079 47999143 45270124 43064036 41354135 39938702 38782580 37719111 36943362
3354C6943362q71072n91287m90088l74231k77167k02661J1159k3630J6467J77177
$$ 36943362 36072290 35481003 34990915 34616684 34339517 34136856 34148015 34124385 34140852 34318029
3344C4318029L53481M87631M58468O68397Q10906R49125Q69297J090956J272688
$$ 34318029 34671510 35159141 35617609 36286006 37096912 38046037 38915334 40006290 41278978
3335D1278978J619101J814382K269024K600282K574316J885586Q75954p55094
$$ 41278978 42898079 44712461 46981485 49581767 52156083 54041669 54917623 54162529
3327E4162529k304146l069853l005490k592225j843486j504769j195753q46632
$$ 54162529 51858383 48788530 45783040 43190815 41347329 39842560 38646807 37800175
3319C7800175p22212m97976m14691j80546J4393R3330J98608J43404K86056K30670
$$ 37800175 37077963 36579987 36165296 35984750 35999143 36092473 36291081 36434485 36720541 36951211
3309C6951211K20461L02613K88758K04642M0507Q7002J60780N5761R5164K93820
$$ 36951211 37171672 37474285 37763043 37967685 38008192 38095194 38255974 38311735 38406899 38700719
3299C8700719M46414K91297M37631L58828L63386N12736N63057N88763J067275
$$ 38700719 39147133 39438430 39876061 40234889 40598275 41111011 41674068 42262831 43330106
3290D3330106J197771J420761J859407K145206K409623K935734L719474M662585
$$ 43330106 44527877 45948638 47808045 49953251 52362874 55298608 59018082 63680667
3282F3680667M949426M576971L421921J733872M73490l74016m72431q1284l50069
$$ 63680667 68630093 73207064 76628985 78362857 78836347 78462331 77989900 77908616 77558547
3273G7558547j298940j361082k238048k605168j681749p18207J35687P69394J133932
$$ 77558547 76259607 74898525 72660477 70055309 68373560 67655353 67791040 68560434 69694366
3264F9694366J488836J781611K108915K375982K663749L138319L379935L295488
$$ 69694366 71183202 72964813 75073728 77449710 80113459 83251778 86631713 89927201
3256H9927201L049093K284434P82962p91610k596864m255223n218621n617439
$$ 89927201 92976294 95260728 96043690 95252080 92655216 88399993 83181372 77563933
3248G7563933n619161m931012m231274l853112l072291k675629k503301k097330
$$ 77563933 71944772 67013760 62782486 58929374 55857083 53181454 50678153 48580823
3240D8580823j778228j720256j623122j525814j287800j450452j256005j190086
$$ 48580823 46802595 45082339 43459217 41933403 40645603 39195151 37939146 36749060
3232C6749060j348502j289934j251141j077582r79187r13004p69042o56107n43049
$$ 36749060 35400558 34110624 32859483 31781901 30802714 29889710 29120668 28464561 27921512
3223B7921512o63278o10362p06687n86979o70837o71558p75185p31793o18151
$$ 27921512 27258234 26647872 25941185 25354206 24683369 24011811 23236626 22504833 21886682
3214B1886682n95012o28434m76889m35687m73543l03892k94894k26762l80851
$$ 21886682 21291670 20663236 20186347 19750660 19277117 18973225 18678331 18451569 18070718
3205A8070718m03990j44013k04933k50217j00709j44526l00190l21799j57656
$$ 18070718 17666728 17522715 17317782 17067565 16966856 16822330 16522140 16200341 16042685
3196A6042685p8853k59755l18725k28637l13028k20450l23134j13535k02308k22603
$$ 16042685 15963832 15704077 15385352 15156715 14843687 14623237 14300103 14186568 13984260 13761657
3186A3761657j02480k66149k50108k44069j31633k66333k04623j37653O39k39819
$$ 13761657 13659177 13393028 13142920 12898851 12767218 12500885 12296262 12158609 12159248 11919429
3176A1919429j94016k36467l8766L0860p3287q8345j78229j06987p9319o4660
$$ 11919429 11725413 11488946 11450180 11481040 11407753 11319408 11141179 11034192 10954873 10890213
3166A0890213k58892j38913j70838k00946m5630N5453j30860m4119j21949r0349
$$ 10890213 10631321 10492408 10321570 10120624 10074994 10130447 9999587 9955468 9833519 9743170
3156I743170k9153j5776N9579j06920j9254J37509M4249o878P9538j57131k93842
$$ 9743170 9714017 9698241 9757820 9650900 9631646 9769155 9813404 9806526 9886064 9728933 9435091
3145I435091k11898r5156o5527k87847p2684n4950j3579n407j30789j37006j52743
$$ 9435091 9223193 9128037 9062510 8774663 8701979 8647029 8633450 8628043 8497254 8360248 8207505
3134H207505o9308K223q4478j36062j09033K9048n5936l4025J01870k5193j10257
$$ 8207505 8138197 8140420 8055942 7919880 7810847 7839895 7783959 7749934 7851804 7826611 7716354
3123G716354J1372N6378j241O8559R0786O8645J91653J06450M3822q8880j23523
$$ 7716354 7727726 7784104 7782863 7851422 7942208 8010853 8202506 8308956 8352778 8263898 8140375
3112H140375j98252k56245k19395j72676l6685j16046q4916m7538K0681p1729
$$ 8140375 7942123 7685878 7466483 7293807 7257122 7141076 7056160 7008622 7029303 6957574
3102F957574j23539M6797l5846r1895j43692l4659j3045M6421K9489O2819j01835
$$ 6957574 6834035 6880832 6844986 6753091 6609399 6574740 6561695 6608116 6637605 6700424 6598589
3091F598589j39321O0308J05275M750J45435K15892J17615Q7056J99536n0393
$$ 6598589 6459268 6519576 6624851 6629601 6775036 6990928 7108543 7195599 7395135 7344742
3081G344742l4470M1878j49554j83854k44512k00867k13944r3357n1283k6645
$$ 7344742 7310272 7352150 7202596 7018742 6774230 6573363 6359419 6266062 6214779 6188134
3071F188134j18939j38156j1399q3906o2234k1099P606L6120j08007K8146m7367
$$ 6188134 6069195 5931039 5919640 5835734 5773500 5752401 5760007 5796127 5688120 5716266 5668899
3060E668899l7034J05249l4007o6323m2899O1832R6501J01423J18530j2372j7994
$$ 5668899 5631865 5737114 5703107 5636784 5593885 5655717 5752218 5853641 5972171 5959799 5941805
3049E941805N0961P4257m7654L170j16824n4735l7145n1078M1774N9257N4458
$$ 5941805 5992766 6067023 6019369 6022539 5905715 5850980 5813835 5762757 5804531 5863788 5918246
3038E918246j3250J06145m5593K8894L0290K0553O9564M942K4103J02090J52069
$$ 5918246 5904996 6011141 5965548 5994442 6024732 6045285 6114849 6119791 6143894 6245984 6398053
3027F398053K02301K31513J99735K53660K20658K47327K98674L92643L01308M21120
$$ 6398053 6600354 6831867 7031602 7285262 7505920 7753247 8051921 8444564 8745872 9166992
3017I166992K92097m9194j92505l82252l59620l49003k45288j35285j45612p6702
$$ 9166992 9459089 9409895 9217390 8835138 8475518 8126515 7881227 7745942 7600330 7523628
3007G523628r2556j12029o1888K0845L98J22282L6499J74394J56425K4113J46299
$$ 7523628 7431072 7319043 7257155 7278000 7278398 7400680 7437179 7611573 7767998 7792111 7938410
2996G938410K51395L12196J89477K46718K73699M76465M78610M34577P82803Q56478
$$ 7938410 8189805 8502001 8691478 8938196 9211895 9688360 10166970 10601547 11384350 12240828
2986A2240828R39565P10738L33395M1965l08118q16259q81701p79989n19933n84139
$$ 12240828 13180393 13891131 14224526 14266491 13958373 13142114 12260413 11480424 10960491 10376352
2976A0376352l31632k65048j85359j07169j14918o3025R0548k4612r7913J7375
$$ 10376352 10044720 9779672 9594313 9487144 9372226 9309201 9399749 9375137 9277224 9294599
2966I294599O1570K24008J00750J04509J50595K83964K60687L48369L39412L12162
$$ 9294599 9356169 9580177 9680927 9785436 9936031 10219995 10480682 10829051 11168463 11480625
2956A1480625N27024M03278N64698O43834M34694M39080K16151J32237k3438j55471
$$ 11480625 12007649 12410927 12975625 13619459 14054153 14493233 14709384 14841621 14818183 14662712
2946A4662712k05585j35894K7413l0108j24282Q8294O5888P4362K1778O0981l0376
$$ 14662712 14457127 14321233 14348646 14318538 14194256 14282550 14348438 14422800 14444578 14505559 14475183
2935A4475183N8141J97710M8263J42160J22372J67757L61982J65036J91507J77995
$$ 14475183 14533324 14731034 14779297 14921457 15043829 15211586 15573568 15738604 15930111 16108106
2925A6108106J40304K79129L92724L02176M61070M63839M62176M52124O08555
$$ 16108106 16248410 16527539 16920263 17222439 17683509 18147348 18609524 19061648 19670203
2916A9670203N92539N24102N59238J26317J6443l92733n60620o02756p69284p11895
$$ 19670203 20262742 20786844 21346082 21472399 21488842 21096109 20535489 19932733 19163449 18451554
2906A8451554n23713l38521m55973m04104j65404j61353O981O2563Q5254L4412
$$ 18451554 17927841 17589320 17133347 16729243 16563839 16402486 16409467 16472030 16557284 16591696
2896A6591696L9782R6250m5411Q153p368O3169J56416J56450O1646K4094p7280
$$ 16591696 16631478 16727728 16682317 16690470 16683102 16746271 16902687 17059137 17120783 17144877 17067597
2885A7067597j08878j99582q7807k86253l46054m22550m96885m31613m68967n11979
$$ 17067597 16958719 16759137 16671330 16385077 16039023 15616473 15119588 14687975 14219008 13707029
2875A3707029l97213k79800l34627l37971k55019j8662j77743k46403k10894j93062
$$ 13707029 13309816 13030016 12695389 12357418 12102399 12083737 11905994 11659591 11448697 11255635
2865A1255635o7374j36802k92050k43594k33812j88371k19917l70644k85116l14091
$$ 11255635 11188261 11051459 10759409 10515815 10282003 10093632 9873715 9503071 9217955 8903864
2855H903864k49904k45613l49577k25984j58891l48897j93934j29337j80434j03731
$$ 8903864 8653960 8408347 8058770 7832786 7673895 7324998 7131064 7001727 6821293 6717562
2845F717562j38202k14011j18573j89224j59490j60284n4552j53694k6991j04943
$$ 6717562 6579360 6365349 6246776 6057552 5898062 5737778 5683226 5529532 5502541 5397598
2835E397598r5121J6465j21313n0044j30739j55900j20844k9969l3816j79536
$$ 5397598 5302477 5318942 5197629 5147585 5016846 4860946 4740102 4710133 4676317 4496781
2825D496781n5511p7375j70669l1692o0687q6074j11586l3466j6308K3576j19962
$$ 4496781 4441270 4363895 4193226 4161534 4100847 4014773 3903187 3869721 3853413 3876989 3757027
2814C757027m4065j79458q0619q6803j0796l1219r5809l5537o1517M122N9787
$$ 3757027 3712962 3533504 3452885 3366082 3355286 3324067 3228258 3192721 3131204 3135326 3195113
2803C195113o1891o6058j19528q1210m1215m2784j780n9390J6632o6905l9749
$$ 3195113 3133222 3067164 2947636 2866426 2825211 2782427 2780647 2721257 2737889 2670984 2631235
2792B631235k1665R385l8487j93874J11640k8941j48218k6310r105j6695l0813
$$ 2631235 2609570 2618955 2580468 2386594 2498234 2469293 2321075 2294765 2285660 2268965 2238152
2781B238152p2142l0225o9208M0828q8941L685j5172q3737n3552q5114k3893O6733
$$ 2238152 2166010 2135785 2066577 2107405 2018464 2022149 2006977 1923240 1869688 1784574 1760681 1827414
2769A827414l200p0455k9187k2931k3834M9093o6739k7152O902l8264N6185p246
$$ 1827414 1824214 1753759 1724572 1701641 1677807 1726900 1660161 1633009 1639911 1601647 1657832 1650586
2757A650586n9069m2012n7192k3204l6383n7525L3548k4275n4488o1581Q238L6756
$$ 1650586 1591517 1549505 1492313 1469109 1432726 1375201 1408749 1384474 1329986 1268405 1276643 1313399
2745A313399J0420q6398o3023L0251J655M7013j0667j25910k8509J09534j07062
$$ 1313399 1323819 1237421 1174398 1204649 1206304 1253317 1242650 1116740 1088231 1197765 1090703
2734A090703J3925m9461J2923M882l8100j772l8956N4544M735j08515n9300J4404
$$ 1090703 1104628 1055167 1068090 1072972 1034872 1033100 994144 1048688 1053423 944908 885608 900012
2722I00012k3153J01372n2466j19952O2063J20676j18676K2358l7482N8809R620
$$ 900012 876859 978231 925765 805813 867876 988552 869876 892234 854752 913561 923181
2711I23181P7778q6525m5407k0003r923l3921K2743r114K9719n5302n622N5745
$$ 923181 1000959 914434 869027 849024 839101 805180 827923 818809 848528 793226 787604 843349
2699H43349K8654n053m8179k0895j1969n7051M4860k9599j70105Q6255K2619P2409
$$ 843349 872003 866950 818771 797876 785907 728856 773716 744117 574012 660267 682886 755295
2687G55295k8100m2258L5772j02446K7262Q89L7963m8476L8515P9491j22160l899
$$ 755295 727195 684937 720709 618263 645525 646414 684377 635901 674416 753907 631747 627848
2675F27848Q759L3440p2015N4328J5389N4855P1421j73821k6775Q7369K0389m9109
$$ 627848 636607 670047 598032 652360 667749 722604 794025 620204 593429 680798 701187 652078
2663F52078j3375j17904M4120M1646K3195M0175n6514M9045N5335j07063m6046
$$ 652078 638703 520799 564919 606565 629760 669935 613421 662466 717801 610738 564692
2652E64692P3695N460k8318q1357m607N9642l9073l3941Q2652n731j21393l6636
$$ 564692 638387 643847 615529 534172 529565 589207 550134 516193 598845 593114 471721 435085
2640D35085M9381N5324O4771j4078q7272O3121J2145J5518J3514N4509P2961j16925
$$ 435085 484466 539790 604561 590483 503211 566332 578477 593995 607509 662018 734979 618054
2628F18054k9708M3962o2531k6834k6594l5045o1503J18601M7275q9241q759j0264
$$ 618054 588346 632308 569777 542943 516349 481304 419801 538402 585677 496436 487677 477413
2616D77413M3052k4028n641J6346k1363J44O9837m5398L3653j5656J1410J8560
$$ 477413 520465 496437 490796 507142 485779 485923 555760 510362 544015 528359 539769 558329
2604E58329p041o0977m017o0258m1629l190L1141K966j2951O5774L498o8103M050
$$ 558329 551288 490311 486294 426036 384407 381217 412358 415324 402373 468147 471645 403542 407592
2591D07592O3187O4299K243J3173j00665r194l5458l4650p6102J14265O1069m5326
$$ 407592 470779 535078 537321 550494 449829 440635 405177 370527 294425 408690 469759 424433
2579D24433j086k2722n1009o1043J480K4198L9828j1078N4855K73p238m9271K5146
$$ 424433 423347 400625 349616 288573 290053 314251 354079 343001 397856 398129 390891 341620 366766
2566C66766K7248l1148O5253J3384j11467p4668Q457N7636j3068O0625o8354n6607
$$ 366766 394014 362866 428119 441503 330036 255368 263825 321461 308393 369018 300664 244057
2554B44057M2497K9674Q163n2485Q1862n583j2558j2189k2756j4147M2683O7366
$$ 244057 286554 316228 324391 271906 353768 348185 335627 323438 300682 286535 329218 396584
2542C96584j14684j23774M1104p7645K2293M4717J0690n5909m1948l676Q2944
$$ 396584 281900 158126 199230 121585 143878 188595 199285 143376 101428 97752 180696
2531A80696l5878N6732o0306L4876Q4694q1620l7866Q288K4758p0271L6257l1737
$$ 180696 144818 201550 141244 176120 260814 179194 141328 149616 174374 104103 140360 108623
2519A08623j5720r1991J21548N1020o2936O7154J2017M5707o3085m1886l6718
$$ 108623 92903 912 122460 173480 110544 177698 189715 235422 172337 130451 93733
2508I3733k8888J00777k8158j8327k1734N0952p7970n8463j4479P2667J06565
$$ 93733 64845 165622 137464 119137 97403 148355 70385 11922 -2557 70110 176675
2497A76675k4298L2898J6812K6796M442q6220m0277o7507J37726K4710k053K6619
$$ 176675 152377 185275 202087 228883 233325 147105 106828 39321 177047 201757 199704 226323
2485B26323q4419J2105K4243j09847K4419n717j0764j00541R5757O0246j00506
$$ 226323 141904 154009 178252 68405 92824 87107 76343 -24198 71559 131805 31299
2474C1299o586M1998L5195J07112K6077L0423m1379j04653J05767O430m0231m5196
$$ 31299 24713 66711 101906 209018 235095 265518 224139 119486 225253 231683 191452 146256
2462A46256m9330M2289n5970n0085R5793O126r7695J09179n1850R894K4080n2787
$$ 146256 96926 139215 83245 33160 128953 135079 37384 146563 94713 104607 128687 75900
2450G5900o5490m3198r873J07591k3808m5595Q6492K3543r944k3287q269j2118
$$ 75900 10410 -32788 -42661 64930 41122 -4473 82019 105562 95618 72331 64062 51944
2438E1944R7366m933j7593r591n0218m5604j735R439N9742J2149K2969k4856j04493
$$ 51944 149310 144377 126784 117193 66975 21371 19636 29075 88817 100966 123935 99079 -5414
2425e414j37263Q4226J28104P5156l0878n7330K3912k4883j02544l9677R7561
$$ -5414 -142677 -58451 69653 144809 113931 56601 80513 55630 -46914 -86591 10970
2414A0970M9008j7782M7742n5681n6508N1879L4140q9564q937Q875O2296L9340
$$ 10970 59978 42196 89938 34257 -22251 29628 63768 -25796 -34733 -25858 36438 75778
2402G5778j4502j1485N8258J9362m9101P8523Q3616k4219l2427j9998k5650p8041
$$ 75778 61276 49791 108049 127411 78310 156833 240449 216230 183803 163805 138155 60114
2390F0114M99k2470M4554K8528M7695n7775L4561L7405J28184J6541k2680N81
$$ 60114 60613 38143 82697 111225 158920 101145 135706 173111 301295 317836 295156 295737
2378B95737l4994o0674p6193k7040J3646J3782P6940m1177n733m9691j30423k7082
$$ 295737 260743 200069 123876 96836 110482 124264 201204 160027 154294 104603 -25820 -52902
2366e2902M6498L4946J6802J34865j14122l6164K2991L8272N3345J0475q7759
$$ -52902 -6404 28542 45344 180209 66087 29923 52914 91186 144531 155006 67247
2355F7247k4839Q664p1518L7460n4920Q5258K100J0483L2388j3481L8113j20429
$$ 67247 42408 51072 -20446 17014 -37906 47352 49452 59935 92323 78842 116955 -3474
2343c474K6952J01881O120k8953J9152n5929N533k1781o242l024p0091J2140M1467
$$ -3474 23478 125359 131479 102526 121678 65749 71282 49501 43259 40235 -29856 -17716 23751
2330B3751M5668L087n8296J811j20145J17659j1992J9360K6598P3159K9916j2452
$$ 23751 69419 72506 14210 16021 -104124 13535 1543 20903 47501 120660 150576 138124
2318A38124J00737L419l5546j24191k3002N854l4001J6881L5549P100p0655n5952
$$ 138124 238861 242280 206734 82543 59541 65395 31394 48275 83824 90924 20269 -35683
2306c5683J1567R7231L5251O9549k3713K2800J08633r9439n9565q2010n0258o0618
$$ -35683 -24116 73115 108366 177915 154202 177002 285635 186196 126631 44621 -5637 -66255
2294f6255K7787N7004K2987L0469K7948J43257l7993l4463K3992j7276L4603n5487
$$ -66255 -38468 18536 41523 71992 99940 243197 205204 170741 194733 177457 212060 156573
2282A56573j06258K1683K0315J29105j0454r4238Q466L2666J1229Q3634J5867
$$ 156573 50315 71998 92313 221418 210964 116726 125192 157858 169087 252721 268588
2271B68588j20672L532m907j10079R6545L0824K453q993j7908M3537j56201l2163
$$ 268588 147916 151448 146541 36462 133007 163831 166284 157291 139383 182920 26719 -5444
2259e444J45277L5065n9158n1998p159K1684M0260k1285q585R1390N1536N0116
$$ -5444 139833 174898 115740 63742 56583 78267 118527 97242 88657 180047 231583 281699
2247B81699p5124L9516J5007o0207M0057L2155j21142O5353M729K1333p0296N2632
$$ 281699 206575 246091 261098 200891 240948 273103 151961 217314 222043 243376 173080 225712
2235B25712R0803M9943j25325l5898o8841j2323O3006M4488P7518k7920j000m3546
$$ 225712 316515 366458 241133 205235 136394 124071 187077 231565 309083 281163 280163 236617
2223B36617M2324j4084N1040n1129j1923J5893n126N292K2962p2680L2834K947
$$ 236617 278941 264857 315897 264768 252845 268738 263612 268904 291866 219186 252020 254967
2211B54967J11665P3040p3528q0960P0738J97980K1406n511P424K9058m4463M9554
$$ 254967 366632 439672 366144 285184 355922 553902 575308 569797 577221 606279 561816 611370
2199F11370k5013J0868J1334M4559M8062m0105M7583N1409k109Q772k6291n362
$$ 611370 586357 597225 608559 653118 701180 661075 708658 760067 757958 766730 740439 735077
2187G35077l975n9525j2194P9530k9178K2052M5230k7575R243P7937J03371K6479
$$ 735077 731102 671577 659383 738913 709735 731787 777017 749442 758685 836622 939993 966472
2175I66472p7250k2182P0222L3304k4688O6781M8100J1689Q3977R999M2700N4159
$$ 966472 889222 867040 937262 970566 945878 1012659 1060759 1072448 1156425 1166424 1209124 1263283
2163A263283M0688j063N2457O6701O6691q8898j3937Q0623r519Q2169R3931N0497
$$ 1263283 1303971 1302908 1355365 1422066 1488757 1399859 1385922 1466545 1457026 1539195 1633126 1683623
2151A683623N7803N8165P7009J8865M9920J41889R4067J37959J37905J66594J77066
$$ 1683623 1741426 1799591 1876600 1895465 1945385 2087274 2181341 2319300 2457205 2623799 2800865
2140B800865J86862K06957J53880k5613K70740K22326K75028K36458L64456M83603
$$ 2800865 2987727 3194684 3348564 3322951 3593691 3816017 4091045 4327503 4691959 5175562
2130E175562L88828M36510M72343O47976O93719R06881Q82093J262461J591718
$$ 5175562 5564390 6000900 6473243 7121219 7814938 8721819 9603912 10866373 12458091
2121A2458091J819958K379659L160402M478719O080956M940691M451320M39208
$$ 12458091 14278049 16657708 19818110 24296829 30377785 35318476 39769796 40209004
2113D0209004k538175n474654o990608m739563l489095k546770k025241j377058
$$ 40209004 37670829 32196175 25205567 20466004 16976909 14430139 12404898 11027840
2105A1027840j150932r11308q99985n20497n21620l50250m77861m08205n91111
$$ 11027840 9876908 8965600 8065615 7545118 7023498 6673248 6195387 5787182 5196071
2096E196071l85838m13306k42912k88079k81076k88265k27615j96900j4465j31640
$$ 5196071 4810233 4396927 4154015 3865936 3584860 3296595 3068980 2872080 2857615 2725975
2086B725975j00799j41090o2467o2854j84367l7933o6081j45165o4192j26069
$$ 2725975 2625176 2484086 2421619 2358765 2174398 2136465 2070384 1925219 1861027 1734958
2076A734958P6932j53703n5116n1155m8866j48975j34661L3680Q071l4474j16954
$$ 1734958 1811890 1658187 1603071 1551916 1503050 1354075 1219414 1253094 1261165 1226691 1109737
2065A109737p7176J7425J9836j59315k7274J35263O914j8080n3120n8220q017
$$ 1109737 1032561 1049986 1069822 910507 883233 1018496 1025410 1007330 954210 895990 887973
2054H87973m0456m2206K9226m9702r9240j4234O3463m7166m6064L4083M7147n616
$$ 887973 847517 805311 834537 784835 685595 671361 734824 687658 641594 675677 722824 717208
2042G17208m0933j5438j4089J38262P428J2057o476m5588j11325q711l3417k5990
$$ 717208 676275 660837 646748 785010 792438 804495 798019 752431 641106 632395 598978 572988
2030E72988o1001J02815p432l4126k646j11546N7646J8739n9103n1526N8794j02133
$$ 572988 511987 614802 607370 573244 570598 459052 516698 535437 476334 424808 483602 381469
2018C81469k5216P265r9796R1683N532M5822j21354J4601J9140k8180K3643M4425
$$ 381469 356253 363518 263722 355405 360937 406759 285405 300006 319146 290966 314609 359034
2006C59034J7176n4227j8625n6121n4845J04922m9190k4155k3122n077N7105J1346
$$ 359034 376210 321983 303358 247237 192392 297314 248124 223969 200847 195770 252875 264221
1994B64221L0832n7458n301P2690n5033M7919J168K7945n7917M8195j3779l663
$$ 264221 295053 237595 232294 304984 249951 297870 299038 326983 269066 317261 303482 299819
1982B99819J08208q9427n9048o8697p4533l5949R3752J10135O9611q701n4298
$$ 299819 408027 318600 259552 190855 116322 80373 174125 284260 353871 345170 290872
1971B90872j01131q8579J1463M6334O9631k7525P3989j1930O5842L0415l5172
$$ 290872 189741 101162 112625 158959 228590 201065 275054 263124 328966 359381 324209
1960C24209j06800j9293L5995r0827k6143j6376J21474r9571R1087j5367j9891
$$ 324209 217409 198116 234111 143284 117141 100765 222239 122668 213755 198388 178497
1949A78497j8664p997j1190l5268K4572L5345M838Q145l6284L4762n1139m6293
$$ 178497 159833 151836 140646 105378 129950 165295 170133 178278 141994 176756 125617 79324
1937G9324J4905m1950L6606j39106K3084J395l9266J0208L7979p500l8923J14803
$$ 79324 94229 52279 88885 -50221 -27137 -25742 -65008 -54800 -16821 -24321 -63244 51559
1925E1559K5361m3270N4464N0832p5405P0882l2942r5037J34977j1837k8757K1379
$$ 51559 76920 33650 88114 138946 63541 134423 101481 6444 141421 129584 100827 122206
1913A22206p1314l7280J4713J4489J8634j07939L5324r352l6070J58237Q0425
$$ 122206 50892 13612 28325 42814 61448 -46491 -11167 -20519 -56589 101648 182073
1902A82073k7185P0233j56227p5197J50638j717q8269q5408J6906J7062k2756
$$ 182073 154888 225121 68894 -6303 144335 142618 54349 -31059 -14153 2909 -19847
1891a9847L317R8111m4639L4240j8868j22459O5017J0489j826m9296K8273O8371
$$ -19847 -16530 81581 36942 71182 52314 -70145 -5128 5361 3535 -45761 -17488 50883
1879E0883j09467Q791j7303K0058n2988N2229O4540q361N5526N6386j3793m1481
$$ 50883 -58584 -49793 -67096 -47038 -100026 -47797 16743 8382 63908 120294 106501 65020
1867F5020J9803j4063j37749J02032N9866J2826k907K7638p8927k2661j520P2712
$$ 65020 84823 70760 -66989 35043 94909 107735 104828 132466 53539 30878 29358 102070
1855A02070N1397K0674n1691k2556k0516j5214J87132K8840n1972J6555m0111
$$ 102070 153467 174141 122450 99894 79378 64164 251296 280136 228164 244719 204608
1844B04608l5215k2693o7449Q1918K3458o5769j2567j3226K9413o0060k5992q4649
$$ 204608 169393 146700 79251 161169 184627 118858 106291 93065 122478 62418 36426 -48223
1832d8223n3232Q3365J8644N3115l2020j1103L155J13647p8653N9873m4850j6540
$$ -48223 -101455 -18090 554 53669 21649 10546 13701 127348 48695 108568 63718 47178
1820D7178K8784P6957p4420j21227M1594P6761m988k0335j3140p7357k3517J38882
$$ 47178 75962 152919 78499 -42728 -1134 75627 70639 50304 37164 -40193 -63710 75172
1808G5172P8879q3826m3017j05501m464M0227o5977K2061R2036N9719l9193q779
$$ 75172 154051 70225 27208 -78293 -82757 -42530 -108507 -86446 5590 65309 26116 17337
1796A7337k1969n2822J11875l0707l8755M8816L8711l0888m0787o6528N7569J9566
$$ 17337 -4632 -57454 54421 23714 -15041 33775 72486 41598 811 -65717 -8148 11418
1784A1418O8202O424k2322N8848m0335j54092o1436N9601L5300N7192K9302j0401
$$ 11418 79620 86044 63722 122570 82235 -71857 -133293 -73692 -38392 18800 48102 37701
1772C7701J7573q4157o760p490n0325R163p9960J24859q3335K7599M3382o718
$$ 37701 55274 -28883 -35643 -43133 -93458 -84295 -164255 -39396 -122731 -95132 -51750 -58468
1760e8468K3920Q0384N389l4424q5693R9923P1434j13972J5747j0902N0266J1379
$$ -58468 -34548 45836 51225 16801 -68892 31031 102465 -11507 4240 -6662 43604 54983
1748E4983r0760o2019K4373P8838J30268j3109j42576O7782J3072l0846p5326
$$ 54983 -35777 -97796 -73423 5415 135683 122574 -20002 47780 60852 30006 -45320
1737d5320j457J04888o4122o352J8794l9910j660Q296k6483l3857k7910J6364
$$ -45320 -46777 58111 -6011 -12363 6431 -33479 -35139 -26843 -53326 -87183 -115093 -98729
1725i8729J27114m2052k1717j4075l2094L1242N3818p930j5291q913l9785M0771
$$ -98729 28385 -13667 -35384 -49459 -81553 -50311 3507 -4423 -19714 -28627 -68412 -27641
1713b7641o1550M5320P302j257l589m9512N7421M6476J7711q8467k3053J15950
$$ -27641 -89191 -43871 -36569 -37826 -41415 -90927 -33506 12970 30681 -57786 -80839 35111
1701C5111p914R6246o8377n0215K228k0706N2867j8478n1500M7704L1044o7033
$$ 35111 27197 123443 55066 4851 7079 -13627 39240 20762 -30738 16966 48010 -19023
1689a9023p1703P9963m934j9714k9431J6006J3574k9045L6543m0908L4891L8445
$$ -19023 -90726 -10763 -15697 -35411 -64842 -48836 -35262 -64307 -27764 -68672 -33781 4664
1677D664N578O776k9459J3292j7084O5640m2760j0995k5213j957m56r492j8664
$$ 4664 10242 17018 -12441 851 -16233 49407 6647 -4348 -29561 -31518 -31974 -41466 -60130
1664f0130L745j7178J5533Q4180j25060k7793L6514m1586K9633N2130m4166J2135
$$ -60130 -56385 -73563 -58030 26150 -98910 -126703 -90189 -131775 -102142 -50012 -94178 -82043
1652h2043R9795J1152m2544o6716r8394J11217J4409L0910j1163p8525M0241L4969
$$ -82043 17752 28904 -13640 -80356 -178750 -67533 -53124 -22214 -33377 -111902 -71661 -36692
1640c6692R061k4708N9635l5125j2411K6099K2835N0808q6723n9668j2712M840
$$ -36692 -27631 -52339 7296 -27829 -40240 -14141 8694 59502 -27221 -86889 -99601 -94761
1628i4761O7853N8578p2090n853J15817m7062o1764p8309J3364k3872L0039R568
$$ -94761 -26908 31670 -40420 -46273 69544 22482 -39282 -117591 -104227 -128099 -98060 -88492
1616h8492L3784M0168R458j8552p528P9953J7318p1397m8020O594k9729J6528
$$ -88492 -54708 -14540 -5082 -23634 -31162 48791 66109 -5288 -53308 -46714 -76443 -59915
1604e9915O662M8373n1495j0290R2121q352j08089L4938l4751q4116J66812k0778
$$ -59915 -53253 -4880 -56375 -66665 25456 17104 -90985 -56047 -90798 -174914 -8102 -28880
1592b8880J4686J9304O6730m8350l2063N3427n9988M736j9813J0451m0900N2525
$$ -28880 -14194 5110 71840 23490 -8573 44854 -15134 -10398 -30211 -19760 -60660 -8135
1580h135J43035O816n8682o7141J405M0907j22547p1576K8626J25543n94n4977
$$ -8135 134900 141716 83034 15893 17298 58205 -64342 -135918 -107292 18251 17657 -37320
1568c7320q3452N6539P3561L6791q879L3134q1790l4487l8287J41528j1377j5162
$$ -37320 -120772 -64233 9328 46119 37240 70374 -11416 -45903 -84190 57338 45961 30799
1556C0799p999p0765O0420J319l9170k4646N8554k0934n7486K5680O0898J4605
$$ 30799 22800 -47965 12455 13774 -25396 -50042 8512 -12422 -69908 -44228 16670 31275
1544C1275L1202k6227m9479J00621j8948k5956j1903O437n6128l9858N0558J6152
$$ 31275 62477 36250 -13229 87392 68444 42488 30585 37022 -19106 -58964 -8406 7746
1532G746p9911o7337M8732j817k7767L0080R3465p036J8465J05618j02579k2375
$$ 7746 -72165 -139502 -90770 -92587 -120354 -90274 3191 -3845 14620 120238 17659 -4716
1520d716n6197k6914p9002l2579J51936n7996O4376R8217p830p9851r8138n377
$$ -4716 -60913 -87827 -166829 -199408 -47472 -105468 -41092 57125 49295 -30556 -128694 -134071
1508a34071L5105M2473R4103j062J2256m4764L9347p0777K5566j0867o0394n0251
$$ -134071 -98966 -56493 37610 36548 48804 4040 43387 -27390 -1824 -12691 -73085 -123336
1496a23336K5303q175P1910j9929j119P5306m7290j5796j7524Q1496o0348q0022
$$ -123336 -98033 -106208 -34298 -54227 -55346 19960 -27330 -43126 -60650 20846 -39502 -119524
1484a19524N1674p611m3322K0588N8029o4297L2095J07203L5231O3063m2518l7703
$$ -119524 -67850 -75461 -118783 -98195 -40166 -104463 -72368 34835 70066 133129 90611 52908
1472E2908L3856o8772m012M219j1226K2091J1734J6285O9842p3820j03315j63256
$$ 52908 86764 17992 13980 18199 6973 29064 40798 57083 126925 53105 -50210 -213466
1460b13466O3302Q7731N1660p2621j6731P8998p8064M6920Q7951M5892J1321j00416
$$ -213466 -150164 -62433 -10773 -83394 -100125 -21127 -99191 -52271 35680 81572 92893 -7523
1448g523P4470L2240p8997m8260p8324O6444M8816M2069j14024L5561J5871N5319
$$ -7523 66947 99187 20190 -28070 -106394 -39950 8866 50935 -63089 -27528 -11657 43662
1436D3662m07j30785L5900R8154q240l4406k8732o7645k8176O4572K2963j0151
$$ 43662 43255 -87530 -51630 46524 38284 3878 -24854 -92499 -120675 -56103 -33140 -43291
1424d3291N0871k8001K2703O1209q0813K4649J04991Q181q7569N7580K6804j67783
$$ -43291 7580 -20421 2282 63491 -17322 7327 112318 120499 32930 90510 117314 -50469
1412e0469q0053L1340N1516L3993j2874P5697o270l8415q3735O833l7629P3725
$$ -50469 -130522 -99182 -47666 -13673 -26547 49150 42880 4465 -79270 -72437 -110066 -36341
1400c6341L1695l3171n8675m2692o6202Q6312K8373M7912R0509p8416J19793m0969
$$ -36341 -4646 -37817 -96492 -139184 -205386 -119074 -90701 -42789 47720 -30696 89097 48128
1388D8128O1444r1211K7566J4457j23798L1254j08316o7206J32760j3887m406
$$ 48128 109572 18361 45927 60384 -63414 -32160 -140476 -207682 -74922 -88809 -93215
1377i3215J382N5868O6475n1412j4418P0048o6891o9669j6894N4351J49233k6356
$$ -93215 -91833 -35965 30510 -20902 -35320 34728 -32163 -101832 -118726 -64375 84858 58502
1365E8502m3308l5106J3970K9637L0172m0817L4735j2430l2469K5460k8671N5842
$$ 58502 15194 -19912 -5942 23695 53867 13050 47785 35355 2886 28346 -325 55517
1353E5517n8410r9382J00537L7278m9174n8245m0472j1629k4401O0248N690l2810
$$ 55517 -2893 -102275 -1738 35540 -13634 -71879 -112351 -123980 -148381 -88133 -82443 -115253
1341a15253Q9164P0050q6686K9774k635K2466L1522k7885J8762r1536L1845P0245
$$ -115253 -26089 43961 -42725 -12951 -15586 6880 38402 10517 29279 -62257 -30412 39833
1329C9833L342J6177m0770r2856J2467M371J13905J5456r5931k7803O4211l0306
$$ 39833 43175 59352 18582 -74274 -61807 -57436 56469 71925 -24006 -51809 12402 -17904
1317a7904n419o6338O111J6615J23582o1928n5252J8436j616R0859l2071L9565
$$ -17904 -23323 -89661 -83550 -66935 56647 -5281 -60533 -42097 -43713 47146 15075 54640
1305E4640k6205k3697j21977n806O238J24974J381j03265M4667J01844j32645
$$ 54640 28435 4738 -117239 -123045 -116807 8167 9548 -93717 -49050 52794 -79851
1294g9851Q3880M8679m2905m3668n4749R0027J717j40184p1215N4566Q3305L7817
$$ -79851 4029 52708 9803 -33865 -88614 1413 3130 -137054 -208269 -153703 -70398 -32581
1282c2581m5857O348N1828M5522p9779P1824J05479p3892j0648M9605j35243K7458
$$ -32581 -78438 -72090 -20262 25260 -54519 17305 122784 48892 38244 87849 -47394 -19936
1270a9936j3202k1136M8167r5201J12642K5327r458k5801j6778M9430j4466j23474
$$ -19936 -33138 -54274 -6107 -101308 11334 36661 27203 1402 -15376 34054 19588 -103886
1258a03886O0322L8308J18833P276k03534O641k3990Q5206q546M6583m2754o7217
$$ -103886 -43564 -5256 113577 120853 -82681 -76040 -100030 -14824 -23370 23213 -19541 -86758
1246h6758O9814q067L7529o2700j2874p7q919N6786m7717J3553j2559K5951P0205
$$ -86758 -16944 -25011 12518 -50182 -63056 -63133 -72052 -15266 -62983 -49430 -61989 -36038 34167
1233C4167k5273m31P2644j03919K2862J5710j1147j30486N8591R9130n587J366
$$ 34167 8894 8463 81107 -22812 50 15760 4613 -125873 -67282 31848 26261 27627
1221B7627o8677l8822n7729M6880l1294J2828J9232k3395M6653Q5133M1036p4984
$$ 27627 -41050 -79872 -137601 -90721 -122015 -109187 -89955 -113350 -66697 18436 59472 -15512
1209a5512M5740P6198j00043j0062L9573J2221o8629p8373Q015M0376R7569m2658
$$ -15512 30228 106426 6383 -3679 35894 48115 -20514 -98887 -90872 -50496 47073 4415
1197D415o8326K3062j1022j4760L256o727L2186O4399J3504Q9809q2867p735P3249
$$ 4415 -63911 -40849 -51871 -66631 -63375 -70102 -37916 26483 39987 129796 46929 39194 112443
1184A12443o9172j7335m1761m4815O8097J0319M7698J0737k9891j1168r7028J145
$$ 112443 43271 25936 -15825 -60640 7457 17776 65474 76211 46320 35152 -61876 -60731
1172f0731Q9927L0194n5573k6054M9613l2279k9116m2742M7286K4013n1598l3672
$$ -60731 29196 59390 3817 -22237 27376 -4903 -34019 -76761 -29475 -5462 -57060 -90732
1160i0732j6985r5994J00000M2202M0581j9763m0671M9958L4129L3077j1295J2379
$$ -90732 -107717 -203711 -103711 -61509 -20928 -40691 -81362 -31404 2725 35802 24507 36886
1148C6886P4143p7567r8015Q2015M4888j8158o367K613m6634j5947l5458J10271
$$ 36886 111029 33462 -64553 17462 62350 44192 37825 40438 -6196 -22143 -57601 52670
1136E2670O2495j42967k5410J6749m9068M5188M9155K1020l0612l500R2252j7498
$$ 52670 115165 -27802 -53212 -36463 -85531 -40343 8812 29832 -780 -4280 87972 70474
1124G0474r9036N6529O655o5931N8230N2947Q979o2543r7978m8337J7610n8120
$$ 70474 -28562 27967 34622 -31309 26921 79868 88847 26304 -71674 -120011 -102401 -160521
1112a60521j8281N023n548R4345L7210J58653K4912n9003j34704n2n2396j1894
$$ -160521 -178802 -173779 -179327 -84982 -47772 110881 135793 76790 -57914 -57966 -110362 -122256
1100a22256K3074R4233O8700M3253l7668p5527J02182m535j11446j9593n4158
$$ -122256 -99182 -4949 63751 107004 69336 -6191 95991 91456 -19990 -39583 -93741
1089i3741Q0687K659J1250M286n3609o5134J12323k8436q6734Q0231R382K0952
$$ -93741 -13054 -10395 855 5141 -48468 -113602 -1279 -29715 -116449 -36218 -26836 -5884
1077e884o7861n7194J5369K0120N6395Q6594R653l3486k3104J00056j09914l1832
$$ -5884 -73745 -130939 -115570 -95450 -39055 47539 57192 23706 602 100658 -9256 -41088
1065d1088l3884J83540L9928m8868j8596p4086Q1248r330k3181j555J5418M9336
$$ -41088 -74972 108568 148496 99628 81032 6946 88194 78864 55683 54128 69546 118882
1053A18882m1248j21519o3777O9677j04775p1960J05087P4919o0462o1059N8765
$$ 118882 77634 -43885 -107662 -37985 -142760 -214720 -109633 -34714 -95176 -156235 -97470
$$ [...]
##END NTUPLES=NMR SPECTRUM
##END=
