##TITLE=1H_TG-2346-B1
 CDCl3
 8 sc, 
 9.02.2022
##JCAMPDX= 6.0         $$ Bruker NMR JCAMP-DX V2.0
##DATA TYPE= NMR SPECTRUM
##DATA CLASS= NTUPLES
##ORIGIN= UXNMR, Bruker Analytische Messtechnik GmbH
##OWNER= root
$$ XWIN-NMR		Version 3.5
$$ Wed Feb  9 10:23:51 2022 Russian Standard Time (UT+4h)  she@DPX200
##.OBSERVE FREQUENCY= 200.131346
##.OBSERVE NUCLEUS= ^1H
##.ACQUISITION MODE= SIMULTANEOUS
##.ACQUISITION SCHEME= undefined
##.AVERAGES= 8
##.DIGITISER RES= 18
##SPECTROMETER/DATA SYSTEM= spect
##.PULSE SEQUENCE= zg30
##.SOLVENT NAME= CDCl3
##.SHIFT REFERENCE= (INTERNAL, CDCl3, 0, 15.7381)
##AUDIT TRAIL= $$ (NUMBER, WHEN, WHO, WHERE, WHAT)
$$ ##TITLE= Audit trail, XWIN-NMR		Version 3.5
$$ ##JCAMPDX= 5.01
$$ ##ORIGIN= Bruker BioSpin GmbH
$$ ##OWNER= she
$$ F:/spectra/data/she/nmr/H-F/1/pdata/1/auditp.txt
$$ ##AUDIT TRAIL=  $$ (NUMBER, WHEN, WHO, WHERE, WHAT)
(   1,<2022-02-09 10:21:46.60 +0400>,<she>,<DPX200>,
      <created by zg, POWCHK disabled, PULCHK disabled
       configuration hash MD5:
       00 E9 B6 7A A2 85 ED C7 34 08 36 98 17 FE 4E 26
       data hash MD5: 16K
       50 47 36 BC DA 89 6D 23 D7 DE 57 B4 B1 E6 91 2A>)
(   2,<2022-02-09 10:21:52.87 +0400>,<she>,<DPX200>,
      <Start of raw data processing
       efp BC_mod = 2 LB = 0.24 FT_mod = 6 PKNL = 1 PHC0 = -15870.12 PHC1 = 10.00078 SI = 16K 
       data hash MD5: 16K
       F7 E0 E1 47 2D D5 FF C5 84 A7 41 D6 67 6F EF 2B>)
(   3,<2022-02-09 10:22:17.35 +0400>,<she>,<DPX200>,
      <pk PHC0 = 0.8973388 PHC1 = 0 
       data hash MD5: 16K
       88 3C FB 58 F4 1B 4B 9F 1C 3D 21 D3 B9 29 38 B9>)
(   4,<2022-02-09 10:22:22.18 +0400>,<she>,<DPX200>,
      <abs ABSG = 5 
       data hash MD5: 16K
       AC 54 37 30 AA C6 0C 7E 45 07 0D 19 BB 8F 00 62>)
$$ ##END=
$$ 
$$ hash MD5
$$ 73 44 E3 00 8B 8F EB A3 3D 29 E6 90 24 39 35 3F
##$RELAX= 
##$RELAX= 
##$RELAX= 
##$RELAX= 
##$RELAX= 
##$RELAX= 
$$ Bruker specific parameters
$$ --------------------------
##$DU= <F:/spectra>
##$EXPNO= 1
##$NAME= <H-F>
##$PROCNO= 1
##$TYPE= <nmr>
##$USER= <she>
##$AMP= (0..31)
100 100 100 100 100 100 100 100 100 100 100 100 100 100 100 100 100 100 
100 100 100 100 100 100 100 100 100 100 100 100 100 100 
##$AQSEQ= 0
##$AQ_mod= 1
##$AUNM= <au_zg>
##$AUTOPOS= <>
##$BF1= 200.13
##$BF2= 200.13
##$BF3= 200.13
##$BF4= 200.13
##$BF5= 200.13
##$BF6= 200.13
##$BF7= 200.13
##$BF8= 200.13
##$BYTORDA= 1
##$CFDGTYP= 0
##$CFRGTYP= 5
##$CHEMSTR= <none>
##$CNST= (0..31)
1 1 145 1 1 1 1 1 1 1 1 1 1 1 1 1 1 1 1 1 1 1 1 1 1 1 1 1 1 1 1 1 
##$CPDPRG= <>
##$CPDPRG1= <>
##$CPDPRG2= <>
##$CPDPRG3= <>
##$CPDPRG4= <mlev>
##$CPDPRG5= <mlev>
##$CPDPRG6= <mlev>
##$CPDPRG7= <mlev>
##$CPDPRG8= <mlev>
##$CPDPRGB= <>
##$CPDPRGT= <>
##$D= (0..31)
0 1.2 0 0 0 0 0 0 0 0.06 0 0.03 0 0 0 0 0.0002 0 0 0 0 0 0 0 0 0 0 0 0 
0 0 0 
##$DATE= 1644387705
##$DBL= (0..7)
120 120 120 120 120 120 120 120 
##$DBP= (0..7)
150 150 150 150 150 150 150 150 
##$DBP07= 0
##$DBPNAM0= <>
##$DBPNAM1= <>
##$DBPNAM2= <>
##$DBPNAM3= <>
##$DBPNAM4= <>
$$ [...]
##$SUBNAM2= <"">
##$SUBNAM3= <"">
##$SUBNAM4= <"">
##$SUBNAM5= <"">
##$SUBNAM6= <"">
##$SUBNAM7= <"">
##$SUBNAM8= <"">
##$SUBNAM9= <"">
##$SW= 18.0517287032376
##$SWIBOX= (0..15)
0 0 2 0 0 0 0 0 0 0 0 0 0 0 0 0 
##$SW_h= 3612.71676300578
##$TD= 16384
##$TD0= 1
##$TE= 0
##$TE2= 300
##$TE3= 300
##$TEG= 300
##$TL= (0..7)
0 120 120 120 120 120 120 120 
##$TP= (0..7)
150 150 150 150 150 150 150 150 
##$TP07= 0
##$TPNAME0= <>
##$TPNAME1= <>
##$TPNAME2= <>
##$TPNAME3= <>
##$TPNAME4= <>
##$TPNAME5= <>
##$TPNAME6= <>
##$TPNAME7= <>
##$TPOAL= (0..7)
0.5 0.5 0.5 0.5 0.5 0.5 0.5 0.5 
##$TPOFFS= (0..7)
0 0 0 0 0 0 0 0 
##$TUNHIN= 0
##$TUNHOUT= 0
##$TUNXOUT= 0
##$USERA1= <user>
##$USERA2= <user>
##$USERA3= <user>
##$USERA4= <user>
##$USERA5= <user>
##$V9= 5
##$VALIST= <valist>
##$VCLIST= <CCCCCCCCCCCCCCC>
##$VD= 0
##$VDLIST= <DDDDDDDDDDDDDDD>
##$VPLIST= <PPPPPPPPPPPPPPP>
##$VTLIST= <TTTTTTTTTTTTTTT>
##$WBST= 1024
##$WBSW= 4
##$XGAIN= (0..3)
0 0 0 0 
##$XL= 0
##$YL= 0
##$YMAX_a= 318377
##$YMIN_a= -581709
##$ZGOPTNS= <>
##$ZL1= 120
##$ZL2= 120
##$ZL3= 120
##$ZL4= 120
##$ABSF1= 15.72926
##$ABSF2= -2.322589
##$ABSG= 5
##$ABSL= 3
##$ALPHA= 0
##$AQORDER= 0
##$ASSFAC= 0
##$ASSFACI= 0
##$ASSFACX= 0
##$ASSWID= 0
##$AUNMP= <proc_1d>
##$AZFE= 0.1
##$AZFW= 0.1
##$BCFW= 0
##$BC_mod= 2
##$BYTORDP= 0
##$COROFFS= 0
##$CY= -3
##$DATMOD= 1
##$DC= 0
##$DFILT= <>
##$DTYPP= 0
##$F1P= 0
##$F2P= 0
##$FCOR= 1
##$FTSIZE= 16384
##$FT_mod= 6
##$GAMMA= 0
##$GB= 0
##$INTBC= 1
##$INTSCL= 0
##$ISEN= 128
##$LB= 0.24
##$LEV0= 0
##$LPBIN= 0
##$MAXI= 10000
##$MC2= 0
##$MEAN= 0
##$ME_mod= 0
##$MI= 1.114404
##$NCOEF= 0
##$NC_proc= -5
##$NLEV= 6
##$NOISF1= 3.799351
##$NOISF2= 2.8
##$NSP= 0
##$NTH_PI= 0
##$NZP= 0
##$OFFSET= 15.73808
##$PC= 1
##$PHC0= -15869.22
##$PHC1= 10.00078
##$PH_mod= 1
##$PKNL= yes
##$PPARMOD= 0
##$PSCAL= 0
##$PSIGN= 0
##$REVERSE= no
##$SF= 200.130002698157
##$SI= 16384
##$SIGF1= 3
##$SIGF2= 2
##$SINO= 5.538805
##$SIOLD= 16384
##$SREGLST= <1H.CDCl3>
##$SSB= 0
##$STSI= 16384
##$STSR= 0
##$SW_p= 3612.71676300578
##$SYMM= 0
##$S_DEV= 0
##$TDeff= 16384
##$TDoff= 0
##$TI= <>
##$TILT= no
##$TM1= 0
##$TM2= 0
##$TOPLEV= 0
##$USERP1= <user>
##$USERP2= <user>
##$USERP3= <user>
##$USERP4= <user>
##$USERP5= <user>
##$WDW= 1
##$XDIM= 16384
##$YMAX_p= 472227546
##$YMIN_p= -258388
$$ End of Bruker specific parameters
$$ ---------------------------------
##NTUPLES= NMR SPECTRUM
##VAR_NAME=  FREQUENCY,     SPECTRUM/REAL,   SPECTRUM/IMAG
##SYMBOL=    X,             R,               I
##VAR_TYPE=  INDEPENDENT,   DEPENDENT,       DEPENDENT
##VAR_FORM=  AFFN,          ASDF,            ASDF
##VAR_DIM=   16384,         16384,           16384
##UNITS=     HZ,            ARBITRARY UNITS, ARBITRARY UNITS
##FACTOR=    0.220516191357247, 1,           1
##FIRST=     3149.66199781087, 0,            0
##LAST=      -463.054765194908, 0,           0
##MIN=       -463.054765194908, -258388,     0
##MAX=       3149.66199781087, 472227546,    0
$$ Real data points
##PAGE= N=1
##DATA TABLE= (X++(R..R)), XYDATA
$$ [...]
7186A814606R3257K8666Q2292M4058Q4897J10923J01513R3563N1407J39863J39497
7175B784542M9824P0228P4156M9752M8453P1512Q6528O4574L8922M8662R3706
7164C480859M1411M6519J40837J10227J06549Q5073P7019P0577J22998N9428P9861
7153D421358J41830J07961J13422J62732K10014K00354J93405J75911K08347K02779
7143F138113J88512J94245J69367K28940J90521K36692K30353K77539K81490K90124
7133H425896L44267M41681L78463M56300N01681N37513N49039O33311P11666P04451
7123A3684268P95557Q41234Q40026R71043J126194J330155J491518J831361K170535
7114B5081891K547600K980233L550751M113379M798254N776415O921289Q399508
$$ y = [1814606, 1907863, 1936529, 2018821, 2062879, 2147776, 2258699, 2360212, 2453775, 2505182, 2645045, 2784542, 2834366, 2904594, 2978750, 3028502, 3076955, 3148467, 3234995, 3299569, 3338491, 3387153, 3480859, 3522270, 3568789, 3709626, 3819853, 3926402, 4011475, 4088494, 4159071, 4282069, 4341497, 4421358, 4563188, 4671149, 4784571, 4947303, 5157317, 5357671, 5551076, 5726987, 5935334, 6138113, 6326625, 6520870, 6690237, 6919177, 7109698, 7346390, 7576743, 7854282, 8135772, 8425896, 8770163, 9211844, 9590307, 10046607, 10548288, 11085801, 11634840, 12268151, 12979817, 13684268, 14479825, 15321059, 16161085, 17132128, 18258322, 19588477, 21079995, 22911356, 25081891, 27629491, 30609724, 34160475, 38273854, 43072108, 48848523, 55769812, 64169320]
7106F4169320J0441224J2606585J4813581J5143726J2913441P347092k65746q566255
7098A28602968j5104760j8012113j8012650j4923522j1303795q157574n950367
7091C7138187m389555l457174k768053k283540j893686j709123j535122j386003
7083A7715931j229090j165254r13806p98054p15085o58179m94667m79450m83191
7074A0779155l96776l31564l37241k54826k77935l19829k45108j95295j88089
7065H232492j19488j19336q9770n5463N8325J55829L01131M49899N35904N19848
7055I869371L44563R8672l25030o56966q14178q79056q33837o04220n23198m44762
7045E231359l12677k34327k86974k01933j78375j33624j51771j65639r9792j27939
$$ y = [64169320, 74610544, 87217129, 102030710, 117174436, 130087877, 137434969, 137169223, 128602968, 113498208, 95486095, 77473445, 62549923, 51246128, 43088554, 37138187, 32748632, 29291458, 26523405, 24239865, 22346179, 20637056, 19101934, 17715931, 16486841, 15321587, 14407781, 13609727, 12894642, 12236463, 11741796, 11262346, 10779155, 10382379, 10050815, 9713574, 9458748, 9180813, 8860984, 8615876, 8420581, 8232492, 8113004, 7993668, 7903898, 7848435, 7906760, 8062589, 8363720, 8813619, 9349523, 9869371, 10213934, 10312606, 9987576, 9330610, 8516432, 7637376, 6803539, 6199319, 5676121, 5231359, 4918682, 4684355, 4397381, 4195448, 4017073, 3883449, 3731678, 3566039, 3466247, 3338308]
7035C338308j35192j64106p3891j05874j41355j13396j11487p5111n141j8760
7025B393995r8254N286q9292n4588o3452q4501k7529p4846n1147o2881m2458j02305
7013A648028j4237k5746k9563k2681m8839l4316o3572J4381K6478k8643o9100
7002A352190n2207j4150l2640m2401j1158k0037j1973j2472k9776k153m1763m6207
6990A035253k6250m7615j3594m254o2853k2572q971p210j5135M857k5542N67J0895
6977H17576l2447m481J7603J2827n1500l1361l1950l9443O671j7999k7011J4337
6965F32822j0965l6579k6820N4722o200p986l5947n6870j0559P1911l8526j2041
6953E16962k494q0902m9352N270k838K688J8166j1055k6915J9744l1081J1878
$$ y = [3338308, 3203116, 3039010, 2965119, 2859245, 2717890, 2604494, 2493007, 2417896, 2412755, 2393995, 2295741, 2301027, 2211735, 2157147, 2093695, 2009194, 1981665, 1906819, 1855672, 1792791, 1750333, 1648028, 1633791, 1608045, 1578482, 1555801, 1506962, 1472646, 1409074, 1423455, 1449933, 1421290, 1352190, 1299983, 1285833, 1253193, 1210792, 1199634, 1179597, 1167624, 1155152, 1125376, 1123223, 1081460, 1035253, 1009003, 961388, 947794, 943540, 880687, 858115, 849144, 841934, 826799, 831656, 806114, 806681, 817576, 785129, 780648, 798251, 811078, 759578, 728217, 696267, 656824, 663495, 645496, 618485, 632822, 621857, 585278, 558458, 613180, 606980, 598994, 563047, 506177, 495618, 567529, 529003, 516962, 514468, 433566, 384214, 389484, 386646, 389334, 407500, 396445, 369530, 389274, 358193, 370071]
6941C70071N5054J9343k7901l2960M695j2777K0504o597m9491j2683N853j3074
6929C20037l1058m6486J7204N1890j3392k2647K5981N808l2992k9088K230L5802
6917B83289m8296m562K1236J8364j9810l1587M3112L8235n6642q4420N0089O177
6905B15185l1955j2851M2033K8720l0805l9548K1527O820P197J6056m3937P334
6893A85776L2355k0532q7445n6763N7190M7687J2158J8357k6796l4532J1461N4214
6881A93130p3170O32K420l5656K1661j5605n496Q616M0266m4145O992J287l8301
6868F2631j5377M7104J0679o1311O088L5121J0715m142k3671m173m0797L2082
6856E4949L0778K4976L0478n4966r061K1989l4329M4965J5771K8997K3445j7771
$$ y = [370071, 425125, 444468, 416567, 383607, 388302, 375525, 396029, 389432, 339941, 327258, 333111, 320037, 288979, 242493, 259697, 311587, 298195, 275548, 301529, 307337, 274345, 245257, 247487, 283289, 234993, 230431, 251667, 270031, 250221, 218634, 261746, 299981, 243339, 158919, 209008, 215185, 183230, 170379, 212412, 241132, 210327, 170779, 192306, 199126, 206323, 222379, 178442, 185776, 218131, 197599, 110154, 53391, 110581, 158268, 170426, 188783, 161987, 127455, 138916, 193130, 119960, 120592, 123012, 87356, 109017, 93412, 87916, 96532, 136798, 92653, 99645, 100932, 62631, 47254, 94358, 105037, 43726, 49814, 84935, 95650, 91508, 67837, 63664, 22867, 54949, 85727, 110703, 141181, 86215, 77154, 99143, 64814, 109779, 125550, 154547, 177992, 160221]
6844A60221p758K2342m5350j4477k0887K2615O332j0413L5457o303K5599o2662
6832A04716M095K6272n338m6466j7566M4171j5526j2518k2701q087J7433m7737
6820B0748L2694J1603J1741K9646k5378o4009j1206J6885j708o1486k2043Q0170
6808A7657K2250J2054j3333M4035J2083n2933l1250J6197O6811l1403l5699n209
6796B1260j6352j0459j1875L1737K2554L059J664k1088m409J2130K0835O008k2554
6783C2510m2368L397M5404K013k2328m3281P2401p267j6614J5102j1513N4852
6771H2308m2009o1214K2312o722J3635K8578j2207l2772k4459K2727j6673R1155
6759F4659K0302n3646L631k7254m174N8382j3112k8901J9069R008K003j1984o324
$$ y = [160221, 152463, 174805, 129455, 114978, 94091, 116706, 123038, 112625, 148082, 141779, 167378, 104716, 108811, 135083, 129745, 83279, 65713, 109884, 94358, 81840, 59139, 51052, 68485, 20748, 53442, 65045, 76786, 106432, 81054, 17045, 5839, 22724, 21016, -40470, -62513, 17657, 39907, 51961, 38628, 82663, 94746, 41813, 10563, 26760, 93571, 62168, 26469, 21260, 4908, -5551, -17426, 14311, 36865, 39924, 41588, 20500, 16091, 28221, 49056, 55064, 32510, -9858, -6461, 38943, 40956, 18628, -24653, 47748, 40481, 23867, 38969, 27456, 82308, 40299, -20915, 1397, -5325, 8310, 36888, 24681, -8091, -32550, -9823, -26496, 64659, 84961, 31315, 34946, 7692, 3518, 61900, 48788, 19887, 38956, 47964, 49967, 37983, 31659]
6746C1659K3768J4993p17K2186j7944K8880m5078j1897n92j0968J469m255L6197
6733F7701J2908j5123k3227M2644J4202j7697l2554r985J1730J2490J9726p003
6721G5812n453R23J567L2359q395L8620R526k2187N0655k8768N5776K5790m635
6708B21590O5972O6164K5313L6778R5778O9095N1805J6456N2372P972m3951n965
6696F59379m9927j23566p2503j13418J2001o3858j9410j930k0817n8465k2410
6685A25076K3130l419l2087k0064K3174J0297m1416j8931N3743M5196j7962n2280
6673I4457m654r994M8671L0178m0930k257J1677p6230j2235P5652N2765l7370
6661A29730n768l6779o633J5812R235m0016j2219J589J4736o024m1367L778K6937
$$ y = [31659, 55427, 70420, 69703, 91889, 73945, 102825, 57747, 45850, 45258, 34290, 35759, 31504, 67701, 80609, 65486, 42259, 84903, 99105, 81408, 48854, 38869, 50599, 63089, 82815, 75812, 70359, 71282, 72849, 105208, 96813, 135433, 144959, 122772, 173427, 144659, 200435, 226225, 221590, 287562, 353726, 379039, 415817, 511595, 580690, 632495, 648951, 701323, 709295, 665344, 659379, 609452, 485886, 413383, 299965, 311966, 248108, 228698, 226768, 205951, 147486, 125076, 148206, 144787, 112700, 92636, 115810, 126107, 84691, 65760, 119503, 164699, 146737, 94457, 89803, 79809, 128480, 158658, 117728, 115471, 127148, 50918, 38683, 114335, 167100, 129730, 123962, 87183, 80550, 96362, 105597, 65581, 53362, 54951, 69687, 63663, 22296, 26074, 53011]
6648E3011n111L304j0493O080L792M42K7339j4074q905k1074p674R42k4061l3875
6634c0357J7064L1941P919k5887O530K9127J722j3555n5117K6397L4684J7650
6622D8118O773k3076M1262J1686m4783P745r504l3313R5258j2465n7835j5036
6610A4830k8347M5215j6052j3025M1374N6626K1023J0761l5675L645m4854q663
6598D6858j1820J2324K0438k648J3165j4251J0176J7259L6176K7065k9720j8048
6586A06974N42O458l046n983O083N889k2238k8183j4227n539J5504k4902N2603
6573H9935L2538O510m2568n0839j6151M0554L5072l475l2076k572K7056j5346
6561F8638N5909j0891m7057J3105K0218O9626j0069J4999j2626l5188M3319K2553
$$ y = [53011, 47900, 51204, 40711, 46791, 50583, 51025, 78364, 64290, 55385, 34311, 26637, 27579, 3518, -30357, -13293, 18648, 26567, 680, 7210, 36337, 38059, 24504, -30613, -4216, 30468, 48118, 54891, 31815, 73077, 84763, 39980, 47725, 38221, 4908, 100166, 87701, 29866, 14830, -13517, 31698, 15646, 2621, 43995, 100621, 121644, 132405, 96730, 100375, 55521, 46858, 35038, 47362, 67800, 65152, 78317, 64066, 74242, 91501, 127677, 154742, 125022, 106974, 107516, 113974, 110928, 104945, 111028, 116917, 94679, 66496, 52269, 46730, 62234, 37332, 89935, 122473, 128983, 86415, 35576, 19425, 59979, 95051, 91576, 59500, 56928, 83984, 68638, 124547, 113656, 66599, 79704, 99922, 169548, 159479, 174478, 161852, 126664, 169983, 192536]
6549A92536r075K3667j4368q502J1795O6669O205n723L9075j2666p835L3736P3553
6536C89067K7663Q1175J2179O8633J11352O4369J97016K39035J76133P8368p9866
6525A365124j39539k43722k31900j43672j39795j06520o9019l2513k3949O319
6515B40814n6866k1283l0725L88k4241l4812o866J1740K4344l1959K9116n0507
6503D9143j1448J3514j6286q728L9830q31m939L42k3524L4985j6641k4930j047
6490B9440q65k9562J1125L1163l5453Q130L2239Q9107k9985k8293j2896j8304
6478D5846J1260l0380M0220k9392r026k2585L0192k7985p507K9619k8476O372
6466H158l3768K911K3579Q9755j4421l5739l557l2366L5592l0161J2187J2589
$$ y = [192536, 183461, 207128, 192760, 184258, 196053, 262722, 268927, 263204, 302279, 289613, 281778, 315514, 389067, 416730, 497905, 510084, 578717, 690069, 754438, 951454, 1190489, 1366622, 1444990, 1365124, 1225585, 981863, 749963, 606291, 466496, 359976, 290957, 258444, 234495, 240814, 183948, 162665, 131940, 132328, 108087, 73275, 66409, 78149, 102493, 70534, 99650, 49143, 37695, 51209, 34923, 26195, 66025, 65194, 60255, 60597, 37073, 72058, 55417, 30487, 29440, 28575, -987, 10138, 41301, 5848, 13978, 46217, 135324, 105339, 77046, 64150, 45846, 57106, 26726, 66946, 37554, 28528, 5943, 36135, 8150, 643, 30262, 1786, 8158, -25610, -22699, 880, 90635, 76214, 40475, 36918, 4552, 40144, 9983, 22170, 34759]
6454C4759Q547q78p941k7809J4311K1312L6J2397l063j0457J4280J762k0807j963
6440C4486Q138m9426k5525L5363j7242N6288J2234Q828K698n7853K0865O6019
6428I4873K4761o6986L545o369J2790K0193q366k5921K6261L2413M291M286M5107
6415A60878M4024r938M3570j6245Q40N507K3381K2753o5475k2227L0329N011l6825
6402A85583l643J8786K6504K1290O20J398j2494j2240k4415m7721l2020K8165
6390A49813m2887L6199r353k734j5673l7749J728J9311K3652l5856k7563K7305
6378H6193P763m3775P4199L945r0605J6344Q5181L7970o309j3598J3684j0250
6366A60742p800M7310M2281K2260k66L6859N7828m675K429J927l0440K3076n11
$$ y = [34759, 43306, 42428, 34487, 6678, 20989, 42301, 42337, 54734, 51671, 41214, 55494, 57256, 36449, 34486, 42624, -6802, -32327, 3036, -14206, 42082, 54316, 63144, 65842, 7989, 28854, 94873, 119634, 52648, 56193, 49824, 62614, 82807, 74441, 48520, 74781, 107194, 111485, 115771, 160878, 204902, 194964, 238534, 222289, 223129, 228636, 252017, 274770, 209295, 187068, 217397, 222408, 185583, 181940, 200726, 227230, 248520, 249140, 250538, 238044, 225804, 201389, 153668, 121648, 149813, 106926, 143125, 133772, 131038, 115365, 77616, 79344, 98655, 122307, 86451, 58888, 86193, 93956, 50181, 124380, 128325, 37720, 54064, 139245, 177215, 170906, 157308, 170992, 160742, 152942, 200252, 242533, 264793, 264527, 301386, 359214, 354539, 356968, 358895, 328455, 351531, 351020]
6353C51020O868J4062k3633l2391L4403L5225Q07k4126k2463j4021k4194q3717
6341B17840l2881L5541k6011m0439m2288L2965O6508K6841j8357r408K7447n5073
6329A82685M271P536m333O363q440j1002L7815J1999L8267J7873j7j5687K7108
6316B94438P0671o2284J6659l2777q856K0932l472L2708K7272m0713j6991j9682
6304B77905p376J9851N6643n767m2272k3871m5083L6195r747m903J5532j9410
6292B47697K5433M39j7350k2522N9014J164l8350O8870k1368m761J1716r028R086
6279C10040J6892l2193o9530N0789L3360k4607m8020K7696J2414L8690k7112l7123
6267B51296l577J5343M6067K5866n395q944L6054J2307m747K6923K9083o8229
$$ y = [351020, 357888, 371950, 348317, 315926, 350329, 385554, 386361, 362235, 339772, 325751, 301557, 217840, 184959, 220500, 194489, 154050, 111762, 144727, 211235, 238076, 219719, 210311, 237758, 182685, 186956, 194492, 190159, 196522, 188082, 177080, 214895, 226894, 265161, 283034, 283017, 267330, 294438, 365109, 302825, 319484, 286707, 277851, 298783, 295311, 328019, 355291, 314578, 297587, 277905, 270529, 290380, 347023, 341256, 298984, 275113, 230030, 266225, 256478, 251575, 267107, 247697, 273130, 273569, 256219, 233697, 292711, 293875, 255525, 324395, 303027, 298266, 309982, 300954, 310040, 326932, 294739, 225209, 275998, 309358, 284751, 236731, 264427, 276841, 315531, 288419, 251296, 247719, 263062, 309129, 334995, 329600, 320656, 356710, 369017, 364270, 391193, 420276, 352047]
6255C52047j9615q350K9717J0704l439p998r195N789j4689m5182K6967M8765k1207
6242C44314L304M0231o487p070l4126o224K9807l2831L4489K6103j8159K7130
6230D00481Q2387o4904K5265m585m9044K9951L665M6950J6462j2012K2997J5363
6218E12976l1727K886M60j6015j5884K6381Q141K464O739M4873L7118l6655J200
6205E42957Q631N154o744L2033K4127K2889n821k2142K8462J5419L8483o7800
6193F15648J1148M1884M2411L9436j2923L4230J637j2579M0725R126K1128j2090
6181H19781K7738M7948J1515k1567p95M8566M0082M8511M828j1785M076O7989
6169A086887K716j1822N705j276P2430M9923M5803k0699N4233P0739j4849M8712
$$ y = [352047, 332432, 324082, 353799, 364503, 361064, 353066, 343871, 349660, 334971, 289789, 316756, 365521, 344314, 347618, 387849, 381362, 374292, 340166, 333942, 363749, 330918, 365407, 391510, 373351, 400481, 482868, 417964, 443229, 438644, 389600, 419551, 423216, 470166, 486628, 474616, 497613, 512976, 481249, 484135, 484595, 468580, 452696, 479077, 487218, 489682, 496421, 541294, 578412, 541757, 542957, 551588, 556742, 549998, 582031, 606158, 629047, 623226, 601084, 629546, 644965, 683448, 615648, 626796, 668680, 711091, 750527, 737604, 771834, 773471, 760892, 801617, 810743, 831871, 819781, 847519, 895467, 906982, 885415, 884620, 933186, 973268, 1021779, 1026607, 1014822, 1018898, 1086887, 1089603, 1077781, 1083486, 1082210, 1154640, 1204563, 1250366, 1229667, 1283900, 1354639, 1339790, 1388502]
6157A388502r562N3707Q7351J6470P1J23682P1714M1850J3804n078J16819M6662
6145A945992J1848Q2196P9983J9674L5365M8509L695N5198L5511J166Q1737Q7594
6133B488468K9989P3468N1940J26213J18016O8170P4976L7003J05817R3977R5789
6122C363826P3620J19974Q3229N9186R6445J37611J40608J58622J36278J64278
6112D533677K02050K12399K04417J95820J60287K07221K65838K61849L13153K63476
6102F820187K71349L34570M24456M11273M50587N50381N75039P00540Q77065R63301
6092A2378748J109617J293641J570354J816309K115833K498401L048239L752895
6084B9584037M199329L847661K440466P99212q20873k290266k865198k363612
$$ y = [1388502, 1378940, 1432647, 1519998, 1536468, 1536539, 1660221, 1731935, 1773785, 1787589, 1782511, 1899330, 1945992, 1957840, 2040036, 2120019, 2139693, 2175058, 2223567, 2227262, 2282460, 2317971, 2319137, 2400874, 2488468, 2518457, 2591925, 2643865, 2770078, 2888094, 2956264, 3031240, 3068243, 3174060, 3268037, 3363826, 3437446, 3557420, 3640649, 3699835, 3796280, 3933891, 4074499, 4233121, 4369399, 4533677, 4735727, 4948126, 5152543, 5348363, 5508650, 5715871, 5981709, 6243558, 6556711, 6820187, 7091536, 7426106, 7850562, 8261835, 8712422, 9262803, 9837842, 10538382, 11415447, 12378748, 13488365, 14782006, 16352360, 18168669, 20284502, 22782903, 25831142, 29584037, 33783366, 37631027, 40071493, 40870705, 40049832, 37759566, 34894368, 32530756]
6076C2530756j190695L6441J165167K258131K832721K390383R29657q73060k579907
6067C7499594m001322m680145m291282l218485k315169j646769j275025r43336
6059A5128061p03425n83448l61003k14153k05922j48020p0569j3787l4988O2697
6049A2855443J84542J82158L13641L60702N15239P17292Q21600J010788J275385
6040A8236790J502469J713732K062676K510032K841880L470759M314568N206999
6032D1859905N268667M070323K002955k53111k214059l645308l913487k651563
6024D0524322r37004N69191K061936L168618L435681K078195j96010k387928m510153
6015D3806848o077425o280517n230508l857052k808034k123881j694145j330735
$$ y = [32530756, 31340061, 31376502, 32541669, 34799800, 37632521, 40022904, 40952561, 40079501, 37499594, 33498272, 28818127, 24526845, 21308360, 18993191, 17346422, 16071397, 15128061, 14424636, 13841188, 13480185, 13266032, 13060110, 12912090, 12841521, 12827734, 12792746, 12855443, 13039985, 13222143, 13535784, 13896486, 14411725, 15129017, 15950617, 16961405, 18236790, 19739259, 21452991, 23515667, 26025699, 28867579, 32338338, 36652906, 41859905, 47128572, 51198895, 53201850, 52948739, 50734680, 47089372, 43175885, 40524322, 39587318, 40156509, 42218445, 45387063, 48822744, 50900939, 50704929, 48317001, 43806848, 37729423, 31448906, 26218398, 22361346, 19553312, 17429431, 15735286, 14404551]
6007A4404551j037940q15858p13393o62546o34156o19023n71296m98081m78258
5998H374000m93374m15305l65380l10749k75961k58588k16675k21771j91770j57178
5988E467249k17837j49296j66300j72468p6224j45832q4527o5753r6177q5478
5978D207357o9533l1825p2874o6120J0120P369p196k5741j09155r6675p0572j26387
5966C548768j57075j46543j47616r2456j00459j13137o9607k1914k9199l6216
5956B634546j1753l8735k4226l4861N214n4201k0849n734m6581L1728L0576L6720
5944B501844K8367O254Q2747O4139Q4930P8936R6745j6169K9379J320m8629K064
5932B911927n8426n8028q3754j12770K4241J02020Q5074N7359J3939M1860m2973
$$ y = [14404551, 13366611, 12550753, 11837360, 11174814, 10540658, 9921635, 9350339, 8852258, 8374000, 7880626, 7465321, 7099941, 6789192, 6513231, 6254643, 6037968, 5816197, 5624427, 5467249, 5249412, 5100116, 4933816, 4761348, 4685124, 4539292, 4454765, 4389012, 4292835, 4207357, 4137824, 4105999, 4033125, 3967005, 3977125, 3984494, 3977298, 3951557, 3842402, 3745727, 3675155, 3548768, 3391693, 3245150, 3097534, 3005078, 2904619, 2791482, 2721875, 2699961, 2670762, 2634546, 2622793, 2584058, 2559832, 2524971, 2530185, 2475984, 2455135, 2449401, 2402820, 2434548, 2465124, 2501844, 2530211, 2536465, 2619212, 2683351, 2768281, 2847217, 2943962, 2927793, 2957172, 2958492, 2909863, 2911927, 2853501, 2795473, 2711719, 2598949, 2623190, 2725210, 2810284, 2867643, 2881582, 2923442, 2880469]
5921B880469j4424K5775j639r8231q4570l6461j5782M451L323N3924m7817l428
5909B665590k3220r3621l354O7843J8847o9459p8888j8202m4558q4291r2843j2937
5897B230907q13k2545M0290L2327K8480Q7595J35144P7372J79460J00745J51570
5886C040532K02769K47701K75995K32077K19370J35834j1460j04863j43873j24891
5876C969191r1707n1592j20J0107r3692k8988R250n6467p7323j26055q8845o4866
5864C308893J7535O9586M2853O5650J6826L6594O4035Q8805J66784K35064K48171
5853D360796L80990M68163N57430M59002J85500p6952k57366m61045o28796n94809
5843D392913m23597l37358k72572j86734j11241p1978j06191l4140l6468M998
$$ y = [2880469, 2866045, 2891820, 2890181, 2791950, 2707380, 2670919, 2655137, 2659588, 2662911, 2716835, 2669018, 2665590, 2642370, 2548749, 2545395, 2613238, 2632085, 2562626, 2483738, 2465536, 2420978, 2336687, 2243844, 2230907, 2230094, 2207549, 2247839, 2280166, 2308646, 2396241, 2531385, 2608757, 2788217, 2888962, 3040532, 3243301, 3491002, 3766997, 3999074, 4218444, 4354278, 4342818, 4237955, 4094082, 3969191, 3877484, 3825892, 3825772, 3835879, 3742187, 3713199, 3722449, 3665982, 3588659, 3462604, 3373759, 3308893, 3326428, 3396014, 3438867, 3504517, 3521343, 3557937, 3621972, 3710777, 3877561, 4112625, 4360796, 4741786, 5209949, 5767379, 6226381, 6411881, 6334929, 6077563, 5616518, 4987722, 4392913, 3969316, 3631958, 3359386, 3172652, 3061411, 2989433, 2883242, 2849102, 2812634, 2817632]
5833B817632O1587K0757m0203P1013O1489J33568J31935J23850K43139K45488
5823C870255K90439L20846L74327N22239N63573M49666K27273l9952k39152n03681
5813E835833o62421o04734m92744l23819j96598j55344q6517r4840p6282L1075
5803C173609k6035p4611K613Q0913n7181l709L5387K7283Q8200J04796P5265J08531
5791C535061J40682J17422J42777K05347K40525J55855J04698J6303o8485j16329
5781D473856j73248j78843j67150m4103l7134R013J28916p190M4795N0301L3983
5770D133196N8355M4974R6763J30049M6429R1914J20311N5366J56734J84580J17736
5759E236407J06362J97816J95690J72944J51396K14710K10546J73339K70820L01108
$$ y = [2817632, 2879219, 2899976, 2859773, 2930786, 2992275, 3125843, 3257778, 3381628, 3624767, 3870255, 4160694, 4481540, 4855867, 5378106, 5941679, 6391345, 6618618, 6578666, 6339514, 5835833, 5173412, 4568678, 4075934, 3752115, 3555517, 3400173, 3313656, 3218816, 3142534, 3173609, 3147574, 3072963, 3075576, 3156489, 3099308, 3095599, 3130986, 3158269, 3246469, 3351265, 3426530, 3535061, 3675743, 3793165, 3935942, 4141289, 4381814, 4537669, 4642367, 4658670, 4590185, 4473856, 4300608, 4121765, 3954615, 3910512, 3873378, 3882391, 4011307, 4004117, 4048912, 4099213, 4133196, 4191551, 4236525, 4333288, 4463337, 4509766, 4601680, 4721991, 4777357, 4934091, 5118671, 5236407, 5342769, 5540585, 5736275, 5909219, 6060615, 6275325, 6485871, 6659210, 6930030, 7231138]
5749G231138K53095L41144L70271L31171L85775L87177M84510O46170O92290Q04217
5739A1926958R66425J174129J377059J614554J920406K284066K559123L144117
5731B6966837L769668M262306M265872L016545O77591j141939j949032k941089
5723C6926759m296328m511714l609836k538189j779495j214247q30141n32923
5715A7613886k11764L7015K75178M90472P31700R86736J353982J678013K055206
5706B5010424K454909L106338L707880M322517M442758L379191J121002j070800
5698D6474219k101221l067084m596802n130005m298605l169729k226116j537930
5690B0346727j065424n93505k99312q6142J70529L84178P33375R91596J314032
$$ y = [7231138, 7484233, 7825377, 8195648, 8526819, 8912594, 9299771, 9784281, 10430451, 11122741, 11926958, 12893383, 14067512, 15444571, 17059125, 18979531, 21263597, 23822720, 26966837, 30736505, 34998811, 39264683, 42281228, 42958819, 41816880, 39867848, 36926759, 32630431, 28118717, 24508881, 21970692, 20191197, 18976950, 18146809, 17613886, 17402122, 17439137, 17714315, 18204787, 18936487, 19923223, 21277205, 22955218, 25010424, 27465333, 30571671, 34279551, 38602068, 43044826, 46424017, 47545019, 46474219, 44372998, 41305914, 36709112, 31579107, 27280502, 24110773, 21884657, 20346727, 19281303, 18687798, 18388486, 18302344, 18472873, 18857051, 19590426, 20582022, 21896054]
5681B1896054J732302K163744K687890L020909K651127J167235m62852j409392
5673C3447017j922841k923471l596477l250607k451597j801209j311808r04914
5665A5284093o59935l89618j80018j01677J05931K85332N37665P09049R92757
5656A6583579J298505J600665J987444K379839K983101L375295L026901J696536
5648C4931865k09156j511689k098081l113074m105529l986117l194010k323857
5640A4390352j749886j343110j084951r19368o74860o23390n10870m58095m29999
5631F595823l82375k91022k95129k87322k39555j67272j69625j87834j65572j06631
5621D303486j20116j50669j23604j40960p0990j52224q3392q1973j29057j37460
$$ y = [21896054, 23628356, 25792100, 28479990, 31500899, 34152026, 35319261, 34856409, 33447017, 31524176, 28600705, 25004228, 21753621, 19302024, 17500815, 16189007, 15284093, 14624158, 14234540, 14054522, 13952845, 14058776, 14344108, 14881773, 15590822, 16583579, 17882084, 19482749, 21470193, 23850032, 26833133, 30208428, 33235329, 34931865, 34722709, 33211020, 31112939, 27999865, 23894336, 19908219, 16714209, 14390352, 12640466, 11297356, 10212405, 9293037, 8618177, 7994787, 7483917, 7025822, 6595823, 6213448, 5922426, 5627297, 5339975, 5100420, 4933148, 4763523, 4575689, 4410117, 4303486, 4183370, 4032701, 3909097, 3768137, 3697147, 3544923, 3461531, 3379558, 3250501, 3113041]
5611C113041n5172j23422j35886m7692m3475l5495j24888j8992m1713n4036j752
5600B430518l2686J7841l1243m6307K2057p075p075K7895j230l7923J8989J7253
5588B371014N4608L5280Q8727Q3171J15893L7255K2595p273m8656p3362j16149
5577B563103j39956j38183j29747p3673p4463p1355l3092m3836l6360K3423J9920
5566A865781l8146j214P9202l5200L931Q0215J7534k6624P6043J24498J61672
5555B307692R7441Q6855J10963L2000l6662p6822j06228r5640r2373j54320j28604
5544A944302o9073l7934j8530j7024j0533L6173l3636R0920K8994L4566P7597
5533B025822N0104O2639j1012k4836j18214r1848j37479p2170m8123r4717m0382
$$ y = [3113041, 3057869, 2934447, 2798561, 2750869, 2707394, 2671899, 2547011, 2528019, 2486306, 2432270, 2430518, 2397832, 2415673, 2384430, 2338123, 2360180, 2353105, 2346030, 2373925, 2372695, 2334772, 2353761, 2371014, 2425622, 2460902, 2549629, 2632800, 2748693, 2785948, 2808543, 2801270, 2752614, 2679252, 2563103, 2423147, 2284964, 2155217, 2081544, 2007081, 1935726, 1902634, 1858798, 1822438, 1845861, 1865781, 1827635, 1826421, 1905623, 1870423, 1874354, 1954569, 1972103, 1945479, 2021522, 2146020, 2307692, 2405133, 2491988, 2602951, 2634951, 2598289, 2521467, 2415239, 2319599, 2227226, 2072906, 1944302, 1875229, 1837295, 1818765, 1801741, 1791208, 1827381, 1793745, 1884665, 1913659, 1948225, 2025822, 2075926, 2138565, 2127553, 2102717, 1984503, 1892655, 1755176, 1683006, 1634883, 1540166, 1499784]
5522A499784m8345m313k4080L9894j0893m8982j9583j0509M7654n2553o3697N1462
5510A355839R3516N3633K6053P3609Q0720N8736Q2857P8109m7827K0430j7319
5499A858356o5469o7709j23844j79048q8543q7970n6986J1200k7569r075o2779
5488A100564m664J3753o5090j7317J1507n3157p967j4833N2782j9794k381k6256
5476I67147n5933m4006q5503N2702N2299j7749j04691L2803R512m4480k6270L1950
5464G67781M1250L0883m2051M129K9050J0836k5924N3529J268j3640L600L6572
5452H97283J5686J8083K5327J6274k0166l6345L723k3060p4649J1568p633n8728
5440G67363j2804M5771O4671O8807J4693M7819N0293o0576K1113j9430o36j1343
$$ y = [1499784, 1451439, 1447126, 1423046, 1462940, 1452047, 1403065, 1383482, 1372973, 1420627, 1368074, 1304377, 1355839, 1449355, 1502988, 1529041, 1602650, 1683370, 1742106, 1824963, 1903072, 1855245, 1875675, 1858356, 1792887, 1725178, 1601334, 1422286, 1333743, 1245773, 1188787, 1199987, 1172418, 1163343, 1100564, 1095900, 1109653, 1044563, 1027246, 1038753, 985596, 977629, 962796, 1015578, 995784, 993403, 967147, 911214, 867208, 781705, 834407, 886706, 868957, 764266, 797069, 806581, 762101, 735831, 767781, 809031, 839914, 797863, 801992, 831042, 841878, 815954, 869483, 870751, 857111, 860711, 897283, 912969, 931052, 956379, 972653, 952487, 916142, 919865, 896805, 822156, 833724, 826091, 767363, 754559, 800330, 865001, 933808, 948501, 996320, 1046613, 986037, 1007150, 987720, 987084, 975741]
5428I75741j7329k5197k6781k119m7144k4364l0806k7856L1341j3404L2558m314
5416H20326n3219J2116M9155l7361K1711J8649j5660j9291M284r744K9884k7797
5404G93053M5987n5588k4995L256J2239K4643n9859m3972P6512J4382J622L3717
5392H20997k4738j1614K4329j5196n3832J161J2920j8252L2155q533J6637N0493
5380H26527k382k560K0809O3745K0737r549M5328J9366l2769K5892M7962J9186
5368A042292L2017M8644L6700J3458P029m217N1517Q1891L5777L9537J2172P6705
5356A473522J23882P2166J5037N6259r4243m6094L1982l3485r0145p8117j04831
5345A325933j6222j1951k7923K4120J5104j3342l1734Q934J396K57L6204j3730
$$ y = [975741, 958412, 933215, 906434, 904315, 857171, 832807, 802001, 774145, 805486, 792082, 824640, 820326, 767107, 779223, 828378, 791017, 812728, 831377, 815717, 796426, 800710, 790966, 820850, 793053, 839040, 783452, 758457, 761713, 773952, 798595, 738736, 694764, 771276, 785658, 787280, 820997, 796259, 784645, 808974, 793778, 739946, 741107, 754027, 735775, 767930, 759397, 776034, 826527, 824145, 821585, 842394, 906139, 926876, 917327, 962655, 982021, 949252, 975144, 1023106, 1042292, 1074309, 1122953, 1159653, 1173111, 1180140, 1175923, 1227440, 1309331, 1345108, 1384645, 1396817, 1473522, 1597404, 1669570, 1684607, 1740866, 1646623, 1600529, 1632511, 1599026, 1508881, 1430764, 1325933, 1309711, 1297760, 1269837, 1293957, 1309061, 1295719, 1263985, 1272919, 1274315, 1274572, 1310776, 1297046]
5333A297046o59J2392L7919k098L9128L1585m6296j7063j26194j5508r521m1270
5321A159461l8634l0326k019o5216k0500J3753J1207K6711P5307L950l0578k0783
5309A082333L9828j6016J3100p621k8611l4111K0186o892J074O1497j616k2985
5297A100166m6432M465p885m91R597k1340j3556K5607m6239k328O0807l0863K1529
5284A053037P1310j5318J6735j2836M747J909Q193k5567R887J5009J1594J6986
5272A155686j5138N2074l0483j9513L3196m222M5326K9053l4719R00j7392K4674
5260A219442O3136l7522l60K7180M7303k3494j0456q6623k9136L9698P202j1376
5248A204994l034L8056L5168J1779L9547J1079L5681L8357j0933K1985l4524L0065
$$ y = [1297046, 1296387, 1308779, 1346698, 1344600, 1383728, 1415313, 1369017, 1351954, 1225760, 1210252, 1200731, 1159461, 1120827, 1090501, 1088482, 1023266, 1002766, 1016519, 1027726, 1054437, 1129744, 1133694, 1103116, 1082333, 1122161, 1106145, 1119245, 1111624, 1083013, 1048902, 1069088, 1062196, 1063270, 1124767, 1123151, 1100166, 1053734, 1058199, 1050314, 1049823, 1059420, 1038080, 1024524, 1050131, 1003892, 1001564, 1062371, 1031508, 1053037, 1124347, 1109029, 1125764, 1112928, 1117675, 1119584, 1127777, 1102210, 1112097, 1127106, 1138700, 1155686, 1140548, 1192622, 1162139, 1142626, 1175822, 1171600, 1216926, 1245979, 1211260, 1212160, 1194768, 1219442, 1282578, 1245056, 1244696, 1271876, 1319179, 1295685, 1285229, 1198606, 1169470, 1209168, 1216370, 1204994, 1201960, 1240016, 1275184, 1286963, 1326510, 1337589, 1373270, 1411627, 1400694, 1422679, 1388155, 1418220]
5236A418220R0985m0237J059N318o409L3969K7401J7902M3106K0552L2874j1634
5224A633106k8461Q3993K5411J0410O464J11448o662N4115J07834P7853r14J01444
5212B176041J15926N3572Q4759J6743M1883m601R313L7807J5429P6634M8400K1338
5200B693244M9541M9452k4602J00475J02625Q2980L6461Q679N6800P0217Q9493
5189C315365J03397R3030M4765M1795R0205J46276J47661J13387N7331N1613J14583
5178D319408J56024J08420Q9117J25935J89311J39369J29254J53437J69598K82744
5168E862617K21079J73372K41891K94406K74113L19790L09033L71805M18195L95143
5158H881444M89246N82286P33788Q22669Q67752J081648J391227J465821J397379
$$ y = [1418220, 1509205, 1468968, 1470027, 1475345, 1468936, 1502905, 1530306, 1548208, 1591314, 1611866, 1644740, 1633106, 1604645, 1688638, 1714049, 1724459, 1730923, 1842371, 1835709, 1889824, 1997658, 2075511, 2074597, 2176041, 2291967, 2345539, 2430298, 2447041, 2488924, 2484323, 2493636, 2531443, 2546872, 2623506, 2671906, 2693244, 2742785, 2792237, 2767635, 2868110, 2970735, 3053715, 3090176, 3098855, 3155655, 3225872, 3315365, 3418762, 3511792, 3556557, 3598352, 3688557, 3834833, 3982494, 4095881, 4153212, 4204825, 4319408, 4475432, 4583852, 4672969, 4798904, 4988215, 5127584, 5256838, 5410275, 5579873, 5862617, 6083696, 6257068, 6498959, 6793365, 7067478, 7387268, 7696301, 8068106, 8486301, 8881444, 9370690, 9952976, 10686764, 11509433, 12377185, 13458833, 14850060, 16315881, 17713260]
5149A7713260J059867O24979M25636K86903o734J76496O18416J045234J576224
5140B3520281K140875K500201K318677J586058P28673L24102R3207m40207j02435
5131C2669432M98239P10094P10722J034596J142223R27026Q26218Q88019J252254
5122D0658823J165768P87636Q93321P76435j25549j008008j075204j141527j326046
5113C9605649o41857M55962J112659J064128O18888M37442L8065r24395j194112
5104D0572429q65862j090831j535695j239787p07663p79181r34319p53581m10693
5095C2254817j59239j3998M54323M39916j98867j128677j548606j940574k524220
5086B5634875k594857j913256j231154o78768k18905J00915J06068k40356o93732
$$ y = [17713260, 18773127, 19398106, 19823742, 20110645, 20103911, 20280407, 20898823, 21944057, 23520281, 25661156, 28161357, 30480034, 32066092, 32794765, 33118867, 33212074, 32771867, 32669432, 33167671, 33877765, 34588487, 35623083, 36765306, 37692332, 38518550, 39406569, 40658823, 41824591, 42612227, 43505548, 44281983, 44156434, 43148426, 42073222, 40931695, 39605649, 38963792, 39419754, 40532413, 41596541, 42215429, 42652871, 42690936, 41766541, 40572429, 39706567, 38615736, 37080041, 35840254, 35132591, 34353410, 33419091, 32665510, 32254817, 32095578, 32081580, 32535903, 32975819, 32776952, 31648275, 30099669, 28159095, 25634875, 23040018, 21126762, 19895608, 19216840, 18997935, 19098850, 19204918, 18964562, 18270830]
5077A8270830r83245j093129j389617j372086j149328q30715o64459n85668m82020
5068I720563m87815m02238m25480m23454l27419l20633l33377k77621k50984j92180
5058F279362k20460j83560j05763j35120r7120j18351p2353n9430r1230o3388
5048E132587r5087j12827j52960r9414r1378j06376j10561j09744l3580p7302
5038D143358q5966j09406p5958K534N0180J4397n3945O8744J11848O3964P590
5027D137340o1190J3921J3071P0445Q0677N3061j7167j0067M5404q206k9447q9861
5015D197981m8430q2674q8037q8754r8727j00376q4606j48721r5194n2153q2468
5004C227841q987P045j4427L8305K4536J9243N0656k6910J4862m7786r127J5176
$$ y = [18270830, 17287585, 16194456, 14804839, 13432753, 12283425, 11452710, 10788251, 10202583, 9720563, 9232748, 8830510, 8405030, 7981576, 7654157, 7333524, 7000147, 6722526, 6471542, 6279362, 6058902, 5875342, 5769579, 5634459, 5537339, 5418988, 5346635, 5287205, 5195975, 5132587, 5037500, 4924673, 4771713, 4672299, 4580921, 4474545, 4363984, 4254240, 4220660, 4143358, 4057392, 3947986, 3872028, 3874562, 3924742, 3939139, 3885194, 3953938, 4065786, 4129750, 4137340, 4076150, 4090071, 4103142, 4173587, 4254264, 4307325, 4290158, 4280091, 4325495, 4317289, 4287842, 4197981, 4149551, 4066877, 3978840, 3890086, 3791359, 3690983, 3606377, 3457656, 3362462, 3310309, 3227841, 3218854, 3225899, 3211472, 3249777, 3274313, 3293556, 3344212, 3317302, 3332164, 3284378, 3275251, 3290427]
4992C290427k6789k1507m3178j7215m5584o127q095k0626l707J876m6293O116
4980C059298P0675o1420K3918J5791n2316p2109l0829Q477m6556p1894j4629k2648
4968B805758P0125K3374K0639j1336l157L8250L038n355j9786n7352J6238l1274
4956B849162k3399M1658j1358M7464J4706l0898j2782K8977l4418L6490l8317
4945B867285m215P0058L906J3442j0068j5620K520K2705K5217J3727K3086J9976
4933C032019r101o9709o8639p3390l6677K9189k0282k6264L8031K4923O315R879
4921B836294J763J7498L3557O6699O4573L3601j6373O626O9568k7007r887J4868
4909C091780l4509j40893j43993j10336q3462p6881q7338n3143n1880q4561K0264
$$ y = [3290427, 3263638, 3242131, 3198953, 3181738, 3136154, 3130027, 3121932, 3101306, 3097599, 3099475, 3053182, 3059298, 3129973, 3068553, 3092471, 3108262, 3055946, 2983837, 2953008, 2961485, 2914929, 2843035, 2828406, 2805758, 2875883, 2899257, 2919896, 2908560, 2905403, 2943653, 2946691, 2941336, 2921550, 2864198, 2880436, 2849162, 2825763, 2867421, 2856063, 2903527, 2918233, 2887335, 2874553, 2903530, 2869112, 2905602, 2867285, 2863070, 2933128, 2937034, 2950476, 2940408, 2924788, 2927308, 2950013, 2975230, 2988957, 3012043, 3032019, 3022918, 2953209, 2884570, 2811180, 2774503, 2803692, 2783410, 2757146, 2795177, 2820100, 2826415, 2836294, 2838057, 2855555, 2889112, 2955811, 3020384, 3053985, 3037612, 3044238, 3113806, 3086799, 3076912, 3091780, 3057271, 2916378, 2772385, 2662049, 2578587, 2501706, 2414368, 2361225, 2309345, 2224784, 2245048]
4898B245048m0012n204o3725q2034l0006p6218j4952K5776l582K4595q141o1286
4886A910259n1517P9655L3116p919Q455l8204Q760K1164K7263L7524L5244M5703
4874B109503N7238N4026R1971j0847J8819l9701q3543q5530q3150l7214p685K8780
4862B012667R033K7900N2162K4058Q8363R2666Q1312l8745l5811j17604j13467
4851B082534p9925r4074p5742J5838j3726n210l4950L7778N2818q5529k9875j5077
4839A754860J3209j4878j9361J4762L0602j7783J9709P9947K9793K3854K5247
4828A939961L5788r705O9813N3155K8755j902J6228N7633R3277J36849N3604N1270
4816B524726P7965R8140R0183M8983J59139J48888J29955K24165K18992L56743
$$ y = [2245048, 2205036, 2199832, 2136107, 2054073, 2024067, 1947849, 1932897, 1958673, 1955091, 1979686, 1971545, 1910259, 1858742, 1938397, 1971513, 1963594, 1972049, 1933845, 1942605, 1963769, 1991032, 2028556, 2063800, 2109503, 2166741, 2220767, 2312738, 2301891, 2320710, 2281009, 2197466, 2111936, 2028786, 1991572, 1983887, 2012667, 2021700, 2049600, 2101762, 2125820, 2214183, 2306849, 2388161, 2349416, 2313605, 2196001, 2082534, 2002609, 1908535, 1832793, 1848631, 1834905, 1829695, 1794745, 1832523, 1885341, 1799812, 1769937, 1754860, 1768069, 1753191, 1733830, 1748592, 1779194, 1761411, 1781120, 1861067, 1890860, 1914714, 1939961, 1975749, 1966044, 2035857, 2089012, 2117767, 2115865, 2132093, 2189726, 2283003, 2419852, 2473456, 2524726, 2602691, 2700831, 2791014, 2839997, 2999136, 3148024, 3277979, 3502144, 3721136, 4077879]
4806D077879L70625L76614K77042J25748n9285P405j55450l64953k91829j87524
4796D176272j17986j18658n8753o748K8312K9525M6554L8332L8180O9209J27046
4785D251285J26348Q1485J63703Q9624J30770J87915J06604P0338O6065O8254
4775E342391P0721M1625N8849K4443O5525N0190N0722J44261J26856Q8794O3158
4764F127535J53564J26995J82752J99702J73390K54290J96046J56565J76505J86199
4754G933543K73231K57716K33591K67061K85595L26846L44439M22730M98526M77174
4744A1320452O17207P21792Q51600J030476J219735J377131J703329K035799K302925
4735B3180446K762347L424285M093796M403044L757615J667979n79399j151315
$$ y = [4077879, 4448504, 4825118, 5102160, 5227908, 5168623, 5176028, 5020578, 4655625, 4363796, 4176272, 4058286, 3939628, 3880875, 3874127, 3902439, 3931964, 3978518, 4016850, 4055030, 4124239, 4251285, 4377633, 4459118, 4622821, 4712445, 4843215, 5031130, 5137734, 5208072, 5274137, 5342391, 5413112, 5454737, 5513586, 5538029, 5603554, 5653744, 5704466, 5848727, 5975583, 6064377, 6127535, 6281099, 6408094, 6590846, 6790548, 6963938, 7218228, 7414274, 7570839, 7747344, 7933543, 8206774, 8464490, 8698081, 8965142, 9250737, 9577583, 9922022, 10344752, 10843278, 11320452, 11937659, 12659451, 13511051, 14541527, 15761262, 17138393, 18841722, 20877521, 23180446, 25942793, 29367078, 33460874, 37863918, 41621533, 43289512, 42710113, 41558798]
4727D1558798j767513l458507l705222k479154j320603m40166L16385J034789
4719B9738807J727670K327135K941120L760069M736890N695296O409542O524853
4711F3861382N489239L840191K266594j062512n181676o158464o190925p384039
4703D9479790o896817n093302l374779k209093j216320m92159J24009Q29944J428053
4694C2579326J958039K803635L562058L853332K911457L18036k093290k635457
4686D3257136l598385n615547n591855m332374l135139k340980j798150j295307
4678A5549399j073363r12073p35610o78403n64732n06841m65889m60995l32675
4669I818818l22235l00076k82884k95855k89620k45833k32477j84512j81624j44732
$$ y = [41558798, 39791285, 36332778, 32627556, 30148402, 28827799, 28387633, 28704018, 29738807, 31466477, 33793612, 36734732, 40494801, 45231691, 50926987, 57336529, 63861382, 69350621, 73190812, 75457406, 74394894, 69213218, 63054754, 56863829, 49479790, 42582973, 37489671, 34114892, 31905799, 30689479, 30197320, 30321329, 31151273, 32579326, 34537365, 37341000, 40903058, 44756390, 47667847, 47985883, 45892593, 43257136, 39658751, 34043204, 28451349, 24118975, 20983836, 18642856, 16844706, 15549399, 14476036, 13563963, 12828353, 12149950, 11585218, 11078377, 10612488, 10151493, 9818818, 9496583, 9196507, 8913623, 8617768, 8328148, 8082315, 7849838, 7665326, 7483702, 7338970]
4659G338970j35987j20893m9670r5630r9733J1062k2939o1040J5093j4555J4417
4648F779095l6355N688Q4337L8776L1345l255J3163n4197j03023q3989q0841j2037
4636F578707N3309N4006Q5586J57605K24973K23046J20466J59601J18689R4636
4626G870624L4860K666Q4834K6528N4956O2139J1891N5721o4384p3016l5126J18346
4614H150039J53487J65950K42092K54791K35573K79439J17825m599L0790K9606
4604I654993j0321Q9625J35987O2629J12136k7975M669j4178l3144j9665L2J0312
4592I965100J9348J77253J30482O6745J62262J02391O8631R2685R4380J86007
4582A1065284L28086L28016L96762L83607L44170L86437L86783L70429L93767
$$ y = [7338970, 7202983, 7082090, 7032420, 6936790, 6837057, 6848119, 6825180, 6764140, 6779233, 6764678, 6779095, 6742740, 6748428, 6832765, 6871541, 6902886, 6899631, 6912794, 6858597, 6755574, 6671585, 6590744, 6578707, 6632016, 6686022, 6771608, 6929213, 7154186, 7377232, 7497698, 7657299, 7775988, 7870624, 7905484, 7908150, 7992984, 8019512, 8074468, 8136607, 8148498, 8204219, 8139835, 8066819, 8031693, 8150039, 8303526, 8469476, 8711568, 8966359, 9201932, 9481371, 9599196, 9594597, 9625387, 9654993, 9644672, 9734297, 9870284, 9932913, 10045049, 10017074, 10021743, 10007565, 9974421, 9954756, 9954788, 9965100, 9984448, 10161701, 10292183, 10358928, 10521190, 10623581, 10692212, 10784897, 10879277, 11065284, 11393370, 11721386, 12118148, 12501755, 12845925, 13232362, 13619145, 13989574, 14383341]
4573A4383341M42246N66795P06032Q58294J152605J354274J549108J851086K220226
4564B5084007K629294L084489L689507M453619N229573N429827M499988K469115
4556E6569419M75623q60976k029384k946712k470065j027938N90846K153915L377214
4547E3831942L726156K927914J112196p90815j788198k800414l449087k744616
4539E0025078j003930P77190J703222J422766J09241j160554j896023k728977
4531D7248013l286650k858290j570095k44892Q73381J756107J967212J087135
4523D4971921n57853j950095k951272m021658m778100m384375l441731k596001
4515B0290836j957055j551572j289948j069475q59780p34197o27898n67385m40189
$$ y = [14383341, 14825587, 15392382, 16098414, 16956708, 18109313, 19463587, 21012695, 22863781, 25084007, 27713301, 30797790, 34487297, 38940916, 44170489, 49600316, 54100304, 56569419, 57045042, 56184066, 54154682, 51207970, 48737905, 47709967, 48300813, 50454728, 53831942, 57558098, 60486012, 61598208, 60807393, 59019195, 56218781, 52769694, 50025078, 49021148, 49798338, 51501560, 52924326, 53033567, 51873013, 49976990, 47248013, 43961363, 41103073, 39532978, 39288086, 40161467, 41917574, 43884786, 44971921, 44414068, 42463973, 39512701, 35491043, 30712943, 26328568, 22886837, 20290836, 18333781, 16782209, 15492261, 14422786, 13563006, 12828809, 12200911, 11633526, 11193337]
4506A1193337m43890m37145l87265l35878l06162k96206k91219k71502l00956
4497H123114k16229k09260j89842j59839j29989j39408j16358p1873j25096r7142
4487F668078r1471q4452l4687n4671j08227j01177l0422j13200j21978m5101l6699
4476E845993m8713l5923O495J6339n7600k1284p9612j27766m7180j33215r2493
4465E225041k1222M2978K7100q6913q7502l9968j05682j11135n3181l8083Q791
4454D760224k2008O3110M6893o367M0655R280m1241P436k8953L404J4175L2878
4442D879486Q6628J11307J02799P5920J29617J26065K06966L05568L27086L03096
4432F654538L36921K74029O5968p8740j41026k43202j31658j53925k05042k00035
$$ y = [11193337, 10749447, 10312302, 9925037, 9589159, 9282997, 8986791, 8695572, 8424070, 8123114, 7906885, 7697625, 7507783, 7347944, 7217955, 7078547, 6962189, 6890316, 6765220, 6668078, 6576607, 6492155, 6457468, 6402797, 6294570, 6193393, 6162971, 6049771, 5927793, 5882692, 5845993, 5797280, 5761357, 5767852, 5784191, 5726591, 5705307, 5625695, 5497929, 5450749, 5317534, 5225041, 5203819, 5246797, 5273897, 5186984, 5099482, 5059514, 4953832, 4842697, 4789516, 4751433, 4760224, 4738216, 4801326, 4848219, 4841852, 4882507, 4891787, 4850546, 4857982, 4829029, 4832433, 4846608, 4879486, 4966114, 5077421, 5180220, 5256140, 5385757, 5511822, 5718788, 6024356, 6351442, 6654538, 6991459, 7265488, 7331456, 7252716, 7111690, 6868488, 6736830, 6582905, 6377863, 6177828]
4422F177828k51047k16179j20035K3089N7807q12J35884P6940O6077J6797r4374
4411E871975j70007j63775j61828r8514j9261O0076J10458L2004j2301r7460j80136
4400E171231j50405j65589j20401p9587l8108j1940M851N5566M965o7182j30773
4389D472628k63439k63832l14770j84545j82633j42334p9448j08142j5949r7669
4379B819867j9392R328k0940k4669o293m8378q875L9881L040j4326L4939K054
4367B766236K6158P162P051l172j4553l7724m1796o4444j4601l6358l6671O227
4355B563515l5052j1019r756P702m6643o0765K2835M4090K5999l911k7015n8576
4343B411404n8013k0400l4627k9657l1254l1668N742L0304k9762L8408o602J7070
$$ y = [6177828, 5926781, 5710602, 5590567, 5613656, 5671463, 5670651, 5806535, 5883475, 5949552, 5966349, 5871975, 5701968, 5538193, 5376365, 5277851, 5258590, 5318666, 5429124, 5461128, 5448827, 5351367, 5171231, 5020826, 4855237, 4734836, 4655249, 4617141, 4605201, 4610052, 4665618, 4670583, 4603401, 4472628, 4209189, 3945357, 3630587, 3446042, 3263409, 3121075, 3041627, 2933485, 2917536, 2819867, 2800475, 2809803, 2788863, 2764194, 2757901, 2709523, 2700648, 2740529, 2743569, 2729243, 2764182, 2766236, 2792394, 2799556, 2806607, 2803435, 2788882, 2751158, 2709362, 2644918, 2630317, 2593959, 2557288, 2563515, 2528463, 2517444, 2507688, 2515390, 2468747, 2407982, 2430817, 2474907, 2500906, 2496995, 2469980, 2411404, 2353391, 2332991, 2298364, 2268707, 2237453, 2205785, 2211527, 2241831, 2212069, 2250477, 2243875, 2260945]
4331B260945J04856M3579L3353O5240N7256J09733J9457O8612L8528N2157K2484
4320B876200k6923J3872J9532P4126l2805N9815L2413r726P4057J117J8693R728
4308C110099N1916N5299N5739M3300O9026J7776L922N6877J9716N5343L2178K680
4296C573871J9924L9140n1147m9870M08P5328k6243J9203L526L8202p097j5400
4284C619845j8101N1298m0559k8077J7150l057k4412K140o1246r198Q389Q257
4272C522429k038R116P8283Q2042J05142P3866L4063Q4095O4049L9475K3324L1820
4260D145666Q21j8751j0830Q1590R4559K1278P935M9466O2303J04566J07469J40609
4248D786681J88369J14356J05722O6924R7227J32207Q7993R8396J83731J85272
$$ y = [2260945, 2365801, 2409380, 2442733, 2507973, 2565229, 2674962, 2694419, 2763031, 2801559, 2853716, 2876200, 2849277, 2863149, 2882681, 2956807, 2924002, 2983817, 3016230, 3006504, 3080561, 3081678, 3100371, 3110099, 3162015, 3217314, 3273053, 3316353, 3385379, 3403155, 3407077, 3463954, 3483670, 3539013, 3571191, 3573871, 3593795, 3632935, 3581788, 3531918, 3532326, 3607654, 3581411, 3600614, 3604140, 3642342, 3635245, 3619845, 3601744, 3653042, 3612483, 3584406, 3601556, 3598499, 3574087, 3576227, 3514981, 3505783, 3514172, 3522429, 3520391, 3529507, 3607790, 3689832, 3794974, 3868840, 3902903, 3986998, 4051047, 4090522, 4113846, 4145666, 4146487, 4127736, 4116906, 4198496, 4293055, 4314333, 4322268, 4371734, 4434037, 4538603, 4646072, 4786681, 4975050, 5089406, 5195128, 5262052, 5359279, 5491486, 5579479, 5677875, 5861606, 6046878]
4238F046878J24369K36641K30646K78024L68889L05511K71796K25776J79380K35177
4228H503087J63092J72782K24083K63765K70226K35780K69328K33552L06854K54299
4218A0896848L90548K85216K33275K37957J91278J26364J44084J76202K19013
4209A2900785K08790K93218L64515L28925L06153L43387L66222L65617L10680
4200A5788292M00383L24700L77026L93924M79504N45985O65037P52221P04506
4191B0431578Q15827P81015O84786P05126O68844P00611O07717O73702O44749
4182B6713955O44532P05457P11339Q29431J029835J140130J286166J294055J489697
4173C5844597J602361J774169J890529K143017K295056K498382K671618K936720
$$ y = [6046878, 6171247, 6407888, 6638534, 6916558, 7285447, 7590958, 7862754, 8088530, 8267910, 8503087, 8666179, 8838961, 9063044, 9326809, 9597035, 9832815, 10102143, 10335695, 10642549, 10896848, 11287396, 11572612, 11805887, 12043844, 12235122, 12361486, 12505570, 12681772, 12900785, 13109575, 13402793, 13767308, 14096233, 14402386, 14745773, 15111995, 15477612, 15788292, 16188675, 16513375, 16890401, 17284325, 17763829, 18309814, 18974851, 19727072, 20431578, 21247405, 22028420, 22713206, 23418332, 24087176, 24787787, 25395504, 26069206, 26713955, 27358487, 28063944, 28775283, 29604714, 30634549, 31774679, 33060845, 34354900, 35844597, 37446958, 39221127, 41111656, 43254673, 45549729, 48048111, 50719729, 53656449]
4165E3656449L114502L512172L848976M288958M743160N459053O235465P439600
4157I2298335Q867379J0517880J2245438J4351313J7197132K0840375K4710796
4150B01028648K9691788L5930579M5360517N3524060N3017522L9658186J4016246
4143D72227546j7828412m8265822o4670048o6359160n3781972l8816973k8073399
4136A54431760k0810507j6003100j2595594j0175526q193580o709358n643668
4129G4300427m948450m507943m230408l977253l618784l169320k722885k422607
4121D4702777k124920j953463j860223j555990j412240j233814j179840j049634
4113C2332653j056604j068543j160923j114620r26537q94435r61894q26870p76721
$$ y = [53656449, 56770951, 60283123, 64132099, 68421057, 73164217, 78623270, 84858735, 92298335, 101165714, 111683594, 123929032, 138280345, 155477477, 176317852, 201028648, 230720436, 266651015, 312011532, 365535592, 418553114, 458211300, 472227546, 454399134, 406133312, 341463264, 275104104, 221322132, 182505159, 154431760, 133621253, 117618153, 105022559, 94847033, 86653453, 79944095, 74300427, 69351977, 64844034, 60613626, 56636373, 53017589, 49848269, 47125384, 44702777, 42577857, 40624394, 38764171, 37208181, 35795941, 34562127, 33382287, 32332653, 31276049, 30207506, 29046583, 27931963, 27005426, 26110991, 25149097, 24322227, 23545506]
4104B3545506p73878p12970n80445m97468m16464m05245l90539l46574m53317
4095A8968606m81088l83241l30078l41572l53411k46031k13684k39965j79887
4086A6199649j53234l28589m73551n61029o17042n79697n49652n57876n36914
4077A1842065n22811n01081n29433m70635l99099k53581k73404j45413j51139
4068H595469j32152j64944j46394j59330j32756j86639j49969k03345j68771j35341
4058G015828j82124j57248j18263j04961j22781m0731j03934q8210q2579r6278
4048E918719j58391k22552j40864o4534r4248j18808r9326q8093q7635m8646k8501
4037D767121j01837q6496k9245o2869j11480q1454k2902k9238k0847L3868l3764
$$ y = [23545506, 22771628, 22058658, 21478213, 20980745, 20564281, 20159036, 19768497, 19421923, 18968606, 18487518, 18104277, 17774199, 17432627, 17079216, 16833185, 16619501, 16379536, 16199649, 16046415, 15717826, 15244275, 14683246, 14066204, 13486507, 12936855, 12378979, 11842065, 11319254, 10818173, 10288740, 9818105, 9419006, 9165425, 8892021, 8746608, 8595469, 8463317, 8298373, 8151979, 7992649, 7859893, 7673254, 7523285, 7319940, 7151169, 7015828, 6833704, 6676456, 6558193, 6453232, 6330451, 6289720, 6185786, 6097576, 6014997, 5918719, 5760328, 5537776, 5396912, 5332378, 5238130, 5119322, 5019996, 4931903, 4844268, 4795622, 4767121, 4665284, 4578788, 4549543, 4486674, 4375194, 4293740, 4270838, 4241600, 4220753, 4254621, 4220857]
4026D220857K8550Q7284O6185J23450J58265J08909Q4532O9902P9115J0061o9200
4015D967910j85995k40582k42733k97092k28976k26759j72934j36078p2698p5174
4005C088889p2597k5096q3580n4849o8946l6783p5438n3323o2113p5689p4029
3994B406446p4515n7775l3318q8147o7197L0311M6572R510n269N0073l6114n2650
3982B127927L214J0640K7949p9615j25927k8308k6871j54201k2527o0222K92L7744
3970A710095j0186k847j8190L4203m885N4662L5014M447m2729m714k4405N083
3958A735548l4654j0248j7303j4246l6250R842L6464l359m3771n8399r05j9124
3946A543595m7215q1393p3793j088K5176m060P138L8850N852l144m767P692O365
$$ y = [4220857, 4249407, 4336691, 4402876, 4526326, 4684591, 4793500, 4878032, 4947934, 5027049, 5037110, 4967910, 4781915, 4541333, 4298600, 4001508, 3772532, 3545773, 3372839, 3236761, 3164063, 3088889, 3016292, 2991196, 2907616, 2852767, 2783821, 2747038, 2671600, 2618277, 2556164, 2480475, 2406446, 2331931, 2274156, 2240838, 2152691, 2085494, 2115805, 2162377, 2171887, 2166618, 2216691, 2180577, 2127927, 2131141, 2141781, 2169730, 2090115, 1964188, 1935880, 1909009, 1754808, 1732281, 1672059, 1672351, 1710095, 1699909, 1697062, 1678872, 1713075, 1708190, 1762852, 1797866, 1802313, 1759584, 1754870, 1730465, 1735548, 1700894, 1690646, 1673343, 1659097, 1622847, 1632689, 1669153, 1665794, 1622023, 1563624, 1562719, 1543595, 1496380, 1414987, 1341194, 1340106, 1365282, 1361222, 1368360, 1407210, 1413062, 1409918, 1405151, 1412843, 1419208]
3933A419208k5941L0467J0582p578L3872l3068k8302k0816r1613l9878l3900m1091
3921A171942N574p5477j1261j9511j6646k5969J4426k2318m4171j6743m937L7318
3909I92227N113k1612J6069M018O9409J8701m7898L3591K1667j2006n944p4747
3897I98588J2743N5662L6102J8143k0753k6217J8169k1446j5365k1651q54j9655
3885A013466J4014Q6725L2935m9516N2469o625n007J4632r812k77K0989O9962
3873A233955N1426M343j1987O4082N2250N9891k3516L2309R9867R3133J16064
3862A771817J32949Q1987J10838J63216J88951K14114L18150K04175J42806L969
3852C332972j83046l53407l32979l06568k34538j96003j34575j65634j00350n7636
$$ y = [1419208, 1393267, 1423734, 1434316, 1426738, 1460610, 1427542, 1399240, 1378424, 1286811, 1246933, 1213033, 1171942, 1177516, 1102039, 1090778, 1071267, 1054621, 1028652, 1043078, 1020760, 976589, 959846, 954909, 992227, 997340, 975728, 991797, 995815, 1065224, 1083925, 1036027, 1069618, 1091285, 1079279, 1073335, 998588, 1011331, 1066993, 1103095, 1121238, 1100485, 1074268, 1092437, 1070991, 1055626, 1033975, 1033121, 1013466, 1027480, 1114205, 1147140, 1097624, 1150093, 1143468, 1138461, 1153093, 1143281, 1143004, 1163993, 1233955, 1285381, 1289724, 1277737, 1341819, 1394069, 1453960, 1430444, 1462753, 1562620, 1655753, 1771817, 1904766, 1986753, 2097591, 2260807, 2449758, 2663872, 2982022, 3186197, 3329003, 3332972, 3149926, 2796519, 2463540, 2156972, 1922434, 1726431, 1591856, 1426222, 1325872, 1268236]
3842A268236p2019l0894k1634j7741j164m351M545q7685m429O3207j2816K2666
3830A105921j9834o6545n8523l6l0o763l0328m0659M2041m5285m1821k7379k7409
3817G83350J7318J8115j8170K7119R691Q271J1349m7908l7671j346J4266K9532
3805H13916L31k2152j6077l7372Q966l1332L2466J4264r599o460j1601K2835M9453
3792H07638j6066l7143M4395M1646k8241L8596k5340k0008L5358M1945J1917n010
3780H89687o5557l440p406M0806j378k821m555J8470M3758m181L3348L249J3700
3767I53680K0259K4557m265N407J3535k055l7200M890l4350J3093K1704M2144
3755A021399q273o3848L6161k7299r260l4609m2337P78O7460M5030o0206j5437
$$ y = [1268236, 1196217, 1165323, 1143689, 1125948, 1124784, 1120433, 1124978, 1037293, 1032864, 1096071, 1083255, 1105921, 1086087, 1019542, 961019, 960983, 960953, 954190, 923862, 883203, 925244, 879959, 838138, 810759, 783350, 800668, 818783, 800613, 827732, 837423, 845694, 857043, 809135, 771464, 770118, 784384, 813916, 814247, 792095, 776018, 738646, 747612, 716280, 748746, 763010, 753411, 746951, 735350, 758185, 807638, 791572, 754429, 798824, 840470, 812229, 850825, 825485, 805477, 840835, 882780, 894697, 889687, 824130, 820690, 813284, 854090, 852712, 849891, 845336, 863806, 907564, 903383, 936731, 939980, 953680, 973939, 998496, 994231, 999638, 1013173, 1011118, 973918, 978808, 944458, 957551, 979255, 1021399, 1013126, 949278, 985439, 958140, 948880, 914271, 871934, 872712, 940172, 985202, 924996, 909559]
3743I09559k3800J2912O5408K5878j1377O0165M6081J8047m254j355O1230K7125
3731A185619k4830M5783K5038j4372J3806k9217m6708L3374J7957n499j199K7363
3719A227115k7276m9992O4967J6140o2544m512k0816O834O5953j6687L1955K0806
3707A251943n655J4966j3239L5431K2423j6351Q189k4357L6589L8344l038k3403
3695A321842j3241o759L4480o105K553L4453l598K9629j5850j1748m5519k5010
3683A295127R2995n1392n759J6208K6390K2470J744L1413K9804O688K5139O3812
3671A554639J3833J1389J1532J361l7485K8957J8397N8469o0877j3203J8614q61
3659A604765n0258o201L0494J2222n176l3701K1582l7576j5614K1734K654l1147
$$ y = [909559, 885759, 898671, 964079, 989957, 978580, 1038745, 1084826, 1102873, 1098619, 1097264, 1158494, 1185619, 1160789, 1206572, 1231610, 1217238, 1231044, 1201827, 1155119, 1188493, 1206450, 1200951, 1199752, 1227115, 1199839, 1149847, 1214814, 1230954, 1168410, 1163898, 1143082, 1149916, 1215869, 1199182, 1231137, 1251943, 1246288, 1261254, 1248015, 1283446, 1305869, 1289518, 1297707, 1273350, 1309939, 1348283, 1345245, 1321842, 1308601, 1301842, 1336322, 1330217, 1332770, 1367223, 1363625, 1393254, 1377404, 1365656, 1320137, 1295127, 1388122, 1336730, 1330971, 1347179, 1373569, 1396039, 1397783, 1429196, 1459000, 1465688, 1490827, 1554639, 1568472, 1579861, 1591393, 1592754, 1555269, 1584226, 1602623, 1661092, 1600215, 1587012, 1605626, 1604765, 1554507, 1548306, 1578800, 1591022, 1585846, 1552145, 1573727, 1536151, 1520537, 1542271, 1544925, 1513778]
3647A513778K978m9022q53L960M290L7499J2264Q937m781J1602n7672K3384L7937
3634A544301k6470K8569M7395Q829n2113j8335L6059L0107J6412k3697p4305K0908
3622A537660L7892J5135m105K5508k6035K5313J8875q2871J1314K1282J3315L5428
3610A628711k0826J3363K6243l2033j4843l9946k0710J6094L0063R171m2803k5985
3598A526499Q690O3425n829j7090m6614n075L9201M0324l1368l5238O789j1661
3586A532053K2657J6010j6256k8625K4872M2220K3931R760j9636o057p955J5429
3574A608403p858J1413m172n6354K6444M8207J7069n3432L6910M3028j3644J578
3562A657592K4356m9020k1517J4892K8783n138K9216J1473k6296N7660J6620l3036
$$ y = [1513778, 1516756, 1467734, 1466881, 1470841, 1475131, 1512630, 1524894, 1533831, 1529050, 1540652, 1482980, 1506364, 1544301, 1517831, 1546400, 1593795, 1602624, 1550511, 1532176, 1568235, 1598342, 1614754, 1591057, 1516752, 1537660, 1575552, 1590687, 1586582, 1612090, 1586055, 1611368, 1630243, 1547372, 1558686, 1579968, 1593283, 1628711, 1607885, 1621248, 1647491, 1615458, 1600615, 1560669, 1539959, 1556053, 1586116, 1595287, 1552484, 1526499, 1535189, 1598614, 1592785, 1575695, 1529081, 1524006, 1563207, 1603531, 1572163, 1536925, 1543714, 1532053, 1554710, 1570720, 1554464, 1525839, 1550711, 1592931, 1616862, 1626622, 1606986, 1600929, 1592974, 1608403, 1600545, 1611958, 1607786, 1551432, 1577876, 1626083, 1643152, 1589720, 1626630, 1669658, 1656014, 1657592, 1681948, 1632928, 1611411, 1626303, 1655086, 1649948, 1679164, 1690637, 1664341, 1722001, 1738621, 1705585]
3550A705585J193L5445M0912l5770K8832k8174P782l069K900J3941L1380L3946
3538A834903Q814K3987l8144k6519K1013J4356L1618j9055K2462j3475j6274M1708
3526A885394J4192l8414J4426K2608k4788l8854J732K7583j5260M0617M2543L1180
3514A962959L1822o000m7814K1806l2998N136Q839N0454j1606L4509m208l8303
3502A974596K9693M7654q521K6647K5645M734j7306p426N5883j2468k9748M254
3490B093637j1742J7352Q3891L7537j0364O572L4726M439L2971m1769k1650L5798
3478B261398l983R218K6414j0465l6225J3822P715j3598Q091O3867J5372k0580
3466B321046M9392L5292o222R104M1218N8606P9181J1138n939M0063K5823J8104
$$ y = [1705585, 1706778, 1742223, 1783135, 1747365, 1776197, 1748023, 1755805, 1752736, 1755636, 1769577, 1800957, 1834903, 1843717, 1867704, 1829560, 1803041, 1824054, 1838410, 1870028, 1850973, 1873435, 1859960, 1843686, 1885394, 1899586, 1861172, 1875598, 1898206, 1873418, 1834564, 1836296, 1863879, 1848619, 1889236, 1931779, 1962959, 1994781, 1988781, 1940967, 1962773, 1929775, 1934911, 1943750, 1994204, 1982598, 2017107, 2012899, 1974596, 2004289, 2051943, 2043422, 2070069, 2095714, 2100448, 2083142, 2075716, 2131599, 2119131, 2089383, 2093637, 2081895, 2099247, 2183138, 2220675, 2210311, 2216883, 2251609, 2256048, 2289019, 2247250, 2225600, 2261398, 2257415, 2266633, 2293047, 2282582, 2246357, 2260179, 2267894, 2254296, 2262387, 2326254, 2341626, 2321046, 2370438, 2405730, 2399508, 2408612, 2449830, 2508436, 2587617, 2598755, 2592816, 2632879, 2658702, 2676806]
3454B676806M5619L7486k5676N9520M8037J8740L4931L1584N326j0228R313N5549
3442B987007L719K7482Q038L4395R9291J09811M0778O4004R5392P3284Q8744L8060
3430C670005J55200J56071J77453J65614J72811K11228K80637L66176L10689M08041
3420F073925N20117O13463O57401N91727K36837p0912k96146n49674p36144o14497
3410F426097l86512k77881j39184j06599o3780K2295O605Q0283J62678J76607
3400E900609R2743R0572J94076J72410J89249J99954K81004L95983N05671N80144
3390H602415O54698O21081Q16875R53843J017134R52931L43186k75441o24170
3381A3062552j191476j419617j208190q72463n76228l86892k23646j82808p6720
$$ y = [2676806, 2722425, 2759911, 2734235, 2793755, 2841792, 2860532, 2895463, 2927047, 2932373, 2922145, 2931458, 2987007, 2990726, 3018208, 3026246, 3060641, 3159932, 3269743, 3310521, 3374525, 3469917, 3543201, 3631945, 3670005, 3825205, 3981276, 4158729, 4324343, 4497154, 4708382, 4989019, 5355195, 5665884, 6073925, 6594042, 7207505, 7864906, 8456633, 8693470, 8622558, 8326412, 7776738, 7040594, 6426097, 6039585, 5761704, 5622520, 5515921, 5452141, 5474436, 5481041, 5561324, 5724002, 5900609, 5993352, 6083924, 6278000, 6450410, 6639659, 6839613, 7120617, 7516600, 8022271, 8602415, 9257113, 9878194, 10695069, 11648912, 12666046, 13618977, 13962163, 13686722, 13062552, 11871076, 10451459, 9243269, 8370806, 7794578, 7407686, 7184040, 7001232, 6924512]
3372F924512m9135J9751J76911J47413R0218N5895k4850k6711n4162q0342p418
3361G172082P6622J80405K29678K90438L70675M35485N30114M98956L06130P5152
3351A0165737j67046m31115o57382o88555o07719m47526k51100k33155k26570
3342F455569j16141l5922m3320l2908J12047N9573K4094Q045m8942k5892l5731
3331F320472n3014M3509j3424K671J17879Q5855Q9085K9362L7009J32881J15557
3320F907842O3908O9910O4572p7230j6027j9615N9052K4729k917M0446O9845J29008
3308G313523J15561R0304J12401J82591J09369J30556J79311K20386K66476K27236
3298H947714J25699J33774K9673M6436R7683J98714J29671J69073K02372J67013
$$ y = [6924512, 6875377, 6895128, 7072039, 7219452, 7309670, 7365565, 7340715, 7314004, 7259842, 7179500, 7172082, 7248704, 7429109, 7658787, 7949225, 8319900, 8755385, 9285499, 9784455, 10090585, 10165737, 9998691, 9567576, 8910194, 8221639, 7613920, 7166394, 6915294, 6682139, 6455569, 6339428, 6303506, 6260186, 6227278, 6339325, 6398898, 6422992, 6431037, 6382095, 6356203, 6320472, 6267458, 6310967, 6297543, 6300214, 6418093, 6503948, 6593033, 6622395, 6659404, 6792285, 6907842, 6971750, 7041660, 7106232, 7029002, 7012975, 6993360, 7052412, 7077141, 7074224, 7114670, 7184515, 7313523, 7429084, 7519388, 7631789, 7814380, 7923749, 8054305, 8233616, 8454002, 8720478, 8947714, 9073413, 9207187, 9236860, 9283296, 9380979, 9579693, 9709364, 9878437, 10080809, 10247822]
3288A0247822K37250J59717O8496M5279L5171K3528J04857J74385J76386J54196
3278A1427087K65841K90677K50126L23196L42248L45622L54541M46926M90766
3269A4537030N09732L86154K84502K88485K86889L29718M14945M92101O07822
3260A8137378O95298Q11811Q64409R50121R87961J018072J095436J069833J129248
3251B6759567J134077J171314J192646J144802J042876Q77456O34992K19444k68446
3242C3908728q04893j353311j787747j969247j938442j694865j496537j284063
3234B1579623j125822j003469j011268q52682o72583o71551n67872n87011m78730
3225A4608635m27625m93064l74827l87953l69551l29539l09972k62170k86166
$$ y = [10247822, 10485072, 10644789, 10713285, 10758564, 10793735, 10817263, 10922120, 11096505, 11272891, 11427087, 11692928, 11983605, 12233731, 12556927, 12899175, 13244797, 13599338, 14046264, 14537030, 15046762, 15432916, 15717418, 16005903, 16292792, 16622510, 17037455, 17529556, 18137378, 18832676, 19644487, 20508896, 21459017, 22446978, 23465050, 24560486, 25630319, 26759567, 27893644, 29064958, 30257604, 31402406, 32445282, 33322738, 33957730, 34177174, 33908728, 33103835, 31750524, 29962777, 27993530, 26055088, 24360223, 22863686, 21579623, 20453801, 19450332, 18439064, 17586382, 16913799, 16242248, 15674376, 15087365, 14608635, 14181010, 13687946, 13313119, 12925166, 12555615, 12226076, 11916104, 11653934, 11367768]
3216A1367768k87331j98197k39288k79040j79714j95057j68089j65786j83205
3207I472061j60193j89284j82527j37523j58678j77750k40316k85137j87058j73701
3197G579894j40885j20003j78421j21524j16506q1993q1547n7100j02054j14255
3187F465606m3373m5747r3309j06181o7197n2854o22j9767l8549k5554r3307n7591
3175E821555n0784m0401q6940j05977r6408p9133m8804j15794q3087o7168r7722
3164D949337p0486n4724k0569l4687P223q3423n7520o3382k5678k3549m0843o5971
3152D415728j0812k8322l6294J2427L6861K9462r7397k2942k3466n1053p9591
3141D144601p9561l0161k4788m9512l5206j3717m3772q2058j8107n118m1012J5146
$$ y = [11367768, 11080437, 10882240, 10642952, 10363912, 10184198, 9989141, 9821052, 9655266, 9472061, 9311868, 9122584, 8940057, 8802534, 8643856, 8466106, 8225790, 7940653, 7753595, 7579894, 7439009, 7319006, 7140585, 7019061, 6902555, 6820562, 6739015, 6681915, 6579861, 6465606, 6422233, 6376486, 6283177, 6176996, 6109799, 6056945, 6056323, 6036556, 5998007, 5972453, 5879146, 5821555, 5770771, 5730370, 5643430, 5537453, 5441045, 5361912, 5313108, 5197314, 5114227, 5047059, 4949337, 4878851, 4824127, 4803558, 4768871, 4776094, 4692671, 4635151, 4571769, 4546091, 4522542, 4481699, 4415728, 4404916, 4376594, 4340300, 4352727, 4389588, 4419050, 4321653, 4298711, 4275245, 4224192, 4144601, 4065040, 4034879, 4010091, 3960579, 3925373, 3911656, 3867884, 3785826, 3767719, 3762601, 3721589, 3736735]
3129C736735j7n6666p4499k738o1573l7765L1032l939l7659k4996o6997l9934
3117C360984k5667n0105N5231j229k6120l5711m2508j9260m3486L210L593k8706
3105C150226j6489k8000k2150j6438J219l4495r418j7226p348R337m8003j4391
3093B946824l9803k0793M0332n2112k9639r288Q734l7251l4286m277O844L6029
3081B811314K27j2157J1637n2721m6503J570J8425l4087j1654l558k6723L3787
3069B689557l4985j8881N5067j3347r726l8631J4162m8809l2590j0992P652j7436
3057B541041k1250m531p825J8608m010m2698n3667K5040k6408J1683L3603o0918
3045B408668k4271L0843j4522O4499Q810m5864o723l4788j7647j7351l4585M9026
$$ y = [3736735, 3736718, 3680052, 3605553, 3602815, 3541242, 3503477, 3534509, 3530570, 3492911, 3467915, 3400918, 3360984, 3335317, 3285212, 3340443, 3339214, 3313094, 3277383, 3234875, 3215615, 3172129, 3175339, 3178932, 3150226, 3133737, 3105737, 3083587, 3067149, 3068368, 3033873, 3024455, 3007229, 2999881, 3009218, 2961215, 2946824, 2907021, 2886228, 2926560, 2874448, 2844809, 2835521, 2844255, 2807004, 2772718, 2768441, 2775285, 2811314, 2811541, 2799384, 2811021, 2758300, 2711797, 2713367, 2731792, 2697705, 2686051, 2682493, 2655770, 2689557, 2654572, 2635691, 2690758, 2677411, 2667685, 2629054, 2643216, 2594407, 2561817, 2550825, 2558477, 2541041, 2519791, 2515260, 2507435, 2526043, 2522033, 2479335, 2425668, 2450708, 2424300, 2435983, 2469586, 2408668, 2384397, 2415240, 2400718, 2465217, 2474027, 2428163, 2421440, 2386652, 2369005, 2351654, 2317069, 2366095]
3033B366095n1789J1692R792r098M8304m5178K53K1559J1841j0663J5506M0466
3021B408780K806n131M796k6106n231O9300K051j9050j2607j3713M3549K2600
3009B472044N8249J5448J1763L0349n599J8033J2159N1841j1541M797M0402P142
2997B705087K6698J796M9146J094M2873K7120J6707J04555j2693J265K5149L3800
2985C022597P1710K9744m40K9528M4541O6577P6637L1634O7866P9125k1857K0061
2973C517723P6198O0452P8216J9063n709K5162M2506L6088J2953L1490n190M0577
2961C929529K9399Q921J2739N3727K469Q0016Q7009k0321R0989J06605P8429P0066
2949D529577O7264R4347P3521J28478J13323J59121J13828J27549J05637J01926
$$ y = [2366095, 2314306, 2325998, 2335790, 2326692, 2374996, 2329818, 2330071, 2351630, 2363471, 2352808, 2368314, 2408780, 2411586, 2406455, 2411251, 2385145, 2379914, 2449214, 2451265, 2432215, 2419608, 2405895, 2449444, 2472044, 2530293, 2545741, 2557504, 2587853, 2582254, 2600287, 2612446, 2664287, 2652746, 2657543, 2697945, 2705087, 2731785, 2733581, 2782727, 2783821, 2826694, 2853814, 2870521, 2975076, 2962383, 2963648, 2988797, 3022597, 3094307, 3124051, 3123611, 3153139, 3197680, 3264257, 3340894, 3372528, 3440394, 3519519, 3497662, 3517723, 3593921, 3654373, 3732589, 3751652, 3745943, 3771105, 3813611, 3849699, 3862652, 3894142, 3888952, 3929529, 3958928, 3967849, 3980588, 4034315, 4036784, 4116800, 4203809, 4183488, 4274477, 4381082, 4459511, 4529577, 4596841, 4691188, 4764709, 4893187, 5006510, 5165631, 5279459, 5407008, 5512645, 5614571]
2939E614571J66958J42479J86338J66823J83638J26248J74360J70547J82641K19830
2929G334433J28096J08136J62805Q1389M4646M7487Q2228M9146P5493J11710J05364
2918H330933P7567J18541J29643J46539Q2187K27989K31805K02371K81590K93104
2908A0122269L38177L18930L34910L97172M38295M33678M26672M18928L08218
2899A3537249J85636m7496l20085m46242o08492n63077l79290k65596k42705j78967
2889A0670935j03089l2905K4327k4245l5736N6566K9747N7024J9839R5598Q1098
2878A0839159L1258M0272R0717Q0065l8819l8243o3930j01708j87614j77778j28853
2867A0344526k57438k98650k78568k91359l25000l13165j46341j57669j56051
$$ y = [5614571, 5781529, 5924008, 6110346, 6277169, 6460807, 6587055, 6761415, 6931962, 7114603, 7334433, 7462529, 7570665, 7733470, 7814859, 7859505, 7906992, 7989220, 8038366, 8113859, 8225569, 8330933, 8408500, 8527041, 8656684, 8803223, 8885410, 9113399, 9345204, 9547575, 9829165, 10122269, 10460446, 10779376, 11114286, 11511458, 11949753, 12383431, 12810103, 13229031, 13537249, 13722885, 13675389, 13355304, 12909062, 12300570, 11737493, 11358203, 11092607, 10849902, 10670935, 10567846, 10534941, 10559268, 10535023, 10499287, 10555853, 10585600, 10642624, 10662463, 10758061, 10839159, 10870417, 10910689, 11001406, 11081471, 11042652, 11004409, 10940479, 10838771, 10651157, 10473379, 10344526, 10087088, 9788438, 9509870, 9218511, 8893511, 8580346, 8434005, 8276336, 8120285]
2858H120285j31254j67749j03790j14197j01127j52845q5145k09628k51704k08392
2848F594454j55722k14068k09876k22616j37370j44217j94803j63754j61278j43311
2838D847439k25510j47817q2655q4267j20843n9801j02257r6656j09142l7433
2828C781058j9055r6817r0513n4271m9060q8222q8620n7913m3843o0483p5657
2817C056604n9374l1552m1665r5585o7363p7690j9460j9491n3617p7306k7696
2806B485805m0824m6626j14025k7278j3278m4102k5330m0999l3207k5430m9385
2795B025321l3604k4292J0908l5601n7822N968k1383k6050l2356m3156k3764K2595
2783A766764o7026m5162o5491o8958J2755q962J7026n1133p9073K728J3418k0701
$$ y = [8120285, 7989031, 7821282, 7717492, 7603295, 7502168, 7349323, 7264178, 7054550, 6802846, 6594454, 6438732, 6224664, 6014788, 5792172, 5654802, 5510585, 5315782, 5152028, 4990750, 4847439, 4621929, 4474112, 4391457, 4307190, 4186347, 4126546, 4024289, 3927633, 3818491, 3781058, 3762003, 3665186, 3574673, 3520402, 3471342, 3383120, 3294500, 3236587, 3192744, 3132261, 3056604, 2997230, 2965678, 2924013, 2828428, 2761065, 2683375, 2663915, 2644424, 2590807, 2513501, 2485805, 2444981, 2398355, 2284330, 2257052, 2243774, 2199672, 2174342, 2133343, 2100136, 2074706, 2025321, 1991717, 1967425, 1978333, 1942732, 1884910, 1890878, 1869495, 1843445, 1811089, 1767933, 1744169, 1766764, 1699738, 1654576, 1589085, 1520127, 1532882, 1523920, 1540946, 1489813, 1410740, 1413468, 1426886, 1406185]
2771A406185n7883o7509P574J6899L765r312m6602m5217k6923J7822j7008n7494
2759A124297j2824J3586o3782l9933j7417J0440m086k1004j771l6935J1228J2194
2747I73993k5301J3951Q419p0649p6032K5367K2974l8901m8801K5071M512m2090
2735G72513k9826q561K672j4089J4953l80o1493j835L131k9367j5671J0918j9679
2722F23286O51L0886k9389o1223L1113r340l2371j5860K4327j5220K9768J2814
2710E89442l7065m1382M461k3709m2042j3095K3233K5760k6657m806j3315Q530
2698D49355j2941m1239K2866L0051n3718m8700o758O3158L0322l0607P927j6862
2686C92854k7455K669L0205m80m7095j388l4557J2422J6466Q569k3108J326j0685
$$ y = [1406185, 1348302, 1280793, 1288367, 1305266, 1309031, 1299719, 1253117, 1207900, 1180977, 1198799, 1181791, 1124297, 1111473, 1125059, 1061277, 1021344, 1003927, 1014367, 1010281, 989277, 987506, 950571, 961799, 973993, 948692, 962643, 971062, 900413, 824381, 849748, 872722, 833821, 785020, 810091, 814603, 772513, 742687, 734126, 736798, 722709, 737662, 737282, 675789, 673954, 677085, 647718, 632047, 642965, 623286, 623937, 654823, 625434, 564211, 595324, 585984, 553613, 537753, 562080, 546860, 576628, 589442, 552377, 510995, 515456, 491747, 449705, 436610, 459843, 485603, 458946, 454140, 440825, 449355, 436414, 395175, 418041, 448092, 394374, 345674, 338916, 402074, 432396, 401789, 409716, 392854, 365399, 368068, 398273, 397793, 350698, 349310, 314753, 327175, 343641, 352210, 329102, 330428, 319743]
2673C19743l3478L5272k7829j5225L296K4390K7422l9756j0544j7785J2512l3083
2661B44935L1567P630K8102j8991L928l1005l5727Q429O102J793K2203r406j460
2648B58100j0760L5672j4049P831j2334q1433N9435k1599R622k231N4034k1143
2636B61145m4210j3760R922M5045k1264L09J0389k8216L2868K6214l0121J6928
2624B65249r530l2720K1550n1186M8833P7260j5809l4147n4608l4896K8572J9866
2612B28434k352K0406p161o0840L1512L580q985J3733m0217K3795O0481l3145
2600B29241L64j8769m3836N998M9396j0426p3479J2969J03031k0837m4114k0541
2588A68997J9743L6090l5204l1412q120L2916J590l0904K5455j4413k3796O697
$$ y = [319743, 286265, 321537, 293708, 278483, 281779, 306169, 333591, 293835, 283291, 265506, 278018, 244935, 276502, 284132, 312234, 293243, 297171, 266166, 230439, 238868, 244970, 246763, 268966, 259560, 258100, 247340, 283012, 268963, 276794, 264460, 183027, 242462, 220863, 230485, 228254, 282288, 261145, 216935, 203175, 213097, 258142, 236878, 237187, 247576, 219360, 252228, 278442, 248321, 265249, 255719, 222999, 244549, 193363, 242196, 319456, 303647, 269500, 214892, 179996, 208568, 228434, 226082, 246488, 239327, 178487, 209999, 213579, 204594, 218327, 178110, 201905, 262386, 229241, 229605, 210836, 167000, 172998, 222394, 211968, 138489, 151458, 254489, 233652, 189538, 168997, 188740, 224830, 189626, 158214, 150094, 183010, 184600, 153696, 179151, 164738, 140942, 147639]
2576A47639n5528r76M9820K2977o1918K8805K1272q644k9476R384J7006k8684
2564A11677n4325L7709M4054k4914J9820m539l7119j8143k9439M5541R667K1251
2552A21240R231J5663j5298n0524J491J9875k3005o214J3721j1542l5776j5625
2540B3237m5565M7811n44j7929J5222M1000m3223J9132M0253j1886K1581J7123
2528A06212j4105j8304J4721m3868P258k23n3270j5830O1166j4710K3219n0845
2516A421R839L7166o519n2957L1890N3442n92j3763k2600j3698P497l2997K4734
2503B2863K7280L9185j6458q1671J5327k1561K900j3203q79k6242K0258P2557
2491D0356j6889m6468K8513l59K6502j2915k8272L0695L8012K7678n4742O177
$$ y = [147639, 92111, 91135, 140955, 163932, 102014, 130819, 152091, 143447, 113971, 123355, 140361, 111677, 57352, 95061, 139115, 114201, 134021, 129482, 92363, 74220, 44781, 90322, 99989, 121240, 130471, 146134, 130836, 80312, 81803, 101678, 78673, 72459, 86180, 74638, 38862, 23237, -22328, 25483, 24939, 7010, 22232, 63232, 20009, 39141, 79394, 67508, 89089, 106212, 92107, 73803, 88524, 44656, 51914, 51691, -1579, -17409, 43757, 29047, 52266, 1421, 11260, 48426, 41907, -11050, 20840, 74282, 73690, 59927, 37327, 23629, 31126, -1871, 22863, 50143, 89328, 72870, -8801, 6526, -15035, -12135, -25338, -26217, -52459, -32201, 40356, 23467, -23001, 5512, 5153, 31655, 18740, -9532, 21163, 59175, 86853, 32111, 38288]
2479C8288J9642j4027p5315M669j6024N3042n5247O1295L7632r313N0053k4574
2467G0121n7280k2938J6387N887J7334j7500o0802M2140N9110J1418k3639r961
2455C0277K8028q070J5914l5062k9010K2396M2068k3305k6383k9307j8819l4526
2443f5799L6261K4151J3183l0897j1186J1275K382P271O50m793o388k3399p975
2430e5264J0586K5756K0466j0131j99L6751O623n1819l2705J6663J6987m5171
2418f1457j8873M8852L6214J0334j3476m1413k883K306R570j3853r175j7337L4288
2405c6903n209r4286L615P4886J5968j6979M1429k4039j8673M5886k7285K2927
2393a8663q841m9490L5233O7205L0153n3685k6219p393L627l88M6377m7282k9706
$$ y = [38288, 57930, 43903, -31412, -26743, -42767, 10275, -44972, 16323, 53955, 44642, 94695, 70121, 12841, -10097, 6290, 12177, 29511, 12011, -48791, -6651, 52459, 63877, 40238, 30277, 58305, 50235, 66149, 31087, 2077, 24473, 66541, 43236, 16853, -12454, -31273, -65799, -29538, -5387, 7796, -23101, -34287, -23012, -20630, -13359, -12709, -17502, -23890, -47289, -55264, -44678, -18922, 1544, -8587, -8786, 27965, 34588, -17231, -49936, -33273, -16286, -61457, -80330, -31478, 4736, 15070, 1594, -39819, -42702, -40396, -30826, -44679, -53854, -71191, -36903, -42112, -136398, -132783, -57897, -41929, -58908, -17479, -41518, -60191, -14305, -41590, -18663, -27504, -76994, -41761, 25444, 55597, 1912, -24307, -31700, -28073, -28461, 17916, -29366, -59072]
2380e9072K6777O9617j6267k1743o057L3769k2378l6404L8810L0487J3067j102
2368D9504p657j7416k5211P8724l5888p956l2544J3402K1835l2008l3250O778
2356b1687P1561o1623n0057k3377K7665K9512j5548l4280L2250K7573k0704P800
2344c0915N1416J7654l7230l243P286N835k7137q8920J5716K3987N4004N261l4165
2331d0451k3425K4792J2495M131j2576k0561L434L3112j135J1784j6141R617k5673
2318d0597J3605k7806N3823q926l9372J1774Q440k846k6688j576M434M3814l030
2305a4951L0497k4270m612P63J2384K4286j4741L1739K3640k6478j008K504k8353
2292A1400N017o833J223n4626K4940o9741J6154P4333J0019p6269J2457M3675
$$ y = [-59072, -32295, 37322, 21055, -688, -6745, 27024, 4646, -31758, 7052, 37539, 50606, 49504, 41847, 24431, -780, 77944, 42056, 34100, 1556, 14958, 36793, 4785, -28465, -21687, 49874, -11749, -61806, -85183, -57518, -28006, -43554, -77834, -45584, -18011, -38715, -30915, 20501, 38155, 925, -2318, 4968, 10803, -16334, -105254, -89538, -65551, -11547, -6286, -40451, -63876, -39084, -26589, -22458, -35034, -55595, -52161, -19049, -20184, -8400, -24541, -14924, -40597, -26992, -54798, -975, -9901, -49273, -37499, -29059, -31905, -58593, -60169, -55735, -11921, -14951, 15546, -8724, -13336, -12573, -189, 24097, 9356, 41095, 64735, 38257, 37249, 39753, 11400, 16417, 9584, 10807, -43819, -18879, -88620, -72466, 1867, 11886, -64383, -51926, -8251]
2280h251j5596j6489k0305L7025l464K5016l7573L1650K4588j2483K9126n3515
2268b0271n820J7719n7395j5261M1680L6760k5710N7658j8970j4397l194K0439
2256A3238k5900L2634N443N076j8594k265n437k97o536j7521k7200L4352K183
2243a0824j6564M8377Q161J3195j7084j1507o1740j4011Q0449j0969J5856K4051
2231D7390j6048J4158k003k2146j739N8729M5009k3173n5728L7110j8679J579
2219F4459J8008K4882l5769j7458O0156m7365n1839J6540j1431L655J8097J4978
2207E6913j3918L3665M1324L2677K3843o7060k0620l5336J1770L8909J8793j0586
2195A10374N250N0877k1044J0165L0939l7448J8321K3510Q313Q01P0892l9868
$$ y = [-8251, -23847, -40336, -60641, -23616, -27080, -2064, -39637, -7987, 16601, 4118, 33244, -20271, -26091, -8372, -65767, -81028, -39348, -2588, -28298, 29360, 10390, -4007, -7201, 13238, -12662, 19972, 25415, 30491, 11897, 9632, 4195, 3898, -2638, -20159, -47359, -13007, -10824, -27388, 20989, 29150, 42345, 25261, 13754, -47986, -61997, 18452, 7483, 23339, 47390, 31342, 45500, 43497, 21351, 19612, 78341, 123350, 100177, 44449, 81559, 62880, 64459, 82467, 107349, 71580, 54122, 114278, 66913, 15074, 31614, 20183, 23838, 41935, 56913, 42995, 76660, 117984, 150661, 174504, 107444, 86824, 51488, 63258, 102167, 120960, 110374, 115624, 166501, 145457, 155622, 186561, 149113, 167434, 190944, 199257, 200058, 270950, 231082]
2183B31082J898L5778k7031l150k1530K3181J2347M9653k7077m257N5293r863
2171C16324L6369k0280J0009N571n2841O5966J1254J1653k3592M9979m961J4604
2159D20055m1638n123K7522j714o887K1090P7462L3625L7114M870L3804J2429
2147F12609N0095k3503J7722K4542O9294J5175j7170N7556l485p668J09747P6203
2135I81117L194Q0493O8318P0311n278M8519Q1948P8948Q9005Q3127O2810J12790
2123A755302J10314J24716J10351J83214K12558K49038K29480K14033K59738K47743
2113C696487L60335M29862M98592O13801P59103R72499J228324J409839J726410
2104A1695252K454156L077815K237221R80970j271050l767372l892311k579860
$$ y = [231082, 232980, 268758, 241727, 238577, 217047, 240228, 252575, 302228, 275151, 270894, 326187, 316324, 352693, 332413, 342422, 347993, 295152, 361118, 372372, 384025, 360433, 410412, 405451, 420055, 378417, 373294, 400816, 399102, 392215, 413305, 490767, 524392, 561506, 566376, 600180, 612609, 662704, 639201, 656923, 681465, 750759, 765934, 748764, 806320, 802835, 795167, 904914, 981117, 984311, 1064804, 1133122, 1203433, 1198155, 1246674, 1328622, 1407570, 1496575, 1579702, 1642512, 1755302, 1865616, 1990332, 2100683, 2283897, 2496455, 2745493, 2974973, 3189006, 3448744, 3696487, 4056822, 4486684, 4985276, 5599077, 6358180, 7330679, 8559003, 9968842, 11695252, 14149408, 17227223, 19464444, 20445414, 19174364, 15406992, 11514681, 8934821]
2096H934821j704418j213620r14809o19922m64346m04514k83922k09186j99133
2087B920951j62435j06278j79442j92737k31862j83235j29646j23023r4657m0065
2077A477571j25176r9784o5161J4057j8842j04282o4843j4491n6185o4177k7851
2066H50836k1127m2684k0572R493m1063p0871q5857n8379K5751k4796r013m852
2054E06866k9795l4288k8616J1697M4644j7498r904k0455o4518k6056K3059L728
2042C58864l262j4806p953j7161N450m701m2906N938M0649k4571q1997k0694j2156
2029A80694K5443M885r910K0836O4181j8516m3736J884j4491j9720k6353j1143
2017A54054K1612J3060n513k9187j8752m2431L2696j0136j2423K4784l0148N1628
$$ y = [8934821, 7230403, 6016783, 5101974, 4482052, 4017706, 3613192, 3329270, 3120084, 2920951, 2758516, 2652238, 2472796, 2280059, 2048197, 1864962, 1735316, 1612293, 1517636, 1477571, 1352395, 1252611, 1187450, 1201507, 1182665, 1078383, 1013540, 999049, 942864, 878687, 850836, 829709, 787025, 766453, 775946, 734883, 664012, 578155, 519776, 545527, 520731, 511718, 506866, 477071, 442783, 414167, 425864, 470508, 453010, 443106, 422651, 358133, 332077, 355136, 358864, 355602, 340796, 332843, 315682, 321132, 316431, 273525, 279463, 320112, 295541, 213544, 192850, 180694, 206137, 211022, 201112, 221948, 286129, 267613, 223877, 225761, 211270, 191550, 165197, 154054, 175666, 188726, 183213, 154026, 135274, 92843, 125539, 115403, 102980, 127764, 97616, 149244]
2005A49244p619l8220k0728J617K339k9504k426L7698o643j6646J545L618J9272
1992I3547k3850Q408k197K3417M4231l8521n9644L81j3100K3536l9108K7958J9078
1979F4136O6968J1841o8034o9055J2328P6907k8517m7065N3917J0365n1347j0089
1967B2355N865K4619J1647k2055m7451j1503l9251L0915L7522m9018J7312N7691
1955C8648R283j417m1081K9571M677J5226J8558n0809j4843M1433l3099J8441
1943C4588K4111K9243o2367j2269q136L6267N0474m5858l1513P685l9077j7844
1931c4696o793J2518m9824L3313K9220j1891L6720K5483Q275k6943K6585k8016
1919A3951m5052Q972K2627l5525N4193k1472p524J6825k5425k6340J6443J8185
$$ y = [149244, 141625, 103405, 82677, 84294, 86633, 57129, 54703, 92401, 85758, 69112, 70657, 74275, 93547, 69697, 78105, 75908, 99325, 143556, 105035, 45391, 45772, 32672, 56208, 17100, 45058, 64136, 131104, 142945, 74911, 5856, 18184, 95091, 66574, 19509, 73426, 83791, 32444, 22355, 28220, 52839, 64486, 42431, -5020, -16523, -55774, -24859, 12663, -36355, -19043, 38648, 47931, 46514, 5433, 35004, 39681, 54907, 73465, 22656, 7813, 49246, 16147, 34588, 58699, 87942, 25575, 13306, 5170, 41437, 91911, 46053, 14540, 22225, -16852, -34696, -41489, -28971, -78795, -45482, -16262, -28153, 8567, 34050, 42325, 15382, 41967, 13951, -31101, -22129, 498, -35027, 19166, -2306, -9830, 6995, -18430, -44770, -28327, -10142]
1907a0142P406J220J9800k6135j4221j7948K2076k4388O842N1657k829J9593n0849
1894a7918L937j7861j3385N6747j8268k1904K0819J3520l0449k4713J4318M460
1882c0697j998K1263R747m2556L1333K9953l095j8539n3990k0234P0932K4024
1870A6143p6350N9382K1051j0937l6990l3960J5688K4269j4879j0581j2955K4221
1858c5898N3810M2135n9683o155p93p158j2824l484O5617m8436O788k785j2786
1845b1652K3043N621l9323R350K7518k3899M1375K7264k7444N9301k3762j9177
1833C8215M1400k0072m304j6911o7891J3396o60j603J63k2849M1052J9214j6631
1820B519o1709j7119P7967j6094k659K6901j1063L3974J08j8130j9479j6947j9164
$$ y = [-10142, -2736, -1516, 18284, -7851, -22072, -40020, -17944, -42332, -35490, 16167, 13338, 32931, -17918, -13981, -31842, -45227, 11520, -6748, -28652, -7833, 5687, -24762, -49475, -35157, -30697, -32695, -11432, -1685, -44241, -12908, 17045, 13950, -4589, -58579, -78813, -7881, 16143, -60207, -825, 20226, 9289, -27701, -61661, -45973, -21704, -36583, -47164, -60119, -35898, 17912, 60047, 364, -5791, -6584, -13742, -26566, -30050, 35567, -12869, -6081, -8866, -21652, 1391, 7012, -32311, -22961, 4557, -19342, 22033, 49297, 21853, 81154, 57392, 38215, 79615, 59543, 55239, 38328, -29563, -16167, -16827, -18430, -18267, -41116, -64, 19150, 2519, -59190, -76309, 1658, -14436, -17095, 9806, -1257, 32717, 32825, 14695, -4784, -21731, -40895]
1807d0895k5732N222M0851p340l3590l047J0520K9776j0792R543J6751j1193j7844
1794c7770m1248N5601k9614l0076O9704K4761k4047l6534m878n3599N0527K9595
1782b7578j6439k5400Q2996j5282q650L3748j32o680p411J3611p693l8884k2281
1769d6075m2216K1200K7394k3511M0995o837m3922k1919o496j288N6536j5300
1757f1439m216j6961K7512K0801j3879l4835r148K4228j5852O2188L1916n4280
1745d3965j2722R88k7382J2249j2076M5634j077J208K1495m4975n925Q585l0043
1732h8006P277M8818K3516l3526n6472L3232N671q508k0955N2230n91j7702j5053
1719g0069J6651L4070J0557l9635J7566L8966j6830n4924j6107K7427Q4085n3977
$$ y = [-40895, -66627, -61405, -20554, -27894, -61484, -64531, -54011, -24235, -35027, -25484, -8733, -19926, -37770, -79018, -23417, -53031, -83107, -13403, 11358, -12689, -49223, -54101, -107700, -57173, -27578, -44017, -69417, 13579, -1703, -10353, 23395, 23263, 16583, 9172, 22783, 15090, -23794, -46075, -88291, -67091, -39697, -63208, -22213, -29050, -72972, -94891, -101387, -102675, -46139, -61439, -65655, -82616, -55104, -34303, -48182, -83017, -92165, -67937, -83789, -21601, 10315, -43965, -56687, -55699, -83081, -70832, -82908, -37274, -38351, -37143, -15648, -60623, -66548, -57963, -88006, -80729, -31911, -8395, -41921, -98393, -65161, -59490, -67998, -88953, -36723, -37314, -55016, -70069, -53418, -19348, -8791, -48426, -30860, 8106, -8724, -63648, -79755, -52328, 31757, -22220]
1707b2220m3440O5016p304j8926J6172k536O43J1775m0694O247L4738K7919m8138
1694b0748k2105J5260K4042j1307k3216p024n965M7816J1432J7971m0714j9542
1682c4100P87j0644m8723r349L6900k3576R654N0358J2272k8441J7802o861m3403
1669g7324l2688L2244O805J8638L7156J6361k2986L633k3735r714j765j1821l2728
1656i7924j0051M5842k6917N3064R151k8742j716j2032M098q990j4420n521N4949
1643c9209L4004L0577k3175j555M359J9179l5900k6678Q770J2299L6639J4679
1631C3989n858o4667K9668P184p05l17L010j8700m9798P777K2251k3537L7931
1618b1772K3163l947j62l2411J2721j3923O633l3023K9055L8896M5047O95m4017
$$ y = [-22220, -65660, -644, -7948, -26874, -10702, -13238, -12595, -820, -41514, -35267, -529, 27390, -20748, -42853, -27593, -3551, -14858, -38074, -45098, -51063, -3247, 8185, 26156, -14558, -34100, -33313, -43957, -92680, -102029, -65129, -88705, -79051, -28693, -16421, -44862, -27060, -33921, -77324, -110012, -77768, -70963, -52325, -15169, 1192, -21794, -18161, -41896, -51610, -53375, -65196, -97924, -107975, -62133, -89050, -35986, -26835, -55577, -57293, -69325, -65227, -74217, -88637, -94158, -39209, -5205, 25372, 2197, 642, 5001, 24180, -11720, -38398, -29628, -17329, 19310, 33989, 28131, -36536, -6868, 316, -389, -706, 2304, -16396, -66194, -58417, -36166, -59703, -21772, 1391, -2556, -2718, -35129, -22408, -36331, -29698, -62721, -33666, 5230, 50277, 50972, 6955]
1605F955L9365k9635r75k7158k5785K8231o2994o852J6118l662m5206N7200M858
1592d9540l7149M4317L5593m1j7920m6525n972k768L9374J0960K8946m0604N334
1579c5995j0797m011o656j8641L3455k3759L1313L1969L1751j1738k7057p5005
1567h5171O7754l4154r166M6098j0230k978k0412R462K5032k3141k1672j7667
1555g6245O076J6102k0718J640M3866J9690M283k7667j8649k7009K7948n230k5724
1542h1637Q581N8978J2445q5044K8107k408N5871J9167j1170N0543J5171k0417
1530D8187K207l6233n6062P450K1113J6879J7947J0302J1101m2642m1831P270
1518c4312L6742j7331J8017L2316k2306j5311r403N247M888N3029J8042j0632
$$ y = [6955, 46320, 16685, 15710, -11448, -37233, -9002, -71996, -78848, -62730, -66392, -111598, -54398, -49540, -86689, -42372, -6779, -6820, -24740, -71265, -77237, -80005, -40631, -29671, -725, -41329, -35995, -46792, -50803, -57459, -76100, -42645, -66404, -35091, -3122, 28629, 16891, -10166, -85171, -17417, -51571, -60737, -14639, -24869, -27847, -48259, -38797, -13765, -36906, -58578, -76245, -70169, -54067, -74785, -73145, -29279, -9589, -5306, -32973, -51622, -78631, -50683, -55913, -81637, -73056, -14078, -1633, -86677, -58570, -60978, -5107, 14060, 2890, 53433, 68604, 48187, 50394, 14161, -41901, -34451, -13338, 3541, 21488, 31790, 42891, 249, -41582, -34312, 2430, -14901, 3116, 35432, 13126, -2185, -11588, -6341, -1453, 51576, 69618, 58986]
1506E8986l3179L537p5739j1991O0994m371l6670k1567K0134J7945J7545K4197
1494A9821k9603R097J3862J7457L0201j5362m4131r374J663L1474k2746q3692
1482h1333K9429L9396j210j5689k8924j889J5739K4660K2103m826m3764j3642
1470e9950J4543K4598j5373j043j8375N2056n05j5942J8265j476l775K576j3187
1457a7588l2637J3885N737q183P918m876l4358J0352P582J8761j6632K7835R330
1444a2874L5905R92p589k3862k159k8850M1090k757p43K5710K16j0926l1425K3926
1430F654k0842k6085j2849j603L2726K878J2617J0366n849L9648l6979N181J553
1417G416k7536j2630j6497k4982J3035M0491O033J6697J6971O62k9404K8910O682
$$ y = [58986, 25807, 29344, -46395, -58386, 2608, -1763, -38433, -60000, -39866, -21921, -4376, 19821, -9782, -685, 13177, 30634, 60835, 45473, 1342, -8032, -6369, 25105, 2359, -81333, -51904, -12508, -13718, -29407, -58331, -60220, -44481, -19821, 2282, -2544, -46308, -59950, -45407, -20809, -36182, -37225, -55600, -3544, -4049, -19991, -1726, -3202, -6977, -4401, -17588, -50225, -36340, -30603, -38786, -30868, -35744, -70102, -59750, -52168, -33407, -50039, -22204, -12874, 23031, 24023, 16434, -7428, -9587, -38437, 2653, -104, -847, 24863, 25079, 14153, -17272, 6654, -14188, -40273, -53122, -54725, -21999, -19121, -6504, 3862, -1987, 37661, 682, 5863, 7416, -20120, -32750, -49247, -74229, -61194, -20703, -14670, 2027, 18998, 19660, -9744, 19166, 25848]
1404B5848o483R713k3864k7027m3766m0393Q4633K0639k2035l1878l6397L2316
1392e8694L8279p920j7763J0673m6820N0066L3367q315l1710O521o147o949j2990
1379e8402j7003K7609K2603J0991m1457K3008j4705L6937k4855l065K3603n555
1367b0291k498l1689K3063J9514J0128M674l0090K0112K085k7884j7617K4674
1355b5819K3038n792k5326r407l2494k9181P0037l0813j3632O6144k4107m1612
1343g8964L1036L3105L5618J5400m9769j4460O308J7661M392n9284L5388r270
1331c2839j0566K0576k8635N0712J9934o3851q93J8434L761L1467L857o5284J2576
1318d0751J8326j3476K7936R228k6742L2669q256m2651L3895L2972n0081j8406
$$ y = [25848, 19365, 29078, 5214, -21813, -65579, -105972, -21339, -700, -22735, -54613, -91010, -58694, -20415, -28335, -46098, -35425, -82245, -32179, 1188, -7127, -38837, -32316, -38463, -45412, -58402, -75405, -47796, -25193, -14202, -55659, -32651, -47356, -10419, -35274, -38339, -14736, -20291, -22789, -54478, -31415, -11901, -1773, 2901, -27189, -7077, -4992, -32876, -50493, -25819, -2781, -8573, -33899, -43306, -75800, -104981, -34944, -65757, -79389, -13245, -37352, -78964, -47928, -14823, 20795, 36195, -13574, -28034, -21726, -4065, 327, -58957, -23569, -32839, -43405, -22829, -51464, -752, 19182, -44669, -45562, -27128, -23367, 8100, 11957, -53327, -40751, -22425, -35901, -7965, 1263, -25479, 7190, -1066, -43717, -9822, 23150, -26931, -45337]
1306d5337L4270n3567M7442J8498o3456J2774l5683N1830L0900N128j5203O419
1294e985k6795k4872K1188J0400K7989J2805j7672R631l4879K2002j467O087N853
1281D285j2752m6101k2952R5401j3600l8448m6093L0038N7471K6342m7796k5450
1269c9655N9494K5760n2142l962k0616R034J4273J6175j4278k8004J3871J3358
1257f692R64J4595L5804m229j6864l2249j8129K3368R847M90j7459Q238j9040
1244b1356m6734j801K4891O9361j5455k8525l0352M4669k4217p6331P6798N3717
1232B4665n6800o719L7604O93N604J5557j4542j3497j2068J9423L8454l3668K7563
1219C2269m6429m2072O9959k3641j539o23J3646L2301o1724K166N0696m9185k2278
$$ y = [-45337, -11067, -64634, -17192, 1306, -62150, -49376, -85059, -33229, -2329, 2799, -12404, -5985, -32780, -57652, -36464, -26064, 1925, 14730, -2942, 6689, -28190, -6188, -7655, -1568, 4285, -8467, -54568, -77520, 17881, 4281, -34167, -80260, -50222, 7249, 33591, -14205, -39655, 19839, 45599, -6543, -10505, -31121, -22087, -7814, 8361, -5917, -33921, -20050, -6692, -5728, 8867, 44671, 40442, 23578, -8671, -26800, -3432, 6415, 6905, -10554, -2316, -21356, -68090, -69891, -45000, 24361, 8906, -19619, -49971, -5302, -29519, -105850, -29052, 24665, -32135, -38854, -1250, -557, 5047, 20604, 6062, -7435, -19503, -80, 38374, 4706, 32269, -14160, -56232, 13727, -9914, -11453, -12076, 1570, 33871, -27853, -25687, 25009, -24176, -46454]
1206d6454l077l0682N2490R591M2508j5102L036N1010l0646q1320L5953l219k425
1193a8337M9645k3514L9873o848l6822K867M8533m4585l0228N23J8493Q270l2993
1180b5123K0302p344p556K9797L7367J1379m8144K616l5202j2390q197J6910k413
1167b7998k779L228l4191J8976J0627K7989k5451J5828k644J7909k7614J1923
1155a4197l399j8669o69l0168N833K405K4989O4669j445K1782m2264n2993K5693
1142a8433K7880L1617o819K843L4454l6518l2974m7522K7151J1225n8595L2071
1130c3620n0087L1137M6311r053K7928k4180O7230j8648k1122N652j6055J1598
1118A7091j0095j9768j4034J7820j2712J0956l2736N5359k2612k5795O332J8333
$$ y = [-46454, -49531, -80213, -27723, -18132, 24376, 9274, 12310, 63320, 32674, -48646, -12693, -15912, -18337, 31308, 7794, 47667, 40819, 3997, 6864, 55397, 10812, -19416, -18893, -400, 7870, -25123, -4821, -12165, -19721, 10076, 47443, 58822, 10678, 13294, -21908, -34298, -42495, -25585, -27998, -30777, -27549, -61740, -42764, -32137, -4148, -29599, -13771, -16415, 1494, -26120, -14197, -17596, -36265, -36934, -67102, -61269, -58864, -33875, 30794, 29349, 51131, 8867, -44126, -18433, 9447, 41064, 34245, 37088, 71542, 35024, 2050, -45472, -18321, -7096, -65691, -33620, -83707, -52570, -6259, -15312, 12616, -11564, 55666, 37018, 15896, 21548, 5493, 17091, 6996, -12772, -26806, -8986, -21698, -10742, -43478, 11881, -10731, -36526, -30194, -11861]
1106a1861J0346m9120K0611K4581m5628m463O3968k2218P852M3580m7057j5197
1094b4606K2975j2649m09K7655m0291R491Q76m5278K1378O039J4330J4296P079
1081H86j9878j7322l9763K4627J3869L0190L0320k648K5150p0783K125J8246O1080
1068E6099j6417j6599n098R920l153m980R319k6138j1771M1498l9067k9721L8891
1055B783J302m472J9353K437l5903j2141j7925L8580O4509k7979l3536J6156j5234
1042b070k6606M0578J2430m529o4744K8606L5678j7686j0881k4993q959k2507
1030f5683j2965O1807K8287m8027k5511L0869L0981j4210K4695m7127O5502J5843
1018D4461m769r612l1439J8639l0209k2149L579R853n0805kK9522N2938j3688
$$ y = [-11861, -1515, -50635, -30024, -5443, -51071, -55534, 8434, -13784, -5932, 37648, -9409, -24606, -1631, -14280, -14689, 12966, -27325, -17834, -16958, -62236, -40858, -34819, -20489, -6193, 886, -18992, -36314, -76077, -51450, -37581, -7391, 22929, 20281, 45431, -25352, -23227, -4981, 56099, 39682, 23083, 17985, 27905, 24752, 19772, 29091, 2953, -8818, 32680, -6387, -36108, 2783, 4085, -387, 18966, 21403, -14500, -26641, -44566, -5986, 58523, 30544, -2992, 13164, -2070, -28676, 11902, 24332, 19803, -44941, -16335, 19343, 1657, -9224, -34217, -43176, -65683, -78648, -16841, 11446, -36581, -62092, -31223, -242, -14452, 10243, -36884, 28618, 44461, 39692, 30080, -1359, 17280, -12929, -35078, -31499, -21646, -72451, -72453, -42931, 10007, -3681]
1005c681N0786m577m5840N557o340K4297K2804Q676l9260J0754O031N2627o3520
992A8314j98J1797j2803K3688M9526l1493l6880n3894L8104O4715n2006k7210
980h340k3653K8656m513M080K0894n5251P796P1015l9487j8140L5229j4404k2927
967a9045j2153L0070O628p105k2386M9210Q131n0730k0482J4498n089Q154n611
954b5910K361M268n794L1496N8169k0084O029k7916k709J31k1701K4690J9298
941D2328j5312q475l4561k2430k0696j3930O8994L5479K6952l8709j7670R838
929A1808J6102K3637j6265m9242j4842L1796J5130J8674Q083l2104l194L0833
917D0416p4326j7858L9418n023M607R614K761K5830O371n3725J9527l252j8399
$$ y = [-3681, 47105, 42528, -3312, 2245, -4095, 20202, 43006, 51682, 12422, 23176, 29207, 81834, 18314, 18116, 29913, 17110, 40798, 90324, 58831, 21951, -31943, 6161, 70876, 18870, -8340, -31993, -3337, -7850, -3770, 17124, -38127, -30331, 40684, 1197, -16943, 18286, 3882, -19045, -31198, -1128, 5500, -1605, -23991, 25219, 33350, -17380, -37862, -23364, -28453, -20299, -25910, -23549, -19281, -25075, 6421, 64590, 44506, 50535, 22619, 19910, 20041, -1660, 23030, 42328, 27016, 18541, -16020, -38450, -59146, -73076, -4082, 31397, 58349, 19640, 1970, 11808, 27910, 51547, 35282, -13960, -28802, 2994, 18124, 36798, 44881, 12777, 9583, 40416, -33910, -51768, -12350, -17373, -12766, -3152, -391, 25439, 31810, -21915, -2388, -5640, -24039]
904b4039L4174M9659q487J4784m3314k5595N015L8752m523l9767k0511j2584K528
891c3908K8405k7616K9626J5111o902P450k15n5179L461q298M7332K7154j4174
878A2247l3072O0529j7165j2829j6532K2549m531r545L7066k6056K9468l249L4841
865G3721m5165l1020O214L695K1601m2372j3800M57j949J557j3706J5499q222
852c3490L6242M0878L1335o3873j180J5010l3508M7634l3630n1417M6275J3464
840A3740j2369k791K4718M8830k4168n0668K3847N586M7863k7822j3543l2476
828G47j9757j4847M299k1126L5429L0792q6605J6974O8548k3366p314L4741J3201
815C1716l8356J8245J3451m7308Q092J6807K0009m9432o1338j400K0636L9001
$$ y = [-24039, 10135, 59794, 51307, 66091, 22777, -2818, 2197, 40949, 36426, -3341, -23852, -36436, -33908, -5503, -33119, -3493, 11618, 4716, 12166, 11951, -43228, -39767, -48065, -733, 26421, 12247, -20825, 39704, 22539, 9710, -6822, 15727, 11196, 1651, 38717, 12661, 42129, 38880, 73721, 28556, -2464, 3750, 7445, 29046, -13326, -27126, -26669, -28618, -27061, -40767, -25268, -33490, 2752, 43630, 74965, 11092, 9912, 24922, -8586, 39048, 5418, -45999, 276, 13740, 1371, -1420, 23298, 72128, 47960, -2708, 21139, 26725, 74588, 46766, 33223, 747, -19010, -33857, -29558, -50684, -15255, 15537, -71068, -54094, 14454, -8912, -16226, 18515, 31716, -6640, 11605, 25056, -22252, -14160, 2647, 22656, -26776, -88114, -89514, -68878, -29877]
$$ [...]
##END NTUPLES=NMR SPECTRUM
##END=
