##TITLE=1H_TG-2343
 CDCl3
 8 sc, 
 18.1.2022
##JCAMPDX= 6.0         $$ Bruker NMR JCAMP-DX V2.0
##DATA TYPE= NMR SPECTRUM
##DATA CLASS= NTUPLES
##ORIGIN= UXNMR, Bruker Analytische Messtechnik GmbH
##OWNER= root
$$ XWIN-NMR		Version 3.5
$$ Tue Jan 18 11:35:56 2022 Russian Standard Time (UT+4h)  she@DPX200
##.OBSERVE FREQUENCY= 200.131346
##.OBSERVE NUCLEUS= ^1H
##.ACQUISITION MODE= SIMULTANEOUS
##.ACQUISITION SCHEME= undefined
##.AVERAGES= 8
##.DIGITISER RES= 18
##SPECTROMETER/DATA SYSTEM= spect
##.PULSE SEQUENCE= zg30
##.SOLVENT NAME= CDCl3
##.SHIFT REFERENCE= (INTERNAL, CDCl3, 0, 15.7238)
##AUDIT TRAIL= $$ (NUMBER, WHEN, WHO, WHERE, WHAT)
$$ ##TITLE= Audit trail, XWIN-NMR		Version 3.5
$$ ##JCAMPDX= 5.01
$$ ##ORIGIN= Bruker BioSpin GmbH
$$ ##OWNER= she
$$ F:/spectra/data/she/nmr/H-F/1/pdata/1/auditp.txt
$$ ##AUDIT TRAIL=  $$ (NUMBER, WHEN, WHO, WHERE, WHAT)
(   1,<2022-01-18 11:34:47.96 +0400>,<she>,<DPX200>,
      <created by zg, POWCHK disabled, PULCHK disabled
       configuration hash MD5:
       00 E9 B6 7A A2 85 ED C7 34 08 36 98 17 FE 4E 26
       data hash MD5: 16K
       36 EA 53 8E 05 0D 2C F1 3A 2F 73 AE 38 99 BA 30>)
(   2,<2022-01-18 11:34:51.40 +0400>,<she>,<DPX200>,
      <Start of raw data processing
       efp BC_mod = 2 LB = 0.24 FT_mod = 6 PKNL = 1 PHC0 = -15866.36 PHC1 = 6.400779 SI = 16K 
       data hash MD5: 16K
       FB 51 E0 FD 0E CD D7 93 C5 EF AE EB AD 0D 29 EB>)
(   3,<2022-01-18 11:35:08.82 +0400>,<she>,<DPX200>,
      <pk PHC0 = -4.349876 PHC1 = 5 
       data hash MD5: 16K
       E1 79 B8 00 F3 9E 17 16 D9 10 31 94 93 55 79 84>)
(   4,<2022-01-18 11:35:11.89 +0400>,<she>,<DPX200>,
      <abs ABSG = 5 
       data hash MD5: 16K
       56 00 89 82 97 E4 CB 6D B6 88 A1 0A 3B F2 51 D7>)
$$ ##END=
$$ 
$$ hash MD5
$$ AD 71 87 90 83 C3 C3 F6 DD C1 24 7D 23 BB EF 89
##$RELAX= 
##$RELAX= 
##$RELAX= 
##$RELAX= 
##$RELAX= 
##$RELAX= 
$$ Bruker specific parameters
$$ --------------------------
##$DU= <F:/spectra>
##$EXPNO= 1
##$NAME= <H-F>
##$PROCNO= 1
##$TYPE= <nmr>
##$USER= <she>
##$AMP= (0..31)
100 100 100 100 100 100 100 100 100 100 100 100 100 100 100 100 100 100 
100 100 100 100 100 100 100 100 100 100 100 100 100 100 
##$AQSEQ= 0
##$AQ_mod= 1
##$AUNM= <au_zg>
##$AUTOPOS= <>
##$BF1= 200.13
##$BF2= 200.13
##$BF3= 200.13
##$BF4= 200.13
##$BF5= 200.13
##$BF6= 200.13
##$BF7= 200.13
##$BF8= 200.13
##$BYTORDA= 1
##$CFDGTYP= 0
##$CFRGTYP= 5
##$CHEMSTR= <none>
##$CNST= (0..31)
1 1 145 1 1 1 1 1 1 1 1 1 1 1 1 1 1 1 1 1 1 1 1 1 1 1 1 1 1 1 1 1 
##$CPDPRG= <>
##$CPDPRG1= <>
##$CPDPRG2= <>
##$CPDPRG3= <>
##$CPDPRG4= <mlev>
##$CPDPRG5= <mlev>
##$CPDPRG6= <mlev>
##$CPDPRG7= <mlev>
##$CPDPRG8= <mlev>
##$CPDPRGB= <>
##$CPDPRGT= <>
##$D= (0..31)
0 1.2 0 0 0 0 0 0 0 0.06 0 0.03 0 0 0 0 0.0002 0 0 0 0 0 0 0 0 0 0 0 0 
0 0 0 
##$DATE= 1642491287
##$DBL= (0..7)
120 120 120 120 120 120 120 120 
##$DBP= (0..7)
150 150 150 150 150 150 150 150 
##$DBP07= 0
##$DBPNAM0= <>
##$DBPNAM1= <>
##$DBPNAM2= <>
##$DBPNAM3= <>
##$DBPNAM4= <>
##$DBPNAM5= <>
$$ [...]
##$SUBNAM2= <"">
##$SUBNAM3= <"">
##$SUBNAM4= <"">
##$SUBNAM5= <"">
##$SUBNAM6= <"">
##$SUBNAM7= <"">
##$SUBNAM8= <"">
##$SUBNAM9= <"">
##$SW= 18.0517287032376
##$SWIBOX= (0..15)
0 0 2 0 0 0 0 0 0 0 0 0 0 0 0 0 
##$SW_h= 3612.71676300578
##$TD= 16384
##$TD0= 1
##$TE= 0
##$TE2= 300
##$TE3= 300
##$TEG= 300
##$TL= (0..7)
0 120 120 120 120 120 120 120 
##$TP= (0..7)
150 150 150 150 150 150 150 150 
##$TP07= 0
##$TPNAME0= <>
##$TPNAME1= <>
##$TPNAME2= <>
##$TPNAME3= <>
##$TPNAME4= <>
##$TPNAME5= <>
##$TPNAME6= <>
##$TPNAME7= <>
##$TPOAL= (0..7)
0.5 0.5 0.5 0.5 0.5 0.5 0.5 0.5 
##$TPOFFS= (0..7)
0 0 0 0 0 0 0 0 
##$TUNHIN= 0
##$TUNHOUT= 0
##$TUNXOUT= 0
##$USERA1= <user>
##$USERA2= <user>
##$USERA3= <user>
##$USERA4= <user>
##$USERA5= <user>
##$V9= 5
##$VALIST= <valist>
##$VCLIST= <CCCCCCCCCCCCCCC>
##$VD= 0
##$VDLIST= <DDDDDDDDDDDDDDD>
##$VPLIST= <PPPPPPPPPPPPPPP>
##$VTLIST= <TTTTTTTTTTTTTTT>
##$WBST= 1024
##$WBSW= 4
##$XGAIN= (0..3)
0 0 0 0 
##$XL= 0
##$YL= 0
##$YMAX_a= 372492
##$YMIN_a= -564895
##$ZGOPTNS= <>
##$ZL1= 120
##$ZL2= 120
##$ZL3= 120
##$ZL4= 120
##$ABSF1= 15.70172
##$ABSF2= -2.350129
##$ABSG= 5
##$ABSL= 3
##$ALPHA= 0
##$AQORDER= 0
##$ASSFAC= 0
##$ASSFACI= 0
##$ASSFACX= 0
##$ASSWID= 0
##$AUNMP= <proc_1d>
##$AZFE= 0.1
##$AZFW= 0.1
##$BCFW= 0
##$BC_mod= 2
##$BYTORDP= 0
##$COROFFS= 0
##$CY= -3
##$DATMOD= 1
##$DC= 0
##$DFILT= <>
##$DTYPP= 0
##$F1P= 0
##$F2P= 0
##$FCOR= 1
##$FTSIZE= 16384
##$FT_mod= 6
##$GAMMA= 0
##$GB= 0
##$INTBC= 1
##$INTSCL= 0
##$ISEN= 128
##$LB= 0.24
##$LEV0= 0
##$LPBIN= 0
##$MAXI= 10000
##$MC2= 0
##$MEAN= 0
##$ME_mod= 0
##$MI= 1.114404
##$NCOEF= 0
##$NC_proc= -5
##$NLEV= 6
##$NOISF1= 3.799351
##$NOISF2= 2.8
##$NSP= 0
##$NTH_PI= 0
##$NZP= 0
##$OFFSET= 15.72375
##$PC= 1
##$PHC0= -15870.71
##$PHC1= 11.40078
##$PH_mod= 1
##$PKNL= yes
##$PPARMOD= 0
##$PSCAL= 0
##$PSIGN= 0
##$REVERSE= no
##$SF= 200.130005564736
##$SI= 16384
##$SIGF1= 3
##$SIGF2= 2
##$SINO= 5.538805
##$SIOLD= 16384
##$SREGLST= <1H.CDCl3>
##$SSB= 0
##$STSI= 16384
##$STSR= 0
##$SW_p= 3612.71676300578
##$SYMM= 0
##$S_DEV= 0
##$TDeff= 16384
##$TDoff= 0
##$TI= <>
##$TILT= no
##$TM1= 0
##$TM2= 0
##$TOPLEV= 0
##$USERP1= <user>
##$USERP2= <user>
##$USERP3= <user>
##$USERP4= <user>
##$USERP5= <user>
##$WDW= 1
##$XDIM= 16384
##$YMAX_p= 304184892
##$YMIN_p= -611840
$$ End of Bruker specific parameters
$$ ---------------------------------
##NTUPLES= NMR SPECTRUM
##VAR_NAME=  FREQUENCY,     SPECTRUM/REAL,   SPECTRUM/IMAG
##SYMBOL=    X,             R,               I
##VAR_TYPE=  INDEPENDENT,   DEPENDENT,       DEPENDENT
##VAR_FORM=  AFFN,          ASDF,            ASDF
##VAR_DIM=   16384,         16384,           16384
##UNITS=     HZ,            ARBITRARY UNITS, ARBITRARY UNITS
##FACTOR=    0.220516191357247, 1,           1
##FIRST=     3146.79419790158, 0,            0
##LAST=      -465.922565104201, 0,           0
##MIN=       -465.922565104201, -611840,     0
##MAX=       3146.79419790158, 304184892,    0
$$ Real data points
##PAGE= N=1
##DATA TABLE= (X++(R..R)), XYDATA
$$ [...]
7150C446827J12441J34664J20307Q3506P2968J56657J42743K12206J81036J36807
$$ 3446827 3559268 3693932 3814239 3897745 3970713 4127370 4270113 4482319 4663355 4800162
7140D800162J64864K13953K14259K10831K42256K53305K74380L39212K96701L50675
$$ 4800162 4965026 5178979 5393238 5604069 5846325 6099630 6374010 6713222 7009923 7360598
7130G360598L11267L89476M75030M71349N88444O86480P54657R71234J139604
$$ 7360598 7671865 8061341 8536371 9007720 9596164 10282644 11037301 12008535 13148139
7121A3148139J320068J552938J801728K080161K183285K305414K537624K752424
$$ 13148139 14468207 16021145 17822873 19903034 22086319 24391733 26929357 29681781
7113B9681781L178868L508991L403228K464492J061765q02053k481829l842191
$$ 29681781 32860649 36369640 39772868 42237360 43299125 42497072 40015243 36173052
7105C6173052m709670m868919m443857l436152k558159j720680j208554r02799
$$ 36173052 31463382 26594463 22150606 18714454 16156295 14435615 13227061 12324262
7097A2324262o54609n41297l92284l21717k98204k64550k41221j33587p7790m5275
$$ 12324262 11669653 11128356 10736072 10414355 10116151 9851601 9610380 9476793 9399003 9353728
7087I353728n0136Q39r186O8340J38479J96304J72081J77736K43944K92209L19767
$$ 9353728 9303592 9304431 9295245 9363585 9502064 9698368 9870449 10048185 10292129 10584338 10904105
7076A0904105L71466M43322M50134M90482N28372O62010O35886P55799R68981
$$ 10904105 11275571 11718893 12169027 12659509 13187881 13849891 14485777 15241576 16210557
7067A6210557J132761J321204J564376J857226K083405K275180K300105K282014
$$ 16210557 17343318 18664522 20228898 22086124 24169529 26444709 28744814 31026828
7059C1026828K342116K745474L190701L686572M262114M327519L915418L038892
$$ 31026828 33368944 36114418 39305119 42991691 47253805 51581324 55496742 58535634
7051E8535634J853798Q80109n646o53623j883713l441004n453271o766530p136498
$$ 58535634 60389432 61269541 61263895 60610272 58726559 55285555 49832284 43065754 35929256
7042C5929256o491608m990313l703767k705589j976499j566785j224172j018912
$$ 35929256 29437648 24447335 20743568 18037979 16061480 14494695 13270523 12251611
7034A2251611r01473p42717o65688n49606n25141m17158l92156l28710k83309
$$ 12251611 11350138 10607421 9941733 9392127 8866986 8449828 8057672 7728962 7445653
7025G445653l14533k67066k12958k51375k14187k39580k22876k65182k77112k60470
$$ 7445653 7131120 6864054 6651096 6399721 6185534 5945954 5723078 5457896 5180784 4920314
7015D920314k23177k54116k90727j65050j88662k05362j58915k10180j12761j35547
$$ 4920314 4697137 4443021 4152294 3987244 3798582 3593220 3434305 3224125 3111364 2975817
7005B975817m4271j10413p9750p0559o6680p6324o2837m4695q794l5680k3885
$$ 2975817 2931546 2821133 2741383 2670824 2604144 2527820 2464983 2420288 2411494 2375814 2351929
6994B351929k7748o1776O291L8309L7638J3783N4148P4368J09476J06567R4280
$$ 2351929 2324181 2262405 2268696 2307005 2344643 2358426 2412574 2486942 2596418 2702985 2797265
6983B797265Q8675J72728K40784J73548K14184J12473R6362J6817M2940M5187
$$ 2797265 2885940 3058668 3299452 3473000 3687184 3799657 3896019 3912836 3955776 4000963
6973D000963j10311j41044k62579l17774l61802m33399l26471k34202j64724p8793
$$ 4000963 3890652 3749608 3487029 3169255 2807453 2374054 2047583 1813381 1648657 1569864
6963A569864j13167p5159q1070j53591n7028j4726l3160n6021n5195O130n5255
$$ 1569864 1456697 1381538 1300468 1146877 1089849 1075123 1041963 985942 930747 936877 881622
6952H81622m5873k3302K1351j3099l4007p0729k3160n9531j3141n1237M2793k4585
$$ 881622 835749 812447 833798 820699 786692 715963 692803 633272 620131 568894 611687 587102
6940E87102k4553K7271n4921m2754j1402K2190l4562l4636j6245m3902k5922N0944
$$ 587102 562549 589820 534899 492145 480743 502933 468371 433735 417490 373588 347666 398610
6928C98610K2550J8550q511r825o2460n1507L1975j1751j2336J3037K9233k8763
$$ 398610 421160 439710 431199 421374 358914 307407 339382 327631 315295 328332 357565 328802
6916C28802n5730o408M1195p2056q183J3388K5474K4512k8576l54K3296m3159
$$ 328802 273072 266664 307859 235803 227620 241008 266482 290994 262418 262064 285360 242201
6904B42201k8773K9736r6345j8478O1262M7455l0399k47J5977J0342L0451l0344
$$ 242201 213428 243164 146819 128341 189603 237058 206659 206412 222389 232731 263182 232838
6892B32838m5642j4326L067l1827n5875M9520P2930N4383j9060o1215J1393p194
$$ 232838 187196 172870 175937 144110 88235 137755 210685 265068 246008 184793 196186 188992
6880A88992K7758K9132k7596P214j3195K9803N360m9095M6852k2825j4930J888
$$ 188992 216750 245882 218286 225500 212305 242108 247468 198373 245225 222400 207470 209358
6868B09358j4412r148k193L4258l397n437k0126K1900L1205j6199P91K055m7889
$$ 209358 194946 185798 183605 217863 214466 209029 188903 210803 242008 225809 226600 228655 180766
6855A80766Q98j966L9661N2091m2293K069j1283m4383k727L312L4958K4475J2159
$$ 180766 181664 179698 219359 271450 229157 231226 219943 175560 172833 176145 211103 235578 247737
6842B47737K9709k7675o4150j7822M40k3544k6632l0014M1896j9202j1563k5198
$$ 247737 277446 249771 185621 167799 168239 144695 118063 88049 129945 110743 99180 73982
6830G3982K9994P8044m5369k9865O85M668J0992Q898K1920M198J0329K0831l9199
$$ 73982 103976 182020 136651 106786 107471 112139 123131 132029 153949 158147 168476 189307 150108
6817A50108J4411M217P598j3572k6033L7938o26k3226m114L1332L584l7469P1295
$$ 150108 164519 168736 176334 162762 136729 174667 174041 150815 146701 178033 181617 144148 215443
6804B15443L8569l0346K1360j0249n9485N0656l6189K7138M3486K108m6755j1615
$$ 215443 254012 223666 245026 234777 175292 225948 189759 216897 260383 262491 215736 204121
6792B04121K0551k2537l3680k4831L8669K5230K8204K0714j5927l2992k3506k4945
$$ 204121 224672 202135 168455 143624 182293 207523 235727 256441 240514 207522 184016 159071
6780A59071l0469n1559j789M6645l5486q381R80n664N519N5592j3627O312O696
$$ 159071 128602 77043 75254 121899 86413 78032 79012 73348 78867 134459 120832 127144 133840
6767A33840j5887k1126N870J9636k1609M7949l4438K3463j8m7730M3589m857k2465
$$ 133840 117953 96827 102697 122333 100724 148673 114235 137698 137680 89950 133539 128682 106217
6754A06217K5605m0528K4396K5008o3626N367J1342k5384N1343L0334O543p264
$$ 106217 131822 91294 115690 140698 77072 82439 93781 68397 119740 150074 156617 149353
6742A49353k3329l2061M2630k326l7846k9019M0590J1672O82j93K8910j9104m0889
$$ 149353 126024 93963 136593 134267 96421 67402 107992 119664 120346 120153 149063 129959 89070
6729H9070L9178J7048k6419K1033m1565j1739j2621R123M2225K6595J8783K245
$$ 89070 128248 145296 118877 139910 98345 86606 73985 83108 125333 151928 170711 172956
6717A72956k1304J9464K3754K1468M8034K9647j163o584L4724M9020l8217k6243
$$ 172956 151652 171116 194870 216338 264372 294019 292856 286272 320996 370016 331799 305556
6705C05556j369l9235J1221k9131k9080R314k9350L3551o1408l7060K2946j7630
$$ 305556 304187 264952 276173 247042 217962 227276 197926 231477 170069 133009 155955 138325
6693A38325O251L159L1631l9022l6338J1128n259k4744J1689K557P024J5830k1530
$$ 138325 144576 147735 179366 140344 104006 115134 109875 85131 96820 99377 106401 122231 100701
6680A00701j1884N0144M9952l3681j7960j6L9629j8266j4872Q963K2298K766k4855
$$ 100701 88817 138961 188913 155232 137272 137256 176885 158619 143747 152710 175008 177774 152919
6667A52919L1222k1516L0164L3898j3191K904M5435p344M9035n9401K9931k5519
$$ 152919 184141 162625 192789 226687 213496 216400 261835 254491 303526 244125 274056 248537
6655B48537L2627N6846n279k6097J4767n2386N9574N1672L2119L4131m9603M066
$$ 248537 281164 338010 332731 306634 321401 269015 328589 380261 412380 446511 396908 400974
6643D00974l8683j5752l4579l4641J9276k5454n6564j4581k3726j512L8963K2950
$$ 400974 362291 346539 311960 277319 296595 271141 214577 199996 176270 174758 213721 236671
6631B36671l3127k3930M7155n4978m7524L3171K4648k184q930j1510L163N0722
$$ 236671 203544 179614 226769 171791 124267 157438 182086 179902 170972 159462 162625 213347
6619B13347j7442m3210J2700M4880K0152j8326j9664o7299R975J0386J3536n345
$$ 213347 195905 152695 165395 210275 230427 212101 192437 125138 135113 145499 159035 153690
6607A53690l9663K7391l054K7588L1677N331n3129M274L2924J1985l7050L969
$$ 153690 114027 141418 138364 165952 197629 202960 149831 154105 187029 199014 161964 165933
6595A65933l5244P0880k1417k0272K7508O070j5552k714l234j430j9779L4514
$$ 165933 130689 201569 180152 159880 187388 193458 177906 175192 171958 170528 150749 185263
6583A85263Q926M2500N21m5724K447J9527j0059l7436O231K4982K5421q1820L4353
$$ 185263 194189 236689 237210 191486 193933 213460 203401 165965 172196 197178 222599 140779 175132
6570A75132R7615j2318k9213L601m8923M58L5825k5594k8181L5624J2636j6321
$$ 175132 272747 260429 231216 234817 185894 186352 222177 196583 168402 204026 216662 200341
6558B00341J8020L3854q387j3915K2745l9310N507K3683j2908L276P030M563J9468
$$ 200341 218361 252215 243828 229913 252658 213348 218855 242538 229630 232906 239936 244499 263967
6545B63967K3140n7916J5539j5147m682L2318k9383o00k8907k1082N206O2994
$$ 263967 287107 229191 244730 229583 224901 257219 227836 227236 198329 177247 182453 245447
6533B45447P986j7290M932n114r044j8350L6670m8638M1598L813k2928Q1104K2216
$$ 245447 253433 236143 241075 235961 226917 208567 245237 196599 238197 242010 219082 300186 322402
6520C22402m5781m5681K7131n7652K8913K6242j2900J3747j1071O9978l0317j0051
$$ 322402 276621 230940 258071 200419 229332 255574 242674 256421 245350 315328 285011 274960
6508B74960l1796L9566m3096m1064O5870p583n3113m9020M0653L9209J3185M6670
$$ 274960 243164 282730 239634 198570 264440 256857 203744 154724 195377 234586 247771 294441
6496B94441j0466K8013M587n4240O574l7390N1849L5422J4110l8559j4428R066
$$ 294441 283975 311988 316575 262335 268909 231519 283368 318790 332900 294341 279913 288979
6484B88979j3971j1378k6994L904L0327m951N154L5097L0475p0889k6714l034
$$ 288979 275008 263630 236636 240540 270867 265916 271070 306167 336642 265753 239039 236005
6472B36005K8426K7354j8489M7851K5713L722r333j0127P720K6412P786M7554
$$ 236005 264431 291785 273296 321147 346860 350582 341249 331122 338842 365254 373040 420594
6460D20594k772m5911J710j3196K5455K5937o7636l9204L9824j5323K7645P6794
$$ 420594 417822 371911 373621 360425 385880 411817 344181 304977 344801 329478 357123 433917
6448D33917k3805j813K4113j6700j0506k481N587M2557J510k4181m7307j066O0131
$$ 433917 410112 408299 432412 415712 405206 402725 408312 450869 452379 428198 380891 379825 439956
6435D39956J0039j7135k428k0159l8493O1062N1479o8074J8325J3028j9412r444
$$ 439956 449995 432860 430432 410273 371780 432842 484321 416247 434572 447600 428188 418744
6423D18744J3095Q1612J99n3678m8716K9175K249J1878m352K2198L9557J748q316
$$ 418744 431839 513451 513650 459972 411256 440431 442680 454558 450206 472404 511961 513709 505393
6410E05393l6222Q050O6730M0106J0169N4027n0884N143L6503J8238k8241j4985
$$ 505393 469171 477221 543951 584057 594226 648253 597369 602512 639015 657253 629012 614027
6398F14027K191K2944k7391J972J4275K6654j3306O002L8879k6737P137M6552
$$ 614027 616218 639162 611771 613743 628018 654672 641366 647368 686247 659510 666647 713199
6386G13199j7799l6134L5960J4867K7744m571l564J9152M357q208J7792q646Q074
$$ 713199 695400 659266 695226 710093 737837 733266 729702 748854 753211 745003 762795 754149 762223
6373G62223K2398j1591P454Q852N0066k6650m4752K9711k7567q316N926M558P0325
$$ 762223 784621 773030 780484 789336 839402 812752 768000 797711 770144 761828 767754 772312 842637
6360H42637k0231k8770L2488J854M8171j6970l5408O8361K0398M6264L3546m5024
$$ 842637 822406 793636 826124 827978 876149 859179 823771 892132 912530 958794 992340 947316
6348I47316Q492j164L0060N319j1427k4672q418J9234N7961j9940N7562L9003
$$ 947316 955808 954644 984704 990023 978596 953924 945506 964740 1022701 1002761 1060323 1099326
6336A099326k1337k4600K0565N749l9902J1140j8019N1735K1766l8778M6M6053
$$ 1099326 1077989 1053389 1073954 1079703 1039801 1050941 1032922 1084657 1106423 1067645 1067691 1113744
6324A113744N664o478N1162K9713K910m173N8227K4114l8309K9009K7732J2956
$$ 1113744 1119408 1112930 1164092 1193805 1196715 1192542 1250769 1274883 1236574 1265583 1293315 1306271
6312A306271k936k3295O442k060k71J0258M3104L929j3663L5525J3376O57N9029
$$ 1306271 1303335 1280040 1286482 1284422 1284151 1294409 1337513 1341442 1327779 1363304 1376680 1377337 1436366
6299A436366L1858m1331L7928K3637Q04P270M6879K7622L664J935L0347M573p1127
$$ 1436366 1468224 1426893 1464821 1488458 1489262 1496532 1543411 1571033 1574697 1576632 1606979 1611552 1540425
6286A540425O08J1640M910N950K9341M2193L7232K7486M994J4191L9893M5797
$$ 1540425 1541033 1552673 1557583 1563533 1592874 1635067 1672299 1699785 1704779 1718970 1758863 1804660
6274A804660M4157J6837l6542k1750K1225m004K3287M2998J4550M5731K9674j235
$$ 1804660 1848817 1865654 1829112 1807362 1828587 1824583 1847870 1890868 1905418 1951149 1980823 1979588
6262A979588J6196L1138M0025O3422Q991K3135M4351k3763n903J20987Q1843K3486
$$ 1979588 1995784 2026922 2066947 2130369 2139360 2162495 2206846 2183083 2177180 2298167 2380010 2403496
6250B403496L105K7673N7605M4330L7324J4319k3780P545R7553J9053J0658M302
$$ 2403496 2406601 2434274 2491879 2536209 2573533 2587852 2564072 2571617 2669170 2688223 2698881 2703183
6238B703183P4339K3188L7394M8938l4126P0497j4409Q133J9097P1464P4182M2527
$$ 2703183 2777522 2800710 2838104 2887042 2852916 2923413 2909004 2917137 2936234 3007698 3081880 3124407
6226C124407M5076N2215P2264K7196M4543P0403J9455l5264L8449P6566J03930
$$ 3124407 3169483 3221698 3293962 3321158 3365701 3436104 3455559 3420295 3458744 3535310 3639240
6215C639240L5257M7993L8203M920R4475N8182R9657N4041q460J38222P3394L4439
$$ 3639240 3674497 3722490 3760693 3765613 3860088 3918270 4017927 4071968 4063508 4201730 4275124 4309563
6203D309563M4844O9746P2917P5018Q4296L2073N5364M7602J07352R5828O6825
$$ 4309563 4354407 4424153 4497070 4572088 4656384 4688457 4743821 4791423 4898775 4994603 5061428
6192E061428Q9846J07313O2113R2288P5778J10168L6668N6595J17041J19147J27528
$$ 5061428 5151274 5258587 5320700 5412988 5488766 5598934 5635602 5692197 5809238 5928385 6055913
6181F055913L2644R6940J28762Q4080J05354J03169P9794Q0648Q4388J11521J31125
$$ 6055913 6088557 6185497 6314259 6398339 6503693 6606862 6686656 6767304 6851692 6963213 7094338
6170G094338J26089Q6506P3334M4671J63805Q1780O0637J52905J10011O2115J25230
$$ 7094338 7220427 7306933 7380267 7424938 7588743 7670523 7731160 7884065 7994076 8056191 8181421
6159H181421R2605N9906q32J05411J32537L3709P1257O0174J7886Q7789J18848
$$ 8181421 8274026 8333932 8333100 8438511 8571048 8604757 8676014 8736188 8754074 8841863 8960711
6148H960711J0306j4920M2118M5707K0632M9503N8837J08979n3651Q451J166O7320
$$ 8960711 8971017 8956097 8998215 9043922 9064554 9114057 9172894 9281873 9228222 9236673 9237839 9305159
6136I305159O5824M3480l4957M5003K3990j3796L4586J3905m6916k2531o575n5847
$$ 9305159 9370983 9414463 9379506 9424509 9448499 9434703 9469289 9483194 9436278 9413747 9407172 9351325
6124I351325j2730n4549K4624M670l5021j5514k0227k4476j4761l2543K4872q1367
$$ 9351325 9338595 9284046 9308670 9313340 9278319 9262805 9242578 9218102 9203341 9170798 9195670 9114303
6112I114303o132M612J6252r71l984K3143n729l9794J8151m70J186K7835P1181
$$ 9114303 9108171 9112783 9129035 9128064 9124080 9147223 9141494 9101700 9119851 9119381 9120567 9148402 9219583
6099I219583Q9851m987K898M1063P9692M5193J05515O1990N6701J15341J57565
$$ 9219583 9309434 9304447 9307345 9348408 9428100 9473293 9578808 9640798 9697499 9812840 9970405
6088I970405J57694J61706K52293K74392L83732M30653M48275M97046N10689M99583
$$ 9970405 10128099 10289805 10542098 10816490 11200222 11630875 12079150 12576196 13086885 13586468
6078A3586468N92717P41073Q54626R36535Q64932N52025K50916P6100p7008l81675
$$ 13586468 14179185 14920258 15774884 16711419 17576351 18128376 18379292 18455392 18378384 17996709
6068A7996709o15313o11676l84389o7951K47254M77106M59019J36452j92717m15969
$$ 17996709 17381396 16769720 16385331 16317380 16564634 17041740 17500759 17637211 17444494 17028525
6058A7028525o57937r49260j148795j180525r59503o75583m78747l20432k48960
$$ 17028525 16370588 15421328 14272533 13092008 12132505 11456922 10978175 10657743 10408783
6049A0408783j98872j34832p5292j1413N6260m2238R887N1348J8576P7367Q6175
$$ 10408783 10209911 10075079 9999787 9988374 10044634 10002396 10012283 10063631 10082207 10159574 10245749
6038A0245749J40418K09998J83933K36322L24539M05905M49964O20371O98140
$$ 10245749 10386167 10596165 10780098 11016420 11340959 11746864 12196828 12817199 13515339
6029A3515339O71252O35990P62377Q21402R94803J185192J265039R72652O07986
$$ 13515339 14186591 14822581 15584958 16406360 17401163 18586355 19851394 20824046 21432032
6020B1432032J73549j45168l24665p25141q97389p87121l25050J03886L97686
$$ 21432032 21605581 21460413 21135748 20410607 19513218 18726097 18401047 18504933 18902619
6011A8902619N77625L94410j27381m88963p68709j132544j484817j665752j535991
$$ 18902619 19480244 19874654 19747273 19258310 18489601 17357057 15872240 14206488 12670497
6002A2670497j184368q23231o09827m75939m07308l33811k82027k76679j73255
$$ 12670497 11486129 10662898 10053071 9577132 9169824 8836013 8553986 8277307 8104052
5993H104052o6871j58392j74764r3461r7252j11948j28714o0955q1760n7729j14551
$$ 8104052 8037181 7878789 7704025 7610564 7513312 7401364 7272650 7211695 7129935 7072206 6957655
5982F957655q1772k9072p1432p1543l4289p5619J7794k0608r1617n118j6704n5538
$$ 6957655 6875883 6846811 6775379 6703836 6669547 6593928 6611722 6591114 6499497 6494379 6477675 6422137
5970F422137r2434k7644k0848j5751J3992L7816l7571l0428q928l2394j3880J4943
$$ 6422137 6329703 6302059 6281211 6265460 6279452 6317268 6279697 6249269 6240341 6207947 6194067 6209010
5958F209010l177j2452K0859O1023k5804k9616P023M1470l2516o208k88j1688
$$ 6209010 6205833 6193381 6214240 6275263 6249459 6219843 6226866 6268336 6235820 6229612 6229324 6217636
5946F217636M1737M212M0839K1227J0281N9151J3555j2961N9736J9450K9435J0810
$$ 6217636 6259373 6263585 6304424 6325651 6335932 6395083 6408638 6395677 6455413 6474863 6504298 6515108
5934F515108O747M9329L7656O3047M8048N018O6084L8096K0220P7185R2220J26509
$$ 6515108 6521855 6571184 6608840 6671887 6719935 6724953 6791037 6829133 6849353 6926538 7018758 7145267
5922G145267O7975Q6800Q6472M2882J23712O3118P0548J35774J00422K3864J13564
$$ 7145267 7213242 7300042 7386514 7429396 7553108 7616226 7686774 7822548 7922970 7946834 8060398
5911H060398J28715J14086J32051P2007N7858P6537M6116N4929M1675N7402J08449
$$ 8060398 8189113 8303199 8435250 8507257 8565115 8641652 8687768 8742697 8784372 8841774 8950223
5900H950223N0443J10877J64479J68563J36960J52241K39403K18849J98547J70753
$$ 8950223 9000666 9111543 9276022 9444585 9581545 9733786 9973189 10192038 10390585 10561338
5890A0561338K30514K27885K53921K94733K24040K09597J94651K23107K67754
$$ 10561338 10791852 11019737 11273658 11568391 11792431 12002028 12196679 12419786 12687540
5881A2687540J96386J55977J96005K41284K14459K98775K97582K19237K85183
$$ 12687540 12883926 13039903 13235908 13477192 13691651 13990426 14288008 14507245 14792428
5872A4792428K56028L03843L15350K97688K98415L67593M28431M33838L86780
$$ 14792428 15048456 15352299 15667649 15965337 16263752 16631345 17059776 17493614 17880394
5863A7880394M46445N19183N70599O41475N58227O41759O20161O73244P26267
$$ 17880394 18326839 18846022 19416621 20058096 20616323 21258082 21878243 22551487 23277754
5854B3277754P68369P69023P88445Q28399P90722Q75587P13819Q20733R02674
$$ 23277754 24046123 24815146 25603591 26431990 27222712 28098299 28812118 29632851 30535525
5845C0535525R17331R67322R60779R41777R25672J002373J152662J326414J507799
$$ 30535525 31452856 32420178 33380957 34322734 35248406 36250779 37403441 38729855 40237654
5836D0237654J618785J715473J896512K127486K350750K550471K814534L012524
$$ 40237654 41856439 43571912 45468424 47595910 49946660 52497131 55311665 58324189
5828E8324189L238649L576389L824116M239466M460195M634822M817522M973072
$$ 58324189 61562838 65139227 68963343 73202809 77663004 82297826 87115348 92088420
5820I2088420M998356N008877M994893M788418M506391L838743K803266J607045
$$ 92088420 97086776 102095653 107090546 111878964 116385355 120224098 123027364 124634409
5812A24634409N13919m41017j361512k197368l381591m619643n941459o789391
$$ 124634409 125148328 124707311 123345799 121148431 117766840 113147197 107205738 100416347
5804A00416347o922382o764712o323967n940179n675661n385318m980565m542215
$$ 100416347 93493965 86729253 80405286 74465107 68789446 63404128 58423563 53881348
5796E3881348l947772l483013k969286k551824k239959k045714j747369j550985
$$ 53881348 49933576 46450563 43481277 40929453 38689494 36643780 34896411 33345426
5788C3345426j375606j181708j093357j052133q89253q34894p38328p79622o52757
$$ 33345426 31969820 30788112 29694755 28642622 27753369 26918475 26180147 25400525 24747768
5779B4747768o19682o70387p23983o55575o67467o29229o71988p17763p41847
$$ 24747768 24128086 23457699 22733716 22078141 21410674 20781445 20109457 19391694 18649847
5770A8649847p95776q76482q30746o88161o38164o01438m90966m32213m01129
$$ 18649847 17854071 16977589 16146843 15458682 14820518 14219080 13728114 13295901 12894772
5761A2894772l23020k84830k33774k64153j76613j47774j04389n6569M452J0036
$$ 12894772 12571752 12286922 12053148 11788995 11612382 11464608 11360219 11303650 11308102 11318138
5751A1318138R6813J11053L03251K16652K45084K95866L08991L99789N44254O20409
$$ 11318138 11414951 11526004 11829255 12045907 12290991 12586857 12895848 13295637 13839891 14460300
5741A4460300P16925O77210L66393J65808O005q6180j46479l30522o30058r67917
$$ 14460300 15177225 15854435 16220828 16386636 16392641 16306461 16159982 15829460 15199402 14231485
5731A4231485j263174j170541p79013m90380l25138j74865o887K8415J92302K41722
$$ 14231485 12968311 11797770 11018757 10528377 10203239 10028374 10021487 10049902 10242204 10483926
5721A0483926K89172K47212K71272L62691M93608O27378P00606P37362O74589
$$ 10483926 10773098 11020310 11291582 11654273 12147881 12775259 13475865 14213227 14887816
5712A4887816M06999P0802m0873l4639k10262l81106o93450j181986j353492j137030
$$ 14887816 15294815 15365617 15324744 15290105 15079843 14698737 14005287 12823301 11469809 10332779
5702A0332779q18249n49451k59235j10889M850P6362J06877J13285J41990J97076
$$ 10332779 9514530 8965079 8705844 8594955 8599805 8676167 8783044 8896329 9038319 9235395
5692I235395K71908M05955M63226M76821M21875K37040M4391j11862q3463o0337
$$ 9235395 9507303 9913258 10376484 10853305 11275180 11512220 11556611 11444749 11361286 11300949
5682A1300949l64292o29982q26973r58221p20052m99073l00529j55485j17914
$$ 11300949 10936657 10306675 9479702 8521481 7801429 7302356 7001827 6846342 6728428
5673F728428n8923R5883J14660J87926J89433J68676K07455K56797M03026M62265
$$ 6728428 6669505 6765388 6880048 7067974 7257407 7426083 7633538 7890335 8293361 8755626
5663H755626N03507N14155L57610J12407k1852j5691j49452k94895m44289q15484
$$ 8755626 9259133 9773288 10130898 10243305 10221453 10205762 10056310 9761415 9317126 8501642
5653H501642j044760j110578q54251n82187m89986l71956k64729k12999k35220
$$ 8501642 7456882 6346304 5492053 4909866 4419880 4047924 3783195 3570196 3334976
5644C334976j32751q5190j40085j14339q2890p0122o8782l2009n5525p0410k0856
$$ 3334976 3202225 3117035 2976950 2862611 2779721 2709599 2640817 2608808 2553283 2482873 2462017
5633B462017m5540j00700m8407k6868q4050k3714l0979L040n3120l3049j02376
$$ 2462017 2416477 2315777 2267370 2240502 2156452 2132738 2101759 2104799 2051679 2018630 1916254
5622A916254l6044o3021k638K1329j4469l6482k6045j965j1018K9878m9023n9676
$$ 1916254 1880210 1817189 1814551 1835880 1821411 1784929 1758884 1756919 1745901 1775779 1726756 1667080
5610A667080m1892J960J9834P410L6050k1268J6633L6858J4433n8514j4291r0590
$$ 1667080 1625188 1627148 1646982 1654392 1690442 1669174 1685807 1722665 1737098 1678584 1664293 1573703
5598A573703l3697j0187n3910L0240L0722m8424l2677J5969J5761K1820p4082
$$ 1573703 1540006 1529819 1475909 1506149 1536871 1488447 1455770 1471739 1487500 1509320 1435238
5587A435238K7636O7588j2125J5914M7620k8773K9465P1886J4629j2808j8593
$$ 1435238 1462874 1530462 1518337 1534251 1581871 1553098 1582563 1654449 1669078 1656270 1637677
5576A637677m2231J4310j3633q6R272M1026O878p692j5193N0061m6104J7787K268
$$ 1637677 1595446 1609756 1596123 1596037 1605309 1646335 1653213 1645521 1630328 1680389 1634285 1652072 1654340
5563A654340k3623K2889j2964r8699k4917j9469j9188j7511K7509p080J132K3230
$$ 1654340 1630717 1653606 1640642 1541943 1517026 1497557 1478369 1460858 1488367 1481287 1482419 1505649
5551A505649J0958k5925n4292L6003k686m0674P999M096J904J7124J7781j3683
$$ 1505649 1516607 1490682 1436390 1472393 1469707 1429033 1437032 1441128 1443032 1460156 1477937 1464254
5539A464254N531L6037j3576n472j8297o682L7494M4670J6749K6295j1395L5290
$$ 1464254 1469785 1505822 1492246 1486774 1468477 1461795 1499289 1543959 1560708 1587003 1575608 1610898
5527A610898R0902K8653p552L4561k7144L2418N1905k0186K0123O3804N4221L7873
$$ 1610898 1701800 1730453 1722901 1757462 1730318 1762736 1814641 1794455 1814578 1878382 1932603 1970476
5515A970476Q1362N3589M2906Q0091O5926R0926K4511k8975O4358L3629K3977
$$ 1970476 2051838 2105427 2148333 2228424 2294350 2385276 2409787 2380812 2445170 2478799 2502776
5504B502776M5891M327j8206L9023P6249m703P5060K7982P1534P8672M7287M5284
$$ 2502776 2548667 2552994 2534788 2573811 2650060 2645357 2720417 2748399 2819933 2898605 2945892 2991176
5492B991176P1558L7500j0762n9867J1802Q3897k2715J0254n457j275K9915J3727
$$ 2991176 3062734 3100234 3089472 3029605 3041407 3125304 3102589 3112843 3107386 3106111 3136026 3149753
5480C149753O4510L1583p786Q0601M7111N0035K5290N973J9321L3435P2271M2953
$$ 3149753 3214263 3245846 3238060 3318661 3365772 3415807 3441097 3447070 3466391 3499826 3572097 3615050
5468C615050J5268L5275L9636o345L2009R1681M0316L7015J02384L3071L9416
$$ 3615050 3630318 3665593 3705229 3698884 3730893 3822574 3862890 3899905 4002289 4035360 4074776
5457D074776M5604M0621J2050M1103P2122L2090k2995M1588R5629O0502N8892
$$ 4074776 4120380 4161001 4173051 4214154 4286276 4318366 4295371 4336959 4432588 4493090 4551982
5446D551982M2425O6171K8326K6276R938R9115J14588L2410N4700P6685Q0610
$$ 4551982 4594407 4660578 4688904 4715180 4725118 4824233 4938821 4971231 5025931 5102616 5183226
5435E183226M1458J02811R3711R7857J26783J31424J21452J27356J32119J34662
$$ 5183226 5224684 5327495 5421206 5519063 5645846 5777270 5898722 6026078 6158197 6292859
5425F292859J28768J49121J72856J76740J60357J37211K47151J94844K16004K17134
$$ 6292859 6421627 6570748 6743604 6920344 7080701 7217912 7465063 7659907 7875911 8093045
5415H093045J59631K51378K86689K73169K84052K84163K42282K50992L31384L52930
$$ 8093045 8252676 8504054 8790743 9063912 9347964 9632127 9874409 10125401 10456785 10809715
5405A0809715K14131K69598K71031K60486J68373J02009J36398J44294J22391
$$ 10809715 11023846 11293444 11564475 11824961 11993334 12095343 12231741 12376035 12498426
5396A2498426O5798J53455J12886J24758K13477K77446K53378K28283L21756L21419
$$ 12498426 12564224 12717679 12830565 12955323 13168800 13446246 13699624 13927907 14249663 14571082
5386A4571082L08224L65331L05624L50099M11572L95683M77003N02352M50104
$$ 14571082 14879306 15244637 15550261 15900360 16311932 16707615 17184618 17686970 18137074
5377A8137074M23590M72082N15332N80294O72970P62029Q67732J058263J081358
$$ 18137074 18560664 19032746 19548078 20128372 20801342 21563371 22431103 23489366 24570724
5368B4570724J109480J263816J382063J592543J722365J987106K213953K345765
$$ 24570724 25680204 26944020 28326083 29918626 31640991 33628097 35842050 38187815
5360C8187815K490072K355767K202214K004224K064217K206027K199037K147231
$$ 38187815 40677887 43033654 45235868 47240092 49304309 51510336 53709373 55856604
5352E5856604K012364J911171J452196J094233P65271O60285N89736N07538L96088
$$ 55856604 57868968 59780139 61232335 62326568 63091839 63752124 64341860 64849398 65245486
5343F5245486L46257K87351L32239K32246K4575l19133n29656m68236o13644q06340
$$ 65245486 65591743 65879094 66211333 66443579 66468154 66149021 65619365 65151129 64537485 63731145
5333F3731145j000428j048864j258459j519506j757459j692605j714565j789529
$$ 63731145 62730717 61681853 60423394 58903888 57146429 55453824 53739259 51949730
5325E1949730j875550k112408k314537k396116k433794k415993k253963j938843
$$ 51949730 50074180 47961772 45647235 43251119 40817325 38401332 36147369 34208526
5317C4208526j771939j676436j695037j821549j719770j531506j311651j150816
$$ 34208526 32436587 30760151 29065114 27243565 25523795 23992289 22680638 21529822
5309B1529822j016127r26662q54679q31243r79348r38772r27048q52019o02196
$$ 21529822 20513695 19587033 18732354 17901111 16921763 15982991 15055943 14203924 13601728
5300A3601728n40301m35741k86627k80009l32932k65708k55012k20276k60263
$$ 13601728 13061427 12625686 12339059 12059050 11726118 11460410 11205398 10985122 10724859
5291A0724859k51729k36995k59817k78397k70243l08843k34858k51102k08815
$$ 10724859 10473130 10236135 9976318 9697921 9427678 9118835 8883977 8632875 8424060
5282H424060k19639j99585j95448k17098j42043j82311k41115k02273j69902j91211
$$ 8424060 8204421 8004836 7809388 7592290 7450247 7267936 7026821 6824548 6654646 6463435
5272F463435k06162j41644j53421j69803j47503j71918j43486j89254j65282k51075
$$ 6463435 6257273 6115629 5962208 5792405 5644902 5472984 5329498 5140244 4974962 4723887
5262D723887j65158j67323l9152n9004j09657l7349n6519j10659j12821j03740
$$ 4723887 4558729 4391406 4352254 4293250 4183593 4146244 4089725 3979066 3866245 3762505
5252C762505q2791j41258j50693j23727j33941j03011n4573p6799j25618r0408
$$ 3762505 3679714 3538456 3387763 3264036 3130095 3027084 2972511 2895712 2770094 2679686
5242B679686l83m0922q7682j5410p504n7896o3394l6750j1209k4698l3588m91
$$ 2679686 2679303 2638381 2550699 2535289 2527785 2469889 2406495 2369745 2358536 2333838 2300250 2299759
5230B299759n208j3748j4796l5668J2847l8817l0548O147j0214o0828L839k2013
$$ 2299759 2294551 2280803 2266007 2230339 2243186 2204369 2173821 2179968 2169754 2108926 2112765 2090752
5218B090752l6729n538n1806k5215n1850k5196L837J2702J2218K5189p443l478
$$ 2090752 2054023 2048485 1996679 1971464 1919614 1894418 1898255 1910957 1923175 1948364 1940921 1937443
5206A937443J8198K8889k135M2882L0965j4683j6866J0379J2313Q1730L7700L8015
$$ 1937443 1955641 1984530 1982395 2025277 2056242 2041559 2024693 2035072 2047385 2129115 2166815 2204830
5194B204830L9204J2052Q2620O6404P9379Q6390N5554J410L8518J14246J24724
$$ 2204830 2244034 2256086 2338706 2405110 2484489 2570879 2626433 2627843 2666361 2780607 2905331
5183B905331P3535Q5230J00636J19929J61352M8645J24057J29389J42434J57357
$$ 2905331 2978866 3064096 3164732 3284661 3446013 3494658 3618715 3748104 3890538 4047895
5173D047895J84209J81610J41015R9364O0958Q0148J08783O1201J8135Q2252P2593
$$ 4047895 4232104 4413714 4554729 4654093 4715051 4795199 4903982 4965183 4983318 5065570 5138163
5162E138163P9397O8159P6764J31248J35808J73138K31630K92905L40155L44514
$$ 5138163 5217560 5285719 5362483 5493731 5629539 5802677 6034307 6327212 6667367 7011881
5152G011881L76037K58953K73419K89650K52151J58112Q7353K20735K53973M40637
$$ 7011881 7387918 7646871 7920290 8209940 8462091 8620203 8707556 8928291 9182264 9622901
5142I622901M76827N52863M26679L33293L00643K75218K72938K08938O3265n9131
$$ 9622901 10099728 10652591 11079270 11412563 11713206 11988424 12261362 12470300 12533565 12474434
5132A2474434L2588J68703L75358M34611L37683K18722J42804K07274L08772L36119
$$ 12474434 12507022 12675725 13051083 13485694 13823377 14042099 14184903 14392177 14700949 15037068
5122A5037068K46249n759q6715j65284o8197j01802j8221n5429j46035o7038j5218
$$ 15037068 15283317 15277558 15190843 15025559 14957362 14855560 14837339 14781910 14635875 14568837 14553619
5111A4553619J22686J55150Q5815m080j63355k76300k18301j53422n1276j87964
$$ 14553619 14676305 14831455 14917270 14913190 14749835 14473535 14255234 14101812 14050536 13862572
5101A3862572k65952l53685k68006q3275q2589Q9046o1695k44259l89826m72733
$$ 13862572 13596620 13242935 12974929 12891654 12809065 12898111 12836416 12592157 12202331 11729598
5091A1729598l35003l74133m35709m48100m94450k67724j78214l9407r017m677
$$ 11729598 11394595 11020462 10584753 10136653 9642203 9374479 9196265 9156858 9147841 9143164
5081I143164l9821m0645l6242j30615l45707m72661n40985m57307k40709k06151
$$ 9143164 9103343 9062698 9026456 8895841 8550134 8077473 7536488 7079181 6838472 6632321
5071F632321j91114j87411j61694k35078k05093o7688j3728M788O7250J6135m7957
$$ 6632321 6441207 6253796 6092102 5857024 5651931 5584243 5570515 5575303 5642553 5658688 5610731
5060E610731n5270J7859M9491Q4215k815j4793l8469k379p5627j64752j84083
$$ 5610731 5555461 5573320 5622811 5707026 5704211 5689418 5650949 5648570 5572943 5408191 5224108
5049E224108j25663n9181P197K0338M6441k604N633K2336O1835J03901k9710k5292
$$ 5224108 5098445 5039264 5046461 5066799 5113240 5110636 5116269 5138605 5200440 5304341 5274631 5249339
5037E249339O321k4137k8032M0057K9488r0453o9249o5829p1654k7417m3750p7666
$$ 5249339 5255660 5231523 5203491 5243548 5273036 5182583 5113334 5047505 4975851 4948434 4904684 4827018
5025D827018j35085q7759j20217o8041n3842m6389j07962q4417K6611J5287N4918
$$ 4827018 4691933 4604174 4483957 4415916 4362074 4315685 4207723 4123306 4149917 4165204 4220122
5014D220122k7857o3066k7868q3840q3663j40489j70763k00113q4775p9202j31737
$$ 4220122 4192265 4129199 4101331 4017491 3933828 3793339 3622576 3422463 3337688 3258486 3126749
5003C126749n7492r0830n9439j38120q2958j7766n6103o7694o3802n4423p1560
$$ 3126749 3069257 2978427 2918988 2780868 2697910 2680144 2624041 2556347 2492545 2438122 2366562
4992B366562K5303L6691m8443o8526q4818J2165l9738j00647r8385r2122j25834
$$ 2366562 2391865 2428556 2380113 2311587 2226769 2238934 2199196 2098549 2000164 1908042 1782208
4981A782208q7057q5313q4712n0381q3839j16274q6557j9307l378J8974Q915m6933
$$ 1782208 1695151 1609838 1525126 1474745 1390906 1274632 1188075 1168768 1165390 1184364 1193279 1146346
4969A146346q6638J1228L2076R902l7208j9149N8291n5243m582J0634k124j1278
$$ 1146346 1059708 1070936 1103012 1112914 1075706 1056557 1114848 1059605 1055023 1065657 1063533 1052255
4957A052255p175J5578M3983Q334l1153J9981m2692Q477J328L659J3645M654j5340
$$ 1052255 1045080 1060658 1104641 1112975 1081822 1101803 1059111 1067588 1068916 1072575 1086220 1090874 1075534
4944A075534L9278m636k2801l8430m9736L122K2190j3960L0964l8360l6080J1432
$$ 1075534 1114812 1110176 1087375 1048945 999209 1002331 1024521 1010561 1041525 1003165 967085 978517
4932I78517J1818K5678L094k6415m2031l9181P576M535l3180J58K3978o2302j1516
$$ 978517 990335 1016013 1019107 992692 950661 911480 919056 923591 890411 890569 914547 852245 840729
4919H40729k4674L3939j179l7457M1575K3260L6527n4407k7108M3860L517j5989
$$ 840729 816055 849994 848815 811358 852933 876193 912720 858313 831205 875065 878582 862593
4907H62593o830M3785l7704p191J9496K4930J6525l6514k0356l4661R116j7446
$$ 862593 855763 899548 861844 854653 874149 899079 915604 879090 858734 824073 833189 815743
4895H15743L47L2729L9812L3479P121j7933K2643L6723j7959K4360L1479q1215
$$ 815743 816090 848819 888631 922110 929231 911298 933941 970664 952705 977065 1008544 927329
4883I27329l5686k768N3951M449l151J8995Q5102p252m114J9532M3212l0560k1913
$$ 927329 891643 888875 942826 947275 944124 963119 1048221 1040969 1036855 1056387 1099599 1069039 1047126
4870A047126J1378L1828J2410L2462l0615N411o351K2340Q0990l1328N5088L454
$$ 1047126 1058504 1090332 1102742 1135204 1104589 1110000 1103649 1125989 1206979 1175651 1230739 1234193
4858A234193n507l3490L5789L2827M1081O413m3550N7650K5718J3164l2492N1296
$$ 1234193 1228686 1195196 1230985 1263812 1304893 1311306 1267756 1325406 1351124 1364288 1331796 1383092
4846A383092L4792J7967K7910j1433L3546k7020K1179O856J4137P5570J3224M3546
$$ 1383092 1417884 1435851 1463761 1452328 1485874 1458854 1480033 1486889 1501026 1576596 1589820 1633366
4834A633366N8050L400L336L2214q221n9232N4960O0972L4288J3190Q0205K5917
$$ 1633366 1691416 1694816 1698152 1730366 1722145 1662913 1717873 1778845 1813133 1826323 1906528 1932445
4822A932445M1472N6280J328L6525J7706O5817Q4908J00073K9956J2480M6428
$$ 1932445 1973917 2030197 2031525 2068050 2085756 2151573 2236481 2336554 2366510 2378990 2425418
4811B425418N1531J20086N3343K9204J2773M2756J15392P6199N3765Q8406R6974
$$ 2425418 2476949 2597035 2650378 2679582 2692355 2735111 2850503 2926702 2980467 3068873 3165847
4800C165847L8166P9479J39796R9082J10637R6589Q4740Q4790O9752R1266P1121
$$ 3165847 3204013 3283492 3423288 3522370 3633007 3729596 3814336 3899126 3968878 4060144 4131265
4789D131265O6407J00276J18694N9587M2359J43443J23328R8386J57781R4336
$$ 4131265 4197672 4297948 4416642 4476229 4518588 4662031 4785359 4883745 5041526 5135862
4779E135862J32660J54980J97556J37194M1909J61928J85798J66171J54542K11818
$$ 5135862 5268522 5423502 5621058 5758252 5800161 5962089 6147887 6314058 6468600 6680418
4769F680418J88755J27441J25940J41996J77479K96679K40644K62811L24219L17171
$$ 6680418 6869173 6996614 7122554 7264550 7442029 7738708 7979352 8242163 8566382 8883553
4759H883553L16111L26815L15470L93658M71656M88037M97216N23298O06832N70892
$$ 8883553 9199664 9526479 9841949 10235607 10707263 11195300 11692516 12215814 12822646 13393538
4749A3393538O22175P19154Q14264R02198R33612J150084J407172J579115J883374
$$ 13393538 14015713 14734867 15549131 16451329 17384941 18535025 19942197 21521312 23404686
4740B3404686K198295K285713K410759K377938K340634K651698L150759L814647
$$ 23404686 25602981 27888694 30299453 32677391 35018025 37669723 40820482 44635129
4732D4635129M266892M536330M292351L335521J910837Q03848L51856J74355m10027
$$ 44635129 48902021 53438351 57730702 61066223 62977060 63780908 64132764 64307119 63897092
4723F3897092j622708l401960n541258o487290n902751m391947k711542j508367
$$ 63897092 62274384 58872424 53331166 46843876 40941125 36549178 33837636 32329269
4715C2329269o13970j83987K04576N54215Q79082J000626R75909Q39413O24495
$$ 32329269 31715299 31531312 31735888 32290103 33169185 34169811 35145720 35985133 36609628
4706C6609628J42327l87877q87418j248732j636660j883575j901750j966488j400221
$$ 36609628 36751955 36364078 35476660 34227928 32591268 30707693 28805943 26839455 25439234
4697B5439234p36085k05338O6095K76549M81101P85690J027884J264885J391414
$$ 25439234 24703149 24497811 24563906 24840455 25321556 26107246 27135130 28400015 29791429
4688B9791429J427675J261241J232521J337387J403216J244030J000285P57408
$$ 29791429 31219104 32480345 33712866 35050253 36453469 37697499 38697784 39455192
4680C9455192N94638J115401K024786K839832L093947K811491K103531J210977
$$ 39455192 40049830 41165231 43190017 46029849 49123796 51935287 54038818 55249795
4672E5249795K88864o97343j854555k869901m448540n509931n776683n624688
$$ 55249795 55538659 54841316 52986761 50116860 45668320 40158389 34381706 28757018
4664B8757018m726906l461312k471955j866724j434859j162894r84889q50230
$$ 28757018 24030112 20568800 18096845 16230121 14795262 13632368 12647479 11797249
4656A1797249o99935n98854n25993m78177l76793m48464l44205k97506k67389
$$ 11797249 11097314 10498460 9972467 9494290 9117497 8669033 8324828 8027322 7759933
4647G759933l09761k30710k16082k33852j88620j90630j94582j94975j58538j55870
$$ 7759933 7450172 7219462 7003380 6769528 6580908 6390278 6195696 6000721 5842183 5686313
4637E686313j73001k12578j30239q4281j42406j11034r5328o7992q8736j12125
$$ 5686313 5513312 5300734 5170495 5086214 4943808 4832774 4737446 4669454 4580718 4468593
4627D468593j49592n2232n1660o6680J1366p0672j9770j4298m9706r586J5835
$$ 4468593 4319001 4266769 4215109 4148429 4159795 4089123 4069353 4055055 4005349 3995763 4011598
4616D011598l4968k2195q136l827l6535J6017P456J209N1277M3009k590N7027
$$ 4011598 3976630 3954435 3946299 3942472 3905937 3921954 3929410 3930619 3981896 4024905 4022315 4079342
4604D079342L7785O5025P3791N2569J11767R8919N6298M9454O9430Q1238J68945
$$ 4079342 4117127 4182152 4255943 4308512 4420279 4519198 4575496 4624950 4694380 4775618 4944563
4593D944563Q3946L9523J06685J54567J26052R1874R9498J42038J54516J10434
$$ 4944563 5028509 5068032 5174717 5329284 5455336 5547210 5646708 5788746 5943262 6053696
4583F053696K43613J78932K24385K95464L52199M03329M61269N46466O45253O46450
$$ 6053696 6297309 6476241 6700626 6996090 7348289 7751618 8212887 8759353 9404606 10051056
4573A0051056N70107O76175P93523P88380R38625J157081J215439J073987P80145
$$ 10051056 10621163 11297338 12090861 12879241 13817866 14974947 16190386 17264373 18044518
4564A8044518N81802M37220L01708n5091l94784o06944n65160r6703L89871O77273
$$ 18044518 18626320 19063540 19365248 19310157 18915373 18308429 17743269 17646566 18036437 18713710
4554A8713710P11668N02468L03234K27153R2063j48515m07954n38956m05962m8147
$$ 18713710 19425378 19927846 20231080 20458233 20550296 20401781 19993827 19454871 19048909 19000762
4544A9000762J85353K15346J96781J19850M0411k31051n16904p55455p91452n86316
$$ 19000762 19186115 19401461 19598242 19718092 19758503 19527452 19010548 18255093 17463641 16877325
4534A6877325j59457M3740J31515J5563j75694k69644m50674p30198j055586j256176
$$ 16877325 16717868 16761608 16893123 16908686 16732992 16463348 16012674 15282476 14226890 12970714
4524A2970714j236305j017653p78922m65567k79381k42850k34294j62935j91797
$$ 12970714 11734409 10716756 9937834 9472267 9192886 8950036 8715742 8552807 8361010
4515H361010k83829k83341l18507k97964j98538j7651o7666p6488j08489j42996
$$ 8361010 8077181 7793840 7475333 7177369 6978831 6961180 6893514 6817026 6708537 6565541
4505F565541j98861k76895l02031l09981l63666l74456k15884j98427k12951j05689
$$ 6565541 6366680 6089785 5787754 5477773 5114107 4739651 4523767 4325340 4112389 4006700
4495D006700j12165j52081j55768n0083q4247j69041q2166j10547j14935j16008
$$ 4006700 3894535 3742454 3586686 3536603 3452356 3283315 3201149 3090602 2975667 2859659
4485B859659j26527j12863n8238n4024n0240p9957p3656k7384Q290k84K0911l1670
$$ 2859659 2733132 2620269 2562031 2508007 2457767 2377810 2304154 2276770 2285060 2284776 2305687 2274017
4473B274017l8397j7792n4357o814l5628n4776k4206l5186l2135m2730n1668k0623
$$ 2274017 2235620 2217828 2163471 2156657 2121029 2066253 2042047 2006861 1974726 1931996 1880328 1859705
4461A859705L5652l9523J1697o8178k7213K4953J1350O9462J9556o0999l336O0110
$$ 1859705 1895357 1855834 1867531 1799353 1772140 1797093 1808443 1877905 1897461 1836462 1833126 1893236
4449A893236J0156l730k300O6504P8146M0599P2603J01058J18811J39976J50519
$$ 1893236 1903392 1899662 1897362 1963866 2042012 2082611 2155214 2256272 2375083 2515059 2665578
4438B665578J18444N3452Q4084M7483o907o2418n4896q5071j03674j12670j15328
$$ 2665578 2784022 2837474 2921558 2969041 2962134 2899716 2844820 2759749 2656075 2543405 2428077
4427B428077j20005j43977j04244k4204J5194k5380n2300p1776o1224O9752p90
$$ 2428077 2308072 2164095 2059851 2035647 2050841 2025461 1973161 1901385 1840161 1909913 1909123
4416A909123o7296K6095k0938n7221k8344M4916m5413k8114M296M595o8437n3845
$$ 1909123 1841827 1867922 1846984 1789763 1761419 1806335 1760922 1732808 1737104 1741699 1673262 1619417
4404A619417j2122l4274m764n082m6197j8717l1945J1048r60l651J7186l5491
$$ 1619417 1607295 1573021 1568257 1563175 1516978 1498261 1466316 1477364 1476404 1472753 1489939 1454448
4392A454448J4766M6835M384M7246O5583O120m899O0137K7596l9959J4155M2757
$$ 1454448 1469214 1516049 1520433 1567679 1633262 1639382 1634483 1694620 1722216 1682257 1696412 1739169
4380A739169M2663k1177P8148Q4991l3399N3041P0602P5670M4408M0121N5808
$$ 1739169 1781832 1760655 1838803 1923794 1890395 1943436 2014038 2089708 2134116 2174237 2230045
4369B230045K5991P2723J1241K1948l691J0586L0511L9977J4859P2330p708O9774
$$ 2230045 2256036 2328759 2340000 2361948 2358257 2368843 2399354 2439331 2454190 2526520 2518812 2588586
4357B588586j9201J598M5260j871L1735J0786j6549m4830K5149J2469k2693k0400
$$ 2588586 2569385 2570983 2616243 2614372 2646107 2656893 2640344 2595514 2620663 2633132 2610439 2590039
4345B590039P5816K0541L0693k888Q941N603J3115O280N5639N2195k1928k05N194
$$ 2590039 2665855 2686396 2717089 2714201 2723142 2728745 2741860 2748140 2803779 2855974 2834046 2833841 2839035
4332B839035j0549J0981J6134m1766l026M2651k9937J8636N9373J309J0851m6683
$$ 2839035 2828486 2839467 2855601 2813835 2810809 2853460 2823523 2842159 2901532 2902841 2913692 2867009
4320B867009N2654J01806P2016Q2769R6238Q0929J47964O1632P0657J25014J24565
$$ 2867009 2919663 3021469 3093485 3176254 3272492 3353421 3501385 3563017 3633674 3758688 3883253
4309C883253J91688J91668J92671J13588J08472J21062J2500K5969Q169q2656
$$ 3883253 4074941 4266609 4459280 4572868 4681340 4802402 4814902 4840871 4849040 4766384
4299D766384j28883j18166o2256n3486p5097p7307k9704j2239J4278O4940K6553
$$ 4766384 4637501 4519335 4457079 4403593 4328496 4251189 4221485 4209246 4223524 4288464 4315017
4288D315017M5176O1391K8350K9154N7666L176m9697P4710L635M570Q6231P8468
$$ 4315017 4360193 4421584 4449934 4479088 4536754 4539930 4490233 4564943 4568578 4573148 4659379 4737847
4276D737847O5558L2228K5315P8339P1163M6138R9047J09213R7083P0267R2772
$$ 4737847 4803405 4835633 4860948 4939287 5010450 5056588 5155635 5264848 5361931 5432198 5524970
4265E524970R3145Q5144J00236J14183O8571Q7920L8925N8429K6510j10318o4247
$$ 5524970 5618115 5703259 5803495 5917678 5986249 6074169 6113094 6171523 6198033 6087715 6023468
4254F023468r3831l5434K6773K7237J5289Q3588R0023Q5156O3109J07824Q9363
$$ 6023468 5929637 5894203 5920976 5948213 5963502 6047090 6137113 6222269 6285378 6393202 6482565
4243F482565J83543J44813J61347K02811K40834J62337J52141K61678J98133K47132
$$ 6482565 6666108 6810921 6972268 7175079 7415913 7578250 7730391 7992069 8190202 8437334
4233H437334J98367J08525J09321J73390J76223J78578K21663K67667K49621K70418
$$ 8437334 8635701 8744226 8853547 9026937 9203160 9381738 9603401 9871068 10120689 10391107
4223A0391107K70456L10072L59281L61998L98480L69081M06407L19154L20893
$$ 10391107 10661563 10971635 11330916 11692914 12091394 12460475 12866882 13186036 13506929
4214A3506929L96307L22782L21989K76310K71604K57637L06878K82043K85046
$$ 13506929 13903236 14226018 14548007 14824317 15095921 15353558 15660436 15942479 16227525
4205A6227525L22228K63580L07308L54290L21228L64095K82512M12483M44709
$$ 16227525 16549753 16813333 17120641 17474931 17796159 18160254 18442766 18855249 19299958
4196A9299958N30539N73056N44141N85648O44046O61458O59283O22922O95412
$$ 19299958 19830497 20403553 20947694 21533342 22177388 22838846 23498129 24121051 24816463
4187B4816463P63051P10941Q54274Q32536Q63077J043960J155896J182768J252301
$$ 24816463 25579514 26290455 27144729 27977265 28840342 29884302 31040198 32222966 33475267
4178C3475267J422670J514451J617942J805383J893884J968595K206843K338769
$$ 33475267 34897937 36412388 38030330 39835713 41729597 43698192 45905035 48243804
4170D8243804K486116K743736L023541L367998L743985M227583M811904N535577
$$ 48243804 50729920 53473656 56497197 59865195 63609180 67836763 72648667 78184244
4162G8184244O413644P588719Q782749J0251747J1786977J3210380J4674297J6479741
$$ 78184244 84597888 92186607 100969356 111221103 123008080 136218460 150892757 167372498
4154A67372498J8821567K1282961K2905146K1765114J8227985J4505975J1423533
$$ 167372498 186194065 207477026 230382172 252147286 270375271 284881246 296304779
4147B96304779P880113j4550r525688j7933012k2439140k5421531k9197431l0004792
$$ 296304779 304184892 304170342 294644654 276711642 254272502 228850971 199653540 169648748
4139A69648748k7250037k1115317j5362440j1448396r147584p621209o629898
$$ 169648748 142398711 121283394 105920954 94472558 85324974 77703765 71073867
4132G1073867n959617n410686m909502m307757l709557l207196k810772k504472
$$ 71073867 65114250 59703564 54794062 50486305 46776748 43569552 40758780 38254308
4124C8254308k194873j968753j796038j616051j427000j238321j205632j159722
$$ 38254308 36059435 34090682 32294644 30678593 29251593 28013272 26807640 25647918
4116B5647918j128695j133596j098482j029453r71122r44706r46970q75869q34557
$$ 25647918 24519223 23385627 22287145 21257692 20286570 19341864 18394894 17519025 16684468
4107A6684468p50423p09430p07362o87064n82362n21569n14902m31658m39766
$$ 16684468 15934045 15224615 14517253 13830189 13247827 12726258 12211356 11779698 11339932
4098A1339932l20142l12640l14914k45485l03526k53651k20657k31313k50840
$$ 11339932 11019790 10707150 10392236 10146751 9843225 9589574 9368917 9137604 8886764
4089H886764k36314k64767j94003j89477k12010j11034j20421q4496j28194m0406
$$ 8886764 8650450 8385683 8191680 8002203 7790193 7679159 7558738 7474242 7346048 7305642
4079G305642m1163k1754J7169K7891k3346K6797j5345j0298L4816O8211K8305
$$ 7305642 7264479 7242725 7259894 7287785 7264439 7291236 7275891 7265593 7300409 7368620 7396925
4068G396925K413L7632L5676N2591J11368J02863J56728J64980J95483K33818
$$ 7396925 7399338 7436970 7472646 7525237 7636605 7739468 7896196 8061176 8256659 8490477
4058H490477K02172J83278K59802K55118J24840J20744P6722P6609O3858J79643
$$ 8490477 8692649 8875927 9135729 9390847 9515687 9636431 9713153 9789762 9853620 10033263
4048A0033263K40020K37231N8642j37769k08179k55397m03151o35730p74454r26673
$$ 10033263 10273283 10510514 10569156 10431387 10223208 9967811 9564660 8928930 8154476 7227803
4038G227803q27930o15413m32430l79700k84349j87648k17003j49283j34293j25445
$$ 7227803 6399873 5784460 5352030 4972330 4687981 4500333 4283330 4134047 3999754 3874309
4028C874309q6414j05760j75717q3316j06047j31755o3936j4797l3926L4533j7212
$$ 3874309 3787895 3682135 3506418 3423102 3317055 3185300 3121364 3106567 3072641 3107174 3089962
4017C089962k0418J8679J5858k3812N3106J9061P656J2064M2455r1456k7761o5692
$$ 3089962 3069544 3088223 3104081 3080269 3133375 3152436 3160092 3172156 3214611 3123155 3095394 3029702
4005C029702q1927j37530j94407j40752j33181p9507j17422J4764k2026l1072
$$ 3029702 2947775 2810245 2615838 2475086 2341905 2262398 2144976 2159740 2137714 2106642
3995B106642m5151q6716r3313n7014L8650n611l1389J1058q476j5516K2905N1100
$$ 2106642 2061491 1974775 1881462 1824448 1863098 1857487 1826098 1837156 1828680 1813164 1836069 1887169
3983A887169l8240k9998M0870j0691k8649L2216p021j9664K9306k4614m0931j1383
$$ 1887169 1848929 1818931 1859801 1849110 1820461 1852677 1845656 1825992 1855298 1830684 1789753 1778370
3971A778370l8359M7648J9677l823m907j5016j7402n315k4441M2892K7268m3427
$$ 1778370 1740011 1787659 1807336 1803513 1798606 1783590 1766188 1760873 1736432 1779324 1806592 1763165
3959A763165M9753K7904Q1935N2952P8504N5677L3089Q9907L8946M4074K7898
$$ 1763165 1812918 1840822 1922757 1975709 2054213 2109890 2142979 2232886 2271832 2315906 2343804
3948B343804J3233M480k0596j2059l2154q6000j49991j40183j28434j36081j34781
$$ 2343804 2357037 2361517 2340921 2328862 2296708 2210708 2060717 1920534 1792100 1656019 1521238
3937A521238l7711n732o0668n9029q6113j9862Q481O3679n121j3645J7975n4840
$$ 1521238 1483527 1477795 1417127 1358098 1271985 1252123 1260604 1324283 1319162 1305517 1323492 1268652
3925A268652L2424J18916K6217J3318N2975L8042R9773j8826M6360J31961O9396
$$ 1268652 1301076 1419992 1446209 1459527 1512502 1550544 1650317 1631491 1677851 1809812 1879208
3914A879208M1116N1245J08764L2715N7999j7235M7174P583m020P976k4464J6445
$$ 1879208 1920324 1971569 2080333 2113048 2171047 2153812 2200986 2208569 2204549 2212525 2188061 2204506
3902B204506n3128l8737o9989j42643r3582o5906r5489j05236l1162q8290n0039
$$ 2204506 2151378 2112641 2042652 1900009 1806427 1740521 1645032 1539796 1508634 1420344 1370305
3891A370305q3358o4981M546j5477m6753p2984R162l594j4313l6682n1157k2996
$$ 1370305 1286947 1221966 1226512 1211035 1164282 1091298 1100460 1096866 1082553 1045871 994714 971718
3879I71718P562J5768J5690k2086o8104K3228K4458O4277L7356J0593J9685J02378
$$ 971718 979280 995048 1010738 988652 920548 943776 968234 1032511 1069867 1080460 1100145 1202523
3867A202523P2885Q8827R6826R6402J29231J17569J05325J07147J08341J00093
$$ 1202523 1275408 1364235 1461061 1557463 1686694 1804263 1909588 2016735 2125076 2225169
3857B225169R4536R0735J9599r5321k9895j18697j42950j18462j88017j29612
$$ 2225169 2319705 2410440 2430039 2334718 2304823 2186126 2043176 1924714 1736697 1607085
3847A607085p3423r6254o7520j5225m7621K3482L1731o7681O7007L7289L3608
$$ 1607085 1533662 1437408 1369888 1354663 1307042 1330524 1362255 1294574 1361581 1398870 1432478
3836A432478l7965o043J15017J14808Q8626L386m1025l0556N739N5661k8116m5224
$$ 1432478 1394513 1388470 1503487 1618295 1706921 1710307 1669282 1638726 1644465 1700126 1672010 1626786
3824A626786j38256j30627j52137j33101p0662q766l6607k0338k9536k0141L7390
$$ 1626786 1488530 1357903 1205766 1072665 1002003 993237 956630 936292 906756 886615 924005
3813I24005J321o1012L3985L346p6445K0910L4977l170J5441j5807m5799M9188
$$ 924005 925326 864314 898299 901645 825200 846110 881087 877917 893358 877551 831752 880940
3801H80940M7142o647M059k969L9408M7075P0963N4064J0835L7292M3577J27159
$$ 880940 928082 921435 925494 922525 961933 1009008 1079971 1134035 1144870 1182162 1225739 1352898
3789A352898J09310O5987J48432Q9608R6305J60728R2820J22947Q1301p4293j19684
$$ 1352898 1462208 1528195 1676627 1766235 1862540 2023268 2116088 2239035 2320336 2246043 2126359
3778B126359j42235j67516j64532j61639j13551j46451j18589m0637n8781n2527
$$ 2126359 1984124 1816608 1652076 1490437 1376886 1230435 1111846 1071209 1012428 959901
3768I59901o5697l2578J0290n7303q3890n2207j7396l5811m553l4502M9810k9797
$$ 959901 894204 861626 871916 814613 730723 678516 661120 625309 620756 586254 636064 606267
3756F06267k6918J2248o3466j6160L5866m8160k4907j3221l3243P4255n0605k2826
$$ 606267 579349 591597 528131 511971 547837 499677 474770 461549 428306 502561 451956 429130
3744D29130m1105l1673M0885K9792j2781p5732J6187L0429q349M0609p561k8966
$$ 429130 388025 356352 397237 427029 414248 338516 354703 385132 376783 417392 409831 380865
3732C80865j5692p524l9604n0997L2235k0177J2561l7577J0850k4769j4220k4403
$$ 380865 365173 357649 318045 267048 299283 279106 291667 254090 264940 240171 225951 201548
3720B01548k3982J6701j2245N283k8106J4991K8774R32J2153J6256k0794m5590
$$ 201548 177566 194267 182022 187305 159199 174190 202964 203896 216049 232305 211511 165921
3708A65921o523k3443N8272j5372O700p839N278K2433m8787l4962J1288j9378
$$ 165921 159398 135955 194227 178855 185555 177716 182994 205427 156640 121678 132966 113588
3696A13588P527k4983j0151Q2854o148n0423k9808K6455r449N363l4769L8408
$$ 113588 121115 96132 85981 168835 162687 112264 82456 108911 99462 104825 70056 108464
3684A08464P1950Q242K5925j9182j6129r161l1071k699j3197J6807N235K3656
$$ 108464 180414 188656 214581 195399 179270 170109 139038 136339 123142 139949 145184 168840
3672A68840J5003l8304O0783N803m6051j5920L424L5883m8992j0485j0438N9911
$$ 168840 183843 145539 206322 212125 166074 150154 153578 189461 140469 129984 119546 179457
3660A79457K7920n1857j9556L1005J667k0563k2465j5701j3634k32J1637O1672
$$ 179457 207377 155520 135964 166969 168636 148073 125608 109907 96273 96041 107678 169350
3648A69350j7568j9834J1863k6392K6503K5864j5363P114l1611n8024O761r703
$$ 169350 151782 131948 143811 117419 143922 169786 154423 161537 129926 71902 78663 68960
3636F8960Q638j5057K4792K7119k6492k1719L1491P4437K3597l4153N2766m0364
$$ 68960 77598 62541 87333 114452 87960 66241 97732 172169 195766 161613 214379 174015
3624A74015Q76M249l1536M9153K7432p67R037k638o3211j786Q336j2976m8318
$$ 174015 174891 179140 147604 196757 224189 223422 232459 229821 166610 164824 173160 160184 111866
3611A11866l0366K1114P7518n0601n4042J7743K8336l5706L9818l4559J5351O9403
$$ 111866 81500 102614 180132 129531 75489 93232 121568 85862 125680 91121 106472 175875
3599A75875n7833r916N30N4006k8601n9761M1198J2087m7881K7219L8691l4397
$$ 175875 118042 108126 108656 162662 134061 74300 115498 127585 79704 106923 145614 111217
3587A11217j9272n535J4582k1923k1821K4595K3634o203K9122k9048L700K9M2426
$$ 111217 91945 86410 100992 79069 57248 81843 105477 99274 128396 99348 103048 103077 145503
3574A45503L5928l1565j9300J5239K1279k4895j1677n4062L36L6204K6310n87
$$ 145503 181431 149866 130566 145805 167084 142189 130512 76450 76786 112990 139300 138713
3562A38713m576L1902M0671M158L628p86j1718K2011J0156k2008o5798l2369N6866
$$ 138713 134137 166039 206710 210868 214496 213710 201992 224003 234159 212151 146353 113984 170850
3549A70850o5274p538K2322l805J453M6558m342j7188J863n951M340K3988L635
$$ 170850 105576 98038 120360 116555 118008 164566 160224 143036 144899 138948 143288 167276 170911
3536A70911l2934q412L8092n5474j6408K9239J2023j4182M6397m0404N142j0446
$$ 170911 137977 129565 167657 112183 95775 125014 137037 122855 169252 128848 133990 123544
3524A23544n4698M1738j2714n908J8148M8883J1695l7605n9417N6208l081K440
$$ 123544 68846 110584 97870 91962 110110 158993 170688 133083 73666 129874 126793 129233
3512A29233M0248K357J1285M973j4150n3668j9802L3342L3553l7215k1159M5102
$$ 129233 169481 171838 183123 188096 173946 120278 100476 133818 167371 130156 108997 154099
3500A54099L0492K5559p5393P472N446k5922j5420M403N6752M036m9067N7410
$$ 154099 184591 210150 134757 142229 147675 121753 106333 110736 167488 171524 122457 179867
3488A79867J5822j7313j9041m05N9497l3318j2380L594P32Q035L7892K7879m7000
$$ 179867 195689 178376 159335 158930 218427 185109 172729 176323 177055 185090 222982 250861 203861
3475B03861k9379J7873Q759P2094l5676m9139j3468M5772M7625n4402m3491J5753
$$ 203861 174482 192355 201114 273208 237532 188393 174925 220697 268322 213920 170429 186182
3463A86182j4412j5529K1840K4640O4085k096p1658r431J4713j667K342o610J7599
$$ 186182 171770 156241 178081 202721 266806 264710 193052 183621 198334 196667 199009 192399 209998
3450B09998M205r213N6123L83k6116l2478M5202N3207l0061k3961m133K6277K9041
$$ 209998 214203 204990 261113 261496 235380 202902 248104 301311 271250 247289 243156 269433 298474
3437B98474n395R687M7213M4712L4351M931M5172N3162m0389K1204O0262M1164
$$ 298474 293079 302766 349979 394691 429042 433973 479145 532307 491918 513122 573384 614548
3425F14548P2439N3628j6874K5608L846q2165l5223m3531l8408j9875J3138k6652
$$ 614548 686987 740615 723741 749349 753195 671030 635807 592276 553868 533993 547131 520479
3413E20479K4155P156j8150l2849K3549M1296P1659M6087L2577P0424L0893m9545
$$ 520479 544634 551790 533640 500791 524340 565636 637295 683382 715959 786383 817276 767731
3401G67731M3967L6515k2434K4996N5118K7998O7179M1072R9987K9687M3409N527
$$ 767731 811698 848213 825779 850775 905893 933891 1001070 1042142 1142129 1171816 1215225 1220752
3389A220752l4587o7819j09113j00798j18812m6553m5688l8789r9877l3816P8413
$$ 1220752 1186165 1118346 1009233 908435 789623 743070 697382 658593 558716 524900 603313
3378F03313N47j5530j7450l200l2720p91O9658M5056j5988m8L7689j8219J9823
$$ 603313 603860 588330 570880 567680 534960 534169 603827 648883 632895 632847 670536 652317 672140
3365F72140L1456K9137N0432J7913j687M0126K2609J0293Q611j3508q8961m2237
$$ 672140 703596 732733 783165 801078 799391 839517 862126 872419 881030 867522 778561 736324
3353G36324q0933k5839k8074J6955K6319j0234n1485R348J1600O822q113l7946
$$ 736324 655391 629552 601478 618433 644752 634518 583033 592381 603981 610803 602690 564744
3341E64744K604J848M7332J8460m8251o29O465L7362o995j4388P3865M9955J3114
$$ 564744 567348 569196 616528 634988 586737 586108 592573 629935 622940 608552 682417 732372 745486
3328G45486o621N132k3588o111P4909m30M386m0503L8922J9041k2052k455M3437
$$ 745486 738865 743997 720409 714298 789207 788777 793163 752660 791582 810623 788571 786116 829553
3315H29553n586k6101M4052J1058P59L2626L7336l670M9333O0941J2637M6256
$$ 829553 823967 797866 841918 852976 853735 886361 923697 920027 969360 1030301 1042938 1089194
3303A089194P5716O845M5700L0008M9527m2048J1739L5369P5043N7580j2134M277
$$ 1089194 1164910 1171755 1217455 1247463 1296990 1254942 1266681 1302050 1377093 1434673 1422539 1426816
3291A426816M3999N061q9698P952K4556n730K657p861r595N9716K9339O2543N9150
$$ 1426816 1470815 1475876 1386178 1394130 1418686 1412956 1415613 1407752 1398157 1457873 1487212 1549755 1608905
3278A608905N8728O1491N1685M5503N5813J08354J50044J26666P7565R6430J15093
$$ 1608905 1667633 1729124 1780809 1826312 1882125 1990479 2140523 2267189 2344754 2441184 2556277
3267B556277J19501J11801Q6118J05588K27590K13753Q8462K2253o2015n9743
$$ 2556277 2675778 2787579 2873697 2979285 3206875 3420628 3509090 3531343 3469328 3409585
3257C409585p7707p4939j00787j23408j19795j29599j45199j18308j69663j92983
$$ 3409585 3331878 3256939 3156152 3032744 2912949 2783350 2638151 2519843 2350180 2157197
3247B157197q0271n3770n6735r5975p8738q4243M930P160k8618p8922m8380P670
$$ 2157197 2076926 2023156 1966421 1870446 1791708 1707465 1712395 1719555 1690937 1612015 1563635 1571305
3235A571305Q750n8373n1728m9430O81J9600j9024o5207n6142l2520p9994n7018
$$ 1571305 1580055 1521682 1469954 1420524 1421205 1440805 1421781 1356574 1300432 1267912 1187918 1130900
3223A130900l4946m3618p7484r0578k9438l7232M3405l08l1501l5828L5000j1589
$$ 1130900 1095954 1052336 974852 884274 854836 817604 861009 860701 829200 793372 828372 816783
3211H16783q1513J2119J2415n9177J6932L8424j2928j7550k5378n0067m8859L3307
$$ 816783 735270 747389 759804 700627 717559 755983 743055 725505 700127 650060 601201 634508
3199F34508K2959l5163j0315j8987N990l4803o447L056m0091m704j5575L8442
$$ 634508 657467 622304 611989 593002 598992 564189 557742 560798 520707 516003 500428 538870
3187E38870M9122O589j6815m1110K0908L3948o17n9052m0417Q255l2318R1948
$$ 538870 587992 594581 577766 536656 557564 591512 590895 531843 491426 499681 467363 559311
3175E59311J6169o803Q84q718o9397N1362k0463K2562L1490m8354L396o4435r066
$$ 559311 575480 568677 569561 560843 491446 542808 522345 544907 576397 528043 531439 467004 457938
3162D57938K5481j3248l5975k7751K972M2862j264m7751j8763l3110p86P722L5808
$$ 457938 483419 470171 434196 406445 409417 452279 451015 403264 384501 351391 350605 358327 394135
3149C94135K4107k6631j1217k5171j9874J7554K0777J6597k921j3495l2743J9112
$$ 394135 418242 391611 380394 355223 335349 352903 373680 390277 387356 373861 341118 360230
3137C60230k6713k0898K8692j6299J2445M175M686m7027J7499j4088l2333K5881
$$ 360230 333517 312619 341311 325012 337457 341632 346318 299291 316790 302702 270369 296250
3125B96250m0334m7554M366j5685L2995N5168l2076m001j7517J7445K1360K5841
$$ 296250 255916 208362 212728 197043 230038 285206 253130 249129 231612 249057 270417 296258
3113B96258Q962l7246l0760q543n347p729k7818N708J2287K6584L3848k6411J8336
$$ 296258 305220 267974 237214 228671 223324 215595 187777 193485 205772 232356 266204 239793 258129
3100B58129k0098k2159l1807J954L8607L9152k0917k1468Q584L9609l3104l6499
$$ 258129 238031 215872 184065 186019 224626 263778 242861 221393 229977 269586 236482 199983
3088A99983j6524j1959R0384n7490n4386K3776L9163o082l9602k8930K7603L2925
$$ 199983 183459 171500 261884 204394 150008 173784 212947 206865 167263 138333 165936 198861
3076A98861K3286m180j5277l9214m2770L5434O2627j1185K6439k4616n8299N6628
$$ 198861 222147 217967 202690 163476 120706 156140 218767 207582 234021 209405 151106 207734
3064B07734J600m4760L5805r312K541j3981K3436k3932k636K3929M910J0739l7712
$$ 207734 209334 164574 200379 191067 193608 179627 203063 179131 176495 200424 205334 216073 178361
3051A78361l2709j8658J1546l8400J9386L0456j2053o764L5713l8303r264K823
$$ 178361 145652 126994 138540 100140 119526 149982 137929 131165 166878 128575 119311 122134
3039A22134k5532q895K0549L7246P213l49L2314M091j1486m9636L2379J1260O3270
$$ 122134 96602 87707 108256 145502 152715 152366 184680 188771 177285 127649 160028 171288 234558
3026B34558J9063m9293j0758J4293m6464M6198N553J5424J473l1321N286K2537
$$ 234558 253621 204328 193570 207863 161399 207597 213150 228574 230047 198726 204012 226549
3014B26549L174m2188N898K2107M3847k0444j322M870m96K2406p2213k3577l066
$$ 226549 229723 187535 193433 215540 259387 238943 237621 242491 241995 264401 192188 168611 165545
3001A65545N4079P0299j5695J8172m126O54K1975M958J5960Q770l3677j536K1860
$$ 165545 219624 289923 274228 292400 288274 288928 310903 315861 331821 340591 306914 305378 327238
2988C27238l2008L2763R882N799R1234n214k2823J0743p9394K0902L4929o539
$$ 327238 295230 327993 337875 343674 434908 429694 406871 417614 338220 359122 394051 387512
2976C87512K3785J5464M9305m7349l3205J0560M6379L598j8876J8389N713N002
$$ 387512 411297 426761 476066 428717 395512 406072 452451 456049 437173 455562 461275 466277
2964D66277J7464j3263l3775j9295M9903m55K8191O5976J0882k079k5225K6842
$$ 466277 483741 470478 436703 417408 467311 466856 495047 561023 571905 569826 544601 571443
2952E71443K9872k0377L7324q023K1492K2860L7830K6124k3938J8932O0390L0796
$$ 571443 601315 580938 618262 610239 631731 654591 692421 718545 694607 713539 773929 804725
2940H04725l0018O9378J9911j7778K8576l4948L850l7918L2085l054J3427M738
$$ 804725 774707 844085 863996 846218 874794 839846 843696 805778 837863 834809 848236 852974
2928H52974j618M7075M1844L2279K4304J5073M1205K3594M081J4746P9594R2815
$$ 852974 851356 898431 940275 972554 996858 1011931 1053136 1076730 1080811 1095557 1175151 1267966
2916A267966M5328N1017M7196L4439J4358K9371R37m0427p3024q5002p1026j03072
$$ 1267966 1313294 1364311 1411507 1445946 1460304 1489675 1490612 1450185 1377161 1292159 1221133 1118061
2904A118061l4412m341K1506O0314k4271k1669J914r017o968k9142J8163N9222
$$ 1118061 1083649 1079308 1100814 1161128 1136857 1115188 1117102 1108085 1101117 1071975 1090138 1149360
2892A149360K3337n2934N2853j2167k0398M5505L5008m4591n2940m073n5882j7892
$$ 1149360 1172697 1119763 1172616 1160449 1140051 1185556 1220564 1175973 1123033 1118960 1063078 1045186
2880A045186J433k7663m7480j3752j2831j3826o9215r878J5147m1392q7944o7816
$$ 1045186 1046619 1018956 971476 957724 944893 931067 861852 851974 867121 825729 737785 669969
2868F69969M9891N2663o0757m9750j6049J3623o6306K8431p542m0457m2111k8010
$$ 669969 719860 772523 711766 662016 645967 659590 593284 621715 614173 573716 531605 503595
2856E03595k8976l3867M5683J1331m7176K3055k847l0919r463q1627j2229K7163
$$ 503595 474619 440752 486435 497766 450590 473645 470798 439879 430416 348789 336560 363723
2844C63723k7716J955j8826L5321J5808l2923N341J4378k3291j4010l7514p736
$$ 363723 336007 337962 319136 354457 370265 337342 342683 357061 333770 319760 282246 274510
2832B74510k7092m304O060K8801m3309k8872k9436O46J729m3330M3314J3941m1081
$$ 274510 247418 243114 249174 277975 234666 205794 176358 177004 178733 135403 178717 192658 151577
2819A51577n467O1729J5340k3234q676k3281L658l7336m8211J7559N716J6392
$$ 151577 146110 207839 223179 199945 191269 167988 171646 134310 86099 103658 109374 125766
2807A25766K7742J6859k1406p710k8006o9129J5326p969j7506r479K5760M6226
$$ 125766 153508 170367 148961 141251 113245 44116 59442 51473 33967 24488 50248 96474
2795I6474L796k496k6813J3369K1942k0453o916J2597o5083o261L7911K6267l6571
$$ 96474 100270 97774 70961 84330 106272 85819 78903 91500 26417 20156 58067 84334 47763
2782D7763r254K1406J1462l6570K804l1955M0620P484m5129l0788j952o826N2868
$$ 47763 38509 59915 71377 34807 37611 5656 46276 53760 8631 -22157 -24109 -30935 21933
2769B1933J4187j8647N0593q106l0528p760j9023p1362K4771L5806L830k9983
$$ 21933 36120 17473 68066 59960 29432 21672 2649 -68713 -43942 -8136 -4306 -34289
2757c4289M0082o782m2658J9562J8258K065l1616P009o787r148j3516J6924j0741
$$ -34289 5793 -989 -43647 -24085 -5827 -3762 -35378 -28369 -35156 -44304 -57820 -40896 -51637
2744e1637n0252L9838L765k8988j6549O422J5927M3996k987n1993J1978K0324
$$ -51637 -101889 -62051 -58286 -87274 -103823 -97401 -81474 -37478 -40465 -92458 -80480 -60156
2732f0156K2365j1146J3861N959l201k2085j9824L4409L2646j2739k4662p0937
$$ -60156 -37791 -48937 -35076 -29117 -32318 -54403 -74227 -39818 -7172 -19911 -44573 -115510
2720a15510K3538J0488l6237L2681O387o5069O842L3380O114K5236J4126k5193
$$ -115510 -91972 -81484 -117721 -85040 -78653 -143722 -136880 -103500 -97386 -72150 -58024 -83217
2708h3217l0024m8657J07691n7981k8865K3199n2204L1638O3606L204l2413M1293
$$ -83217 -113241 -161898 -54207 -112188 -141053 -117854 -170058 -138420 -74814 -71610 -104023 -62730
2696f2730M547k2407K3777j5207q92O821M3852j6149o8495N8338m9117J870K5796
$$ -62730 -58183 -80590 -56813 -72020 -72912 -66091 -22239 -38388 -106883 -48545 -97662 -95792 -69996
2683f9996J1320j0884k7950K9499K5296m601n528J1934j2337l8403K2171L5543
$$ -69996 -58676 -69560 -97510 -68011 -42715 -47316 -52844 -40910 -53247 -91650 -69479 -33936
2671c3936j7917l0615O089K2452m1946m1547M0999m3984J2535L1056K2021J146
$$ -33936 -51853 -82468 -76379 -53927 -95873 -137420 -96421 -140405 -127870 -96814 -74793 -73647
2659g3647r072m5345K8505K1013k8004r900k5314l6212K3193K7533P9295J6913
$$ -73647 -82719 -128064 -99559 -78546 -106550 -116450 -141764 -177976 -154783 -127250 -47955 -31042
2647c1042k9256k4176l524j7005p32j8452L5326k0408j4960M6951j1034L2563
$$ -31042 -60298 -84474 -87998 -105003 -105735 -124187 -88861 -109269 -124229 -77278 -88312 -55749
2635e5749l0137p792K4642j3008q580l4830N2180j8448m387J8655K890m6323K4107
$$ -55749 -85886 -93678 -69036 -82044 -90624 -125454 -73274 -91722 -96109 -77454 -74564 -120887 -96780
2622i6780N1048p486m803P499l2330j013j6440L681P6814L5378p1642o4526n189
$$ -96780 -45732 -53218 -58021 -50522 -82852 -83865 -100305 -96624 -19810 15568 -56074 -120600 -125789
2609a25789Q433O2514k1760j7938j2919M6096k3862J9539j2248j9897k4288j5919
$$ -125789 -117356 -54842 -76602 -94540 -107459 -61363 -85225 -65686 -77934 -97831 -122119 -138038
2597a38038K524P824K1671M2323j4891k988o821l8930K1500Q403m224K1397j0578
$$ -138038 -135514 -127690 -106019 -63696 -78587 -81575 -88396 -127326 -105826 -97423 -101647 -80250 -90828
2584i0828K276M218P673K5327k0094m2517K7130P494j190r477p84J2136n7678
$$ -90828 -88552 -84334 -76661 -51334 -71428 -113945 -86815 -79321 -80511 -89988 -90772 -78636 -136314
2571a36314J8796j7268j1494P6783j1395k4009P150k2043j7056j3880k97L9707
$$ -136314 -117518 -134786 -146280 -69497 -80892 -104901 -97751 -119794 -136850 -150730 -151027 -111320
2559a11320j7486Q599J1396M5178k067m332m5874J590J7956j8615M0104R3779
$$ -111320 -128806 -120207 -108811 -63633 -65700 -70032 -115906 -114316 -96360 -114975 -74871 18908
2547A8908j3034m2043o6765K7770k5325m8056N6868N6884k4441n2952j2476M644
$$ 18908 5874 -36169 -102934 -75164 -100489 -148545 -91677 -34793 -59234 -112186 -124662 -120018
2535a20018M0355N1932m204m8421j7316P274m1772J5348K6285j5590K3701K9099
$$ -120018 -79663 -27731 -31935 -80356 -97672 -90398 -132170 -116822 -90537 -106127 -82426 -53327
2523e3327J5724m1221J6831j9097K891K4119p4190l775R146K0066N7236k2462
$$ -53327 -37603 -78824 -61993 -81090 -78199 -54080 -128270 -132045 -122899 -102833 -45597 -68059
2511f8059l0605n1388K2506K9369L0832n2745r1Q6604J3265j7213j5584j9841
$$ -68059 -98664 -150052 -127546 -98177 -67345 -120090 -120181 -33577 -20312 -37525 -53109 -72950
2499g2950J7439m1849J9084M6724k301j1966J179k2657k0718P788N7510j9497
$$ -72950 -55511 -97360 -78276 -31552 -33853 -45819 -44640 -67297 -88015 -80227 -22717 -42214
2487d2214K1560m4895J1742j9160k8036J464K9197N1017l79j1934q530k710M4566
$$ -42214 -20654 -65549 -53807 -72967 -101003 -99539 -70342 -19325 -19704 -31638 -40168 -42878 1688
2474A688J234l8103m2387p848k2245l33m5711M301M8846L1092q611K504N6j8906
$$ 1688 2922 -35181 -77568 -85416 -107661 -107994 -153705 -149404 -100558 -69466 -78077 -75573 -75517 -94423
2460i4423L1028l0724P420p7866L9091L9644j2353m7481K1900l1604N0949J1846
$$ -94423 -63395 -94119 -86699 -164565 -125474 -85830 -98183 -145664 -123764 -155368 -104419 -92573
2448i2573J151k2511j9990J6365K9381J326k1334J1879J7590l1846r474K7623
$$ -92573 -91422 -113933 -133923 -117558 -88177 -86851 -108185 -96306 -78716 -110562 -120036 -92413
2436i2413q316L2272J0679K0707P641m2029O0250K6041p6595K4477p309q5939
$$ -92413 -100729 -68457 -57778 -37071 -29430 -71459 -11209 14832 -61763 -37286 -44595 -130534
2424a30534M161M6999J6640L0406j0920J7547q649l5770k101K2121n5123J082
$$ -130534 -126373 -79374 -62734 -32328 -43248 -25701 -34350 -70120 -72221 -50100 -105223 -104141
2412a04141j2386M3372j7751j1915k3453r33Q234q069M3777M4289O1080O456l0376
$$ -104141 -116527 -73155 -90906 -102821 -126274 -127207 -118973 -127042 -83265 -38976 22104 28560 -1816
2399a816n3459l3220K4053M9889J893M6697k2112k3072k3146M3879J4318l4137
$$ -1816 -55275 -88495 -64442 -14553 -12660 34037 11925 -11147 -34293 9586 23904 -10233
2387a0233K511J9797N5473j7180k4276l417O331Q3009k0515o0202j879m6475J3891
$$ -10233 -7722 12075 67548 50368 26092 22675 29006 112015 91500 31298 29419 -17056 -3165
2374c165J800j417j6356O998J9732j0996j0690k4951j6366l0728r604l948M4441
$$ -3165 -1365 -2782 -19138 -12140 7592 -3404 -14094 -39045 -55411 -86139 -95743 -99691 -55250
2361e5250j6998l508J3366Q07p82o030K4962K2263n9859J1865J5614j1907J6855
$$ -55250 -72248 -75756 -62390 -61583 -62365 -68395 -43433 -21170 -81029 -69164 -53550 -65457 -48602
2348d8602M5875M371j2752l561k139M1143j1618l9499J1278K8468k915m3171r148
$$ -48602 -2727 1644 -11108 -14669 -16808 24335 12717 -26782 -15504 12964 10049 -33122 -42270
2335d2270l756K2869j0946K5922K0209o3222L543p248k988K6501Q373l2965j3374
$$ -42270 -46026 -23157 -34103 -8181 12028 -51194 -47651 -54899 -57887 -31386 -23013 -55978 -69352
2322f9352Q775L8368J3718K4189n062k9605K5822J2906q1084N329K2481j7646
$$ -69352 -60577 -22209 -8491 15698 10636 -18969 6853 19759 -61325 -55996 -33515 -51161
2310e1161m028L0096M3348J9061l6227j773n1540n414M9759l7025O615M8161M121
$$ -51161 -55189 -25093 18255 37316 1089 -684 -52224 -57638 -7879 -44904 -38289 9872 13993
2297A3993l7446l110K5713n099J629K4883n767k0216l685J2344m6489l1788P0082
$$ 13993 -23453 -26563 -850 -5949 -4320 20563 14796 -5420 -9105 3239 -43250 -75038 -4956
2284d956J9732j9903L2708l5674K4144P6896n8437p949M1777P099M189o0696k4427
$$ -4956 14776 -5127 27581 -8093 16051 92947 34510 26561 68338 75437 79626 18930 -5497
2271e497N9732O359m342L407o6601L8202J3093n834J5062k1133J2085J2297j5709
$$ -5497 54235 60594 56252 59659 -6942 31260 44353 38519 53581 32448 44533 56830 41121
2258D1121j0130L7199J596M2540k4000l8184l1105J77M8408L2601l085j3657J6772
$$ 41121 30991 68190 69786 112326 88326 50142 19037 19214 67622 100223 97138 83481 100253
2245A00253k9346M008M703M1948k597q338p215j9075K5018L4801M6300k1089m0213
$$ 100253 70907 74915 79618 121566 118969 110631 103416 84341 109359 144160 190460 169371 129158
2232A29158l7893P0995J745m381m9044l6182K2721K1645J0023j9002J1112N680
$$ 129158 91265 162260 164005 159624 110580 74398 97119 118764 128787 109785 120897 126577
2220A26577p931J7783K8773l2933Q383J4937K1921k8137N6653J2159K598K0413
$$ 126577 118646 136429 165202 132269 140652 155589 177510 149373 206026 218185 220783 241196
2208B41196l7622M0349M1753K7175q050j7218M7178K2428l1217O5103L9800j3119
$$ 241196 203574 243923 285676 312851 304801 287583 334761 357189 325972 391075 430875 417756
2196D17756M630k727N8594J1504l6979j348K2339K9676q199n789J2757P5009O7348
$$ 417756 422386 419659 478253 489757 452778 451430 473769 503445 495246 489457 502214 577223 644571
2183F44571l9490L5184K4140N3461r323j9267P295r416R062M0732q103l944k672
$$ 644571 605081 640265 664405 717866 708543 689276 696571 687155 696217 736949 728846 724902 722230
2170G22230L5342K2863Q596N3778K6817O7730r895j8935K6299M1907N2380M9000
$$ 722230 757572 780435 789031 842809 869626 937356 927461 908526 934825 976732 1029112 1078112
2158A078112P957j1591J2938M7715R3564O4609L3005J9294Q6410P1222N2334L9224
$$ 1078112 1086069 1074478 1087416 1135131 1228695 1293304 1326309 1345603 1432013 1503235 1555569 1594793
2146A594793M6019P4638J45770Q3328J6368R3161J68040J31420J55695J48517
$$ 1594793 1640812 1715450 1861220 1944548 1960916 2054077 2222117 2353537 2509232 2657749
2136B657749J12104J76070J82970K15057K19580K59472K88967L66471L90415L98457
$$ 2657749 2769853 2945923 3128893 3343950 3563530 3823002 4111969 4478440 4868855 5267312
2126E267312M63657N63711N80167P78283R42993J155357J366201J740518K093032
$$ 5267312 5730969 6294680 6874847 7653130 8596123 9751480 11117681 12858199 14951231
2117A4951231K006443K211965K898357L022328Q82426k049735l229800m530024
$$ 14951231 16957674 19169639 22067996 25090324 25972750 23923015 20693215 16163191
2109A6163191m094840k643490j821628j129160q92824o13339m52402l71671k81112
$$ 16163191 12068351 9424861 7603233 6474073 5581249 4967910 4515508 4143837 3862725
2100C862725k28696j36379j95728k24634k14590k74960j71247j49309j57365j61737
$$ 3862725 3634029 3497650 3301922 3077288 2862698 2587738 2416491 2267182 2109817 1948080
2090A948080p6018j14762r7284r8154n857j20677o4955o7224k6964n5147m9448
$$ 1948080 1872062 1757300 1660016 1561862 1556005 1435328 1370373 1303149 1276185 1221038 1171590
2079A171590n3485j12222m8662o8310n9806m1823k0269q4125j0999k8069j5035
$$ 1171590 1118105 1005883 957221 888911 829105 787282 767013 682888 671889 643820 628785
2068F28785O830o4929p7761o294L3598j1809o7860j164K4110l1550k5274m3602
$$ 628785 635615 570686 492925 486631 520229 508420 440560 439396 463506 431956 406682 363080
2056C63080J1128p100J1396l6827k1459m2049M6965l999p5936j665J9509n6970
$$ 363080 374208 367108 378504 341677 320218 278169 325134 321135 245199 243534 263043 206073
2044B06073o072M4681K6887k9460O870p084K4603J3019m4578J6767K0835K261
$$ 206073 200001 244682 271569 242109 248979 241895 266498 279517 234939 251706 272541 274802
2032B74802j3093j6769j2724p601j3264o3984l7137M1439k7132j4833J6206O005
$$ 274802 261709 244940 232216 224615 211351 147367 110230 151669 124537 109704 125910 131915
2020A31915J7751l739k9753j2230K4949j8011K981K4164k1171n9756J017j9054
$$ 131915 149666 145927 116174 103944 128893 110882 113863 138027 116856 57100 58117 39063
2008C9063j9273l0889J5915J04756k4371m1790J4988J7371J2148J5700j7807k7777
$$ 39063 19790 -11099 4816 109572 85201 43411 58399 75770 87918 103618 85811 58034
1996E8034n7628O500m0935M8916L0806q057m3479M002J2573K1431M1484j6326
$$ 58034 406 6906 -34029 14887 45693 37636 -5843 -1841 10732 32163 73647 57321
1984E7321p6217o408O2514J0547J0796n1602k1363M0913r346J509K1775j2608
$$ 57321 -18896 -25304 37210 47757 58553 6951 -14412 26501 17155 18664 40439 27831
1972B7831n8358O861L551L7390J9235J4474k8543k9062j7379k133N3414L4119
$$ 27831 -30527 -23666 -20115 17275 36510 50984 22441 -6621 -24000 -26133 27281 61400
1960F1400l9236m6617l199J0557j8484K8009k0361R914J1804Q464L286m7446j053
$$ 61400 22164 -24453 -27652 -17095 -35579 -7570 -27931 -18017 -6213 2251 5537 -41909 -42962
1947d2962M5451L4287l2298L813M002N446P811Q045m367l382J0435O880q1975
$$ -42962 2489 36776 4478 8291 12293 17739 25550 33595 29228 25846 36281 43161 -38814
1934c8814l7928K9287k3200J2778N1772j0412k0219J9888J4265k9908k5225M0878
$$ -38814 -76742 -47455 -70655 -57877 -6105 -16517 -36736 -16848 -2583 -32491 -57716 -16838
1922a6838J8162r896L0486j150m4138j3465J93m248L0923k0342M3772p6110j0959
$$ -16838 1324 -8572 21914 20764 -23374 -36839 -36646 -40894 -9971 -30313 13459 -62651 -73610
1909g3610n9998j4423L2903j1040K3353J4992M6458j1386j5832m1368N7747q931
$$ -73610 -133608 -148031 -115128 -126168 -102815 -87823 -41365 -52751 -68583 -109951 -52204 -61135
1897f1135l8860J99L2216L3963p6384N3481n438L3088K830k2406M1218m2559j9295
$$ -61135 -99995 -99796 -67580 -33617 -110001 -56520 -61958 -28870 -26040 -48446 -7228 -49787 -69082
1884f9082O635J3538n148P560J2377m3773P037M3916K8336k7357l8235n3243O2419
$$ -69082 -62447 -48909 -54057 -46497 -34120 -77893 -70856 -26940 1396 -25961 -64196 -117439 -55020
1871e5020M7274K1072o808j9636N2025l7919k5924J3601M65l060j6257K1449J0927
$$ -55020 -7746 13326 6518 -13118 38907 988 -24936 -11335 -10870 -13930 -30187 -8738 2189
1858B189l4376M389L1462p849l1488n204J5352J1779K7007J4758P645J0204j4892
$$ 2189 -32187 -27798 3664 -4185 -35673 -40877 -25525 -13746 13261 28019 35664 45868 30976
1845C0976O919P49Q5604o5765o590m71m9410J1024j6634j8672j0370J6069j7346
$$ 30976 37895 38644 124248 58483 51893 51422 2012 13036 -3598 -22270 -32640 -16571 -33917
1832c3917n499j8894n6485O386o68N0832L0939k7026P5864j5018m2701j7482o6
$$ -33917 -39416 -58310 -114795 -108409 -109077 -58245 -27306 -54332 21532 6514 -36187 -53669 -53735
1819e3735K3899k5894n412J9992r031J8902r404j5243M4255J820n735O96l9058
$$ -53735 -29836 -55730 -61142 -41150 -50181 -31279 -40683 -55926 -11671 -9851 -15586 -14890 -53948
1806e3948L488J9416k0781K0685L6814M3369n3682m7705J3356J4478O085k0407
$$ -53948 -50460 -31044 -51825 -31140 5674 49043 -4639 -52344 -38988 -24510 -18425 -38832
1794c8832j8169p442J1307O6979l7285j2321j121L3152k6042l5520K0474l0937
$$ -38832 -57001 -64443 -53136 13843 -23442 -35763 -36884 -3732 -29774 -65294 -44820 -75757
1782g5757j5790M6910J5720j9917O8788j975m1476L2327j4050k9493M1533l2474
$$ -75757 -91547 -44637 -28917 -48834 19954 17979 -23497 8830 -5220 -34713 6820 -25654
1770b5654m5553j9175K0592N743k2917J1568k7536j4703J153Q26M5921L9585j1334
$$ -25654 -71207 -90382 -69790 -64047 -86964 -75396 -102932 -117635 -116482 -115656 -69735 -30150 -41484
1757d1484J0431j2898l852K4945M446J0508j1192n2717n6554N575K7554J1926
$$ -41484 -31053 -43951 -47803 -22858 -18412 -7904 -19096 -71813 -128367 -122792 -95238 -83312
1745h3312J2453M803M3806o704m3477k2582J5584O375J5468J969k7261K4988k0584
$$ -83312 -70859 -66056 -22250 -28954 -72431 -95013 -79429 -73054 -57586 -55617 -82878 -57890 -78474
1732g8474K2308k5931J5802L2215K8455m9591k1544J8080o047J9625J4320J0832
$$ -78474 -56166 -82097 -66295 -34080 -5625 -55216 -76760 -58680 -64727 -45102 -30782 -19950
1720a9950m0503p94N104K4668N5324j7928l7125m0884K5578j2553J1166m9650
$$ -19950 -60453 -61247 -56143 -31475 23849 5921 -31204 -72088 -46510 -59063 -47897 -97547
1708i7547o068K4430K1018O1373k7084j5380L8105p37O1590l0267n1695k2739
$$ -97547 -103615 -79185 -58167 3206 -23878 -39258 -1153 -1890 59700 29433 -22262 -45001
1696d5001Q685M4868o8764j9266K5127O2894l7722k3112p6073M990K8184O3233
$$ -45001 -36316 8552 -60212 -79478 -54351 8543 -29179 -52291 -128364 -123374 -95190 -31957
1684c1957Q745j3106N1336m1530l0787M276M4072j2336J0413k4371p6617J5968
$$ -31957 -23212 -36318 15018 -26512 -57299 -53023 -8951 -21287 -10874 -35245 -111862 -95894
1672i5894L3524K7395q37k2160J382J0425M2507j7512J2559k0672r263J9688j5968
$$ -95894 -62370 -34975 -35812 -57972 -56590 -46165 -3658 -21170 -8611 -29283 -38546 -18858 -34826
1659c4826k4335o6381N9287M1166l2959m3935K512J3895N8023M2751p011q674
$$ -34826 -59161 -125542 -66255 -25089 -58048 -101983 -99471 -85576 -27553 15198 8187 -487
1647d87K2409l9880J116J0472M274K6135m4240R358R841k0333J9251m0563l2640
$$ -487 21922 -17958 -16842 -6370 -2096 24039 -20201 -10843 -1002 -21335 -2084 -42647 -75287
1634g5287K9672K1023m2189n1049M0986L9248j5438j116N8768o741L7825k6406
$$ -75287 -45615 -24592 -66781 -117830 -76844 -37596 -53034 -54150 4618 -2123 35702 9296
1622I296l0815m8062M390J7074p442J1523K5360R41j2490K5723K176p237l7546
$$ 9296 -21519 -69581 -65191 -48117 -55559 -44036 -18676 -17735 -30225 -4502 -2326 -9563 -47109
1609d7109J7023k1143M22J0161M03P62J5919M912m2367L0942k3145j5750m9204
$$ -47109 -30086 -51229 -50807 -40646 -40243 -39481 -23562 -18650 -61017 -30075 -53220 -68970 -118174
1596a18174L0337R1890k0209J2279k7570l1562l381K0526j357j0104J9483j0472
$$ -118174 -87837 4053 -16156 -3877 -31447 -63009 -66390 -45864 -47221 -57325 -37842 -48314
1584d8314J0898l4040q021L1261N4329k1028o1318k944K0081J9585l457K3667
$$ -48314 -37416 -71456 -79477 -48216 6113 -14915 -76233 -79177 -59096 -39511 -42968 -19301
1572a9301l93n792j3708k9466J2713L7771k3382j4399L2982K4570J7691J0991
$$ -19301 -19694 -25486 -39194 -68660 -55947 -18176 -41558 -55957 -22975 1595 19286 30277
1560C0277n6888K1026l7487J611L3376l0220N2588k8009O697N593k3668j1762
$$ 30277 -26611 -5585 -43072 -41461 -8085 -38305 14283 -13726 -7029 -1436 -25104 -36866
1548c6866J8687j099k696n683m4039L0910J6985L169j7507J5234p946o474J5899
$$ -36866 -18179 -19278 -21974 -27657 -71696 -40786 -23801 -20632 -38139 -22905 -30851 -37325 -21426
1535b1426j7618l337N112O583l239p700L3565j0725M4218j5369j6632k843o4730
$$ -21426 -39044 -42381 -37269 -30686 -33925 -41625 -8060 -18785 25433 10064 -6568 -9411 -74141
1522g4141j5493J18111L1392o1150n7522m597l259K0633N936l5517L8674j5350
$$ -74141 -89634 28477 59869 -1281 -58803 -63400 -66659 -46026 -40090 -75607 -36933 -52283
1510e2283J9623K356l0052J7443j0190l214k6404L2409L7017l6794o116K7092
$$ -52283 -32660 -30304 -60356 -42913 -53103 -56317 -82721 -50312 -13295 -50089 -56205 -29113
1498b9113L9815q43n97m5027J490m0926N5676l3346J8914m719m0917L1582j6071
$$ -29113 10702 9859 9262 -35765 -34275 -75201 -19525 -52871 -33957 -38676 -79593 -48011 -64082
1485f4082J4487L9956R557k2748l360m754K6960j3459k9235l476p573l5853j590
$$ -64082 -49595 -9639 -82 -22830 -26190 -30944 -3984 -17443 -46678 -50154 -57727 -93580 -95170
1472i5170N6785l5429k553L2820K7017J8458k6225k240K315l302M624N330m2926
$$ -95170 -38385 -73814 -76367 -43547 -16530 1928 -24297 -26537 -24222 -27524 -22900 -17570 -60496
1459f0496L1376K8829j1997m2377j5290N1738N7892j3893j2489l2642P372K2078
$$ -60496 -29120 -291 -12288 -54665 -69955 -18217 39675 25782 13293 -19349 -11977 10101
1447A0101m7639j0706J6646L0047j7560L646K8488K5889j7598n5701Q061M8985
$$ 10101 -37538 -48244 -31598 -1551 -19111 -15465 13023 38912 21314 -34387 -26326 22659
1435B2659l2452k6196L496j9147k2912l034K3642k5604J0557L2632L2372K8099
$$ 22659 -9793 -35989 -32493 -51640 -74552 -77586 -53944 -79548 -68991 -36359 -3987 24112
1423B4112j775n7275l0220M3039O334n1062j882o881N5166J2065m0112Q679m309
$$ 24112 22337 -34938 -65158 -22119 -15785 -66847 -68729 -75610 -20444 -8379 -48491 -39812 -44121
1410d4121M744N3526J5028p7014k8267L6N2007R636K8481l7559j9536J1173j0595
$$ -44121 -39377 14149 29177 -47837 -76104 -76068 -24061 -14425 14056 -23503 -43039 -31866 -42461
1397d2461l5917l1672N0336L258o230O6332Q556r174l1660J0160K0086k2150J9556
$$ -42461 -78378 -110050 -59714 -56456 -62686 3646 12202 3028 -28632 -18472 1614 -20536 -980
1384i80p27l9797J9661k7079j81j9084M2512P4483q069p3115J4883n480m2830
$$ -980 -1707 -41504 -21843 -48922 -49103 -68187 -25675 48808 40739 -32376 -17493 -22973 -65803
1371f5803J9378k5922J9815L9882K2830n4699N868m7935J4232J703L1350R403
$$ -65803 -46425 -72347 -52532 -12650 10180 -44519 -38651 -86586 -72354 -70651 -39301 -29898
1359b9898m8523N788L2058k9950J2536K5473J8663n560j6067P031J8582m3853
$$ -29898 -78421 -72633 -40575 -70525 -57989 -32516 -13853 -19413 -35480 -28449 -9867 -53720
1347e3720M80j0393k2593M1030N6701j0025q581L460m44P324o3616K8394M530
$$ -53720 -53240 -63633 -86226 -45196 11505 1480 -7101 -3641 -4085 3239 -60377 -31983 -27453
1334b7453k4056K9386j7072k3673Q1942l0575l0121l6602M8170J9496j0077J2178
$$ -27453 -51509 -22123 -39195 -62868 19074 -11501 -41622 -78224 -30054 -10558 -20635 -8457
1322h457o4132N1192R106k8986N168j3577l7889P725J1933N5400j2568l3064K1598
$$ -8457 -72589 -21397 -12291 -41277 -36109 -49686 -87575 -79850 -67917 -12517 -25085 -58149 -36551
1309c6551R813N680J5883J4622k7163p344L5401J537J4029k7262J2661J7547j0937
$$ -36551 -26738 -21058 -5175 9447 -17716 -25060 10341 11878 25907 -1355 11306 28853 17916
1296A7916K4346k3124l8138K2536K7462l7755j2273J3447J2167l7528J2235J3306
$$ 17916 42262 19138 -19000 3536 30998 -6757 -19030 -5583 6584 -30944 -18709 -5403
1284e403k2130j2754m0661J7446l524k1504O9147K8037J012J9887j1153l231k6819
$$ -5403 -27533 -40287 -80948 -63502 -67026 -88530 -19383 8654 9666 29553 18400 15169 -11650
1271a1650M8127k7958j7682M526k8679N5538M5912k9223p2227L6155r737K7411
$$ -11650 36477 8519 -9163 -4637 -33316 22222 68134 38911 -33316 2839 -6898 20513
1259B0513j6795m4962k5772L1796P0986K0452M734m130n0703o9883K1484J0027
$$ 20513 3718 -41244 -67016 -35220 35766 56218 60952 56822 6119 -63764 -42280 -32253
1247c2253j0497O783J0175P316J6607l7326K1605L0382J8223N12k3361j091K5307
$$ -32253 -42750 -35967 -25792 -18476 -1869 -39195 -17590 12792 31015 31527 8166 7075 32382
1234C2382m2741j6352J4432J9802L7753l9103j8008n119j329l5598R960K4686
$$ 32382 -10359 -26711 -12279 7523 45276 6173 -11835 -16954 -18283 -53881 -43921 -19235
1222a9235K0622p504J8763l0138K2545J3501J4502p4826J0844p722j7441J3196
$$ -19235 1387 -6117 12646 -17492 5053 18554 33056 -41770 -30926 -38648 -56089 -42893
1210d2893M4138m4285J7611M9285k7302m0608J4670N0703j4092J1747j6379M6822
$$ -42893 1245 -43040 -25429 23856 -3446 -44054 -29384 21319 7227 18974 2595 49417
1198D9417m2634k8342q510J9869l5793j5398K0572N4086l3239M9029j1258o7566
$$ 49417 6783 -21559 -30069 -10200 -45993 -61391 -40819 13267 -19972 29057 17799 -49767
1186d9767J4112J3658K6484j9744K454Q081n978k6075J6468J4248J1097K6665
$$ -49767 -35655 -21997 4487 -15257 -12803 -4722 -10700 -36775 -20307 -6059 5038 31703
1174C1703J652l3839k7003K7194J2769k9816j038l7043N780p437M5924k3543j5192
$$ 31703 33355 -484 -27487 -293 12476 -17340 -18378 -55421 -49641 -57078 -11154 -34697 -49889
1161d9889j3141j0753p310K1714L2210k5565P3734L0223m5449j8846m063l4954
$$ -49889 -63030 -73783 -81093 -59379 -27169 -52734 21000 51223 5774 -13072 -17135 -52089
1149e2089L4176J6047L8757l6632j4752q1185J2744R0275J7018j7811l3805k6209
$$ -52089 -17913 -1866 36891 259 -14493 -95678 -82934 7341 24359 6548 -27257 -53466
1137e3466K5816l756q0302J4787N3735j8220N0673L1914L0992k2746m9759K0577
$$ -53466 -27650 -31406 -111708 -96921 -43186 -61406 -10733 21181 52173 29427 -20332 245
1125B45N700J7225K4941m4703o2673L6263O298J2503L0573m5652N9283p491o0028
$$ 245 5945 23170 48111 3408 -59265 -23002 -16704 -4201 26372 -19280 40003 32512 -27516
1112b7516r470k7892L232N8397M7467m8514l4394K4394k8839L1576K8112l3537
$$ -27516 -36986 -64878 -61646 -3249 44218 -4296 -38690 -14296 -43135 -11559 16553 -16984
1100a6984J5257O3621Q040l1846l4085k9352L629o83n438m736K8777M624L8944
$$ -16984 -1727 61894 69934 38088 4003 -25349 -21720 -22403 -27841 -32577 -3800 824 39768
1087C9768o323m9256J7639l3427J2333K420J0591K4048O033J6906k7352j2398
$$ 39768 33445 -15811 1828 -31599 -19266 -16846 -6255 17793 23826 40732 13380 982
1075I82j5167M7106o835J9485m5872l7170K5268Q179k5793k250j9352n365J4845
$$ 982 -14185 32921 26086 45571 -301 -37471 -12203 -4024 -29817 -32067 -51419 -56784 -41939
1062d1939L5382j6473L8251L5363k3750j1443p0790L2771O1914q782L6166m1813
$$ -41939 -6557 -23030 15221 50584 26834 15391 -55399 -22628 39286 30504 66670 24857
1050B4857O35k2673m7785l8902P516P0969L1575j5295K1930K924k498L0406m7253
$$ 24857 25492 2819 -44966 -83868 -76352 -5383 26192 10897 32827 35751 33253 63659 16406
1037A6406l7823K5423j1280R736r647l3189O668K6357j0667L4226j9044j8790
$$ 16406 -21417 4006 -7274 2462 -7185 -40374 -33706 -7349 -18016 16210 -2834 -21624
1025b1624N7687J0620l3581r390l4007o4937O4621O2356K5350k1807J923k7677
$$ -21624 36063 46683 13102 3712 -30295 -95232 -30611 31745 57095 35288 37211 9534
1013I534L061Q879O08k6837l0909l512K1064n640k6815L1239K5012n788j1384
$$ 9534 12595 21474 22082 -4755 -35664 -39176 -18112 -23752 -50567 -19328 5684 -104 -11488
1000a1488L786r767n780N5303J9935q198m7298l7738k0329K7614r972j7615j9762
$$ -11488 -7702 -17469 -23249 32054 51989 43791 -3507 -41245 -61574 -33960 -43932 -61547 -81309
987h1309L0747k2507M5792J7120O1336Q264J472k9100n9308J2233j9444J6078
$$ -81309 -50562 -73069 -27277 -10157 51179 59443 60915 31815 -27493 -15260 -34704 -18626
975a8626L6243L1566n9373N5170k5622j9617j7028J7625n818K3997k8819j8060
$$ -18626 17617 49183 -10190 44980 19358 -259 -17287 338 -5480 18517 -10302 -28362
963b8362j214J5106N70l6355O531n621N2945P461q214l9087Q185K4461m581K0318
$$ -28362 -29576 -14470 -13900 -50255 -43724 -49345 3600 11061 2847 -36240 -28055 -3594 -8175 12143
949A2143O766m4961k1825K3878L7814P0931l3788m2660K8537L6002r6108l8140
$$ 12143 18909 -26052 -47877 -23999 13815 84746 50958 8298 36835 72837 -23271 -61411
937f1411O6121l8220k8172P2335O6589n2457L2399K747m4655r4288J7231N7943
$$ -61411 4710 -33510 -61682 10653 77242 24785 57184 59931 15276 -79012 -61781 -3838
925c838J7884M4026k3131j11k4481r321R061k4829K6091m1709N205O621J6240
$$ -3838 14046 58072 34941 34830 10349 1028 10089 -14740 11351 -30358 -25153 -18532 -2292
912b292n293K0389l9239J1432J06041k5170o0902q671N6783n0389L0089M325O0430
$$ -2292 -7585 12804 -26435 -15003 91038 65868 4966 -3705 53078 2689 32778 37103 97533
899I7533j1120n5498K104k2561l8753j8727L7860j9157J3818L5497j8444J2953
$$ 97533 86413 30915 33019 10458 -28295 -47022 -9162 -28319 -14501 20996 2552 15505
887A5505M484o419p966J4725J7904k4682J4749n887l0850o533k6871O221k7806
$$ 15505 19989 13570 5604 20329 38233 13551 28300 22413 -8437 -14970 -41841 -35620 -63426
874f3426M3734j7719R367R348j7381m216J6459J9540K6578l7036K1006k3201k3283
$$ -63426 -19692 -37411 -28044 -18696 -36077 -40293 -23834 -4294 22284 -14752 6254 -16947 -40230
861d0230J6709J2N3248l8168Q440m7546j4180J4932N7269M860n135M2551J9177
$$ -40230 -23521 -23509 29739 -8429 11 -47535 -61715 -46783 10486 15346 10211 52762 71939
848G1939j8075j3656K845j5379l622K817J8878M1197l90J2823j6400j5958k0911
$$ 71939 53864 40208 43053 27674 24052 26869 45747 86944 86554 99377 82977 67019 46108
835D6108o123J147L8926r090n2877r295J3271Q585J3364o1J6108J521m1512k4861
$$ 46108 39985 41132 80058 70968 18091 8796 22067 30652 44016 43955 60063 61584 20072 -4789
821d789J1631M6935P898l0408P445j0599L4638k6238J416r3090n799J4929M2962
$$ -4789 6842 53777 61675 31267 38712 28113 62751 36513 37929 -55161 -60960 -46031 -3069
808c069O5378l7858q294P4305m7307j13773k1201P3078K5020L344P0496p782m0519
$$ -3069 62309 24451 16157 90462 43155 -70618 -91819 -18741 6279 9623 80119 72337 31818
795C1818P803L3172k4026j6490q4090K2035M0905L5476l6704J9837L9583Q415
$$ 31818 39621 72793 48767 32277 -51813 -29778 11127 46603 9899 29736 69319 77734
783G7734n1864j8157Q45N8399J2765l2135m5738j7174k9566R738N1060l266o956
$$ 77734 25870 7713 8558 66957 79722 47587 1849 -15325 -44891 -35153 15907 12641 5685
770E685k0139K9607J280n5791R5526k8480j4948L0455m0099J1972j595L3047j6154
$$ 5685 -14454 15153 16433 -39358 56168 27688 12740 43195 3096 15068 13473 46520 30366
757C0366j7425j6924J9939N671K0417J6824K697l666n2843L500q508k4163j1738
$$ 30366 12941 -3983 15956 21627 42044 58868 61565 57899 5056 8556 48 -24115 -35853
744c5853j0282Q5282J8659k4080p947J4825m0374j9006K7058p140J2099N016N440
$$ -35853 -46135 39147 57806 33726 25779 40604 230 -18776 8282 1142 13241 18257 23697
$$ [...]
##END NTUPLES=NMR SPECTRUM
##END=
