##TITLE=1H_TG-2343-C
 CDCl3
 8 sc, 
 15.3.2023
##JCAMPDX= 6.0         $$ Bruker NMR JCAMP-DX V2.0
##DATA TYPE= NMR SPECTRUM
##DATA CLASS= NTUPLES
##ORIGIN= UXNMR, Bruker Analytische Messtechnik GmbH
##OWNER= root
$$ XWIN-NMR		Version 3.5
$$ Wed Mar 15 14:46:50 2023 Russian Standard Time (UT+4h)  she@DPX200
##.OBSERVE FREQUENCY= 200.13135
##.OBSERVE NUCLEUS= ^1H
##.ACQUISITION MODE= SIMULTANEOUS
##.ACQUISITION SCHEME= undefined
##.AVERAGES= 8
##.DIGITISER RES= 18
##SPECTROMETER/DATA SYSTEM= spect
##.PULSE SEQUENCE= zg30
##.SOLVENT NAME= DMSO
##.SHIFT REFERENCE= (INTERNAL, DMSO, 0, 15.7337)
##AUDIT TRAIL= $$ (NUMBER, WHEN, WHO, WHERE, WHAT)
$$ ##TITLE= Audit trail, XWIN-NMR		Version 3.5
$$ ##JCAMPDX= 5.01
$$ ##ORIGIN= Bruker BioSpin GmbH
$$ ##OWNER= she
$$ F:/spectra/data/she/nmr/H-F/1/pdata/1/auditp.txt
$$ ##AUDIT TRAIL=  $$ (NUMBER, WHEN, WHO, WHERE, WHAT)
(   1,<2023-03-15 14:43:09.56 +0400>,<she>,<DPX200>,
      <created by zg, POWCHK disabled, PULCHK disabled
       configuration hash MD5:
       00 E9 B6 7A A2 85 ED C7 34 08 36 98 17 FE 4E 26
       data hash MD5: 16K
       C2 EE E6 CB 16 B8 08 FA D8 DC 0A 29 8D 3C AE 49>)
(   2,<2023-03-15 14:45:35.57 +0400>,<she>,<DPX200>,
      <Start of raw data processing
       efp BC_mod = 2 LB = 0.24 FT_mod = 6 PKNL = 1 PHC0 = -19110.26 PHC1 = 18.80074 SI = 16K 
       data hash MD5: 16K
       2D 5B CB E6 D9 64 E6 5D 3E 55 8C 2D 3F 17 89 12>)
(   3,<2023-03-15 14:45:55.59 +0400>,<she>,<DPX200>,
      <pk PHC0 = 5.983884 PHC1 = -6.799999 
       data hash MD5: 16K
       A9 F0 D9 D2 03 D1 0D F5 57 FE BB A2 6A 44 FD 06>)
(   4,<2023-03-15 14:45:58.78 +0400>,<she>,<DPX200>,
      <abs ABSG = 5 
       data hash MD5: 16K
       46 67 EB DE E9 E3 36 B4 D4 C5 A5 1D 9E A0 05 EB>)
$$ ##END=
$$ 
$$ hash MD5
$$ 43 21 7E 3F 22 E6 C5 95 5B 48 C6 38 C2 2A 00 B3
##$RELAX= 
##$RELAX= 
##$RELAX= 
##$RELAX= 
##$RELAX= 
##$RELAX= 
$$ Bruker specific parameters
$$ --------------------------
##$DU= <F:/spectra>
##$EXPNO= 1
##$NAME= <H-F>
##$PROCNO= 1
##$TYPE= <nmr>
##$USER= <she>
##$AMP= (0..31)
100 100 100 100 100 100 100 100 100 100 100 100 100 100 100 100 100 100 
100 100 100 100 100 100 100 100 100 100 100 100 100 100 
##$AQSEQ= 0
##$AQ_mod= 1
##$AUNM= <au_zg>
##$AUTOPOS= <>
##$BF1= 200.13
##$BF2= 200.13
##$BF3= 200.13
##$BF4= 200.13
##$BF5= 200.13
##$BF6= 200.13
##$BF7= 200.13
##$BF8= 200.13
##$BYTORDA= 1
##$CFDGTYP= 0
##$CFRGTYP= 5
##$CHEMSTR= <none>
##$CNST= (0..31)
1 1 145 1 1 1 1 1 1 1 1 1 1 1 1 1 1 1 1 1 1 1 1 1 1 1 1 1 1 1 1 1 
##$CPDPRG= <>
##$CPDPRG1= <>
##$CPDPRG2= <>
##$CPDPRG3= <>
##$CPDPRG4= <mlev>
##$CPDPRG5= <mlev>
##$CPDPRG6= <mlev>
##$CPDPRG7= <mlev>
##$CPDPRG8= <mlev>
##$CPDPRGB= <>
##$CPDPRGT= <>
##$D= (0..31)
0 1.2 0 0 0 0 0 0 0 0.06 0 0.03 0 0 0 0 0.0002 0 0 0 0 0 0 0 0 0 0 0 0 
0 0 0 
##$DATE= 1678876988
##$DBL= (0..7)
120 120 120 120 120 120 120 120 
##$DBP= (0..7)
150 150 150 150 150 150 150 150 
##$DBP07= 0
##$DBPNAM0= <>
##$DBPNAM1= <>
##$DBPNAM2= <>
##$DBPNAM3= <>
##$DBPNAM4= <>
$$ [...]
##$SUBNAM3= <"">
##$SUBNAM4= <"">
##$SUBNAM5= <"">
##$SUBNAM6= <"">
##$SUBNAM7= <"">
##$SUBNAM8= <"">
##$SUBNAM9= <"">
##$SW= 18.05172834244
##$SWIBOX= (0..15)
0 0 2 0 0 0 0 0 0 0 0 0 0 0 0 0 
##$SW_h= 3612.71676300578
##$TD= 16384
##$TD0= 1
##$TE= 0
##$TE2= 300
##$TE3= 300
##$TEG= 300
##$TL= (0..7)
0 120 120 120 120 120 120 120 
##$TP= (0..7)
150 150 150 150 150 150 150 150 
##$TP07= 0
##$TPNAME0= <>
##$TPNAME1= <>
##$TPNAME2= <>
##$TPNAME3= <>
##$TPNAME4= <>
##$TPNAME5= <>
##$TPNAME6= <>
##$TPNAME7= <>
##$TPOAL= (0..7)
0.5 0.5 0.5 0.5 0.5 0.5 0.5 0.5 
##$TPOFFS= (0..7)
0 0 0 0 0 0 0 0 
##$TUNHIN= 0
##$TUNHOUT= 0
##$TUNXOUT= 0
##$USERA1= <user>
##$USERA2= <user>
##$USERA3= <user>
##$USERA4= <user>
##$USERA5= <user>
##$V9= 5
##$VALIST= <valist>
##$VCLIST= <CCCCCCCCCCCCCCC>
##$VD= 0
##$VDLIST= <DDDDDDDDDDDDDDD>
##$VPLIST= <PPPPPPPPPPPPPPP>
##$VTLIST= <TTTTTTTTTTTTTTT>
##$WBST= 1024
##$WBSW= 4
##$XGAIN= (0..3)
0 0 0 0 
##$XL= 0
##$YL= 0
##$YMAX_a= 324852
##$YMIN_a= -416711
##$ZGOPTNS= <>
##$ZL1= 120
##$ZL2= 120
##$ZL3= 120
##$ZL4= 120
##$ABSF1= 15.73367
##$ABSF2= -2.318179
##$ABSG= 5
##$ABSL= 3
##$ALPHA= 0
##$AQORDER= 0
##$ASSFAC= 0
##$ASSFACI= 0
##$ASSFACX= 0
##$ASSWID= 0
##$AUNMP= <proc_1d>
##$AZFE= 0.1
##$AZFW= 0.1
##$BCFW= 0
##$BC_mod= 2
##$BYTORDP= 0
##$COROFFS= 0
##$CY= -3
##$DATMOD= 1
##$DC= 0
##$DFILT= <>
##$DTYPP= 0
##$F1P= 0
##$F2P= 0
##$FCOR= 1
##$FTSIZE= 16384
##$FT_mod= 6
##$GAMMA= 0
##$GB= 0
##$INTBC= 1
##$INTSCL= 3.70164e-10
##$ISEN= 128
##$LB= 0.24
##$LEV0= 0
##$LPBIN= 0
##$MAXI= 10000
##$MC2= 0
##$MEAN= 0
##$ME_mod= 0
##$MI= 1.114404
##$NCOEF= 0
##$NC_proc= -5
##$NLEV= 6
##$NOISF1= 3.799351
##$NOISF2= 2.8
##$NSP= 0
##$NTH_PI= 0
##$NZP= 0
##$OFFSET= 15.73367
##$PC= 1
##$PHC0= -19104.28
##$PHC1= 12.00074
##$PH_mod= 1
##$PKNL= yes
##$PPARMOD= 0
##$PSCAL= 0
##$PSIGN= 0
##$REVERSE= no
##$SF= 200.13000757953
##$SI= 16384
##$SIGF1= 3
##$SIGF2= 2
##$SINO= 5.538805
##$SIOLD= 16384
##$SREGLST= <1H.CDCl3>
##$SSB= 0
##$STSI= 16384
##$STSR= 0
##$SW_p= 3612.71676300578
##$SYMM= 0
##$S_DEV= 0
##$TDeff= 16384
##$TDoff= 0
##$TI= <>
##$TILT= no
##$TM1= 0
##$TM2= 0
##$TOPLEV= 0
##$USERP1= <user>
##$USERP2= <user>
##$USERP3= <user>
##$USERP4= <user>
##$USERP5= <user>
##$WDW= 1
##$XDIM= 16384
##$YMAX_p= 281664993
##$YMIN_p= -149207
$$ End of Bruker specific parameters
$$ ---------------------------------
##NTUPLES= NMR SPECTRUM
##VAR_NAME=  FREQUENCY,     SPECTRUM/REAL,   SPECTRUM/IMAG
##SYMBOL=    X,             R,               I
##VAR_TYPE=  INDEPENDENT,   DEPENDENT,       DEPENDENT
##VAR_FORM=  AFFN,          ASDF,            ASDF
##VAR_DIM=   16384,         16384,           16384
##UNITS=     HZ,            ARBITRARY UNITS, ARBITRARY UNITS
##FACTOR=    0.220516191357247, 1,           1
##FIRST=     3148.77954332037, 0,            0
##LAST=      -463.937219685411, 0,           0
##MIN=       -463.937219685411, -149207,     0
##MAX=       3148.77954332037, 281664993,    0
$$ Real data points
##PAGE= N=1
##DATA TABLE= (X++(R..R)), XYDATA
$$ [...]
7237B63189j1439k604k3892J0607j5358O458N2703J1281M108K3944k1979r70K1988
7224C18036k0145J1017L7290l0713m2235j7756L6646J2131r454L5374j6156l455
7212C10580L66K8523M1457M7104l4638K9479k9276r2712N7910J3555N9299J8437
7200D50084j9297l2787M8322J7616J9315J4891j9910L6049o388r203l9389K668
7188D61971k2023L5057P0057k4858J6620j5490M5784L0902j3371R343O8545J2407
7176F74944j2071r262M9603M0066q820M1593m0633K9748R8874J8087Q474K9168
7164I19771J0833L127N3335O483q678o362L980M2397O8687J2033n5051l1046N740
7151A025249L1520P4921K4496L3869M9962n782N8188J36347L0936P053N0203L7342
$$ plain form
7237 263189 251750 249146 225254 235861 220503 226961 279664 290945 295053 318997 297018 296048 318036
7224 318036 297891 308908 346198 315485 273250 255494 292140 304271 294817 330191 314035 310580
7212 310580 310946 339469 380926 428030 393392 422871 393595 300883 358793 372348 431647 450084
7200 450084 430787 398000 446322 463938 483253 498144 478234 514283 507895 498692 459303 461971
7188 461971 439948 475005 545062 520204 536824 521334 567118 598020 584649 593992 662537 674944
7176 674944 662873 653611 703214 743280 734460 776053 735420 765168 864042 882129 890603 919771
7164 919771 930604 933731 987066 993549 984871 978509 982489 1024886 1093573 1105606 1050555 1019509 1025249
7151 1025249 1056769 1131690 1156186 1190055 1240017 1234235 1292423 1428770 1459706 1466759 1516962 1554304
7139A554304J02196J6435N5304N3983O1620O601M3772L9642N9969J13304R5636
7128B202766P3226J24937P1210J22031J54840P7855J40571J54800K09320K25974
7118C557530J95468K60179L07344L31470M10017M20094M91555N54606P03531Q97114
7108H128908J105053J354686J617790J738218J580463R34294J70204o89500j417142
7099A4522974j698811j670031j377624j112894r47534p22496n62451m10584k70218
7090E750331k02153j44088q7606n0087L2116K1274Q4691M2099J15358J76446J44368
7079E882749J81720J78148K45140J99788K68386K98889K45071L45375K79037K46871
7069H371174M23618L49770M46751N09734N91745O18795P41229R22797J164804
$$ plain form
7139 1554304 1656500 1672935 1728239 1782222 1843842 1850443 1894215 1933857 1993826 2107130 2202766
7128 2202766 2275992 2400929 2472139 2594170 2749010 2826865 2967436 3122236 3331556 3557530
7118 3557530 3752998 4013177 4320521 4651991 5062008 5482102 5973657 6528263 7231794 8128908
7108 8128908 9233961 10588647 12206437 13944655 15525118 16459412 16629616 15940116 14522974
7099 14522974 12824163 11154132 9776508 8663614 7716080 6993584 6431133 6020549 5750331
7090 5750331 5548178 5404090 5316484 5266397 5298513 5319787 5404478 5446577 5561935 5738381 5882749
7079 5882749 6064469 6242617 6487757 6687545 6955931 7254820 7499891 7845266 8124303 8371174
7069 8371174 8794792 9144562 9591313 10101047 10692792 11311587 12052816 12975613 14140417
7060A4140417J318882J577300J673473J977538K216288K534470L095070L768068
7052C2301506M585255N924779P325457Q910921R695673R115858O147124J165844
7044H5172417l628380p861991r634927r698466q826605p589111o153148m922153
7036B6857636l773264k904201k388859j911433j533467j316021j084327r37054
7028A1009010p71529o32454o11945n29683m93097m18331m01694l61427l55274
7019F433576l04468k43584k93083k41929k92766k93699k63377j76554j68263j79911
7009C975942j66166j36217r0539j07235j82143j00853j02470m1178k8028r4214
6999B926899p8751j03438j08423q0243o6697k3223k4006j14964o8068n1255j1952
$$ plain form
7060 14140417 15459299 17036599 18710072 20687610 22903898 25438368 28533438 32301506
7052 32301506 36886761 42811540 50136997 59047918 68743591 77859449 84006573 85172417
7044 85172417 81544037 73682046 64047119 54348653 45522048 37932937 31779789 26857636
7036 26857636 23084372 20180171 17791312 15879879 14346412 13030391 11946064 11009010
7028 11009010 10237481 9605027 8993082 8463399 7970302 7551971 7150277 6788850 6433576
7019 6433576 6129108 5885524 5592441 5350512 5057746 4764047 4500670 4324116 4155853 3975942
7009 3975942 3809776 3673559 3583020 3475785 3293642 3192789 3090319 3049141 3021113 2926899
6999 2926899 2848148 2744710 2636287 2556044 2489347 2466124 2442118 2327154 2259086 2207831 2195879
6988B195879J713m6063j1439p3898o7909n5076P219k3880k859K0816j7757N4559
6976A981305L356j1273O6989K3708Q1554K2437R5000J05148j3900O392j43951
6965B216765j76273j61410j43812j74450r7075q3849j14444j27876o1430p5317
6955A000829n9293q0765j3512n0717N171J8194J1146m6540l8607m2092L075K7668
6943G34557J4062l8478n3983M7487N3066j01929m1749k7912m5172k6223k2708
6932D91018l518l2815K2486k02K0360p161q313n06o1045N7364j5020o9403K8720
6919D21965k0884k0513k5102L9874l962J9236j5966l1983L7445L6292p19j0084
6907D25599m5532K7905Q191M0826r6890m616J6188n3770l638J8698R013j3689
$$ plain form
6988 2195879 2197592 2151529 2140090 2066192 1998283 1943207 1950426 1926546 1923687 1944503 1926746 1981305
6976 1981305 1984661 1973388 2040377 2064085 2145639 2168076 2263076 2368224 2354324 2360716 2216765
6965 2216765 2040492 1879082 1735270 1560820 1463745 1379896 1265452 1137576 1076146 1000829
6955 1000829 941536 860771 847259 796542 801713 819907 831053 784513 745906 703814 706889 734557
6943 734557 748619 710141 656158 703645 756711 654782 613033 585121 539949 513726 491018
6932 491018 487500 454685 477171 476969 497329 490168 481855 481349 420304 477668 462648 393245 421965
6919 421965 401081 380568 355466 395340 391378 410614 394648 362665 400110 436402 435683 425599
6907 425599 380067 407972 416163 456989 360099 355483 371671 317901 314263 332961 341974 328285
6895C28285M2191j4756m1951R671J0256K1287J7415r995L4046l2348k3252j681
6883C39168j3362l3369K9243K5267O4721l2006l2794p397L0680L3563R159L1545
6871D44418l162o0518o1916p836J0299k7219K9341l5248k8917k8664k8565j0059
6859A91954N3928j0205l6747N5417K942n6786n5154P669P201J6737L0069K51q8259
6846A19017j5260M879K4771K717L238l6118L5000N1048k3813M5393j270k0437
6834A89165k821N2512j4227k9298P432j4239l5769l2411L6445j2460m0636M6231
6822A49924K9021M350L3228N064L5265p13O002J0718J976m1877N3348k9472m7810
6809B09024P096j9317m3654K6678l1325L9576l3735p8418L7128K7936M728K0965
$$ plain form
6895 328285 370476 355720 313769 323440 333696 354983 372398 362403 396449 364101 340849 339168
6883 339168 325806 292437 321680 346947 411668 379662 346868 339471 370151 403714 412873 444418
6871 444418 441256 380738 318822 310986 321285 294066 323407 288159 259242 230578 202013 191954
6859 191954 245882 235677 198930 254347 257289 200503 145349 153018 160219 176956 207025 207276 119017
6846 119017 103757 108636 133407 136124 139362 103244 138244 189292 165479 210872 209602 189165
6834 189165 186344 238856 224629 195331 202763 188524 152755 120344 156789 144329 103693 149924
6822 149924 178945 183295 216523 221587 256852 256139 262141 272859 274835 232958 286306 256834 209024
6809 209024 216120 196803 153149 179827 148502 188078 154343 75925 113053 140989 145717 166682
6797A66682k3772O042p5234n5020M564N8193M1827k2901M6419k210o1397M7103
6785A30296m071l1706k6120L0225J2437K0589K286j6521m5283o082N6680n5646
6773F7084J6931L5888J3969L607o0003J658N209m5098K3362p373L1818l5488k2438
6760B9126k5276N5985L7270N565j2085p950j3750K0219j473k0093k4873R179L2815
6747H4659l1094J047P775q111L8305j5121m035k6567N2551p054M3208k1992n6442
6734E7129M44J5036k1617J4447K856J0205K9494l0315j7883J2577o0821Q089K2043
6721D1684J3695j0811O234Q814j2907j7874L6125J1236m1916J2385K1612k0974
6709D7303J3213j4006m9562J01106K5634p789O9609P626o3607k9035N56P731M1884
$$ plain form
6797 166682 142910 148952 73718 18698 23262 81455 123282 100381 146800 144590 83193 130296
6785 130296 126225 94519 68399 98624 111061 131650 133936 117415 72132 66050 122730 67084
6773 67084 84015 119903 133872 137479 77476 79134 84343 39245 62607 55234 87052 51564 29126
6760 29126 3850 59835 97105 102670 90585 82635 68885 89104 87631 67538 42665 51844 84659
6747 84659 53565 54612 62387 54276 92581 77460 73425 46858 99409 92355 135563 113571 57129
6734 57129 57573 72609 50992 65439 68295 78500 107994 77679 59796 72373 11552 19641 41684
6721 41684 55379 44568 50802 59616 46709 28835 64960 76196 34280 46665 68277 47303
6709 47303 60516 46510 -3052 98054 123688 115899 185508 193134 129527 100492 101048 108779 150663
6696A50663J5963l3363K8557k6278p8721j7804J3387m410J8011l6324M1410M5879
6684A16970j4247P713m1976k1429N0491k2187M549L0458J986n0208n9415M1825
6672D4530O1470J4158k5734l4642L9350N0221j010m9676M1668k1824j6992N838
6660A07357K8022j7261M0808L0224K9767J7193j4202k6354O2877k4987P740Q2593
6648C23777j1307N2808O4250O6606M4962r2510k1260p973r9180l3599k6304k1884
6636B38386l2585j385m6203k1942K2584K3881k0195M632m3865o422r445J2439
6624A19880J1387k3942n63P051j0846n726L891o75j7083k4824M6592p710l6351
6611F1081J4076J9284o4330n900n835J1825O1132K5097m8270l1953J2342M5212
$$ plain form
6696 150663 166626 133263 161820 135542 56821 39017 52404 47994 66005 29681 71091 116970
6684 116970 102723 110436 68460 47031 97522 75335 79884 110342 112328 62120 2705 44530
6672 44530 106000 120158 94424 59782 99132 149353 148343 98667 140335 118511 101519 107357
6660 107357 135379 118118 158926 189150 218917 236110 221908 195554 258431 233444 241184 323777
6648 323777 312470 365278 429528 496134 541096 448586 427326 419353 320173 286574 260270 238386
6636 238386 205801 204416 158213 136271 158855 182736 162541 167173 123308 116886 107441 119880
6624 119880 131267 107325 106762 113813 102967 97241 101132 100457 83374 58550 105142 97432 61081
6611 61081 75157 94441 30111 24211 18376 30201 91333 116430 68160 36207 48549 93761
6599I3761J5377j8169n0645n026K6206N821j2554J6670J7608q366M2823k6504
6587I7002J1387J1401K600n7848j2905J628j7053L4584l0855J8183m225K5150
6575G9049L907k3434J8547n6948K1623L2842N0298k2802q125K1063P244p4321
6563D8943J1034J7053j1289K7564k7424L9909O4101n7882k3718J8955m3969M521
6551F7798J4891L4624m2689o330K1499l0486J8795L6062N4890J800l3473J2190
6539A49571O952l966N752J3204k4043l7801R637j7517J9744Q711K8733k8503j11
6526A30363P25j7331L5279k5205M233K7503m5011l5642r664L4089L3364o9151
6514F3552j7891L7183M2057J962q140R829m17o5577k5666K872P1642J6757L791
$$ plain form
6599 93761 109138 90969 40324 35298 61504 67325 54771 71441 89049 80683 123506 97002
6587 97002 108389 119790 122390 64542 51637 53265 36212 70796 39941 58124 53899 79049
6575 79049 82956 59522 78069 21121 42744 75586 125884 103082 94957 116020 123264 48943
6563 48943 59977 77030 65741 93305 65881 105790 169891 112009 88291 107246 63277 67798
6551 67798 82689 117313 74624 68294 89793 59307 78102 114164 169054 170854 137381 149571
6539 149571 156523 152557 158309 171513 147470 109669 119306 101789 121533 130244 158977 130474 130363
6526 130363 131088 113757 149036 123831 128064 155567 110556 74914 65250 99339 132703 63552
6514 63552 45661 82844 124901 126863 118723 128552 128135 62558 36892 39764 111406 128163 131954
6501A31954k6042l919J995o5314N870L2452j4118j8951K8069M8206P967j6604
6489A11565N6735l0854j3713k1187K621K267j1567M928K677M178j4278M711k0209
6476G7874J4736J2581j851k7992m7363K3000L4551j835j2232Q573r966o475j9967
6463D3634q246L0334L374k6460l848L5753o3706k1049r548Q1716l886j2445K1261
6450F6884j049k9055m3060o077N563N6687K2169q8398K299K4847j3084N0293l6777
6437A1242O2383K8779L343l9793L3526l4460N100J1809K5299j8518j5862k6288
6425D6560J0163k0323m0588l111M5696O9454l8998L4004j0174K92k5529J4711
6413H2157l0751m638l0994M1768J483K8205L6192j5821j6761l9759o326J3684
$$ plain form
6501 131954 105912 101993 103988 38674 44544 76996 62878 43927 71996 120202 128169 111565
6489 111565 168300 137446 123733 102546 105167 107434 95867 100795 103472 107650 93372 98083 77874
6476 77874 92610 105191 103340 75348 27985 50985 85536 83701 71469 80042 70076 63601 43634
6463 43634 35388 65722 69096 42636 38788 74541 10835 -10214 -19762 61954 58068 45623 66884
6450 66884 65835 36780 -6280 -12357 -6794 49893 72062 -16336 -14037 10810 -2274 48019 11242
6437 11242 73625 102404 105747 65954 99480 65020 70120 81929 107228 88710 72848 46560
6425 46560 56723 36400 -4188 -7299 38397 107851 68853 102857 92683 92975 67446 82157
6413 82157 51406 46768 15774 57542 59025 87230 123422 107601 90840 51081 44755 58439
6401E8439J1774P657o197K2717J1782k8288l3854j7808J08739P302n6071m0513
6389D5679N856L3821L679P949M5984k2399l2925K6367L1303m3852j9925L7004
6377A18541k8783j0698L355L5515n3536O139J0993n8104L1847M3092r854m896
6365H3611R257O5485J6419k9076m3328K3567L573L4783M635n979k2611k2422J5645
6352A33559k4366q712K1072K8851L97J0932R844j9392k1729K8309m830k0741k5155
6339A08039K7360j8436p237P7373l7907O949K8486j4305o73K6915m379m6731M1223
6326A86677J547K3007J3018k3608l334l9441N535P3552J3733k4054l91J6346n0464
6313A92123o161M391J9307J6377k564j8816L1157K9364M1591r770n108k3043N267
$$ plain form
6401 58439 70213 77870 71673 94390 106172 77884 44030 26222 134961 142263 86192 45679
6389 45679 51535 85356 89035 96984 142968 120569 87644 114011 145314 101462 81537 118541
6377 118541 89758 79060 82415 117930 64394 70533 81526 23422 55269 98361 88507 83611
6365 83611 92868 158353 174772 145696 102368 125935 129508 164291 168926 162947 140336 117914 133559
6352 133559 109193 100481 121553 150404 150801 161733 171577 152185 130456 158765 153935 133194 108039
6339 108039 135399 116963 109726 187099 149192 156141 184627 170322 169649 196564 192185 145454 186677
6326 186677 188224 211231 224249 200641 197307 157866 163401 236953 250686 226632 226241 242587 192123
6313 192123 185962 190353 209660 226037 223473 204657 235814 265178 306769 296999 291891 268848 274115
6300B74115p2132p7118P4960M7042J7868K3823n962n270k1524L2498L4501l3114
6288B89687j6345K6056j775J6790o0995m264M9565n7730k5056O4589N988l1909
6276B54601K6959J4877M7831k8881k9015J476q0227L0262J5116M737N2357j0434
6264B99659k311m3699j97l335N608j9012m354j7473L6760j2457M3976K4414k4252
6251B83327l5301N3507K6332Q834k3166N383L0498J4608j8846L4783L7614o7582
6239C49991j7986J3097L8840j5137P1307n2342p0355J0832j1876L6317L8390J623
6227C92701l8596K845P775m7506O974L711k0298m2364j1358K7420O327J1819K00
6214B99650J5320J0612m1169o6976M6276L1414J2988J9673r725M542k0261n506
$$ plain form
6300 274115 201983 124865 199825 246867 264735 288558 282596 277326 255802 288300 322801 289687
6288 289687 273342 299398 297623 314413 253418 249154 298719 240989 215933 280522 286510 254601
6276 254601 281560 296437 344268 315387 286372 287848 207621 237883 252999 257736 310093 299659
6264 299659 297348 253649 253452 250117 255725 236713 232359 214886 251646 239189 283165 307579 283327
6251 283327 248026 301533 327865 336699 313533 318916 349414 364022 345176 379959 417573 349991
6239 349991 332005 345102 383942 368805 440112 387770 317415 328247 316371 352688 391078 392701
6227 392701 354105 356950 364725 317219 324193 327904 307606 265242 253884 281304 287631 299450 299650
6214 299650 314970 325582 284413 217437 263713 295127 308115 327788 318063 322605 302344 296838
6202B96838M3875K4865j8854q739Q79K1298Q791L3357j4159J3960j2741K423O1332
6189D53125M7426j6084Q3376j1475p0241l0489l5666L5921l2983p661J8548j1111
6177D22686N63O4284l2809l2161M4973K3953M849J0426k844l521M7492P315k8549
6164E26657L889R610r458l1542J00107P0276M888M0817k897J9341L6912O0553
6152H29153O8210L2750K2842K1354J3502P571J2027o570o1412k5120j6291j1227
6140H86789M374J9510J0855l5741M6616J3216r409M7867K8978r811M1543m8662
6128I96125K7848M4825N467n560m1367N208J7433m4558p787k435o2136j5681J576
6115I18958K8973J6051k7260L1001M8494k9704l6090O9395j2671L6554K5817m9302
$$ plain form
6202 296838 340713 365578 346724 337985 338864 360162 368953 402310 388151 402111 389370 391793 453125
6189 453125 500551 484467 567843 556368 486127 455638 419972 455893 422910 415249 433797 422686
6177 422686 423249 487533 454724 422563 467536 491489 496338 506764 503920 500399 547891 555206 526657
6164 526657 530546 540156 530698 499156 599263 669539 674427 715244 712347 731688 768600 829153
6152 829153 897363 930113 952955 974309 987811 995382 1007409 1000839 939427 914307 898016 886789
6140 886789 891163 910673 921528 885787 932403 945619 936210 984077 1013055 1003244 1044787 996125
6128 996125 1023973 1068798 1074265 1068705 1027338 1032546 1049979 1005421 997634 995199 933063 917382 918958
6115 918958 947931 963982 936722 967723 1016217 986513 950423 1019818 1007147 1043701 1069518 1020216
6103A020216M5748J9461K0398O148K8858k800L0386M9194J3571q858K4628M8435
6091A295385O5714M3965M898K8658J04280o100N2762P9615J02861J00468J21249
6080A993755J14395O9115J31847J61931K11066K51726L19321L56409M42701M21718
6070D473984M30290K89503j1403k20908k52951k16660k08092j02807j5252J49476
6060D315180K15526K92410K67970J15732j33022l65600m28758l86900m05965k65332
6050C221241j99251j72884j41886o1912n3970j05315p0903l0423q086J351q576
6039B369386K7564J3370N661K6615O0802O2626M0885R0211J9030J76197J35112
6028C027459J35605J22819J57417K38666K34675L53654M72388N17347O16321N72938
$$ plain form
6103 1020216 1065964 1085425 1105823 1111971 1140829 1138029 1168415 1217609 1231180 1222322 1246950 1295385
6091 1295385 1361099 1405064 1409962 1438620 1542900 1536800 1589562 1669177 1772038 1872506 1993755
6080 1993755 2108150 2177265 2309112 2471043 2682109 2933835 3253156 3609565 4052266 4473984
6070 4473984 4904274 5193777 5182374 4961466 4708515 4491855 4283763 4180956 4165704 4315180
6060 4315180 4530706 4823116 5091086 5206818 5073796 4708196 4279438 3892538 3486573 3221241
6050 3221241 3021990 2849106 2707220 2645308 2591338 2486023 2415120 2384697 2376611 2377962 2369386
6039 2369386 2396950 2410320 2415981 2442596 2503398 2566024 2606909 2697120 2716150 2892347 3027459
6028 3027459 3163064 3285883 3443300 3681966 3916641 4270295 4742683 5260030 5876351 6449289
6018F449289M46140R1543j55750l00627l58636l00781k16463r3341Q5002K74963
6008E921339L69095L95362K62511j5737l32036n30251o06495n24406m63242m24327
5998D051813k97913k67443k10662j50363j38095p7721j07097n9766j193l6181
5988B705379q4141n5265m4449R082l518k227m6907j4165o611M0084j0393J594
5976B488463K8911K705O9069j2619L6482k702K1763L0880J3218J0683L0140J2318
5964B729311J5044N4952J8468Q2566J5121k0732L6134N1909R2056J2152O7142
5953C154123k043K4305R1152J5190R2843O1455K8521L3877O8414Q1707n001L0143
5941C674686J05082N0884P5801J18606P4296J2739J13137J11180Q7502J19741
$$ plain form
6018 6449289 6895429 6986972 6831222 6530595 6171959 5871178 5654715 5561374 5646376 5921339
6008 5921339 6290434 6685796 6948307 6932570 6600534 6070283 5463788 4939382 4476140 4051813
5998 4051813 3753900 3486457 3275795 3125432 2987337 2909616 2802519 2742753 2741560 2705379
5988 2705379 2621238 2565973 2521524 2530606 2527088 2524861 2477954 2463789 2457178 2497262 2486869 2488463
5976 2488463 2517374 2520079 2589148 2576529 2613011 2610309 2632072 2662952 2676170 2686853 2716993 2729311
5964 2729311 2744355 2799307 2817775 2900341 2915462 2894730 2930864 2982773 3074829 3086981 3154123
5953 3154123 3152080 3176385 3267537 3282727 3375570 3437025 3465546 3499423 3567837 3649544 3644543 3674686
5941 3674686 3779768 3830652 3906453 4025059 4099355 4112094 4225231 4336411 4423913 4543654
5931D543654Q3038N2439J06756R1762J01814R5375P2331O3979J33958J69479O2306
5920E576891J08925J50477J42087J13365P2790P1925J17824J51365J74415J21295
5910F801359J40554J42584K19647J29106J83421K07374K39630K23564K50645K32708
5900H770592J40831K16933J94154J80229K48785J85983J88336K78460K12755K90419
5890A0907477K69740L22757L40588L49571L30691L92812L55361M20428M91287
5881A4180712M23125M17695M28766N24446N21728M96632N37000N88432N79571
5872A8698107N67443O52918N87969N44690O33124O47320P11360O84154O78769
5863B4405854P59437P59934P87408P72594Q16176Q34801Q12417Q35870Q85706
$$ plain form
5931 4543654 4626692 4679131 4785887 4877649 4979463 5074838 5147169 5211148 5345106 5514585 5576891
5920 5576891 5685816 5836293 5978380 6091745 6164535 6236460 6354284 6505649 6680064 6801359
5910 6801359 6941913 7084497 7304144 7433250 7616671 7824045 8063675 8287239 8537884 8770592
5900 8770592 8911423 9128356 9322510 9502739 9751524 9937507 10125843 10404303 10617058 10907477
5890 10907477 11177217 11499974 11840562 12190133 12520824 12913636 13268997 13689425 14180712
5881 14180712 14603837 15021532 15450298 15974744 16496472 16993104 17530104 18118536 18698107
5872 18698107 19265550 19918468 20506437 21051127 21684251 22331571 23042931 23727085 24405854
5863 24405854 25165291 25925225 26712633 27485227 28301403 29136204 29948621 30784491 31670197
5854C1670197R06026Q77157R16498R44166Q73429Q75081R40694R74507J033238
5845D0010993J025345J037726R64216R17830Q75493P78691P69679P95744Q05416
5836D7981133R48216J043380J130890J228533J329521J498914J546435J715343
5828E8422365J918548K066468K277060K514431K805363L039441L363392L680125
5820H0087193M052117M468672M808950N111403N473359N868037O086544O182135
5812A22138410O321050O183162N571240M601614K954713Q12329j520551l546116
5804A43515851n099264o286775p155209p763812q247167q423820q249439p806170
5796H4484195p109660o421882n675801n020222m425811l810322l409661l102691
$$ plain form
5854 31670197 32576223 33453380 34369878 35314044 36187473 37062554 38003248 38977755 40010993
5845 40010993 41036338 42074064 43038280 43956110 44831603 45610294 46379973 47175717 47981133
5836 47981133 48929349 49972729 51103619 52332152 53661673 55160587 56707022 58422365
5828 58422365 60340913 62407381 64684441 67198872 70004235 73043676 76407068 80087193
5820 80087193 84139310 88607982 93416932 98528335 104001694 109869731 115956275 122138410
5812 122138410 128459460 134642622 140213862 144815476 147770189 148582518 147061967 143515851
5804 143515851 138416587 132129812 124974603 117210791 108963624 100539804 92290365 84484195
5796 84484195 77374535 70952653 65276852 60256630 55830819 52020497 48610836 45508145
5788D5508145k752061k418245k141036j967925j734831j535074j393009j272826
5780C0293138j219974j050685r79906r12933p88090o90327o46020o26971n81296
5771B2796936n68266o62738o69693p41068p31090p00901p01743o90231n86625
5762A6744581o35421n82169m84363m54455m77306m20211l93491l45837k89798
5753A2661530l01841k29388k40096k51628k10303j44980j04658j10516j20736
5744A0947384j10256k6028J2652o392J10640K10389L59595L65384L51509J94905
5734A2409782j41135n49310o32884o14227o43266n43725m64171l49552l03951
5725H167561k77647j75116j39346j27305j16666k6335n7811j8039K5676J03178
$$ plain form
5788 45508145 42756084 40337839 38196803 36228878 34494047 32958973 31565964 30293138
5780 30293138 29073164 28022479 27042573 26129640 25341550 24651223 24005203 23378232 22796936
5771 22796936 22228670 21565932 20896239 20155171 19424081 18723180 18021437 17331206 16744581
5762 16744581 16109160 15526991 15042628 14588173 14110867 13690656 13297165 12951328 12661530
5753 12661530 12359689 12130301 11890205 11638577 11428274 11283294 11178636 11068120 10947384
5744 10947384 10837128 10811100 10823752 10817360 10928000 11138389 11497984 11863368 12214877 12409782
5734 12409782 12268647 11719337 11086453 10472226 9828960 9285235 8821064 8471512 8167561
5725 8167561 7889914 7714798 7575452 7448147 7331481 7305146 7247335 7229296 7254972 7358150
5715G358150J19637J92996K68064L65745M40651N10668M87000L27811j21905m55920
5705I492897n45460n71095m61956l63573l29522k52825k35334j52047j26038m3034
5695F412013o777j4713J11681K1309J11531P7794J46336L29512L24050M72840
5685G985576M02765L77810J73950j03854k78751l11316k78405k87816k24999j92664
5675G262296j18020q5002n5282j28778r495L3594k3616m705P5953R8296J14396
5664G159637O4352J02739J91832K62222L28863M67851M54422K96904J6365k22136
5654I123051l73199m25600m30029l51486l82834k94599j60367j92148j47731j93826
5644F171232j40690j51909r9585m6675o0434j17731j08491j1841o8449r7282j29594
$$ plain form
5715 7358150 7477787 7670783 7938847 8304592 8745243 9255911 9742911 10070722 9948817 9492897
5705 9492897 8947437 8376342 7914386 7550813 7221291 6968466 6733132 6581085 6455047 6412013
5695 6412013 6405236 6390523 6502204 6523513 6635044 6712838 6859174 7188686 7512736 7985576
5685 7985576 8388341 8766151 8940101 8836247 8557496 8246180 7967775 7679959 7454960 7262296
5675 7262296 7144276 7059274 7003992 6875214 6865719 6899313 6875697 6870992 6946945 7045241 7159637
5664 7159637 7223989 7326728 7518560 7780782 8109645 8577496 9031918 9328822 9345187 9123051
5654 9123051 8749852 8324252 7894223 7542737 7159903 6865304 6704937 6512789 6365058 6171232
5644 6171232 6030542 5878633 5779048 5732373 5671939 5554208 5445717 5433876 5365427 5268145 5138551
5633E138551m3044n9181j10820j05374j10918n1490j49093k9480r6318j22228
5623D260605p1941p8986p1908j16214n4837p5086r3510q2839m9345o0731q5714
5612C419494o8484p3124n6934m5208l4669M4281l7602n7282l3558r539o8258j9018
5600B960099r3802l523k2518r4071J5499K70o9647j8211p7187k5445n679m4438
5588B521347q5608l5639P4765k0396j3683j5030q7732J5245O772o8107l7963O1500
5576B315471L7607p9759J6248n2051p7808j209k9452k5645J3821j704J0422l6915
5564B089026n3713J1204J2712k5454r269q734j1738P366P775j6704K8778l135
5552B028114k5621k5634N1900m354n56K6620q507l7241j7585j3142L091j4201
$$ plain form
5633 5138551 5095507 5036326 4925506 4820132 4709214 4657724 4508631 4479151 4382833 4260605
5623 4260605 4188664 4109678 4037770 3921556 3866719 3791633 3698123 3615284 3565939 3505208 3419494
5612 3419494 3351010 3277886 3220952 3175744 3141075 3185356 3147754 3090472 3056914 3047375 2979117 2960099
5600 2960099 2866297 2862774 2840256 2746185 2761684 2761954 2692307 2674096 2596909 2571464 2565785 2521347
5588 2521347 2435739 2400100 2474865 2454469 2440786 2425756 2338024 2353269 2360041 2291934 2253971 2315471
5576 2315471 2353078 2273319 2289567 2237516 2159708 2158499 2129047 2103402 2117223 2115519 2125941 2089026
5564 2089026 2035313 2046517 2059229 2033775 2024506 2015772 2004034 2011400 2019175 2002471 2031249 2028114
5552 2028114 2002493 1976859 2028759 2024405 2023849 2050469 2041962 2004721 1987136 1973994 1977085 1962884
5540A962884r970N4350l3549k2381m4869m3205K6830O1579N0440j1796L5321J2759
5528B038393q101K0253o415K8981M4468J9090L457k4731N4669L2870M3502J5533
5516B261969j2932J9198L4379M709P217J8375P4159J0898M1162J09697O2093j44
5504B630780O2618K6459j6834Q1240J8386M3296J04960O7980P7168J19415r447
5493C206021L3959O9068N2746N7823Q5988J24453P9056J05169J04029J06579N3760
5482D078651J48085J27486O2485R8640J41337P3841O1792P0383P0603O9370P2574
5471E075247O1804O2850M523J11485Q7592N991J23074J57716J03647K9660J17010
5460E940599Q8067P9642R4036N4915P1462J14619Q4598N5055J2676N0612N7247
$$ plain form
5540 1962884 1952914 2007264 1973715 1951334 1906465 1863260 1890090 1951669 2002109 1990313 2025634 2038393
5528 2038393 2030292 2050545 2044130 2073111 2117579 2136669 2140126 2115395 2170064 2202934 2246436 2261969
5516 2261969 2249037 2268235 2302614 2307323 2314540 2332915 2407074 2417972 2459134 2568831 2630924 2630780
5504 2630780 2693398 2719857 2703023 2784263 2802649 2845945 2950905 3018885 3096053 3215468 3206021
5493 3206021 3239980 3309048 3361794 3419617 3505605 3630058 3709114 3814283 3918312 4024891 4078651
5482 4078651 4226736 4354222 4416707 4515347 4656684 4730525 4792317 4862700 4933303 5002673 5075247
5471 5075247 5137051 5199901 5204424 5315909 5403501 5409492 5532566 5690282 5793929 5823589 5940599
5460 5940599 6028666 6108308 6202344 6257259 6328721 6443340 6527938 6582993 6595669 6646281 6703528
5449F703528J5535o615J5680n223L4671L9502j4532L0630k770l1877J1883M5039
5437F835451N6796O9270L6648K1405Q2168Q3665Q0186Q3969J32913Q937O6193
5426G557601L1851k0553L57N1669q963J7533J5019j2868N3563Q0215K9653J51737
5414G946814J53081J59950K42636K32712K42973K69938K26290L03036J67876J67383
5404A0112689K55773K28422J98604J82190K35624J39258J38472J28213J84902
5395A1804147Q8129J011P6568J58510M7262J04635J00225J09953J41993K33695
5385A2866128K64369K73519L48817L00207L09493L03350K86106K97378K96091
5376A5545458L38795M33227N45424O49898P04232P91988Q56462J030910J133437
$$ plain form
5449 6703528 6719063 6712448 6728128 6722905 6757576 6797078 6782546 6813176 6810406 6778529 6790412 6835451
5437 6835451 6892247 6961517 6998165 7019570 7101738 7185403 7265589 7349558 7482471 7491408 7557601
5426 7557601 7589452 7568899 7569256 7620925 7611962 7629495 7644514 7631646 7685209 7765424 7795077 7946814
5414 7946814 8099895 8259845 8502481 8735193 8978166 9248104 9474394 9777430 9945306 10112689
5404 10112689 10368462 10596884 10795488 10977678 11213302 11352560 11491032 11619245 11804147
5395 11804147 11892276 11893287 11969855 12128365 12175627 12280262 12380487 12490440 12632433 12866128
5385 12866128 13130497 13404016 13752833 14053040 14362533 14665883 14951989 15249367 15545458
5376 15545458 15884253 16317480 16862904 17512802 18217034 19009022 19865484 20896394 22029831
5367B2029831J307217J524117J721775K115829K555741L069954L436485L567781
5359D1328730L169870K375219J522675P70969L08556L44722O01097R26042J263268
5350E2611148J525351J801729K094110K344198K655633K902367K981681K957517
5342G1873734K704758K254923J684750J082855L17882m03425o15421o19785o27765
5333G7652506p33636j148392j761588k535486l014839l287412l345783l121776
5325E8703594k849292k476446k002042j535615j202775j144792j306056j695643
5317D4490933k236508k638326k828912k726439k535072k238676j894628j601978
5309B5790394j447604j404693j358794j318893j300652j128943r59229q79578
$$ plain form
5367 22029831 23337048 24861165 26582940 28698769 31254510 34324464 37760949 41328730
5359 41328730 44498600 46873819 48396494 49167463 49476019 49820741 50421838 51347880 52611148
5350 52611148 54136499 55938228 58032338 60376536 63032169 65934536 68916217 71873734
5342 71873734 74578492 76833415 78518165 79601020 79918902 79515477 78900056 78280271 77652506
5333 77652506 76918870 75770478 74008890 71473404 68458565 65171153 61825370 58703594
5325 58703594 55854302 53377856 51375814 49840199 48637424 47492632 46186576 44490933
5317 44490933 42254425 39616099 36787187 34060748 31525676 29287000 27392372 25790394
5309 25790394 24342790 22938097 21579303 20260410 18959758 17830815 16871586 15992008
5301A5992008p26935n75873n52345m13453m24688l13710k06617j99068j52495
5292A2426824j91597j81001j14605j08182j54136j36154j4145j21329j31662p8884
5282A1195129o2678q2286j95371k48766k18526l02429l09115l18642l16548k10789
5272H929979k77667k68333k80221k20891k02905j68842k34494k83771k92092j87992
5262F512771k60804k45903j87203k15898k10878j83156j70561j26611j09788j88974
5252D612995j90518j63845r7202j47227j59415q7198j98230j14760m8179j04407
5242C302014l6905r4239o8774m2356p7328j7857l1629q9453n5268n0278k0174
5231B717753n6739l5907j1062o4004n3746l7487p4106K767r605n1870j03845q9301
$$ plain form
5301 15992008 15265073 14689200 14136855 13723402 13298714 12985004 12778387 12579319 12426824
5292 12426824 12235227 12054226 11939621 11831439 11677303 11541149 11527004 11405675 11274013 11195129
5282 11195129 11132451 11050165 10854794 10606028 10387502 10085073 9775958 9457316 9140768 8929979
5272 8929979 8652312 8383979 8103758 7882867 7679962 7511120 7276626 6992855 6700763 6512771
5262 6512771 6251967 6006064 5818861 5602963 5392085 5208929 5038368 4911757 4801969 4612995
5252 4612995 4422477 4258632 4161430 4014203 3854788 3767590 3569360 3454600 3406421 3302014
5242 3302014 3265109 3170870 3102096 3059740 2982412 2964555 2932926 2843473 2788205 2737927 2717753
5231 2717753 2661014 2625107 2614045 2550041 2496295 2458808 2384702 2387469 2377864 2325994 2222149 2132848
5219B132848J5850k0788o607l361K69m5831k7358o5139l4194K5868l1005O111
5207A946663J7105j5106Q4446m3476o0617j3579Q204j5879l7453L8838L076o0898
5195A851324J7769O2176m037K9918r518k7365o811p081O6912K2542R610J7547
5183B022986M1669L8711L0324M5564R4186L8543j6043R6657O2653N7961J10636
5172B623847O3972J10367J17304J96977J22627J17865J07538O776j8760J477l3609
5161C416381q7258m7433m5853l703j4415J6741k554J30337J10768J96867K39724
5150C909602K16119K20217R6933J41837J55265J16322J65424P1156k3527R8659
5140E168007J31148R8858J33905J44545M2294j19062q5856q141N1634O2847Q3124
$$ plain form
5219 2132848 2148698 2127910 2121303 2117942 2118211 2072380 2045022 1979883 1945689 1971557 1940552 1946663
5207 1946663 1963768 1948662 2033108 1989632 1929015 1915436 1923640 1907761 1870308 1909146 1912222 1851324
5195 1851324 1869093 1931269 1927232 1957150 1947632 1920267 1913456 1906375 1973287 1995829 2005439 2022986
5183 2022986 2064655 2103366 2133690 2179254 2273440 2311983 2295940 2392597 2455250 2513211 2623847
5172 2623847 2687819 2798186 2915490 3112467 3235094 3352959 3460497 3467273 3448513 3449990 3416381
5161 3416381 3329123 3281690 3235837 3232134 3217719 3234460 3231906 3362243 3473011 3669878 3909602
5150 3909602 4125721 4345938 4442871 4584708 4739973 4856295 5021719 5092875 5069348 5168007
5140 5168007 5299155 5398013 5531918 5676463 5718757 5599695 5513839 5505698 5557332 5620179 5703303
5129E703303R8271J51468J55236K12351L08587K36437K40731K67203K10863J29965
5119G714415J00351J2394j54225j68188j68603q3222L1122J10587J97712K54622
5109G846965J90901J99570J76116K65509K27612K85079L96246M09858N54104P88891
5099A1340851J051343R72978O29715R23n01498o26019n68911n19785m39580m37539
5089A0902478l51417j41224O6935L06964O18509Q08667Q86032Q93384M18882j62029
5079A4247181m32669m20868k57157p3034Q6086J48674o0784n71733r58035r22512
5069A0785149q25033o55206n55271m35308k85319r1706R9333K79649M52729N80673
5059I349690O74462N06630Q0755m79699p79361p26388p69546o74573m95970m49273
$$ plain form
5129 5703303 5801574 5953042 6108278 6320629 6629216 6865653 7106384 7373587 7584450 7714415
5119 7714415 7814766 7827160 7672935 7504747 7336144 7252922 7284044 7394631 7592343 7846965
5109 7846965 8037866 8237436 8413552 8679061 8906673 9191752 9587998 9997856 10551960 11340851
5099 11340851 12392194 13365172 13994887 13995810 13494312 12868293 12299382 11779597 11340017 10902478
5089 10902478 10551061 10409837 10476772 10783736 11402245 12210912 13096944 13990328 14409210 14247181
5079 14247181 13814512 13393644 13136487 13063453 13149539 13298213 13237429 12665696 11707661 10785149
5069 10785149 9960116 9304910 8749639 8314331 8029012 7937306 8036639 8316288 8769017 9349690
5059 9349690 10024152 10530782 10611537 10131838 9352477 8626089 7856543 7181970 6686000 6236727
5049F236727l55632l20906k69833j94532j07810j18108p0625l5955o7552o7595
5039D628179N0402R9642J12937Q6698O9867n82q1460n7570j03935j80095q6622
5028D537461p6835l4483n6096j19105q2187n8140j53945r4507q1719j05210j817
5017C673417Q0653J0638N0852J28065N4602k8749l3865r1644j51476j34875j43007
5006C414611j77466j53363j18565m8538o7588j12768j8548j47284j52003n5939
4996B362549k1202p2092q4216k6735k8450r380L6027j5757o4944q9123o0220l0076
4984A896381r4077p2465l8520m9229n1381j1088K4837j4960p8334n8069p3725
4973A379370n1177j4267m2703l8701n8683n043j7108j5653l8106k5408P742n796
$$ plain form
5049 6236727 5881095 5560189 5290356 5095824 4988014 4869906 4799281 4763326 4695774 4628179
5039 4628179 4678581 4778223 4891160 4977858 5047725 5047143 4965683 4908113 4804178 4624083 4537461
5028 4537461 4460626 4426143 4370047 4250942 4168755 4110615 3956670 3862163 3780444 3675234 3673417
5017 3673417 3754070 3764708 3815560 3943625 3998227 3969478 3935613 3843969 3692493 3557618 3414611
5006 3414611 3237145 3083782 2965217 2916679 2849091 2736323 2717775 2570491 2418488 2362549
4996 2362549 2341347 2269255 2185039 2158304 2129854 2120474 2156501 2140744 2075800 1986677 1926457 1896381
4984 1896381 1802304 1729839 1691319 1642090 1590709 1579621 1604458 1589498 1511164 1453095 1379370
4973 1379370 1328193 1313926 1271223 1232522 1173839 1168796 1151688 1136035 1097929 1072521 1080263 1074467
4961A074467J2438o2720j8581j995n972J3608K6418J5533k1452j4303n7334K0605
4949I80712q30K5919l2653J6131J2252l1911K774j6964n0627R526J2762j8343
4937I08748K0254l3044k1247k7691n737m7964k2052M6602K460k1333n1419r619
4925G37958j5937O877j5264P838k6452l2607M82M8663q914J2892M1628n9086j4892
4912F83186P053j6435M35j317R452M1130L0346k9077p1759K9599j9060M3025r190
4899F97388q7456l4392r308J6212J4384r3060j0875j197K9311J5115j8194l4345
4887D83583Q079K3684l6867L3273N6792m0132L843k4253l8702J1242O3313L5747
4875E79602k1444J1820n1079K2404O0768M7441m0472M2736L5673l296J0166k5650
$$ plain form
4961 1074467 1086905 1024185 1005604 1003609 997637 1011245 1037663 1053196 1031744 1017441 960107 980712
4949 980712 979882 1005801 973148 989279 1001531 969620 972394 955430 904803 914329 927091 908748
4937 908748 929002 895958 874711 847020 841283 793319 771267 817869 820329 798996 747577 737958
4925 737958 722021 728898 713634 721472 695020 662413 662895 711558 702644 715536 757164 698078 683186
4912 683186 690239 673804 674239 672922 682374 723504 753850 724773 653014 682613 663553 706578 697388
4899 697388 609932 575540 566232 582444 596828 503768 492893 491696 521007 536122 517928 483583
4887 483583 491662 515346 478479 511752 568544 528412 532255 508002 469300 480542 543855 579602
4875 579602 558158 569978 518899 541303 602071 649512 609040 651776 687449 684153 694319 668669
4863F68669k5415l7874p525J361k1738J7904J2135j1166R656m524P5702Q2081
4851G59266m4469q595q444n001j9791l7002n6042m3807J0985Q913q996K1185k9704
4838E38498j8232Q752k3251K3988M4046K9585r099j3389l629K690L7704j8406
4826E99257j7496l352L9850J4J2242O4272o895N434j7190R0117m0273Q243M0804
4813G75027K1884R118k4089Q2121m626j082n280J4806j178K8848Q4479L1819L4560
4800A046407L2435k7513l6017J5714L3298J9149J4820P1767j925Q80N694O2517
4788A237226L0097K6714M7132N1676M3969N4440L8824l2108M359K5988Q2179P79
4776A611275o780K4519P156o468N1980L7719M382J0355L5046O1600R1475J33568
$$ plain form
4863 668669 643254 605380 597855 599216 577478 595382 607517 596351 606007 601483 677185 759266
4851 759266 714797 706202 697758 692757 672966 635964 579922 536115 547100 556013 547017 568202 538498
4838 538498 520266 529018 505767 529755 573801 603386 594287 580898 577269 579959 617663 599257
4826 599257 581761 578409 618259 618273 630515 694787 687892 693326 676136 766253 725980 734223 775027
4813 775027 796911 806029 781940 864061 859435 858353 853073 867879 866701 895549 980028 1011847 1046407
4800 1046407 1078842 1051329 1015312 1031026 1064324 1083473 1098293 1170060 1168135 1169015 1174709 1237226
4788 1237226 1267323 1294037 1341169 1392845 1436814 1491254 1530078 1497970 1502329 1528317 1610496 1611275
4776 1611275 1604495 1629014 1636170 1629702 1681682 1719401 1723783 1734138 1769184 1830784 1922259 2055827
4764B055827M6090P1656N8456J11862P9417M4618P8045Q7556R4957Q6708P4655
4753B889847O6047Q5555R6256J63877J13225J66882J74011J40817K32201K30548
4743D359266K03460L06682L25815M03798M73081O23574O85047P63576Q23410J002670
4733I970379J153653J434311J836492K278673K854615L313290L463832K801982
4725B9107227R87508o82644k057664l181718l208460k899604k358973j881484
4717A3824188j446798r03734n02868k93387n4998K08084L64863N87725P00639
4708A2483714O78432N32252P7363k83762o84485j051609j102874j030333q32711
4699H785987o90033n15573k82100j64491j03055k3469J40275K43359L69854M90597
$$ plain form
4764 2055827 2101917 2173573 2232029 2343891 2423308 2467926 2545971 2633527 2728484 2815192 2889847
4753 2889847 2955894 3041449 3137705 3301582 3414807 3581689 3755700 3896517 4128718 4359266
4743 4359266 4562726 4869408 5195223 5599021 6072102 6695676 7380723 8144299 8967709 9970379
4733 9970379 11124032 12558343 14394835 16673508 19528123 22841413 26305245 29107227
4725 29107227 30094735 29412091 27354427 24172709 20964249 18064645 15705672 13824188
4717 13824188 12377390 11473656 10970788 10677401 10622403 10830487 11195350 11783075 12483714
4708 12483714 13162146 13694398 13771761 13487999 12803514 11751905 10649031 9618698 8785987
4699 8785987 8095954 7580381 7298281 7133790 7030735 7007266 7147541 7390900 7760754 8251351
4689H251351N32144M38653M69064K87544j10400m52406n72437m53312l85978j76833
4679G827390l531J48850K21630L58787N31359P20258R62934J256488J649877K090391
4669A5764433K567501K711092K270774Q53381j73710r77752k396126k905066k700109
4660A5014418k350580j888497j563489j220170r61382p35222o41213m57064m21876
4651D774925l19857k72909k28479j72664j59242j58053r6848j08823j46189o6862
4641C044999j03632j8736j33135j54524q6974m6572m7844j20285n3096r6637j13959
4630B069605J2693J5703n2697k9259m0238J4720q693l6812J0859k7957k3229q1471
4618A823224J2046p7326o3374j156Q523j6689r475k0864K6203j6978l3510k3498
$$ plain form
4689 8251351 8783495 9222148 9691212 9978756 9868356 9415950 8843513 8390201 8004223 7827390
4679 7827390 7823859 7972709 8194339 8553126 9084485 9804743 10767677 12024165 13674042 15764433
4669 15764433 18331934 21043026 23313800 24167181 23993471 23015719 20619593 17714527 15014418
4660 15014418 12663838 10775341 9211852 7991682 7030300 6295078 5653865 5196801 4774925
4651 4774925 4455068 4182159 3953680 3781016 3621774 3463721 3366873 3258050 3111861 3044999
4641 3044999 2941367 2922631 2789496 2634972 2547998 2501426 2453582 2333297 2280201 2183564 2069605
4630 2069605 2082298 2098001 2045304 2016045 1975807 1990527 1981834 1945022 1955881 1927924 1904695 1823224
4618 1823224 1835270 1757944 1694570 1693414 1701937 1685248 1675773 1654909 1681112 1664134 1630624 1607126
4606A607126j272N2722K4287j9610J1837L4152R565k7791K6425J3729L5794p577
4594A759387K6904N9676P4149L5128j4819k1528J3511N88R778O6301L2842Q499
4582B050416N5053M9001M8242P4480L6467Q2411R3266J05253J11916J60022K04911
4571C071438J83152J86197K78847L24444N00340N66165O09277N91269M84637J30036
4561F925802j44084l20693l42443k64692j58813l1794K10192L71701L89360N02192
4551G136728M03122M9854k93359l48053j81839j84259j0545J95993L87431M05407
4541G560480K77734L5536k53748m73292m97232l93725k09798j44391J73225L12976
4531F387765L80473L94140K28778j57549n16624n30209n79961m56482l92752k24812
$$ plain form
4606 1607126 1605854 1658576 1682863 1663253 1675090 1709242 1718807 1691016 1717441 1731170 1766964 1759387
4594 1759387 1786291 1845967 1920116 1955244 1940425 1918897 1932408 1932996 1942774 2009075 2041917 2050416
4582 2050416 2105469 2154470 2202712 2277192 2313659 2396070 2489336 2594589 2706505 2866527 3071438
4571 3071438 3254590 3440787 3719634 4044078 4544418 5110583 5719860 6311129 6795766 6925802
4561 6925802 6781718 6461025 6118582 5853890 5695077 5663283 5873475 6245176 6634536 7136728
4551 7136728 7539850 7589704 7296345 6948292 6766453 6582194 6571649 6767642 7155073 7560480
4541 7560480 7838214 7873750 7620002 7146710 6649478 6255753 6045955 5901564 6074789 6387765
4531 6387765 6768238 7162378 7391156 7233607 6716983 6186774 5606813 5150331 4757579 4532767
4521D532767j38691r8591r3524p4677j58554k10259j92205j28306j35359l1191
4511C271410k7798R5850J3180K9973L728j09360j56489j44009j18214j79841j42698
4500B535732j34173j01474n8412m6891j20807o1923l2215l1081k2719r9615k3896
4489A802526m2318k9689l1852p391J036l0020j4910p2899J62k6463n4030K3357
4477A517509n9703N5427N714l5476r260o2112M316o4654n8615L6049M2694P469
4465A379358M6227j7269m1594M530k2025l6989K3037l5001j6627l746Q539l8264
4453A250176n9759M3810J2306m5026M3875l6397m5787O9302K2398p625M4688j801
4441A290160n0129L8199N2307N6592K152l0472M6802K2803K3718l2733N9837Q7923
$$ plain form
4521 4532767 4394076 4295485 4201961 4127284 3968730 3758471 3566266 3437960 3302601 3271410
4511 3271410 3243612 3339462 3352642 3382615 3386343 3276983 3120494 2976485 2858271 2678430 2535732
4500 2535732 2401559 2300085 2241673 2194782 2073975 2012052 1979837 1948756 1926037 1826422 1802526
4489 1802526 1760208 1730519 1698667 1691276 1692312 1662292 1647382 1574483 1574645 1548182 1494152 1517509
4477 1517509 1457806 1513233 1518947 1483471 1474211 1412099 1416415 1351761 1293146 1329195 1371889 1379358
4465 1379358 1425585 1408316 1366722 1371252 1349227 1312238 1335275 1300274 1283647 1279901 1288440 1250176
4453 1250176 1190417 1234227 1246533 1201507 1245382 1208985 1163198 1232500 1254898 1247273 1291961 1290160
4441 1290160 1240031 1278230 1330537 1387129 1389281 1358809 1405611 1428414 1452132 1419399 1479236 1567159
4429A567159P1572J15576J61087J13731J39442J36875J11835l858p3599j41214
4419B198606k10856j52142j33492j10799n5508m4528o2054j1409J616k5319n6309
4408A337806r2800j6119k9967l8159L179n0557m4221l306K2034p6925J0946M1265
4396A063176Q797q756l7811J8077j1479L3497l845l5088l793l8855L1237J7074
4384A032231K4030l9444K7086J293k8138j0960j7546k54j9171J1354L6678k0418
4372I96741J8290j6863L6524R506J8118l03J0769L40j0128j3214J5862Q072L0258
4359A103972P0537K3333K8576J8386L7279O0565K0781k2553N3086K3531J9277
4348A436770l8450r789R901P26m0608K9763K1509j9225j8572L4029L4286j5108
$$ plain form
4429 1567159 1638731 1754307 1915394 2029125 2168567 2305442 2417277 2413419 2339820 2198606
4419 2198606 1987750 1835608 1702116 1591317 1535809 1491281 1429227 1417818 1419434 1394115 1337806
4408 1337806 1245006 1228887 1198920 1160761 1163940 1113383 1069162 1065856 1087890 1010965 1021911 1063176
4396 1063176 1071973 1063217 1025406 1043483 1032004 1065501 1061656 1026568 1022775 983920 1015157 1032231
4384 1032231 1056261 1016817 1043903 1045196 1017058 1006098 988552 988298 969127 980481 1017159 996741
4372 996741 1015031 998168 1034692 1044198 1062316 1062013 1072782 1073122 1062994 1049780 1065642 1073714 1103972
4359 1103972 1174509 1197842 1226418 1244804 1282083 1342648 1363429 1340876 1393962 1417493 1436770
4348 1436770 1398320 1388531 1398432 1399158 1358550 1388313 1409822 1390597 1372025 1406054 1440340 1425232
4336A425232J8613M3340K3438P935k1843j4585K2211j472n428R2483J6827l3542
4324A573209o227j7361L7080J5223o9708R198j691m8713q194P251L3582J9107
4312A542756l9759N2608L7498K7746j4536k199J07967N0802J10649P6765O2155
4301B012452Q7189J3579m49J7751l7535j3671m4129n5580r405j0711n3348R2407
4289A998550j0040K4134O2245J4848J0840J9438R6797N4337L271J8096K8848L8630
4277B359994m3002m79k0537l7956J8813K2848j49M1229Q0014M9194M1403Q5384
4265B596756J05628M3497P2834L1154N3039J21430J07245P1834L4649p931M7307
4254C277442q676k4507k4734J2673m774M7097l3366j6653j3689O3355M8688K7921
$$ plain form
4336 1425232 1443845 1487185 1510623 1518558 1496715 1482130 1504341 1502869 1497441 1589924 1606751 1573209
4324 1573209 1566982 1549621 1586701 1601924 1532216 1541414 1539723 1491010 1482816 1490067 1523649 1542756
4312 1542756 1502997 1555605 1593103 1620849 1606313 1604114 1712081 1762883 1873532 1950297 2012452
4301 2012452 2099641 2113220 2112771 2130522 2092987 2079316 2035187 1979607 1970202 1959491 1906143 1998550
4289 1998550 1988510 2012644 2074889 2089737 2100577 2120015 2216812 2271149 2274420 2292516 2321364 2359994
4277 2359994 2316992 2316513 2295976 2258020 2276833 2299681 2299532 2340761 2420775 2469969 2511372 2596756
4265 2596756 2702384 2745881 2818715 2849869 2902908 3024338 3131583 3203417 3238066 3230135 3277442
4254 3277442 3268766 3244259 3219525 3232198 3227424 3274521 3241155 3224502 3210813 3274168 3322856 3350777
4242C350777O9170Q0807R3417L8746J50651J51183P5684Q1208O9101K8726J11976
4231D301446P2877L9927M2129O2598L0344L9050L3466J3273M5892K121M9679M7434
4219D780236J10579J66201J55942J01925J05677J88157J06146J33563J41222J21820
4209F111468J50809Q7150J75318J84479J91908K10176K12669J58589K08426K07296
4199G898288K25908J57584J82479J99645J59665K03331J73240K21076K44032J52430
4189I817678K58759K64720K89875K57772K71712K47307K02841L05340L23233L12122
4179A2551359M28105M88332N14884N62330O07826O81297O04255O75442P51382
4170A7865212Q24996Q58263R20972R62017R70167J045316J091400J175600J241232
$$ plain form
4242 3350777 3419947 3500754 3594171 3632917 3783568 3934751 4010435 4091643 4160744 4189470 4301446
4231 4301446 4374323 4414250 4456379 4518977 4549321 4588371 4621837 4635110 4681002 4683123 4732802 4780236
4219 4780236 4890815 5057016 5212958 5314883 5420560 5608717 5714863 5848426 5989648 6111468
4209 6111468 6262277 6349427 6524745 6709224 6901132 7111308 7323977 7482566 7690992 7898288
4199 7898288 8124196 8281780 8464259 8663904 8823569 9026900 9200140 9421216 9665248 9817678
4189 9817678 10076437 10341157 10631032 10888804 11160516 11407823 11610664 11916004 12239237 12551359
4179 12551359 12979464 13467796 13982680 14545010 15152836 15834133 16438388 17113830 17865212
4170 17865212 18690208 19548471 20469443 21431460 22401627 23446943 24538343 25713943 26955175
4161B6955175J311105J346072J445029J649487J708606J887729K129526K532699
4153D0965428K904284L471819M027214M690470N401433O099885O891420Q073595
4145H2525548R568028J1610855J3863831J6476037J9356582K2130546K3773092
4138A99304519K5211212K4398305K1497592J1253365m812326k0387618l0100703
4131B26364346l1149709k9044433k5345730k1196480j6947470j3476774j0785576
4124G8418174q907730p310918o072753m870962m068195l471440l093122k637863
4116C7985191k363928j953664j816933j590465j436126j275965j350811j306944
4108B4890355j140393j104583j059378j045970r44783q49320q18304p17747n69171
$$ plain form
4161 26955175 28266280 29612352 31057381 32706868 34415474 36303203 38432729 40965428
4153 40965428 43869712 47341531 51368745 56059215 61460648 67560533 74451953 82525548
4145 82525548 92093576 103704431 117568262 134044299 153400881 175531427 199304519
4138 199304519 224515731 248914036 270411628 281664993 276852667 256465049 226364346
4131 226364346 195214637 166170204 140824474 119627994 102680524 89203750 78418174
4124 78418174 69510444 62199526 56126773 51255811 47187616 43716176 40623054 37985191
4116 37985191 35621263 33667599 31850666 30260201 28824075 27548110 26197299 24890355
4108 24890355 23749962 22645379 21586001 20540031 19595248 18745928 17927624 17209877 16640706
4099A6640706n24264m05720l99085m07254l72643k14867k61956m25960m25651
4090A3203306m67674m40714m30657m49220l68473l68067l28945k11174k01828
4081I936554j68074j66241j77063k42048k33437j63417j48735j82348j45031r9657
4071H210503p0438m4292p0826J0125l659n3468n4061k6332P1082J05713N6615
4060H130962J1466L8384N087J6222o2038k41244l23967k92135l23982l76184l00033
4049F282538l50795k48394k01524j86511j36361m0116R034R409K5852P3004K07258
4038E443394K85982M20113L86578L41598L51593K03941r3799l02814m22823m88727
4028F125036m01174l87502l78550k60561k41857k53513j43029j80147q5607J527
$$ plain form
4099 16640706 16116442 15710722 15311637 14904383 14531740 14316873 14054917 13628957 13203306
4090 13203306 12735632 12294918 11864261 11415041 11046568 10678501 10349556 10138382 9936554
4081 9936554 9768480 9602239 9425176 9183128 8949691 8786274 8637539 8455191 8310160 8210503
4071 8210503 8140065 8095773 8024947 8035072 8031413 7977945 7923884 7897552 7968634 8074347 8130962
4060 8130962 8142428 8180812 8185899 8202121 8140083 7898839 7574872 7282737 6958755 6582571 6282538
4049 6282538 5931743 5683349 5481825 5295314 5158953 5118837 5127871 5137280 5163132 5236136 5443394
4038 5443394 5729376 6149489 6536067 6877665 7229258 7433199 7339400 7036586 6613763 6125036
4028 6125036 5723862 5336360 4957810 4697249 4455392 4201879 4058850 3878703 3793096 3794623
4018C794623o8976p8770Q995j644o834K0202K9430J66048K40888J38536J57191
4007D399689N0344j14361k65651k26136k12705j57836j61797j60425j45839n4856
3997B950427j08259j45602m4288m134p7959q0270l3365K1995j5535j3745J8196
3986B467461l9398o284N6289p459k5161M7484J8260O5814O60m562m5830o5106
3974B462168o7092j00430r4592l3326k6937R101k0340O6324K1729p7832l269L0593
3962B166097K5358k6493o515l0961n6592L676m5137j4130k0042K8084n6859j5384
3950A951102K8283L4441m6382l358L9335J6075N0818M575k9304r6968o5419j09104
3938A774094n7305r4755r9644j00673k4369q948j7596J7434k180m2719l984J8569
$$ plain form
4018 3794623 3725647 3646877 3655872 3654228 3647394 3667596 3697026 3863074 4103962 4242498 4399689
4007 4399689 4450033 4335672 4070021 3843885 3631180 3473344 3311547 3151122 3005283 2950427
3997 2950427 2842168 2696566 2652278 2648144 2570185 2489915 2456550 2478545 2463010 2449265 2467461
3986 2467461 2428063 2421779 2478068 2470609 2445448 2492932 2511192 2577006 2577666 2573104 2527274 2462168
3974 2462168 2395076 2294646 2200054 2166728 2139791 2148892 2128552 2194876 2216605 2138773 2135504 2166097
3962 2166097 2191455 2164962 2158447 2127486 2070894 2074570 2029433 2015303 1995261 2023345 1966486 1951102
3950 1951102 1979385 2013826 1967444 1964086 2003421 2019496 2070314 2074889 2045585 1948617 1883198 1774094
3938 1774094 1716789 1622034 1522390 1421717 1397348 1388400 1370804 1388238 1386058 1343339 1339355 1357924
3926A357924m5027l3745l8083m0787j4551o692n360j3530J7789O6858J5060j3186
3914A246670m6684M5749L3011n2524k566M6280q353L359N1602O389j1700K5315
3902A336548P3859N2965L9802N9477L5743k410k538J1066M7340m4924j7643l9066
3890A550219K2323J6542l2969n4619p471L5266k6990m5760j1438m0770j4763J1320
3878A400890m5678L978n364l3279m3925j898k613L4805k4715K616r8619K4344
3866A210542O7152J3457k924Q169M326M2535n310O943K5398J8274R0514K8951
3854A508027N0923M3418P4179J32979J33469J72300J29574J13746J22455J36327
3844B617397Q0042k2689o0120r7441r4481j06980k0909k5371P5878J00192K01436
$$ plain form
3926 1357924 1312897 1279152 1241069 1200282 1185731 1179039 1173679 1160149 1177938 1244796 1259856 1246670
3914 1246670 1199986 1245735 1278746 1226222 1223656 1269936 1261583 1264942 1316544 1322933 1311233 1336548
3902 1336548 1410407 1463372 1503174 1562651 1598394 1595984 1593446 1604512 1651852 1606928 1589285 1550219
3890 1550219 1572542 1589084 1556115 1501496 1494025 1529291 1502301 1456541 1445103 1404333 1389570 1400890
3878 1400890 1355212 1359190 1353826 1320547 1276622 1274724 1272111 1306916 1282201 1284817 1186198 1210542
3866 1210542 1277694 1291151 1288227 1296396 1300722 1343257 1337947 1344890 1370288 1388562 1479076 1508027
3854 1508027 1558950 1602368 1676547 1809526 1942995 2115295 2244869 2358615 2481070 2617397
3844 2617397 2697439 2674750 2614630 2517189 2422708 2315728 2294819 2269448 2345326 2445518 2646954
3833B646954K57436J37702k556j64362k85016k78912k55548j76310j31022j60649
3823A587717j33537j01225k6045n5374j4695k8579m2805m1024m013J8675l4375
3812A124720o9079r6899k5712k7221K0456N381m5377l8351K4269K266p755O860
3800H73558j4302K17j4096J6110j0765k412O1923k5138k4446J9904j000j3376
3788H66177k9081m1050J5381j7639p928j0380k5767l1505L3123q717p017L1285
3776G66882M7954L2810l9718k543N2094l5682m0031n0419j0961P4163L3935N161
3764H33645j5008K2023L1699K8089J0879M1007O9094L2130J01413O3171R2398
3753A310540J11445R5945R0261M4734O744p4065q9298j02396o8440r6158p5435
$$ plain form
3833 2646954 2904390 3042092 3039536 2875174 2590158 2311246 2055698 1879388 1748366 1587717
3823 1587717 1454180 1352955 1326910 1271536 1256841 1228262 1185457 1144433 1140420 1159095 1124720
3812 1124720 1055641 958742 933030 905809 926265 931646 886269 847918 872187 874453 866698 873558
3800 873558 859256 859473 845377 861487 850722 848310 910233 885095 860649 880553 879553 866177
3788 866177 837096 796046 811427 793788 785860 775480 749713 718208 751331 742614 735597 766882
3776 766882 814836 847646 807928 805385 857479 821797 781766 731347 720386 794549 828484 833645
3764 833645 818637 840660 872359 900448 911327 952334 1021428 1053558 1154971 1218142 1310540
3753 1310540 1421985 1517930 1608191 1652925 1659669 1585604 1496306 1393910 1325470 1229312 1153877
3742A153877j17899j38115r5633j515m2441k5318k4762k2868K5137k6906n4846
3731F28711K3537n5200j4741J6197K1842K7381m6296K0965k8009n8183K1745J8551
3719E76500k8006J0889l5507q377M0103N028j1459l2757J7620n155L1301o199
3707E53981n5267o1992R312n404J2000J8187K0037j1199L9982k5684J7927j2538
3695D99342k4114K5695j6079k0154K1872P078m7156M495J5159m617m887N2528
3683E09162J8954n0598o128L1560r670k8668k4129K2313k7022L87N7619L952j9917
3670D77815m01n2763N7158K2712j1015L8014l7329m8440K7523o086k5147k6339
3658D15702L1358L0713P342j9210J8234M8000j2925J6865n0069n9389K7912N4788
$$ plain form
3742 1153877 1035978 897863 802230 800715 758274 732956 708194 685326 710463 683557 628711
3731 628711 652248 597048 582307 598504 620346 647727 601431 622396 594387 536204 557949 576500
3719 576500 548494 559383 523876 515499 555602 560630 549171 516414 534034 528879 560180 553981
3707 553981 498714 436722 446034 440630 452630 470817 490854 479655 519637 493953 511880 499342
3695 499342 475228 500923 484844 464690 486562 493640 446484 450979 466138 461521 456634 509162
3683 509162 528116 477518 471390 502950 493280 464612 440483 462796 435774 436161 493780 497732 477815
3670 477815 477414 424651 481809 504521 493506 531520 494191 445751 473274 467188 442041 415702
3658 415702 447060 477773 485115 465905 484139 532139 519214 536079 486010 426621 454533 509321
3646E09321l3441n3446L0029J3190R00J702K3054j9977M052k739k3486n4735K6248
3633D20672K8587r281j7241Q404J6018N7498j6623O615j5786Q450M2093q517K8291
3620E49180j3811r05n406m829j2368j2968Q813J6729m9597Q136l7747n3263R081
3607D01045L8524M6909J7077r234l1748m529P1036n027p8116o775k2054M0378
3595D57486L0026O709j4979m4766k8475M869N6217Q1166k184l6831j2697l4446
3583D62095k6530J2479M0079j631j9599K143r861k0171K0481K374j4807N5p679
3570D39428N4893Q317O440j7640l1196K1380j1124j3134J9821l7470j0437K2901
3558D52179j2619l1169L0515L8370m625O0451m4027k0822j1960K14L036J2954
$$ plain form
3646 509321 475880 422434 452463 465653 466553 468255 491309 471332 475384 472645 449159 394424 420672
3633 420672 449259 439978 422737 431141 447159 504657 488034 494649 478863 487313 529406 520889 549180
3620 549180 535369 534464 529058 524229 511861 498893 507706 524435 474838 482974 445227 391964 401045
3607 401045 439569 486478 503555 494321 462573 458044 529080 524053 445937 439162 417108 457486
3595 457486 487512 494221 479242 434476 406001 410870 467087 548253 546069 509238 496541 462095
3583 462095 435565 448044 488123 486492 466893 469036 459175 439004 459485 461859 447052 447107 439428
3570 439428 494321 502638 509078 491438 460242 481622 470498 457364 477185 439715 429278 452179
3558 452179 439560 408391 438906 477276 472651 533102 489075 468253 456293 456507 459543 472497
3546D72497K1625j7517m019K0061J7060j7666L4936j3330j6224p376p868K7039
3534E09218n2501J1091k809K9972j4146L6958j4426k5599J5527M1140l5775k8208
3522D70442K5286J3048k0422j581j5211K4474K2195J8874n8630J7133J1514j6140
3510D90982k8502M687O6736k7245l919m0651K1099j876O011L1515J4055l2336
3498E00556J6095J941o960M0807L891m5278j3208L0489k4975L8324j8541M3125
3486E66266L7257m8072o048o3185K0077k6834j5696O7427L3717l7759j0455K083
3474E18778N312R748J4102M4674j5410o8306j3550J1107N2244k894j8075J4706
3462E52436J2367k3547K8463k8098j8464K0219j4380M090L4139K3417p332J2600
$$ plain form
3546 472497 494122 476605 472586 492647 509707 492041 526977 513647 497423 490047 482179 509218
3534 509218 456717 467808 464999 494971 480825 517783 503357 477758 493285 534425 498650 470442
3522 470442 495728 508776 488354 486773 471562 496036 518231 537105 478475 495608 507122 490982
3510 490982 462480 467167 533903 506658 502739 462088 483187 481311 487322 518837 532892 500556
3498 500556 516651 518592 511632 552439 556330 511052 497844 528333 503358 541682 523141 566266
3486 566266 603523 555451 549403 486218 506295 479461 463765 531192 564909 527150 516695 518778
3474 518778 524090 533838 547940 592614 577204 508898 495348 506455 558699 555805 537730 552436
3462 552436 564803 541256 569719 541621 523157 543376 528996 533086 567225 590642 583310 595910
3450E95910K0463o6584j2138k2751j1630J0267O3610M415j6781o9651k7372N7989
3438E25747J6627R805O5035J0695l4455J5250j3688K4879L5549L8203P899r2477
3426F09069L6417M2803n1288L7504K0915L7881J6114K267M9101M6553l3156j7082
3414G97098l7084n095K6788k7343M6071L0437k7829K697k3365L1591O9170Q4210
3402I67346j7743N5333Q5073K0770Q2969J16362J29570R8333O6668R5895l6437
3391A664139p6792j47708q1581k3912k6659k4214k9750L1006o4582n9173l2458
3380A128316o7594o8390k0815l0851K3348K7232j1300l5372M7142J084K6806J0244
3368A029850m2767l385M9729M366r247K7516j116j9076j4887P3493M5672k1931
$$ plain form
3450 595910 616373 549789 537651 514900 503270 513537 577147 581562 564781 495130 467758 525747
3438 525747 542374 552179 617214 627909 593454 608704 595016 619895 655444 693647 701546 609069
3426 609069 645486 688289 637001 674505 695420 733301 749415 751682 800783 847336 814180 797098
3414 797098 760014 754919 781707 754364 800435 830872 803043 805740 782375 813966 883136 967346
3402 967346 949603 1004936 1090009 1110779 1193748 1310110 1439680 1538013 1604681 1700576 1664139
3391 1664139 1587347 1439639 1358058 1334146 1307487 1283273 1253523 1284529 1219947 1160774 1128316
3380 1128316 1060722 992332 971517 940666 964014 991246 979946 944574 991716 992800 1019606 1029850
3368 1029850 987083 983698 1033427 1037793 1028546 1056062 1054946 1035870 1020983 1094476 1140148 1118217
3356A118217P6703J0350r996N4099k3892n4580r94l6620K3554N0133l3592o5135
3344A108247n5052J1253M5734K4330r609L2634L8573L4393O608L4513m055o2l1376
3331A236131L6149J0718K7190M3077L3508K3671M6079L0041k6829j6133L8689
3320A482291O1103J1177j2683Q9503M8289J1325J5669j6914J0422M0170Q88K4589
3308A765829J1596M9321P9991Q2596L3520O5908J6017p015O2091Q4988K8848q415
3296B265275O4169M6631R6824j6077M9817J08958P5814O9960N9622M9810K9547
3285B900350P6014J4754R747M7051J12110R2572R5053Q7411J03341Q9331J01058
3274C728792J32453J13438J17164J25878J53116P7681R9227K02625J56118J57876
$$ plain form
3356 1118217 1194920 1205270 1195274 1249373 1225481 1170901 1169907 1133287 1156841 1206974 1173382 1108247
3344 1108247 1053195 1064448 1110182 1134512 1124903 1157537 1196110 1230503 1237111 1271624 1267569 1267507 1236131
3331 1236131 1272280 1282998 1310188 1353265 1386773 1410444 1456523 1486564 1459735 1443602 1482291
3320 1482291 1543394 1554571 1541888 1631391 1679680 1691005 1706674 1689760 1700182 1740352 1741240 1765829
3308 1765829 1777425 1826746 1906737 1989333 2022853 2088761 2104778 2097763 2159854 2244842 2273690 2265275
3296 2265275 2329444 2376075 2472899 2456822 2506639 2615597 2691411 2761371 2820993 2870803 2900350
3285 2900350 2976364 2991118 3000865 3047916 3160026 3252598 3347651 3435062 3538403 3627734 3728792
3274 3728792 3861245 3974683 4091847 4217725 4370841 4448522 4547749 4750374 4906492 5064368
3264E064368J84744J56498K48789K84995K78782L34417L58119L36340L38106L45616
3254G930774L04050K78563K20690J32943J61122O4751J6078m8118k5344r7095
3244H938414j41677l24929l98657l36866l61015m18911m32293m17224l12205k76939
3234E517698k45488k69359k64393k23011j81109j69592k51355j53779j11702j69875
3224C478035p1977j48231r2911m1478j38881j38175j24763l7574l8239j02339
3214B543467o4122r0459m3982n7995l6746o0960k4756n6596m1633l9577j15552
3203A911089j1448k8303o2308L4901r0258m0603L3823m1047J1119l1878r4629
3192A590458m6765m5246o7149O6573L149o4544l0097o704l6117N568j1776M1818
$$ plain form
3264 5064368 5249112 5405610 5654399 5939394 6218176 6552593 6910712 7247052 7585158 7930774
3254 7930774 8234824 8513387 8734077 8867020 9028142 9092893 9108971 9060853 9035509 8938414
3244 8938414 8796737 8471808 8073151 7736285 7375270 6956359 6524066 6106842 5794637 5517698
3234 5517698 5272210 5002851 4738458 4515447 4334338 4164746 3913391 3759612 3647910 3478035
3224 3478035 3406058 3257827 3164916 3123438 2984557 2846382 2721619 2684045 2645806 2543467
3214 2543467 2479345 2388886 2344904 2286909 2250163 2189203 2164447 2107851 2066218 2026641 1911089
3203 1911089 1899641 1871338 1809030 1843931 1753673 1713070 1746893 1705846 1716965 1685087 1590458
3192 1590458 1543693 1498447 1431298 1497871 1501020 1436476 1406379 1399675 1363558 1369126 1357350 1399168
3180A399168l4005o6843l5222k9250p944L1718m6903j5933K0722J1327j3573l5830
3168A177432j0213J8301L200K7164k595n3323j9645j6819m2159j2490k2880K6722
3156A072695K035L986p4165p297O433k9659J7791j2601j6429K1516j9105n0404
3144I14796j753Q651q862J266j6699K0752L0317j7725n9635o059j4623j3100L4914
3131H72240j9796k9245K0844l209r852q280j9509k8298k1699q228L883J9978o107
3118G62722m7949k4449r371L554K5710l4899N5918K9971l2587k5093o711J7982
3106G14798q825l975L4190j6269k6752j5274j6947j9612m632P890M9585j7118
3094F77059r529p865k3822k1221K0038K6205m3369J3720K4214J4235j3808n0577
$$ plain form
3180 1399168 1365163 1298320 1263098 1233848 1225904 1257622 1210719 1194786 1215508 1226835 1213262 1177432
3168 1177432 1167219 1185520 1188720 1215884 1213289 1159966 1140321 1123502 1081343 1068853 1045973 1072695
3156 1072695 1074730 1078716 1004551 997254 1003687 974028 991819 979218 962789 984305 965200 914796
3144 914796 913043 921694 912832 914098 897399 918151 948468 930743 871108 865049 850426 837326 872240
3131 872240 852444 823199 844043 840834 830982 822702 803193 774895 753196 744968 748851 768829 762722
3118 762722 714773 690324 680953 684507 710217 675318 731236 761207 728620 703527 696816 714798
3106 714798 705973 701998 736188 719919 693167 677893 660946 641334 636702 644592 694177 677059
3094 677059 667530 659665 635843 614622 634660 660865 617496 631216 655430 669665 655857 605280
3082F05280O2888Q630k8951k5084J0682k1004n522j7348R973N4075l1124j1565
3070F10930j7398M334j4751J2121M567o0886J289O1666o967j879j5346k1227L899
3057E60352l7850N2176K214l033l1741n802M9210k0095K674J9550o241j1625Q043
3044E77832k1292M1761M6700k4890k1080j1081k3280m8986k4275O0054L2423k1767
3032E62119k1551k3832N246j7628O7853l5125P518M9957j2342J9073J0988p815
3020F04461k612J6013p662k827K6260r482m4135K7064K7884J4138o916l121k4745
3007F14320N3753K1142k5073J2973P6635M4157j2745J7777j6902o1172L8120J0638
2995G73623o465M1102l9362J6899j3195M5698M1686l2322j1048m5547J8878q612
$$ plain form
3082 605280 668168 676798 647847 622763 633445 612441 606919 589571 599544 653619 622495 610930
3070 610930 593532 597866 583115 595236 599803 538917 540206 601872 594905 593026 577680 556453 560352
3057 560352 522502 574678 576892 573859 542118 536316 585526 565431 568105 587655 581414 569789 577832
3044 577832 556540 598301 645001 620111 599031 587950 564670 515684 491409 551463 583886 562119
3032 562119 540568 516736 521982 504354 572207 537082 544600 594557 582215 601288 612276 604461
3020 604461 601849 617862 610200 607373 633633 624151 580016 607080 634964 649102 642186 639065 614320
3007 614320 668073 689215 664142 677115 753750 797907 785162 802939 786037 724865 762985 773623
2995 773623 767158 808260 768898 785797 772602 818300 859986 827664 816616 771069 789947 781335
2983G81335K9780L7933m1163K6483L2402L2880P5840Q497o450L6821k9294j5849
2971I69215L2055L0908J0608K0285j5527L8528L4733j1458M1193j1258J4891K4583
2959A178756j875J3412r704L3386M7703N389O4244L6123J034K7521O4047M9158
2947A509194N3737J4359O5257P3299J13501J2502O0386J01196J21888O5164J11425
2936B301908J30396L5079J10664J18810N0073Q5308O6112K2831K4229j8599O1175
2925B987986k4853j9718N8402O6027m997l7663M607N4578J03353J07575P3573
2914C368870P1397N4418J16648J03909J11155J08804K16298K93742L12491K21566
2904D979298K67324K21385L4974q6813k51056l21940l09822k59469k40295k13065
$$ plain form
2983 781335 811115 849048 807885 834368 866770 899650 975490 983987 977537 1014358 985064 969215
2971 969215 1001270 1032178 1042786 1063071 1047544 1086072 1120805 1109347 1150540 1139282 1154173 1178756
2959 1178756 1176881 1190293 1180589 1213975 1261678 1267067 1331311 1367434 1368468 1395989 1460036 1509194
2947 1509194 1562931 1577290 1642547 1715846 1829347 1841849 1902235 2003431 2125319 2190483 2301908
2936 2301908 2432304 2467383 2578047 2696857 2746930 2832238 2898350 2921181 2945410 2926811 2987986
2925 2987986 2963133 2943415 3001817 3067844 3062847 3025184 3029791 3084369 3187722 3295297 3368870
2914 3368870 3440267 3494685 3611333 3715242 3826397 3935201 4151499 4445241 4757732 4979298
2904 4979298 5246622 5468007 5502981 5416168 5165112 4843172 4533350 4273881 4033586 3820521
2894C820521j76291r7333j17722j41151j27021k3406K1114J739M851J7679l790
2883C179190k5893R5206M2106j2813j7564R6983k0506p495O3702k5493K23j8600
2871C349046o8480j08793j24651j39064j02554j75518j22275q7125j10645q5343
2861B224598n827k8900p0406l2156l0334p4827q3929m2889l7076q3258q0182p6931
2849A577883o1028M0983r903r7752j05932n3330j3743o2220m9223M749j1046o3628
2837A095810o624L9257n6531m3985M434n8480j8091K2671m6141n524O420n7432
2825H75784q238j204l5949o1852j1327J7188R043j7982k3665j8285J3253m0095
2813F96671l4549m378M2741n3025K9501k1645o1389M6653K857k094r5889L422
$$ plain form
2894 3820521 3644230 3546897 3429175 3288024 3161003 3137597 3158711 3160450 3165301 3182980 3179190
2883 3179190 3153297 3248503 3290609 3277796 3260232 3357215 3336709 3329214 3392916 3367423 3367646 3349046
2871 3349046 3280566 3171773 3047122 2908058 2805504 2629986 2507711 2420586 2309941 2224598
2861 2224598 2218771 2189871 2119465 2087309 2056975 1982148 1898219 1855330 1818254 1734996 1654814 1577883
2849 1577883 1516855 1557838 1547935 1450183 1344251 1290921 1277178 1214958 1165735 1170484 1159438 1095810
2837 1095810 1089186 1128443 1071912 1027927 1032361 973881 955790 978461 932320 926796 933216 875784
2825 875784 867546 866342 830393 768541 757214 774402 783445 765463 741798 723513 736766 696671
2813 696671 662122 657744 700485 647460 676961 655316 593927 640580 643437 641343 545454 548876
2801E48876R798J3236r439j8439j1257l5540j2739P632k4536l90p379j796R626
2788D67653k6096l2593J6111J4082p132j9090j4605j7188k6542N539O97n313j4219
2775C41304K7591l3611O006L4968m5799K5099q401M4564K613m4942m5906n1052
2763B52434j149k393k9955L8371N7207k5913K0090o0622K0261r573j4155M768
2751B49371N419j3597q4422L9455J4182N370L1529j8295j5049L657j8584J4573
2739B13609L3669l5580m9458J3751J727j5594j0561J8353L3508n6525k9559M541
2727A21881J5141j328j5912k4151O7054k036j2734J6268j5064n469j3740l2539
2715I7371j4582j9055M4773J0307n774J6402q126K6758m814j486J5550L9747j6410
$$ plain form
2801 548876 558674 571910 562471 544032 532775 497235 484496 492128 467592 467202 459823 458027 467653
2788 467653 441557 408964 425075 439157 432025 412935 398330 381142 354600 360139 360836 355523 341304
2775 341304 368895 335284 341290 376258 330459 355558 347157 391721 394334 349392 303486 252434
2763 252434 251285 248892 218937 257308 314515 288602 308692 248070 268331 258758 244603 249371
2751 249371 254790 241193 156771 196226 210408 215778 247307 229012 213963 217620 199036 213609
2739 213609 247278 211698 162240 175991 177718 162124 151563 169916 203424 146899 117340 121881
2727 121881 137022 135694 119782 95631 162685 160649 147915 164183 149119 143650 129910 97371
2715 97371 82789 63734 108507 118814 113040 129442 121316 148074 143260 141774 157324 197071 180661
2702A80661L5076p2993J2662Q170l1362k8981O3797n2463l1787N4958m9559N5136
2690A43315J3462m5258m1546J043K2712J6369j9331l0792m54j754P2004M2310
2678A72080m6933J1478J1170o4051J0023K7983K1798o8009k3109L8147P0143J9535
2666A80255m2444p4271n4687L5920L0M0903j631N420K2872j0903j4409N6408m7361
2653I6102m0616L5416J6726M7604l4861k837l6032m0650J2935K0467L9328M6057
2641A59639k8455m9820J5726k6230L2432J359k5738j719k6625k0837j4711O3570
2629G8591J2022l7974j6357q735n760P208J6955p117K470K1645P452o7579K6228
2616B9049K5921j6355k1704j5802n5331L3674K2853K3503J562k134J097K0949
$$ plain form
2702 180661 215737 142744 155406 163576 132214 103233 167030 114567 82780 137738 88179 143315
2690 143315 156777 111519 69973 71016 93728 110097 90766 59974 59520 57766 129770 172080
2678 172080 125147 136625 147795 83744 93767 121750 143548 75539 52430 90577 160720 180255
2666 180255 137811 63540 8853 44773 44803 85706 84075 89495 112367 101464 87055 143463 96102
2653 96102 55486 90902 107628 155232 120371 117534 81502 40852 53787 74254 113582 159639
2641 159639 131184 81364 97090 70860 103292 104651 78913 77194 50569 29732 15021 78591
2629 78591 90613 52639 36282 27547 21787 28995 45950 38833 41303 62948 70400 2821 29049
2616 29049 54970 38615 16911 1109 -54222 -20548 2305 25808 27370 25236 26333 47282
2604D7282J871K4304p553K2293J0609P274k0856J865k1863m403l260P078K1591
2591H6232k1292L6872J646K0653K4189m7800k2818k5293K0328o1547K2658N8341
2579I2169k6275Q520n7155k2857O4682J0562j5905l0183j3931J8533L2089M3507
2567A03756l0025K0625j4812K7001j8090l2568J0194m455L5674j8876l3802k3477
2555B1145J1049J2378k3026K3553n6871M2677j2858j632K7735k5269m02K1867
2543D0346l6991K5706J8371R369k5143k725k3661j3712L9484M0154m3607k7442
2531A49K8855k102m5330k3475K4781L5400K2293K8963k8319R230l8563n083L5108
2518D1907K1453l5162o9708J5151M5244r416L2008j3504j3193J1657m0986j3517
$$ plain form
2604 47282 49153 73457 65904 88197 98806 106080 85224 87089 65226 60823 57563 64641 86232
2591 86232 64940 101812 103458 124111 148300 100500 77682 52389 72717 11170 33828 92169
2579 92169 65894 74414 17259 -5598 59084 69646 53741 23558 9627 28160 60249 103756
2567 103756 73731 94356 79544 106545 88455 55887 66081 61626 97300 78424 44622 21145
2555 21145 32194 44572 21546 45099 -11772 30905 18047 16415 44150 18881 18479 40346
2543 40346 3355 29061 47432 56801 31658 28933 5272 -8440 31044 71198 27591 149
2531 149 29004 26902 -18428 -41903 -17122 18278 40571 69534 41215 50445 11882 6799 41907
2518 41907 63360 28198 -41510 -26359 18885 9469 41477 27973 14780 26437 -14549 -28066
2506b8066N0023M705J0637l214p659K981j3726p178k9283r762L3430M3332j8419
2493B7801j7664J927j2999k8758J7030N5450J3551k0584m9036o2114Q3436L2932
2481D0972l8951j0181k6533o985O0221L7830k5005n7938j2785K5140k74j185L0553
2468A4879k3909P3222m6017l4078K6698p588K3270R610l0345L3227k1573O009
2456B3405R843R028j0285j843m017k1053K388l0736k5529l000m063L6101n600
2443b5361J5889K913K2053O997j2228j4176m2115l346M7397K5119r895M9009k0327
2430D1929K8894k7788o1783m529K5252r042j0363l1012J2353O0334l2275l115
2418a1145m8511K1469J2112k7148Q977K0415k8428K8565K0154j8562j6170P852
$$ plain form
2506 -28066 21957 26662 37299 34085 26426 29407 15681 8503 -20780 -30542 2888 46220 27801
2493 27801 10137 12064 -935 -29693 -12663 42787 56338 35754 -13282 -75396 8040 40972
2481 40972 2021 -8160 -34693 -41678 18543 56373 31368 -26570 -39355 -14215 -14489 -15674 14879
2468 14879 -9030 64192 18175 -15903 10795 3207 26477 36087 5742 38969 17396 23405
2456 23405 33248 42276 31991 30148 26131 5078 7466 -23270 -48799 -51799 -55862 -19761 -25361
2443 -25361 -9472 -6559 15494 22491 10263 -3913 -46028 -49374 -1977 23142 13247 62256 41929
2430 41929 70823 43035 -18748 -23277 1975 -7067 -17430 -48442 -36089 24245 -8030 -11145
2418 -11145 -59656 -38187 -26075 -53223 -44246 -23831 -52259 -23694 -3540 -22102 -38272 -30420
2406c0420J1482j2931R832M5373K2293l9940j873k8854j746J4633K1295M3257
2394E2401n5926K3257k5200n2550J3256K9129N7613k8954l3922O331L3418l3261
2382a4408L9020J1186l3551M9822R473k134k8793J8802K5539Q925m1473j0065
2370C2343O2254j5021l0333K1133Q792l7276n6182j4804K6766q778p313j3146
2358c1565N8070k0715K333k5840k3044J6308j419m782q186n8819L0020O2911J8945
2345A4217j9680p424J9400L26k4013J7758o246j385N8278j0051m8852j6983j295
2332b5950L2043k1224M7320o614k8624L184l1541N4053P6938o6311o7424P3896
2320C9746J1843l1418r36k6145L8699K0601j2957j9887M7061j6753o4806J8667
$$ plain form
2406 -30420 -18938 -31869 -22037 23336 45629 5689 3816 -25038 -26784 -12151 9144 52401
2394 52401 -3525 19732 -5468 -58018 -44762 -15633 41980 13026 -20896 -14565 18853 -14408
2382 -14408 24612 35798 2247 52069 61542 59408 30615 49417 74956 83881 42408 32343
2370 32343 94597 79576 49243 70376 79168 41892 -14290 -29094 -2328 -11106 -18419 -31565
2358 -31565 26505 5790 8123 -17717 -40761 -24453 -25872 -30654 -38840 -97659 -67639 -4728 14217
2345 14217 -5463 -12887 6513 6839 -17174 584 -5662 -7047 51231 41180 -7672 -24655 -25950
2332 -25950 6093 -15131 32189 25575 -3049 135 -31406 22647 99585 33274 -34150 39746
2320 39746 51589 20171 19235 -6910 31789 52390 39433 19546 66607 49854 -14952 3715
2308C715L599j6711M3550p958k9956Q464K641Q324l780k4661J2876J53O9177n3862
2294A5571j3015M8651k1363M7205k9413k3804j9674P670N931k477K5231j325R150
2281D8338j2459p75J4985n3989k12K8307K1731j0307r5j4008K7559m8950l668
2268c543m5128J2659K931N721J3135J7751o050M1225K8634n0121k3327J7389N9369
2255G0645k5829k2483K3328M3934q917o4964O865j0829M5915M5443l8766l6265
2243B8077l1145l319m764Q411J045R469M9819j6487J5416L8133j2969m0151L5751
2230G7286k2299l6841L1719L0272l8061J0596J6371O601O562j0185J0523k5585
2218E6959N2331m231P823n5400m4516K1230n7774L5950K8572k0230m933K1337
$$ plain form
2308 3715 7314 -9397 34153 26195 -3761 4703 7344 15668 11888 -12773 103 256 69433 15571
2294 15571 2556 51207 29844 77049 47636 23832 4158 11828 17759 15282 40513 39188 48338
2281 48338 35879 35104 50089 -3900 -4112 24195 45926 35619 35524 21516 49075 125 -3543
2268 -3543 -48671 -36012 -33081 -27360 -14225 3526 -2524 38701 67335 17214 -6113 11276 70645
2255 70645 44816 22333 45661 89595 80678 15714 22579 11750 57665 103108 64342 28077
2243 28077 -3068 -6387 -11151 -2740 -1695 7774 57593 41106 56522 94655 81686 41535 77286
2230 77286 54987 18146 49865 80137 42076 52672 69043 75644 82206 72021 82544 56959
2218 56959 109290 105059 112882 57482 12966 34196 -23578 12372 40944 20714 15781 37118
2206C7118L5214O5702J1882m4856j0183J3797N4508k0414K2523M870j9228K3480
2194A74413m9862j1444L5067j7798l9189n750P9504N623l0798j9623N0361N4897
2182B25401J0408l64l993m618L468N621J9805K5754o0681M7093n7063q043K0972
2169B23760M6239m364M061O1685j8697M2667P399o0493k3909J5444P981R289J7559
2156C28621K3503N1067k4848J8592O0274R000M1828k2152l4909k808l2157L7199
2144D53210L3940L0735N8383M9928M8680l6962O3645L4405M8606k3599L6077J17533
2132I14581O3991M8794K9912J28139P0715M9270J03251K6470R3894J18862J58194
2121A806073J44568J77840K24357J94998J36499K53805L06007L49813L95765M76897
$$ plain form
2206 37118 72332 138034 149916 105060 94877 108674 163182 142768 165291 170161 150933 174413
2194 174413 124551 113107 148174 130376 91187 85437 164941 170564 139766 120143 170504 225401
2182 225401 235809 235445 231452 226834 230302 235923 255728 281482 220801 267894 210831 202788 223760
2169 223760 269999 265635 269696 331381 312684 355351 362750 302257 278348 293792 301773 311062 328621
2156 328621 352124 403191 378343 396935 457209 466209 508037 485885 450976 448168 416011 453210
2144 453210 487150 517885 576268 626196 674876 637914 701559 735964 784570 760971 797048 914581
2132 914581 978572 1027366 1057278 1185417 1256132 1305402 1408653 1435123 1529017 1647879 1806073
2121 1806073 1950641 2128481 2352838 2547836 2684335 2938140 3244147 3593960 3989725 4466622
2111D466622O22831P40989R62754J377386J850031K061936J838038J687610o35942
2102A4972255k116449j988508j899551j602252j379870r82259p62845n35470m90016
2093C215035l15930l05686j88483k07417p2322j22789j88365j08554j46553q6527
2083A472409q5452j18454r7128p1462k1133j0164m5370m9136l4009m4423j08973
2072G86705q0146k4741m6344L7422n7040k6201j7872J849l5120j0870n711k7782
2060D94149k430o720j994k8016n4140J5987m4967l6288O9950l5455m3395N9288
2048C85969k1625j9566q267k4863J3079k2070j2145K6281J6178J5153n1825M55
2036B96754j9447J3556n300k1644q809m1218j9077M203k7248K3002O439J1701
$$ plain form
2111 4466622 5089453 5830442 6793196 8170582 10020613 12082549 13920587 15608197 14972255
2102 14972255 12855806 10867298 8967747 7365495 5985625 5003366 4240521 3705051 3215035
2093 3215035 2899105 2593419 2404936 2197519 2125197 2002408 1814043 1705489 1558936 1472409
2083 1472409 1386957 1268503 1171375 1099913 1078780 1068616 1023246 974110 940101 895678 786705
2072 786705 706559 681818 635474 672896 615856 589655 571783 573632 538512 527642 521931 494149
2060 494149 491719 484999 483005 454989 400849 416836 371869 335581 405531 370076 326681 385969
2048 385969 364344 344778 336511 311648 324727 302657 290512 316793 332971 348124 296299 296754
2036 296754 277307 290863 285563 263919 255110 213892 194815 199018 171770 194772 201211 212912
2024B12912r600j7533J323l2n3744r525J8088L6884n763m7760J9313l0560l0166
2011H3837J1588J4271l37K3001n8020j2260j942J2435R842P8638j260m0672J4739
1998A33860J7246K4309l2845n5203o0418L9020K6163l2041p556K5037k3740J0623
1986F4455o4634P041l365K6718J2061k3151J7703M6862K6364m7813J7878L1001
1974A11120J20o5083m202J210j7937L8361M2044m3900m6836l3466M3913l726K0773
1961D2391J0574K2685m2727Q69M773j4542M0086J1049q1720K1833J3769l877J8370
1948D3533m5821k2729K2313L1822j3147J5358K6000o954j7100l4662J1496M6101
1936E6210j7040Mp550l8008p623n7609M7254M8700l9947p905K6977J3965K651
$$ plain form
2024 212912 203312 185779 187102 187070 133326 123801 141889 178773 173010 125250 144563 114003 83837
2011 83837 95425 109696 109359 132360 74340 62080 60138 72573 82415 161053 159793 119121 133860
1998 133860 151106 175415 142570 87367 26949 65969 92132 60091 52535 77572 53832 64455
1986 64455 -179 6862 3497 30215 42276 19125 36828 83690 110054 62241 80119 111120
1974 111120 111240 46157 41955 43165 25228 63589 105633 61733 14897 -18569 25344 21618 42391
1961 42391 52965 75650 32923 33792 38565 24023 64109 75158 -6562 15271 29040 25163 43533
1948 43533 -2288 -25017 -2704 29118 15971 31329 57329 50375 33275 -1387 10109 56210
1936 56210 39170 39174 31624 -6384 -14007 -71616 -24362 24338 -15609 -23514 3463 17428 20079
1923B0079m602J0975l0589O482j6776j2462Q76n172N8650R857L3496J6254j4588
1910G2480L232m0450l4812j5236J1514K4157l511M6791J9338k2731m3833l2597
1898a5658p066o256L880L0367K6323O550P965M2498m3128l8646r785j5043K0874
1885B875K7879Q174k539p937J5412l3569M93m1602j0047M9828j3799K8733K4294
1872D8195m5844j375J1207q412m3107O903L6336J8001k0330J1847q36j05612P321
1859h5706M4404J7350K6806o465O323l0759q40M612L5184K0653k2227L949j5471
1846b187O3477m080k4390m7986j3701K5576N6962P694J2711l9088K2164o952K0673
1833G0873O834j7305l2658r330J8198l0402O953N747P16J1532O3701m8607l9445
$$ plain form
1923 20079 15477 26452 -4137 2345 -14431 -26893 -26017 -31189 27461 37318 70814 87068 72480
1910 72480 75712 35262 450 -14786 -3272 20885 17374 64165 83503 60772 16939 -15658
1898 -15658 -22724 -28980 -25100 5267 31590 38140 46105 88603 45475 6829 -2956 -17999 2875
1885 2875 30754 38928 36389 28452 43864 10295 10788 -30814 -40861 8967 -4832 23901 48195
1872 48195 2351 976 12183 3771 -39336 -32433 3903 21904 1574 13421 12585 -93027 -85706
1859 -85706 -41302 -23952 2854 -3611 2712 -28047 -28887 -24275 10909 31562 9335 13284 -2187
1846 -2187 61290 57210 32820 -15166 -28867 -3291 53671 61365 74076 34988 57152 50200 70873
1833 70873 77707 60402 27744 18414 36612 6210 13163 18910 19626 31158 94859 46252 6807
1820F807n438J2823q800n6603k631L8664L4218J5383m0050K7428k0701O3m599
1807c436j5570J9939j48L0256J9889j1811l3433m5145N2014l635k3870J2839L192
1794A081O631k068l9162J5895M4463L6786L0041O849p1813m7299M33j7152K2326
1781a2989O5953j0652k6786m9938K3958N0675K3720K7023n3246k6427M0324J7581
1769F9196J2667j2224n3962l8494K7540Q804k6713J7833n38J7048q563j0421k6731
1756b4558O50M8058J449L636j7435q291m4676K2651K7671k4827M263L020p799
1743a6188Q049J0306k6718N4367j6230m9534r764J5994L6824j5512j26028J7098
1731a17336R6875k0309l2519L0438L565K4105m8153K7085M1624j830M622j6707
$$ plain form
1820 6807 1369 14192 5392 -51211 -53842 -15178 19040 34423 -5627 21801 1100 1163 -3436
1807 -3436 -19006 933 785 31041 50930 39119 5686 -39459 12555 8920 -14950 -2111 1081
1794 1081 7712 5644 -33518 -17623 26840 63626 93667 100516 28703 -18596 -18163 -35315 -12989
1781 -12989 52964 42312 15526 -34412 -10454 40221 63941 90964 37718 11291 51615 69196
1769 69196 81863 69639 15677 -22817 4723 13527 -13186 4647 4109 21157 12594 2173 -24558
1756 -24558 -23908 24150 25599 29235 11800 3509 -41167 -18516 9155 -15672 -11409 -8389 -16188
1743 -16188 -8139 2167 -24551 29816 13586 -35948 -45712 -29718 7106 -8406 -134434 -117336
1731 -117336 -20461 -40770 -73289 -42851 -39286 -15181 -63334 -36249 5375 3545 8167 -8540
1719h540l3401K1604n750K8909p593j5919J8653N2799k7507j1013M1398o8406
1707a4766m4715O3063k100j5141k6839L3825M1768m2669O319q064r075O4487J5159
1694F1252n5932O290p881o34k963L1875n379L1510j0845j9390m3603j4443J2562
1681a7581M0901r580j4586K872o6597j2351L8620j9697K7052K9391K8395k9628
1669b789J1898K6402k0997J9401j322n7632L5799R972j4465O090r185k167l2826
1656c1821M400J1614l9655L6886M4308k9471J2551p729J8027j5636K1288l299
1644B1463j0670Q16k8841J0711O129J8920J8590m0237k8191r161n170k9362j9343
1631i4346Q291O9802M0814k9070m0407L4640J4886N1487n0490n6266M108K4871
$$ plain form
1719 -8540 -41941 -20337 -26087 2822 -4771 -20690 -2037 50762 23255 12242 53640 -14766
1707 -14766 -59481 3582 1482 -13659 -40498 -6673 35095 -7574 -1255 -9319 -18394 46093 61252
1694 61252 5320 11610 3729 3095 132 32007 26628 58138 47293 27903 -15700 -30143 -17581
1681 -17581 23320 13740 -846 2026 -64571 -76922 -38302 -57999 -30947 -1556 26839 -2789
1669 -2789 9109 35511 14514 33915 32593 -25039 10760 20732 6267 12357 3172 1005 -31821
1656 -31821 -27421 -15807 -55462 -18576 25732 -3739 8812 1083 19110 3474 24762 21463
1644 21463 10793 11609 -17232 -6521 -392 18528 37118 -3119 -31310 -40471 -45641 -75003 -94346
1631 -94346 -86055 -16253 24561 -4509 -44916 -10276 4610 56097 5607 -50659 -46551 -21680
1619b1680m1825K5147N7224l1631R014K9608m8731m3712N5402k0989k0348q504
1607f1025K9515K2079j741m14J6538m3093J1718p650K263O4056K5003l8752l9306
1594b0809j3229J3825k0167K0984O340k9457K3784k2806K4487M2670j3817k4665
1582a2860j6047Q756L9179m5777N760R421J5778J8702p9417M2761M3070r486j0933
1569H907J776m4301k4241L8083k05J2351K2148r781m6150m3907K4648L5111j3347
1556c8908J906m5985K2864J2877n1215Q7970k5728M1655j5327j6901M0759k311
1544A1656n065m143k617K310j9941n0535L8322n18M3729K4501k0099O0389J193
1531G9182k9634m3688p977J4401j4636K5651N762l9976k9488L5908L1523l2414
$$ plain form
1619 -21680 -63505 -38358 18866 -12765 -3751 25857 -22874 -66586 -11184 -32173 -52521 -61025
1607 -61025 -31510 -9431 -11172 -11586 4952 -38141 -26423 -34073 -31810 32246 57249 18497 -20809
1594 -20809 -34038 -20213 -40380 -19396 -13056 -42513 -18729 -41535 -17048 25622 11805 -12860
1582 -12860 -28907 -20151 19028 -26749 -20989 -11568 4210 22912 -56505 -13744 29326 19840 8907
1569 8907 10683 -33618 -57859 -19776 -19981 -7630 14518 4737 -41413 -85320 -60672 -25561 -38908
1556 -38908 -37002 -82987 -60123 -47246 -98461 -10491 -36219 5436 -9891 -26792 13967 11656
1544 11656 6591 2448 -169 2141 -17800 -68335 -30013 -30531 13198 37699 17600 77989 79182
1531 79182 49548 5860 -2117 12284 -2352 23299 29061 -10915 -40403 -4495 27028 -5386
1519e386P960p193k8569p586J6213j6753m5198M4364K1257J1597J7228j5363j9705
1506b7134o455J2799m4794K6623N7454o9620r061M2963J8556j3922L8256K300
1494B7965k1046l8824n5312L4066J8222K5478r819J3646k2104n0258J0931K2592
1482d4463N7759n0690l4133L7428K7104L7M7240l4083m5345J6903n555l575M9575
1469A8202J626J2960l178M3117k7007k2667j4123J3526l284o2273n106P594M0386
1456b27N42j1034o0211M5099L8977k6436m1579J1283m515P1884L9963O352Q735
1443G8833k6149k4163m3715Q1862l1166n1899J6964J8806j2754m6111K9571O0341
1431E0420n1190M283j8410l2164L3183l1752l2190M4921j493k7038j9883M3192
$$ plain form
1519 -5386 2574 -4619 -33188 -40774 -24561 -41314 -86512 -42148 -20891 -9294 7934 -7429 -27134
1506 -27134 -33589 -20790 -65584 -38961 18493 -51127 -60188 -17225 1331 -12591 25665 27965
1494 27965 6919 -31905 -87217 -53151 -34929 -9451 -19270 -5624 -27728 -77986 -67055 -44463
1482 -44463 13296 -37394 -71527 -34099 -6995 -6958 40282 6199 -39146 -22243 -27798 -31373 18202
1469 18202 19828 32788 29610 72727 45720 23053 8930 22456 19172 -43101 -48207 -40613 -227
1456 -227 315 -10719 -70930 -25831 13146 -13290 -54869 -43586 -48101 23783 63746 70098 78833
1443 78833 52684 28521 -15194 66668 35502 -16397 567 19373 6619 -39492 -9921 50420
1431 50420 -770 3513 -14897 -47061 -13878 -45630 -77820 -32899 -34392 -61430 -81313 -38121
1419c8121N7350J7286k1554m0466L0227n558J2762j6049l3660M92J0727K3791
1407b773l9314p637N0186k6029k2226j1578N4247O9425m2122k717j672J3209l155
1394B7844j9554k9868k9322M6689K2303j674Q063j0217L1816k7266k5013M0786
1382C4587o7601N2078r898k0234J3072J5866k5389l4018J9748m024n443L7918
1370F662M673n8893L1143K4607n1980o597L4487L2372O229l4838k8886l1330p561
1357g9912J4117l458N1908J9658j3182J6285K4297l0807j4850j3111j5472j7659
1345f2186r170P077L5497l2076N6798L4524l1989n9821J0322R914J5473m429L3020
1332B954l153L408k4410O545M2465R25k8400m2908J541k7053Q5704k6037k9495
$$ plain form
1419 -38121 19229 36515 14961 -25505 4722 -836 11926 -4123 -37783 -37291 -26564 -2773
1407 -2773 -42087 -49724 462 -25567 -47793 -59371 -5124 64301 22179 19462 17790 30999 27844
1394 27844 8290 -21578 -50900 -4211 18092 16418 24481 14264 46080 18814 -6199 34587
1382 34587 -33014 19064 9166 -11068 2004 17870 -7519 -41537 -21789 -25813 -31256 6662
1370 6662 11335 -47558 -16415 8192 -43788 -50385 -15898 16474 22703 -12135 -41021 -72351 -79912
1357 -79912 -65795 -69253 -17345 2313 -10869 5416 29713 -1094 -15944 -29055 -44527 -62186
1345 -62186 -71356 -64279 -28782 -60858 -4060 30464 -1525 -61346 -51024 -41110 -25637 -30066 2954
1332 2954 -199 3209 -21201 -14656 27809 28734 334 -42574 -41033 -68086 17618 -8419 -37914
1319c7914l783N511p559L7650L168j2711n4506j1109L6394R0394n030p4852k3076
1306e7423O6966K4164J7061j7026p785l9698j0923J5334L1466K6430l8573l5697
1294b5704M6571o988p1061L4273P775j190k1045P447j4430p888r26j319K9556
1281b4929K9002r684l5231O0094L0778m5808m869J9841J5065j0827p636P092o241
1268A6647k9718j858J3573j5515Q136k2351J6952M6994n7181o745Q633L2384o229
1255C722j3074m479p1655j2923P1384m940l5327L4871J3578o917m199K4738k06
1242e427J6476J281L616p63l5343l1945N5758l6751n1496O2864M4218m063j0074
1229H351O8668l1482n4634r755L7746K6802q523j3222L7055l5714n7551M1384
$$ plain form
1319 -37914 -41697 -36186 -43745 -6095 -2927 -15638 -70144 -81253 -44859 45535 40505 -34347 -57423
1306 -57423 9543 33707 50768 33742 25957 -13741 -24664 -9330 22136 48566 9993 -25704
1294 -25704 20867 13879 -57182 -22909 -15134 -16324 -37369 -29922 -44352 -52240 -53166 -54485 -24929
1281 -24929 4073 -5611 -40842 19252 50030 4222 -647 19194 34259 23432 15796 22888 16647
1268 16647 -13071 -14929 -1356 -16871 -8735 -31086 -14134 32860 -24321 -31066 -22433 9951 3722
1255 3722 -9352 -13831 -85486 -98409 -27025 -31965 -67292 -32421 -18843 -25760 -29959 -5221 -5427
1242 -5427 11049 12330 15946 15183 -20160 -52105 3653 -33098 -84594 -21730 22488 18425 8351
1229 8351 77019 45537 -9097 -18852 18894 45696 37173 23951 61006 25292 -32259 9125
1217I125P53J75p729j8071R88k72K0949j5073k8052m0169K9093K0348j804L2547
1203B808m6195K6359L8015k122n221m6108N224N2538P215k6115n7607L9148M4251
1190C2190P083j1622K75k7194L2390P333l8894K0986j5056l912J6298l9489j6184
1177c5796P9253J3855j5954n6715N3799J1125m2612J1201j10k866J1618Q459m2364
1164g107k4530J0055j7470r847N7509J0674r407o795k6716M2481J6048j8237l319
1151A3339l4210J3497m697k489M8222k5382Q107l4934o1357O8249M0180l2666
1139d141k0901J2269n3692N936M2346o980K0287q897J5201J3283L5496K2762o6330
1126F639j9359L0179L0405K5095o0195K4394J1534m6145k5777L9632n810K2057
$$ plain form
1217 9125 9878 10053 2324 -15747 -14759 -15031 5918 -9155 -37207 -77376 -48283 -27935 -29739 2808
1203 2808 -43387 -17028 20987 18865 13644 -32464 -27240 25298 32513 6398 -51209 -12061 32190
1190 32190 39273 27651 27926 732 33122 40455 1561 22547 7491 3579 19877 -19612 -35796
1177 -35796 43457 57312 41358 -15357 38442 49567 6955 18156 18046 15180 26798 35257 -7107
1164 -7107 -31637 -21582 -39052 -48899 8610 19284 9877 3082 -23634 18847 34895 16658 13339
1151 13339 -20871 -7374 -12071 -14560 33662 8280 16387 -18547 -79904 -11655 28525 -4141
1139 -4141 -25042 -12773 -66465 -60529 -18183 -25163 -4876 -13773 1428 14711 50207 72969 6639
1126 6639 -12720 17459 47864 72959 12764 37158 48692 2547 -23230 16402 10592 32649
1114C2649j3915k6819q555j4732M1964J4871O660l8925N2204j2039N824j0843
1102B8344n2577r314L9688K1463K9498J4889m7241j2025n1724K4871J59J5413
1090A444M3992k8001L1053m2313o0683K7277L7170o244P644O3366m6861l6038
1078h194j8611M4370K8189l7534K4913O791M235r7844J848J7632k2461M7587J9251
1065A0172l1438R811j8514k6772K4192L2021O044K6747k8053j8043L7269k51k2842
1052C43K0985n4696j0945L3346J5643n35K2329J3895l0687J359K5022m5708m5112
1039e4761J8803l7341K5484j8358M2701q223n00N8258l7056o4009N9697k0583
1027c5888m331K4679O0L5147m5838k2695N3900K9293k0247k3153n424k8423L2240
$$ plain form
1114 32649 18734 -8085 -16640 -31372 10592 25463 32123 -6802 45402 33363 39187 28344
1102 28344 -24233 -33547 6141 27604 57102 71991 24750 12725 -38999 -14128 -13969 1444
1090 1444 45436 17435 48488 6175 -54508 -27231 9939 3695 11339 74705 27844 -8194
1078 -8194 -26805 17565 45754 8220 33133 39924 44159 -53685 -51837 -34205 -56666 -9079 10172
1065 10172 -21266 -11455 -29969 -56741 -32549 -528 5516 32263 4210 -13833 23436 23185 343
1052 343 21328 -33368 -44313 -10967 4676 4141 26470 40365 9678 11037 36059 -9649 -54761
1039 -54761 -35958 -73299 -47815 -66173 -23472 -31695 -32195 26063 -10993 -75002 -15305 -35888
1027 -35888 -40219 -15540 -15480 19667 -26171 -48866 5034 34327 14080 -9073 -14497 -42920 -10680
1014a0680J586l1607O3408o0183l5801Q5714j7447m6496L4676J3432l2124O087
1002b9435O795L1906k0778J6978r409J1781N4349K1423m6320p9808J4705L0702
990B889l1177L551q955k253J456N0684l959m2523o821O4567K2762m2888J118k0125
976a1674K4984k2804M9973l7328j8644m9243L7801k4997O675L6889L6793j2007
964A6418o826M3669k0872k8867o4010j182M0796j7413N1270R837j0145J2802l8362
951a2885K921j3704L1050N791o554J946K4897n874j7019L4346N874l7917k7379
938a4507J0913j3965R407J3377k2080k14J5859j6865j4101K721n3116K8293L5761
925a8517l9089L1442Q670k9164M396J4085M6172K0662O217k940l7891k99L3235
$$ plain form
1014 -10680 -9094 -40701 22707 -37476 -73277 12437 -5010 -51506 -16830 -3398 -35522 -29435
1002 -29435 -22640 9266 -11512 5466 -3943 7838 62187 83610 37290 -42518 -27813 2889
990 2889 -28288 -24737 -33692 -35945 -34489 16195 12236 -30287 -37108 27459 50221 7333 8451 -11674
976 -11674 13310 -9494 40479 3151 -15493 -64736 -26935 -51932 -45257 -8368 28425 16418
964 16418 9592 53261 32389 3522 -60488 -61670 -20874 -38287 12983 22820 12675 25477 -12885
951 -12885 -9964 -23668 7382 13173 6619 8565 33462 27588 10569 44915 50789 12872 -14507
938 -14507 -3594 -17559 -8152 5225 -16855 -17069 -1210 -18075 -32176 -29455 -82571 -54278 -18517
925 -18517 -57606 -26164 -17494 -46658 -42262 -28177 17995 38657 44874 41934 4043 3744 36979
912C6979m0102o4210L2120K3395Q21j8576J9848l6566K1499P185j4714J6615k094
899a7800K5112J9502J2385l7350l977N25O916j8215J4016J4133k0033l7879l3504
886g6169M4807K6675m5535L6262K6735K1150m0578l1509n5115K2401J5514J4653
874d0709L3374M755P968K2400J5388k0817J457K6873n4319L4766N1033l5676o921
861C9572R11o8731N2429L8496l4L332r334j3389j7501J123n8125j2091K5335K3593
847E586k1123J2344J321M7969Q256m6396K1611K5280k7841j5226J2535k2144k3903
834b1731K3947q295J8820j921K07j8851j0206K7138K4142j0236J2852r054j0838
821A5974K041K1580m7943k893l8688L0847N3612m2090j7009k685M8945m642k965
$$ plain form
912 36979 -3123 -67333 -35213 -11818 -10997 -29573 -9725 -46291 -24792 -17607 -32321 -15706 -17800
899 -17800 7312 26814 39199 1849 -2128 -1603 5313 -12902 1114 15247 -4786 -42665 -76169
886 -76169 -31362 -4687 -50222 -13960 12775 33925 -6653 -38162 -93277 -70876 -55362 -40709
874 -40709 -7335 -2580 5388 27788 43176 22359 23816 50689 -3630 31136 82169 46493 39572
861 39572 40483 -28248 24181 62677 62643 65975 56641 43252 25751 26874 -31251 -43342 -18007 5586
847 5586 -15537 -3193 -1872 46097 54353 7957 29568 54848 27007 11781 24316 2172 -21731
834 -21731 2216 -6079 12741 10820 11027 -7824 -18030 9108 33250 23014 35866 26812 15974
821 15974 18015 39595 -8348 -11241 -49929 -19082 34530 -7560 -24569 -27254 21691 17049 14084
808A4084k2569m745l9152m22M2692K4622n1214N5256K281m8754Q3R191k4331J9539
794b3439L5568L0606m0092j03997J0288M4823J5486M1626J8195j8062L3438n1264
782f824k6848k9438K7059l5773J9443L2405k4308L3891J6465k3838J2569O56j7977
769b2518j4033J2051m911J7902J5856O5173l3848l7781N2083k1262l2290J5321
757A1743k1779R109q44o7618L6337K090j8376M875J2085m429K2137K7118L2418
744D4866k9150l0418K7166K6652L435q781J5766l2461L363j8624k7507K2307J6688
731A3302j093q324K9752k3199p5909K0120M8072n6097q128L0877J7352N34J4289
718A548O978P443K8922n5972k1674L4972J145j719l1926j0410O4727j6638k9768
$$ plain form
808 14084 -8485 -13230 -52382 -52804 -10112 14510 -36704 18552 20833 -27921 -27838 -18647 -42978 -23439
794 -23439 12129 42735 2643 -101354 -91066 -46243 -30757 10869 29064 11002 44440 -6824
782 -6824 -33672 -63110 -36051 -71824 -52381 -19976 -44284 -10393 6072 -17766 -5197 -4541 -22518
769 -22518 -36551 -24500 -29411 -11509 4347 69520 35672 -2109 49974 28712 -3578 11743
757 11743 -10036 -927 -1771 -69389 -33052 -30962 -49338 -44463 -32378 -36807 -14670 12448 44866
744 44866 15716 -14702 12464 39116 42551 33770 49536 17075 20438 1814 -25693 -3386 13302
731 13302 12209 3885 33637 10438 -65471 -45351 2721 -53376 -61504 -30627 -13275 -12741 1548
718 1548 8526 15969 44891 -11081 -32755 2217 3362 1643 -30283 -40693 24034 7396 -22372
705b2372m642K2511K5417n3202K4809P1179p6904j0067N126K9158j392k5594P7695
692F1722k5814l0754p4772M4414J1653j6062Q212J1581M4214j813N2859k409m5128
$$ plain form
705 -22372 -27014 -4503 20914 -32288 -7479 63700 -13204 -23271 -18145 11013 9621 -15973 61722
692 61722 35908 5154 -69618 -25204 -13551 -29613 -21401 -9820 34394 32581 85440 83031 37903
$$ [...]
##END NTUPLES=NMR SPECTRUM
##END=
