##TITLE=1H_TG-2343-A
 CDCl3
 8 sc, 
 20.1.2022
##JCAMPDX= 6.0         $$ Bruker NMR JCAMP-DX V2.0
##DATA TYPE= NMR SPECTRUM
##DATA CLASS= NTUPLES
##ORIGIN= UXNMR, Bruker Analytische Messtechnik GmbH
##OWNER= root
$$ XWIN-NMR		Version 3.5
$$ Thu Jan 20 12:35:46 2022 Russian Standard Time (UT+4h)  she@DPX200
##.OBSERVE FREQUENCY= 200.131346
##.OBSERVE NUCLEUS= ^1H
##.ACQUISITION MODE= SIMULTANEOUS
##.ACQUISITION SCHEME= undefined
##.AVERAGES= 8
##.DIGITISER RES= 18
##SPECTROMETER/DATA SYSTEM= spect
##.PULSE SEQUENCE= zg30
##.SOLVENT NAME= CDCl3
##.SHIFT REFERENCE= (INTERNAL, CDCl3, 0, 15.7182)
##AUDIT TRAIL= $$ (NUMBER, WHEN, WHO, WHERE, WHAT)
$$ ##TITLE= Audit trail, XWIN-NMR		Version 3.5
$$ ##JCAMPDX= 5.01
$$ ##ORIGIN= Bruker BioSpin GmbH
$$ ##OWNER= she
$$ F:/spectra/data/she/nmr/H-F/1/pdata/1/auditp.txt
$$ ##AUDIT TRAIL=  $$ (NUMBER, WHEN, WHO, WHERE, WHAT)
(   1,<2022-01-20 12:33:24.70 +0400>,<she>,<DPX200>,
      <created by zg, POWCHK disabled, PULCHK disabled
       configuration hash MD5:
       00 E9 B6 7A A2 85 ED C7 34 08 36 98 17 FE 4E 26
       data hash MD5: 16K
       5C 8F D3 70 BA F4 46 CF D5 B4 0D 68 84 F2 7B C3>)
(   2,<2022-01-20 12:34:16.01 +0400>,<she>,<DPX200>,
      <Start of raw data processing
       efp BC_mod = 2 LB = 0.24 FT_mod = 6 PKNL = 1 PHC0 = -15866.3 PHC1 = 6.800781 SI = 16K 
       data hash MD5: 16K
       29 7B EE E7 42 18 8C 2C 4B 90 86 5C 08 25 5D 32>)
(   3,<2022-01-20 12:34:32.79 +0400>,<she>,<DPX200>,
      <pk PHC0 = -0.2433221 PHC1 = 0.4 
       data hash MD5: 16K
       54 73 13 B9 D8 A4 A7 F5 9E 2D 6C 2C FC 3D C3 FD>)
(   4,<2022-01-20 12:34:36.09 +0400>,<she>,<DPX200>,
      <abs ABSG = 5 
       data hash MD5: 16K
       C7 F2 D6 C7 CD 49 51 76 23 B4 1E 59 2D 77 C6 A6>)
(   5,<2022-01-20 12:35:01.48 +0400>,<she>,<DPX200>,
      <abs ABSG = 5 
       data hash MD5: 16K
       C9 E4 88 1D C7 75 D9 E8 38 77 C7 E6 70 C2 52 02>)
$$ ##END=
$$ 
$$ hash MD5
$$ 79 3F AC F2 AB 8B 3D E9 D9 F9 67 4D 87 84 DA FF
##$RELAX= 
##$RELAX= 
##$RELAX= 
##$RELAX= 
##$RELAX= 
##$RELAX= 
$$ Bruker specific parameters
$$ --------------------------
##$DU= <F:/spectra>
##$EXPNO= 1
##$NAME= <H-F>
##$PROCNO= 1
##$TYPE= <nmr>
##$USER= <she>
##$AMP= (0..31)
100 100 100 100 100 100 100 100 100 100 100 100 100 100 100 100 100 100 
100 100 100 100 100 100 100 100 100 100 100 100 100 100 
##$AQSEQ= 0
##$AQ_mod= 1
##$AUNM= <au_zg>
##$AUTOPOS= <>
##$BF1= 200.13
##$BF2= 200.13
##$BF3= 200.13
##$BF4= 200.13
##$BF5= 200.13
##$BF6= 200.13
##$BF7= 200.13
##$BF8= 200.13
##$BYTORDA= 1
##$CFDGTYP= 0
##$CFRGTYP= 5
##$CHEMSTR= <none>
##$CNST= (0..31)
1 1 145 1 1 1 1 1 1 1 1 1 1 1 1 1 1 1 1 1 1 1 1 1 1 1 1 1 1 1 1 1 
##$CPDPRG= <>
##$CPDPRG1= <>
##$CPDPRG2= <>
##$CPDPRG3= <>
##$CPDPRG4= <mlev>
##$CPDPRG5= <mlev>
##$CPDPRG6= <mlev>
##$CPDPRG7= <mlev>
##$CPDPRG8= <mlev>
##$CPDPRGB= <>
##$CPDPRGT= <>
##$D= (0..31)
0 1.2 0 0 0 0 0 0 0 0.06 0 0.03 0 0 0 0 0.0002 0 0 0 0 0 0 0 0 0 0 0 0 
0 0 0 
##$DATE= 1642667604
##$DBL= (0..7)
$$ [...]
##$SUBNAM2= <"">
##$SUBNAM3= <"">
##$SUBNAM4= <"">
##$SUBNAM5= <"">
##$SUBNAM6= <"">
##$SUBNAM7= <"">
##$SUBNAM8= <"">
##$SUBNAM9= <"">
##$SW= 18.0517287032376
##$SWIBOX= (0..15)
0 0 2 0 0 0 0 0 0 0 0 0 0 0 0 0 
##$SW_h= 3612.71676300578
##$TD= 16384
##$TD0= 1
##$TE= 0
##$TE2= 300
##$TE3= 300
##$TEG= 300
##$TL= (0..7)
0 120 120 120 120 120 120 120 
##$TP= (0..7)
150 150 150 150 150 150 150 150 
##$TP07= 0
##$TPNAME0= <>
##$TPNAME1= <>
##$TPNAME2= <>
##$TPNAME3= <>
##$TPNAME4= <>
##$TPNAME5= <>
##$TPNAME6= <>
##$TPNAME7= <>
##$TPOAL= (0..7)
0.5 0.5 0.5 0.5 0.5 0.5 0.5 0.5 
##$TPOFFS= (0..7)
0 0 0 0 0 0 0 0 
##$TUNHIN= 0
##$TUNHOUT= 0
##$TUNXOUT= 0
##$USERA1= <user>
##$USERA2= <user>
##$USERA3= <user>
##$USERA4= <user>
##$USERA5= <user>
##$V9= 5
##$VALIST= <valist>
##$VCLIST= <CCCCCCCCCCCCCCC>
##$VD= 0
##$VDLIST= <DDDDDDDDDDDDDDD>
##$VPLIST= <PPPPPPPPPPPPPPP>
##$VTLIST= <TTTTTTTTTTTTTTT>
##$WBST= 1024
##$WBSW= 4
##$XGAIN= (0..3)
0 0 0 0 
##$XL= 0
##$YL= 0
##$YMAX_a= 531106
##$YMIN_a= -767709
##$ZGOPTNS= <>
##$ZL1= 120
##$ZL2= 120
##$ZL3= 120
##$ZL4= 120
##$ABSF1= 15.71824
##$ABSF2= -2.33361
##$ABSG= 5
##$ABSL= 3
##$ALPHA= 0
##$AQORDER= 0
##$ASSFAC= 0
##$ASSFACI= 0
##$ASSFACX= 0
##$ASSWID= 0
##$AUNMP= <proc_1d>
##$AZFE= 0.1
##$AZFW= 0.1
##$BCFW= 0
##$BC_mod= 2
##$BYTORDP= 0
##$COROFFS= 0
##$CY= -3
##$DATMOD= 1
##$DC= 0
##$DFILT= <>
##$DTYPP= 0
##$F1P= 0
##$F2P= 0
##$FCOR= 1
##$FTSIZE= 16384
##$FT_mod= 6
##$GAMMA= 0
##$GB= 0
##$INTBC= 1
##$INTSCL= 0
##$ISEN= 128
##$LB= 0.24
##$LEV0= 0
##$LPBIN= 0
##$MAXI= 10000
##$MC2= 0
##$MEAN= 0
##$ME_mod= 0
##$MI= 1.114404
##$NCOEF= 0
##$NC_proc= -5
##$NLEV= 6
##$NOISF1= 3.799351
##$NOISF2= 2.8
##$NSP= 0
##$NTH_PI= 0
##$NZP= 0
##$OFFSET= 15.71824
##$PC= 1
##$PHC0= -15866.54
##$PHC1= 7.200781
##$PH_mod= 1
##$PKNL= yes
##$PPARMOD= 0
##$PSCAL= 0
##$PSIGN= 0
##$REVERSE= no
##$SF= 200.130006666877
##$SI= 16384
##$SIGF1= 3
##$SIGF2= 2
##$SINO= 5.538805
##$SIOLD= 16384
##$SREGLST= <1H.CDCl3>
##$SSB= 0
##$STSI= 16384
##$STSR= 0
##$SW_p= 3612.71676300578
##$SYMM= 0
##$S_DEV= 0
##$TDeff= 16384
##$TDoff= 0
##$TI= <>
##$TILT= no
##$TM1= 0
##$TM2= 0
##$TOPLEV= 0
##$USERP1= <user>
##$USERP2= <user>
##$USERP3= <user>
##$USERP4= <user>
##$USERP5= <user>
##$WDW= 1
##$XDIM= 16384
##$YMAX_p= 407843944
##$YMIN_p= -168573
$$ End of Bruker specific parameters
$$ ---------------------------------
##NTUPLES= NMR SPECTRUM
##VAR_NAME=  FREQUENCY,     SPECTRUM/REAL,   SPECTRUM/IMAG
##SYMBOL=    X,             R,               I
##VAR_TYPE=  INDEPENDENT,   DEPENDENT,       DEPENDENT
##VAR_FORM=  AFFN,          ASDF,            ASDF
##VAR_DIM=   16384,         16384,           16384
##UNITS=     HZ,            ARBITRARY UNITS, ARBITRARY UNITS
##FACTOR=    0.220516191357247, 1,           1
##FIRST=     3145.69143281167, 0,            0
##LAST=      -467.025330194113, 0,           0
##MIN=       -467.025330194113, -168573,     0
##MAX=       3145.69143281167, 407843944,    0
$$ Real data points
##PAGE= N=1
##DATA TABLE= (X++(R..R)), XYDATA
$$ [...]
7089C1337982k433391k201378k111416j925373j769452j540398j311176j160755
7081A6884643r37491q04584p32584n56539n13467m74623l66505l09854k92903
7072A1896093l13114k21991j93572k02765j22199j30371m8877k5078j3432M9017
7062A0673711K1312R688q400k969r7345r8495l8754L164J21924J23788J35477
7051A0843101K16168J72858K32528L05430K82717L00723M31347M94488N65146
7042A3844506N83164O78858Q25651R67192J091702J223491J337096J572002J881414
7033B4005076K152070K584530L198565L836727M446827N191373N484059N615674
7025E6514901N259847M661941L732253K219215K53887j760440l723764m906294
$$ y = [31337982, 28904591, 26703213, 24591797, 22666424, 20896972, 19356574, 18045398, 16884643, 15947152, 15142568, 14409984, 13853445, 13339978, 12865355, 12498850, 12188996, 11896093, 11582979, 11360988, 11167416, 10964651, 10842452, 10712081, 10663204, 10638126, 10624694, 10673711, 10695023, 10704711, 10696311, 10693342, 10595997, 10497502, 10458748, 10461912, 10583836, 10707624, 10843101, 11059269, 11232127, 11464655, 11770085, 12052802, 12353525, 12784872, 13279360, 13844506, 14427670, 15106528, 15932179, 16899371, 17991073, 19214564, 20551660, 22123662, 24005076, 26157146, 28741676, 31940241, 35776968, 40223795, 45415168, 50899227, 56514901, 61774748, 66436689, 70168942, 72388157, 72642044, 70881604, 67157840, 62251546]
7017F2251546n310738n276980m440993l621818k811272k242830k040927k096841
7009C4409147k314640k258886k287516k159114k003517j960402j803208j653548
7001A7968316j447474j229867j069868r17062q13864p41002o45778o06996n27007
6992I969398m58133n07818l84085l97955l14931k79669k97285l46681k25213k06008
6982F551620k36921k21592k28011j63674k14402j48668j63189j11299j64083r3607
6972D806174j30781j56863j27270l2102o9873r8843n2428o5762m4915o1504r5804
6961C870029j241R4123J7842L8672Q1983J14693J02468J26600J66905K03799J59964
6950D975837J64057Q8377J2681k7851j74403j45328k74707l32461l06944k32746
$$ y = [62251546, 56940808, 51663828, 47222835, 43601017, 40789745, 38546915, 36505988, 34409147, 32094507, 29835621, 27548105, 25388991, 23385474, 21425072, 19621864, 17968316, 16520842, 15290975, 14221107, 13304045, 12490181, 11749179, 11103401, 10496405, 9969398, 9511265, 9003447, 8619362, 8221407, 7906476, 7626807, 7329522, 6982841, 6757628, 6551620, 6314699, 6093107, 5865096, 5701422, 5487020, 5338352, 5175163, 5063864, 4899781, 4806174, 4675393, 4518530, 4391260, 4359158, 4289285, 4190442, 4138014, 4072252, 4027337, 3965833, 3870029, 3868788, 3962911, 3980753, 4019425, 4101408, 4216101, 4318569, 4445169, 4612074, 4815873, 4975837, 5139894, 5228271, 5240952, 5213101, 5038698, 4893370, 4618663, 4286202, 3979258, 3746512]
6940C746512k36927k10540j10716j22007r8303j10784j95556j01121j85168j47740
6930B227650j17267j11690q1026q4501j10694j15774n2577o0359n6707n0257j8977
6919A367821L0097k3054L225o0482q9524J0404j8768k0445o6428k4220j6763k1946
6907A069917n0618m6096J9483L2154m1306M487k8557m8936j8657J1827k8443l0216
6895H45039L6047q0832k2603L2057m635m6263K069j3559l5333p962N0244k3546
6883G30723p0725K1738N1860p796n5928k0392K1926l0657o7557k2301M1440k8720
6871E63611l2260K4049n450M757n6602j1802M3687K0439L3178m9965n9219J5709
6859D90132R728J543J0202M298M258N630o350R608M6334J977p106J773o4066K1110
$$ y = [3746512, 3509585, 3299045, 3188329, 3066322, 2968019, 2857235, 2661679, 2560558, 2375390, 2227650, 2110383, 1998693, 1917667, 1833166, 1722472, 1606698, 1554121, 1493762, 1437055, 1386798, 1367821, 1397918, 1374864, 1378089, 1317607, 1228083, 1238487, 1219719, 1199274, 1132846, 1108626, 1091863, 1069917, 1019299, 973203, 992686, 1024840, 983534, 988021, 959464, 910528, 891871, 903698, 875255, 845039, 881086, 800254, 777651, 809708, 805073, 758810, 760879, 747320, 711987, 704025, 754269, 730723, 659998, 681736, 733596, 725800, 669872, 649480, 671406, 640749, 573192, 550891, 592331, 563611, 531351, 555400, 549950, 554707, 498105, 486303, 529990, 550429, 583607, 533642, 474423, 490132, 499860, 501403, 511605, 515903, 520161, 525791, 519441, 529049, 575383, 577360, 570254, 572027, 507961, 529071]
6845E29071m860J7987l7549n6908K0936n3906j0440M375P387M0549l6252j6235
6833D04155Q51k096p1320J4387j5102j8484K160P491J8680j6005k2876M1256l409
6820C39688j9068m0811j7356N6296p833P466P899k5097K7451J0466p554k5234
6808C06313M6939J7858j8826k5240J9040O4579j564k0071L5613L7749P555l4917
6796D35028j3355p157j784O627n450J6052j8552k2230n1614n6910J3131j9471
6784B74315k5853M5302m3538n5660J7262j2384m3130m216O1759J6482m1M5116
6772B75414j2948L168l9275L3946j4444m298n159R088j2032n8623K1971M3382
6760B40190n185J9575j9224k6482j7758j8248M5343j4333k8297M4416p371K2242
$$ y = [529071, 524211, 542198, 504649, 447741, 468677, 414771, 404331, 408706, 416093, 456642, 420390, 404155, 405006, 402910, 331590, 345977, 330875, 312391, 314551, 322042, 340722, 324717, 301841, 343097, 339688, 320620, 279809, 262453, 318749, 310916, 318382, 326281, 301184, 328635, 339101, 331547, 306313, 353252, 371110, 352284, 327044, 346084, 410663, 409099, 389028, 424641, 462390, 469945, 435028, 421673, 414516, 412732, 419359, 413909, 429961, 411409, 389179, 337565, 280655, 293786, 274315, 248462, 293764, 250226, 194566, 211828, 199444, 156314, 152098, 213857, 230339, 230298, 275414, 262466, 265634, 226359, 260305, 245861, 241563, 236404, 245492, 233460, 174837, 196808, 240190, 235005, 254580, 235356, 208874, 191116, 172868, 218211, 203878, 175581, 219997, 212626, 234868]
6748B34868p714l4328J7292K1313J5074L6709n8912l6225L0064j9094J6375L9804
6736B55226k0446m0441K0587N012N7943m401l7611K5799m2432L652J3623J7808
6724B54319K623J1894J1257L2692L5878m8571J0516j7400J1647N8678j6399N250
6712C52384O9979m827J2989j3348J5351M0496N4542L5209P0907K3823o69L8031
6700F94867j0664r775r1132L169K697m8827m8596k9843m0501k5882L3989L13l956
6687D25859k7687Q613K4467l934J1368k5699k808n489L2718p8638K0340O6602
6675D45712l2378k129Q9400p9940L7013J5322j7217Q231l7663K3436k8190Q972
6663D30569l8658J3686L0422K6498j9936P861K050L9100k2774K0860R107R725
$$ y = [234868, 227154, 192826, 210118, 231431, 246505, 283214, 224302, 188077, 218141, 199047, 215422, 255226, 234780, 194339, 214926, 219938, 277881, 273480, 235869, 261668, 219236, 222888, 236511, 254319, 256942, 268836, 280093, 312785, 348663, 300092, 310608, 293208, 304855, 363533, 347134, 352384, 422363, 417536, 430525, 417177, 432528, 473024, 527566, 562775, 633682, 657505, 656836, 694867, 684203, 674428, 583296, 586465, 589162, 540335, 491739, 461896, 421395, 395513, 429502, 429815, 425859, 398172, 406785, 431252, 427318, 438686, 412987, 410179, 404690, 437408, 358770, 379110, 445712, 413334, 411205, 500605, 420665, 457678, 473000, 455783, 464014, 426351, 449787, 421597, 430569, 391911, 405597, 436019, 462517, 442581, 450442, 452492, 491592, 468818, 489678, 498785, 508510]
6651E08510L2307n8750k117j2181J3342K3022Q529K9501J349K1431O967k5794
6639E46116k928O1919m920K1891K4520n50m1239L4494N6983J820M263k736M3442
6626G43075P4823l9732M8925O7888N491j8707L7236K9070K5396j5686j3006m1752
6614I03021k7046l9525K4402k6358k4804J4796N941l9623k7227J9512j7980K4714
6602G89823k7794m368L565O217K383K2392k3645l8332L2130J5680J459P801q995
6589G78316K8216j7651m6951m6877M3012m3975N9098k1941L3508R940L1205k0131
6577G85769j9958r581j8251M5428j0560L1469L8125L1502R652j5602l2865M7847
6565H82975l2798j3439O3009L6252j8103L694O3204j4733N357K5383m15K0634
$$ y = [508510, 540817, 482067, 479950, 467769, 481111, 504133, 512662, 542163, 543512, 564943, 571910, 546116, 543188, 605107, 600187, 622078, 646598, 646048, 604809, 639303, 696286, 698106, 702369, 699633, 743075, 817898, 778166, 827091, 894979, 900470, 881763, 918999, 948069, 973465, 957779, 944773, 903021, 875975, 836450, 860852, 834494, 809690, 824486, 830427, 790804, 763577, 783089, 765109, 789823, 762029, 757661, 761226, 767443, 769826, 792218, 768573, 730241, 762371, 778051, 779510, 787311, 778316, 806532, 788881, 741930, 695053, 738065, 694090, 753188, 731247, 764755, 774695, 805900, 785769, 765811, 756230, 737979, 783407, 772847, 804316, 842441, 873943, 883595, 867993, 835128, 882975, 850177, 836738, 899747, 935999, 917896, 921590, 984794, 970061, 975418, 1000801, 1000386, 1021020]
6553A021020j1027J2479l1914L9233P0018p288L8041N562M2275L7952J8526P0124
6541A305001L0268P111R928j2442M3402K8036K868n636Q789J3297L0590O1080
6529A522292K4331M8836N3288N0680P7021n454R195M5134N15K2608k891K6986
6517A872541R624P0894Q6900L2260l8363o392N5606O5310J3749P6468L1660O8241
6505B338498N4966L1816L3068J6863J7767M2279O4904M00K5216N0679K7130K5618
6493B729204J8504K6206Q7494j0350L6252L0403N8187Q8444L6714Q3031M3834
6482C227923l6889J03966J07857o244Q6855R2669N2963N0884P4112P2266Q8517
6471C914879R7549M4849M9374Q0547J03914J12269Q2300N7354J13033N2508J50149
$$ y = [1021020, 1009993, 1022472, 990558, 1029791, 1099809, 1092521, 1130562, 1136124, 1178399, 1216351, 1234877, 1305001, 1335269, 1342380, 1352308, 1339866, 1383268, 1411304, 1414172, 1408536, 1417325, 1430622, 1461212, 1522292, 1546623, 1595459, 1648747, 1699427, 1776448, 1770994, 1780189, 1825323, 1825838, 1848446, 1845555, 1872541, 1882165, 1953059, 2039959, 2072219, 2033856, 2027464, 2083070, 2148380, 2162129, 2238597, 2270257, 2338498, 2393464, 2425280, 2458348, 2475211, 2492978, 2535257, 2600161, 2600561, 2625777, 2676456, 2703586, 2729204, 2747708, 2773914, 2861408, 2851058, 2887310, 2917713, 2975900, 3064344, 3101058, 3184089, 3227923, 3191034, 3295000, 3402857, 3396613, 3483468, 3576137, 3629100, 3679984, 3754096, 3826362, 3914879, 4012428, 4057277, 4106651, 4187198, 4291112, 4403381, 4485681, 4543035, 4656068, 4708576, 4858725]
6460D858725R4044J21892J60494L3584J42197J34197R4047J32470J20351R7565
6450E989566J53203J65362J18839J09073J20634J50830R2183J12298P4447N2152
6440G138587J24569J32139R8649M6113M0532P9733R7978R6134J0007J6831M8599
6429G929871Q3974M4126M0216N3503L7975O0443M3453O357O1805P2379K7921J09595
6417H571618M2946N8353J33251Q2470K1161L9039R7885J36116J33260J00325R8511
6406I514935J12080P7020J86426J19527J26523J22025J69514J40165J00172J40257
6396A0808644J12038J58790J35418J22291J72161J46716J32215Q7777J01345J13486
6386A2090881P5072M2231N0174M8849K3870j7838j1056m2906j01314j19291m8592
$$ y = [4858725, 4952769, 5074661, 5235155, 5268739, 5410936, 5545133, 5639180, 5771650, 5892001, 5989566, 6142769, 6308131, 6426970, 6536043, 6656677, 6807507, 6899690, 7011988, 7086435, 7138587, 7263156, 7395295, 7493944, 7540057, 7580589, 7660322, 7758300, 7854434, 7864441, 7881272, 7929871, 8013845, 8057971, 8098187, 8151690, 8189665, 8250108, 8293561, 8299918, 8361723, 8434102, 8462023, 8571618, 8614564, 8672917, 8806168, 8888638, 8909799, 8948838, 9046723, 9182839, 9316099, 9416424, 9514935, 9627015, 9704035, 9890461, 10009988, 10136511, 10258536, 10428050, 10568215, 10668387, 10808644, 10920682, 11079472, 11214890, 11337181, 11509342, 11656058, 11788273, 11876050, 11977395, 12090881, 12165953, 12208184, 12258358, 12307207, 12331077, 12313239, 12302183, 12259277, 12157963, 12038672, 11990080]
6375A1990080r9190q8115r2602j28563j14103q9450p2724j26386j37315j43210
6365A0898422j38752j55417r4025j50008j97857j58728j88220j45298j16124j66111
6355I387882j85077j70675j48403j34615j08260j20106j35868j21945l6644r8921
6345H127368p6029j55625q5397J250k433m7830k5198l2995o2833l9487k8845j960
6333G569986L721o0255o7550k7487L393L335l5603o6978J5195n1343m3607k6876
6321G215931k1884o1794l6642l6181k0195N1681k4192q6811o5921P204m9294J8683
6309F890585p8555l0681n2770j6496j6454j9342j5097q0765q5097j8730j4839
6298F461759r468j9353k7539m7305q1521l3845N270N138l6825m2098o8273l2333
$$ y = [11990080, 11890890, 11802775, 11710173, 11581610, 11467507, 11378057, 11305333, 11178947, 11041632, 10898422, 10759670, 10604253, 10510228, 10360220, 10162363, 10003635, 9815415, 9670117, 9553993, 9387882, 9202805, 9032130, 8883727, 8749112, 8640852, 8520746, 8384878, 8262933, 8226289, 8127368, 8051339, 7895714, 7810317, 7811567, 7809134, 7761304, 7736106, 7703111, 7640278, 7600791, 7571946, 7569986, 7573707, 7513452, 7445902, 7418415, 7421808, 7425143, 7389540, 7322562, 7337757, 7286414, 7242807, 7215931, 7194047, 7132253, 7095611, 7059430, 7039235, 7090916, 7066724, 6979913, 6913992, 6921196, 6871902, 6890585, 6812030, 6781349, 6728579, 6712083, 6695629, 6676287, 6661190, 6580425, 6495328, 6476598, 6461759, 6452291, 6432938, 6405399, 6358094, 6276573, 6242728, 6247998, 6253136, 6216311, 6174213, 6105940, 6073607]
6286F073607P237k1154n8095O810j0948o6260m6270o7255p599l3091q0725k7924
6274E668333m9907o2834n8040p6212l6822j7406n7703l5026n6074n5109l0556
6263E132644p0716j09366o1084J8516o3974j03811o3050m5150p0055n4760m9964
6252D459230l8047j0265r2784o5556k0694m3497j4756r2379n2497o9965m1465
6241C917325L210n2652l2774m9811n1785l5709m3936m2115k6561o0091j692K021
6229C525430m9508o2561m7943p8552m4987p1191n0789m2630j5299l0448k3586
6218C007936n8229o0480m9176j2092k7281n2753k9500l8480Q67l0268r1064j7203
6206B542277M2222j0473n2162k6130P57m2404l7603k228q334o8044K9528J7226
$$ y = [6073607, 6080844, 6059690, 6001595, 6008405, 5997457, 5931197, 5884927, 5817672, 5810073, 5776982, 5696257, 5668333, 5618426, 5555592, 5497552, 5421340, 5384518, 5367112, 5309409, 5274383, 5218309, 5163200, 5132644, 5061928, 4952562, 4891478, 4909994, 4846020, 4742209, 4679159, 4634009, 4563954, 4509194, 4459230, 4421183, 4410918, 4318134, 4252578, 4231884, 4188387, 4173631, 4081252, 4028755, 3958790, 3917325, 3920535, 3867883, 3835109, 3785298, 3733513, 3697804, 3653868, 3611753, 3585192, 3525101, 3523409, 3525430, 3475922, 3413361, 3365418, 3286866, 3241879, 3170688, 3119899, 3077269, 3061970, 3031522, 3007936, 2949707, 2889227, 2840051, 2827959, 2800678, 2747925, 2718425, 2679945, 2680812, 2650544, 2559480, 2542277, 2584499, 2574026, 2521864, 2495734, 2496491, 2454087, 2416484, 2414256, 2405922, 2337878, 2367406, 2384632]
6194B384632n851j8904k6547j502k8678l221R469L7701n8279j3211M7981k861
6182B320729O606m1958l1070L8214O727J0029j2716j4722J6679O2998J2566j3051
6170B361031q2010m4235O1406k723Q781O357j3733j2125M2134l7294J7841m0250
6158B265180L4866M310l1260M886N127L758J9434L2502l0663l4699L512k5214
6146B251739L1339O4920j1420j3895K5160j1283K8120L5843M6827J3883J9394
6135B480627J5461L2169K3476L3638k2769N0281Q2793k1424N9280K2500N817J5967
6123B777816Q3903L4932N1492M0565K2172J2568R978L1129Q4806P7557M4108O0579
6111C331605M2195p85M3408O2058J9914J0351R6769J01621N6906Q0107O2454K8748
$$ y = [2384632, 2378781, 2359877, 2333330, 2331828, 2303150, 2299929, 2309398, 2347099, 2288820, 2275609, 2323590, 2320729, 2327335, 2285377, 2254307, 2292521, 2299248, 2309277, 2296561, 2281839, 2298518, 2361516, 2374082, 2361031, 2279021, 2234786, 2296192, 2293469, 2302250, 2308607, 2294874, 2282749, 2324883, 2287589, 2305430, 2265180, 2300046, 2304356, 2273096, 2277982, 2283109, 2286867, 2306301, 2338803, 2308140, 2273441, 2276953, 2251739, 2283078, 2347998, 2336578, 2322683, 2347843, 2336560, 2364680, 2400523, 2447350, 2461233, 2480627, 2496088, 2528257, 2551733, 2585371, 2562602, 2612883, 2695676, 2674252, 2733532, 2756032, 2761849, 2777816, 2861719, 2896651, 2948143, 2988708, 3010880, 3023448, 3033426, 3064555, 3149361, 3226918, 3271026, 3331605, 3373800, 3373015, 3416423, 3478481, 3498395, 3508746, 3605515, 3707136, 3764042, 3844149, 3906603, 3935351]
6099C935351P3222M6386J07379J05404N5093N7519L8164N2952R4311J12247J20229
6088D798257J54849J30547J28296J67731J22764J36725K13839K42945K70406K85190
6078F651549K80974L49397L15407L74974N24544N32857N62237O75468Q05779R59539
6068A2032725J099990J291796J486000J684973J859580J753164J594241J414339
6060B4216808Q73519J58122l90885o58718m91345j64684K00701Q11568J111680
6051B5666766J089125Q06794L55877k56070j052860j641596j856830j866180j696311
6042A9548715j367578j003362o88609n78663o46073o58099n70374m69599m55841
6033A3110517l42966l32570k87033k08682j29625k4717J1018J07470K03851K59203
$$ y = [3935351, 4008573, 4054959, 4162338, 4267742, 4322835, 4380354, 4418518, 4471470, 4565781, 4678028, 4798257, 4953106, 5083653, 5211949, 5379680, 5502444, 5639169, 5853008, 6095953, 6366359, 6651549, 6932523, 7281920, 7597327, 7972301, 8496845, 9029702, 9591939, 10267407, 11073186, 12032725, 13132715, 14424511, 15910511, 17595484, 19455064, 21208228, 22802469, 24216808, 25090327, 25248449, 24857564, 24198846, 23707501, 23542817, 23743518, 24555086, 25666766, 26755891, 27562685, 27918562, 27662492, 26609632, 24968036, 23111206, 21245026, 19548715, 18181137, 17177775, 16489166, 15910503, 15264430, 14606331, 14035957, 13566358, 13110517, 12767551, 12434981, 12147948, 11939266, 11809641, 11784924, 11795942, 11903412, 12107263, 12366466]
6023A2366466L41644M78485N14493O89043Q06769J030628J219339J436535J699616
6014B0583018K006086K277915K319216K186795J884151J359884N26034l37948
6006C2805151p95121r63991o09576j28429M85583J079790J285903J094267O59555
5997C4913132k5471r70060j883785k517148k751234k578148k224807j813536j312979
5988A8835964j040377r60441r77212j111094j000476r51470q10055p30621p23634
5979A0530584o64354n74749n32408m61518l60657l83938l31427k83876k78191
5970F659466k68980k15301k43021k09744j08719j90864j71942j02295j33748q6306
5960D928546j27376j70379j07503p3163j14232m5787n1793l3165p3089k2388n1922
$$ y = [12366466, 12708110, 13186595, 13701088, 14390131, 15196900, 16227528, 17446867, 18883402, 20583018, 22589104, 24867019, 27186235, 29373030, 31257181, 32617065, 33143099, 32805151, 32010030, 31046039, 30436463, 30308034, 30793617, 31873407, 33159310, 34253577, 34913132, 34887661, 33917601, 32033816, 29516668, 26765434, 24187286, 21962479, 20148943, 18835964, 17795587, 16835146, 15857934, 14746840, 13746364, 12794894, 11984839, 11254218, 10530584, 9866230, 9291481, 8759073, 8297555, 7936898, 7552960, 7221533, 6937657, 6659466, 6390486, 6175185, 5932164, 5722420, 5613701, 5422837, 5250895, 5148600, 5014852, 4928546, 4801170, 4630791, 4523288, 4450125, 4335893, 4290106, 4238313, 4205148, 4132059, 4109671, 4057749]
5949D057749q0744l4635q9212q6092l7877p883p964j1330j4381j3148k6923m2103
5937C605457k6519n5890j3997j5344M5020p4577J1685m4202m7771J3450j2619
5926C384693N5252J9681M0181L3919k8884m97O0286k6680L3854M7235N8548K0527
5914C698115K8559K0370O0107N1508q515M9250M7723J13989J12370J15365Q1300
5903D370141J10727O4587J1831K4979l2461j6187l4587K9989J2858m910J16412
5892D653379M4719J6968K7431M6639R1917L7682Q6443P7176P5707M9241Q7972
5881E295274Q0084N1551J0004P3845R8153N1141J5938J2612P4763K7454O8175
5870E858994N0319J00316Q9183R5663N4055L8806J44271J72394J25821J30844
$$ y = [4057749, 3977005, 3942370, 3853158, 3767066, 3729189, 3721306, 3713342, 3702012, 3687631, 3674483, 3647560, 3605457, 3578938, 3523048, 3509051, 3493707, 3538727, 3464150, 3475835, 3431633, 3383862, 3397312, 3384693, 3439945, 3459626, 3499807, 3533726, 3504842, 3504345, 3564631, 3537951, 3571805, 3619040, 3677588, 3698115, 3726674, 3747044, 3807151, 3858659, 3850144, 3899394, 3947117, 4061106, 4173476, 4288841, 4370141, 4480868, 4545455, 4557286, 4582265, 4549804, 4533617, 4499030, 4529019, 4541877, 4536967, 4653379, 4698098, 4715066, 4742497, 4789136, 4881053, 4918735, 5005178, 5082354, 5158061, 5207302, 5295274, 5375358, 5426909, 5436913, 5510758, 5608911, 5660052, 5675990, 5688602, 5763365, 5790819, 5858994, 5909313, 6009629, 6098812, 6194475, 6248530, 6287336, 6431607, 6604001, 6729822, 6860666]
5860F860666J30184J20855J53970K16196K34518K16470K82652K55856K68347L72673
5850I112387K68417K71877K96413L11324L15711K06643K09339J65190J66657J98009
5840A1521967J83086J99997K16837K90214L23045L66255L53827M01004L57136
5831A4213368M01163N02887N00954N34000N74525O11078O75088P70873P72156
5822A9556092Q83923R69931R35847R83443J036754R52141J008449Q72249P43437
5813B7942266O95537O43592N89303O73223P35569Q73717J013782J113497J205472
5804C5485958J319231J385221J502345J574374J730770K013472K261991K528206
5796D9801568K821229L098728L496939L971973M420126M819995N249902N520916
$$ y = [6860666, 6990850, 7111705, 7265675, 7481871, 7716389, 7932859, 8215511, 8471367, 8739714, 9112387, 9380804, 9652681, 9949094, 10260418, 10576129, 10782772, 10992111, 11157301, 11323958, 11521967, 11705053, 11905050, 12121887, 12412101, 12735146, 13101401, 13455228, 13856232, 14213368, 14614531, 15117418, 15618372, 16152372, 16726897, 17337975, 18013063, 18783936, 19556092, 20440015, 21409946, 22345793, 23329236, 24365990, 25318131, 26326580, 27198829, 27942266, 28637803, 29281395, 29870698, 30543921, 31279490, 32153207, 33166989, 34280486, 35485958, 36805189, 38190410, 39692755, 41267129, 42997899, 45011371, 47273362, 49801568, 52622797, 55721525, 59218464, 63190437, 67610563, 72430558, 77680460, 83201376]
5788H3201376N866658O115931O162053O103749N898259N464416M854043M231146
5780A27897631L443349K557560J677172P26276k22999j210256k140023k883240
5772A29845470l631621m262115m675470m840769n015276m971643m878744m713406
5764I2856426m517862m285568m097736l938279l772144l595054l405631l249458
5756F1994694l048482k802901k560350k321335k084079j836150j578665j380941
5748D4381791j245063r84408q87111p93953p24038p21859o51105o77051p81089
5739C6916114q44352q30088q83002p89182p25365n94702m32646k23290m437J01527
5729C1690577L44571N69270P78558Q88368Q68139Q39675P50831M47249K25659
$$ y = [83201376, 89068034, 95183965, 101346018, 107449767, 113348026, 118812442, 123666485, 127897631, 131340980, 133898540, 135575712, 136301988, 136078989, 134868733, 132728710, 129845470, 126213849, 121951734, 117276264, 112435495, 107420219, 102448576, 97569832, 92856426, 88338564, 84052996, 79955260, 76016981, 72244837, 68649783, 65244152, 61994694, 58946212, 56143311, 53582961, 51261626, 49177547, 47341397, 45762732, 44381791, 43136728, 42152320, 41265209, 40471256, 39747218, 39025359, 38374254, 37697203, 36916114, 36071762, 35241674, 34358672, 33569490, 32844125, 32249423, 31816777, 31593487, 31589050, 31690577, 32035148, 32604418, 33382976, 34271344, 35139483, 35979158, 36729989, 37177238, 37402897]
5720C7402897j48821p02206j063583j285712j620837j679165j264202j017989
5712B8620382q67239o50172m48590l38354m05708l89124l51021k60716P736K52397
5702B5169591M34388O91225R37396J133088J081333J139134R30262O57043L74272
5693C2547732j32775o46744j038419j347306j643045j619970j279816r82204p94160
5684B3063293o31050l33646k82252l17179l25484k67555m9508J50569L33172N00430
5674B1840790N26554M91487N50213N17270L63689P4908k40954n93427p66933j040076
5664B1723521j172824j089898q47522o88605n01720l33022j61557j76566k56393
5655A6495414k35113j56710o7979J54890K84792M44380O88563Q41866Q58235Q30047
$$ y = [37402897, 37254076, 36551870, 35488287, 34202575, 32581738, 30902573, 29638371, 28620382, 27753143, 27102971, 26654381, 26316027, 25910319, 25521195, 25170174, 24909458, 24917194, 25169591, 25603979, 26295204, 27232600, 28365688, 29447021, 30586155, 31516417, 32173460, 32547732, 32414957, 31768213, 30729794, 29382488, 27739443, 26119473, 24839657, 23857453, 23063293, 22432243, 22098597, 21816345, 21499166, 21173682, 20906127, 20856619, 21007188, 21340360, 21840790, 22367344, 22858831, 23409044, 23926314, 24290003, 24364911, 24123957, 23530530, 22763597, 21723521, 20550697, 19460799, 18613277, 17924672, 17422952, 17089930, 16928373, 16751807, 16495414, 16260301, 16103591, 16035612, 16190502, 16475294, 16919674, 17608237, 18450103, 19308338, 20138385]
5645B0138385P63286O33846M12629K03133k82108p28517r45245j221574j421878
5636A7551957j301536r60504q61440p38648n81259m51676n13483o32556o87651
5627A0823204n88814n82317n77535m71155n24999m99476m42140m34130l80597
5618F322041l33564k60097j98215k48275k28639j20981j79475j84674j24472j23409
5608D320240j60584j46380q0402j21830j42010p2624r1877p8442m0620r3825j03011
5597C188635j7941j02273o5724k3932l6867m694q7313l933o9189q7091o3908o7143
5585B558627o8875o1109m6166k8385j4885J2404n1858q9094l3227n0311m0043
5574B087078L8235q3122o1389l8570n6588m6304p0904K2701J7355l2771o4801
$$ y = [20138385, 20901671, 21535517, 21948146, 22151279, 21869171, 21140654, 20195409, 18973835, 17551957, 16250421, 15289917, 14428477, 13689829, 13108570, 12656894, 12143411, 11510855, 10823204, 10234390, 9652073, 9074538, 8603383, 8078384, 7578908, 7136768, 6702638, 6322041, 5988477, 5728380, 5530165, 5281890, 5053251, 4932270, 4752795, 4568121, 4443649, 4320240, 4159656, 4013276, 3932874, 3811044, 3669034, 3596410, 3504533, 3426091, 3385471, 3291646, 3188635, 3170694, 3068421, 3002697, 2978765, 2941898, 2937204, 2849891, 2845958, 2776769, 2689678, 2625770, 2558627, 2489752, 2428643, 2382477, 2354092, 2339207, 2351611, 2299753, 2210659, 2177432, 2127121, 2087078, 2125313, 2042191, 1980802, 1942232, 1885644, 1839340, 1768436, 1791137, 1808492, 1775721, 1710920]
5563A710920j7589m0211k2527P774m3148j269K1073m5636k5618l4469l4278j7160
5551A457862K223K0217k4111k5581J2668N2898k2016o4347L1424L9819j0677q517
5539A461862J3374j2356j5074M560Q964j3685K0677j7874q16N5009l8143k4464
5527A442034P0099L1931l3188o345k8699K329M5313n5532r494K9366k8295k9254
5515A430265j2935Q89P0276j5257N027n2417J2847J9279K6213m7716k3880P3448
5503A486039M5601l1257k5495j3631L2530j0414r354L1065k4299K8352N046j6064
5491A498119J8888q782M1073L52K2809N0637P616j4512q743L0974R853k336l7245
5478A608703O1773k9578J2514k2188P2267J4451l2698L510N5929L5557O908L2127
$$ y = [1710920, 1693331, 1653120, 1630593, 1638367, 1595219, 1593950, 1615023, 1569387, 1543769, 1509300, 1475022, 1457862, 1460085, 1480302, 1456191, 1430610, 1443278, 1496176, 1474160, 1409813, 1441237, 1481056, 1470379, 1461862, 1475236, 1462880, 1447806, 1452366, 1461330, 1447645, 1468322, 1450448, 1449632, 1504641, 1466498, 1442034, 1512133, 1544064, 1510876, 1504531, 1475832, 1478161, 1523474, 1467942, 1458448, 1487814, 1459519, 1430265, 1417330, 1418219, 1488495, 1473238, 1478265, 1425848, 1438695, 1457974, 1484187, 1436471, 1412591, 1486039, 1531640, 1500383, 1474888, 1461257, 1493787, 1483373, 1474019, 1505084, 1480785, 1509137, 1514183, 1498119, 1517007, 1508225, 1549298, 1549650, 1572459, 1623096, 1630712, 1616200, 1607457, 1638431, 1648284, 1645948, 1608703, 1670476, 1640898, 1653412, 1631224, 1703491, 1717942, 1685244, 1688754, 1744683, 1780240, 1787148, 1819275]
5466A819275L1079j9537M7609K7906R94Q9888M5567J3462Q075L7003K0532J668
5454B123521L1801N7652L2587K2622R796m6671L9723L5527K6803j0993M7927J7843
5442B388138L590l382K3681Q8880J0051L7745P1159N4094N3261N3355K003K0285
5430B802860J11952Q5655L9743R52m7950K7315J02349P0888J9063O7320L3550
5419C313697J9525Q0173N7457K2081Q4317j159K1534J06576N2248K5057J10806
5408C892312Q5996R8598J20899J36761Q9115J21052J19484R9867J19219Q2409
5398D965712J30900N9823J03561K03247J36749J38357J17702J67369J57125P8258
5388F258803P6843J09499J50687K40217K06377K71009K62080K89647L05760L42558
$$ y = [1819275, 1850354, 1830817, 1878426, 1906332, 1907326, 1997214, 2042781, 2056243, 2064318, 2101321, 2121853, 2123521, 2155322, 2212974, 2245561, 2268183, 2277979, 2231308, 2271031, 2306558, 2333361, 2322368, 2370295, 2388138, 2391728, 2388346, 2412027, 2500907, 2510958, 2548703, 2619862, 2673956, 2727217, 2780572, 2782575, 2802860, 2914812, 3000467, 3040210, 3041162, 2993212, 3020527, 3122876, 3193764, 3212827, 3280147, 3313697, 3333222, 3413395, 3470852, 3492933, 3577250, 3576091, 3597625, 3704201, 3756449, 3781506, 3892312, 3978308, 4076906, 4197805, 4334566, 4423681, 4544733, 4664217, 4764084, 4883303, 4965712, 5096612, 5156435, 5259996, 5463243, 5599992, 5738349, 5856051, 6023420, 6180545, 6258803, 6335646, 6445145, 6595832, 6836049, 7042426, 7313435, 7575515, 7865162, 8170922, 8513480]
5378H513480L70640L60081L73655L74291L45288L32786L07063L14619K74883K25423
5368A1792209J99773J53738J78559J26963J93067K50405K83923K38867L22133
5359A3739637L55449L33756L32587K62396L68104M11165M09129L24772L72077
5350A6909072M07539L60277M30410L96699M52196M94299O12885P09563Q37652
5341B1610592Q28246R66723R85703R12642P76800O83582P01750R33006J212141
5332B9611185J487887J805510K046833K163579K339380K397204K456877K516598
5324D6825053K529519K355953K095253J987478J952014J858222J885492J831810
5316F3320794J773987J754577J570896J413269J210360J109813Q45206O04685
$$ y = [8513480, 8884120, 9244201, 9617856, 9992147, 10337435, 10670221, 10977284, 11291903, 11566786, 11792209, 11991982, 12145720, 12324279, 12451242, 12644309, 12894714, 13178637, 13417504, 13739637, 14095086, 14428842, 14761429, 15023825, 15391929, 15803094, 16212223, 16536995, 16909072, 17316611, 17676888, 18107298, 18503997, 18956193, 19450492, 20063377, 20772940, 21610592, 22438838, 23405561, 24391264, 25303906, 26080706, 26764288, 27466038, 28399044, 29611185, 31099072, 32904582, 34951415, 37114994, 39454374, 41851578, 44308455, 46825053, 49354572, 51710525, 53805778, 55793256, 57745270, 59603492, 61488984, 63320794, 65094781, 66849358, 68420254, 69833523, 71043883, 72153696, 72998902, 73603587]
5308G3603587N23486K82596o152k33896k97621m10033m71887n19331p26053q32889
5298G0911807j073068j263925j486452j542458j557604j516228j558902j695089
5290E9218081j708160j660941j773679j919842k056407k229892k318916k354806
5282D3195438k428813k389369k153572j982191j797573j624410j481514j400875
5274B7937121j337177j230278j144264j088554j034428r18916q37225p06583o60004
5265A8979692o05420m78061m66489n15232m17932l48926l47403l87954l98265
5256A5014010l41365l32355l57336l10133l10255k39820k43151j85473k06939
5247A2487183j98985j72823k10759k08214k00785j99346j72806j85169k97553
$$ y = [73603587, 74127073, 74409669, 74403517, 74169621, 73872000, 73461967, 72990080, 72470749, 71744696, 70911807, 69838739, 68574814, 67088362, 65545904, 63988300, 62472072, 60913170, 59218081, 57509921, 55848980, 54075301, 52155459, 50099052, 47869160, 45550244, 43195438, 40766625, 38377256, 36223684, 34241493, 32443920, 30819510, 29337996, 27937121, 26599944, 25369666, 24225402, 23136848, 22102420, 21183504, 20346279, 19639696, 18979692, 18374272, 17896211, 17429722, 16914490, 16496558, 16147632, 15800229, 15412275, 15014010, 14672645, 14340290, 13982954, 13672821, 13362566, 13122746, 12879595, 12694122, 12487183, 12288198, 12115375, 11904616, 11696402, 11495617, 11296271, 11123465, 10938296, 10640743]
5238A0640743k42246k71856k71296k30080k74568l32373l63488l06789l78984
5229G969063k97499k43109k77358k68254j84981j91268k40507k27997j28151j69049
5219E740890j65332j25341p9153j33063j00956l6278q8336j03818o7675q3410
5209D757528n3824j2957j1971n89p4982l4065j8336M4835M0496l629k199N5442
5197D685749L5325O0535O6446P7803N9230O7967J0698m1041k2834m4726r2880
5186D862272q4037n1049j8519j8231Q1961L190N8994L7435M7248J8493M7498O4060
5174E049315Q5464P6424P0321M7481J55671J97475J70529K34645L02179K71040
5164F660544K26682K38148K36545J62803J31191Q9739j7653n6624Q938K6715J19355
$$ y = [10640743, 10398497, 10126641, 9855345, 9625265, 9350697, 9018324, 8654836, 8348047, 7969063, 7671564, 7428455, 7151097, 6882843, 6697862, 6506594, 6266087, 6038090, 5909939, 5740890, 5575558, 5450217, 5371064, 5238001, 5137045, 5100767, 5012431, 4908613, 4840938, 4757528, 4703704, 4690747, 4678776, 4678187, 4603205, 4569140, 4550804, 4595639, 4636135, 4632506, 4630307, 4685749, 4721074, 4781609, 4848055, 4925858, 4985088, 5053055, 5063753, 5022712, 4999878, 4955152, 4862272, 4778235, 4727186, 4708667, 4690436, 4772397, 4775587, 4834581, 4872016, 4919264, 4937757, 4985255, 5049315, 5134779, 5211203, 5281524, 5329005, 5484676, 5682151, 5852680, 6087325, 6389504, 6660544, 6887226, 7125374, 7361919, 7524722, 7655913, 7745652, 7727999, 7671375, 7680313, 7707028, 7826383]
5153G826383J58563J51918K50280J78964J94905K26820K56250K87623L14736M22309
5143A0268751N58271N43146N63680O50056O34851N89196N86117N55307M03180
5134A5352555M25086M36989N14431P97171Q55915R07151R45989Q95289Q12230
5125B1942806Q07024M74841K47210K82733J69277K44789M44743N97642O68240
5116B5879305O48371P26718O54727N88540N62244N25817N21049L36686J89866
5107C0633323J47375J8218j36062j44971r3663k04701m709J71849K54677K70382
5097C0911718J30457M980j97419n37225o22529o04012n71643o56737o48987n45949
5087B6662654m85685m44429l49344l01850k59567k97812l25480m36636n27802
$$ y = [7826383, 7984946, 8136864, 8387144, 8566108, 8761013, 8987833, 9244083, 9531706, 9846442, 10268751, 10827022, 11370168, 11933848, 12583904, 13218755, 13807951, 14394068, 14949375, 15352555, 15777641, 16214630, 16729061, 17526232, 18382147, 19289298, 20235287, 21130576, 21942806, 22749830, 23224671, 23471881, 23754614, 23923891, 24168680, 24613423, 25211065, 25879305, 26527676, 27254394, 27909121, 28497661, 29059905, 29585722, 30106771, 30443457, 30633323, 30780698, 30798916, 30662854, 30517883, 30424220, 30219519, 30214810, 30386659, 30641336, 30911718, 31042175, 31047155, 30849736, 30312511, 29689982, 29085970, 28514327, 27857590, 27208603, 26662654, 26176969, 25732540, 25383196, 25081346, 24821779, 24523967, 24198487, 23761851, 23234049]
5078B3234049p73386r82646r87351j074158q98092p01336n50562l54345k56571
5069A6655602k59773l63413m89783o40438p69051q07608q68639p40681o64934
5060A1051282n53096m66886l50450k58499k60793l10667l02461k32773j89998
5051H125659k37033j30527j86662r4112j23365m8302m0036p3285m8272j47193
5041F996872j07202j40762j18459j25686j15090q4379n0706r0320n1737J0077
5031F122608j1161q59L0619m9032l7953n1616p4184q0408P478q4113j08775q0139
5019E582465r787n3562p1647r6147j12274p0336p4927o0087j17363m4851r1880
5008D779604j02121p1298k7520l4043n6581k4264K090l8001q3172j01350o8495
$$ y = [23234049, 22460663, 21478017, 20490666, 19416508, 18518416, 17817080, 17266518, 16912173, 16655602, 16395829, 16032416, 15542633, 14902195, 14133144, 13325536, 12456897, 11716216, 11051282, 10498186, 10031300, 9680850, 9422351, 9161558, 8850891, 8548430, 8315657, 8125659, 7888626, 7758099, 7571437, 7477325, 7353960, 7305658, 7265622, 7192337, 7144065, 6996872, 6889670, 6748908, 6630449, 6504763, 6389673, 6305294, 6254588, 6164268, 6112531, 6122608, 6111447, 6110588, 6141207, 6092175, 6054222, 6002606, 5928422, 5848014, 5855492, 5771379, 5662604, 5582465, 5572678, 5519116, 5447469, 5351322, 5239048, 5168712, 5093785, 5033698, 4916335, 4871484, 4779604, 4677483, 4606185, 4578665, 4544622, 4488041, 4463777, 4465867, 4427866, 4344694, 4243344, 4174849]
4997D174849o6028j12963j23439q0421j06399o8313r2437j05162p1096k6263l8988
4986C283340r3937j33048p4482q3290j9157K8883k6174k5784p936o986j6660r4134
4974B730635n1351m8672j09894k2430l1389q1780j31680m5574p631J4428m9213
4963B165449q7962j3167j3197M19k6393p3240l6834j2285l8527J1557l6958M3419
4951A882281q865m828P685l3538r219r0619m5442k4855Q710o1668l0971k1246
4939A567425j4356M206M4979m456o8413n613l2094m7145K26p4946R874M7069k78
4926A426478J1641k2727o6478M0870o428o8633P511L7507o596k1702o265O36k4921
4913A300893m8784L1843K4504l0387j5037k9935m4537j7457j2261l7102o727K2765
$$ y = [4174849, 4108821, 3995858, 3872419, 3791998, 3685599, 3617286, 3524849, 3419687, 3348591, 3322328, 3283340, 3189403, 3056355, 2981873, 2898583, 2879426, 2908309, 2882135, 2856351, 2848415, 2841429, 2824769, 2730635, 2679284, 2630612, 2520718, 2498288, 2466899, 2385119, 2253439, 2207865, 2200234, 2214662, 2165449, 2077487, 2064320, 2051123, 2051542, 2025149, 1951909, 1915075, 1902790, 1864263, 1875820, 1838862, 1882281, 1873416, 1868588, 1876273, 1842735, 1833516, 1742897, 1697455, 1672600, 1681310, 1619642, 1588671, 1567425, 1553069, 1557275, 1602254, 1597798, 1529385, 1523772, 1491678, 1444533, 1444759, 1369813, 1379687, 1426756, 1426478, 1438119, 1415392, 1348914, 1389784, 1383356, 1314723, 1322234, 1359741, 1353145, 1331443, 1325178, 1325814, 1300893, 1252109, 1283952, 1308456, 1278069, 1263032, 1233097, 1188560, 1171103, 1158842, 1121740, 1115013, 1137778]
4901A137778O480m2740L043l9977M3388L4495m8223N7887k1620l6556J6815J6026
4889A126796l5060j399l8300J1079J0103k4359J1797n7612j8179K0414k4273M0360
4877A021367l2491l6673J3049m5944m2095l424M492M6249O5670j3847o5752J6126
4865I26727K0148k0867J527l9825J9384K7824l6124K0783l648L8645m0980L8236
4853I51830J5181k0543p827j1925N801k5981M8046j5195l5062M8126R356J8207
4841I80014J7111l9088k1730q061n9014L1216O0023J092R924k1686l6103J7508
4829I31206J00703k0307l4404J8127P674J2101J7665r083K8619M2384n2940j2907
4817A028838J3903K2824M4147k2369J2912J8469P496M6242L3186k681k0187P9043
$$ y = [1137778, 1144258, 1101518, 1104561, 1064584, 1107972, 1142467, 1094244, 1152131, 1130511, 1093955, 1110770, 1126796, 1091736, 1090337, 1052037, 1063116, 1073219, 1048860, 1060657, 1003045, 984866, 1005280, 981007, 1021367, 988876, 952203, 965252, 919308, 877213, 873789, 878281, 924530, 990200, 976353, 910601, 926727, 946875, 926008, 927535, 887710, 907094, 934918, 898794, 919577, 915929, 954574, 913594, 951830, 967011, 946468, 938641, 926716, 932517, 906536, 954582, 939387, 904325, 952451, 961807, 980014, 997125, 958037, 936307, 928246, 869232, 900448, 960471, 961563, 971487, 949801, 913698, 931206, 1031909, 1011602, 977198, 995325, 1002999, 1015100, 1032765, 1023682, 1052301, 1094685, 1041745, 1028838, 1042741, 1065565, 1109712, 1087343, 1100255, 1118724, 1126220, 1172462, 1205648, 1202967, 1182780, 1261823]
4805A261823M6959l1963m9804l0447M8931L8205N8592L1518J8135m6326J1276
4794A356899N9753r061J1906Q0208M0784K7754O1684K6747n8041N8517J6199K0208
4782A693557Q5503K9781J4091L2581L3796R419M4682Q4463N3740M4061M6664M6757
4770B219095N1187M3408N2414K9975N5869K2929Q4225J37178M5003O5270O7636
4759B874189Q3006N3649M2429O6816Q3777R5264J22400Q9780O7246J27013R2241
4748C797810J58014J34615J31549J15788J39424J25214J19688J83493J77331J91062
4738E273988J65752J96144J97083K09250K59349K83731K56975L15617L49200L48260
4728G855349L92605M18036M55465N17422N99367O85486P79583R94003J147607
$$ y = [1261823, 1308782, 1276819, 1227015, 1196568, 1245499, 1283704, 1342296, 1373814, 1391949, 1345623, 1356899, 1416652, 1407591, 1419497, 1499705, 1540489, 1568243, 1629927, 1656674, 1598633, 1657150, 1673349, 1693557, 1779060, 1808841, 1822932, 1855513, 1889309, 1898728, 1943410, 2027873, 2081613, 2125674, 2172338, 2219095, 2270282, 2313690, 2366104, 2396079, 2451948, 2474877, 2559102, 2696280, 2741283, 2806553, 2874189, 2957195, 3010844, 3053273, 3120089, 3203866, 3299130, 3421530, 3511310, 3578556, 3705569, 3797810, 3955824, 4090439, 4221988, 4337776, 4477200, 4602414, 4722102, 4905595, 5082926, 5273988, 5439740, 5635884, 5832967, 6042217, 6301566, 6585297, 6842272, 7157889, 7507089, 7855349, 8247954, 8665990, 9121455, 9638877, 10238244, 10923730, 11703313, 12697316, 13844923]
4719A3844923J260492J543446J742868J921204K011473J917808J701276J530625
4711B7474115J291787O64541o7826l76059o46942q64075n13023j85068P6597M40569
4701B7294616Q93905J240774J510143J841759K095648K406145K646174K664721
4693D2593885K356526J907905J162688K90469l49991j381885k294944k434784
4685D1849869k578536k570431j930294j250131q68188n78352j69648Q0378J82571
4676C2167238M28039N34220O18249N29566L14790J52957k13077q81281j486211
4667C2164490j730001j973122k225581j791903j406818j340265j114098q39667
4659A9743035q01938r88766j155561j126351j056420q47187p68296p49095p28987
$$ y = [13844923, 15105415, 16648861, 18391729, 20312933, 22324406, 24242214, 25943490, 27474115, 28765902, 29430443, 29362617, 28986558, 28339616, 27475541, 26962518, 26777450, 26854047, 27294616, 28188521, 29429295, 30939438, 32781197, 34876845, 37282990, 39929164, 42593885, 44950411, 46858316, 48021004, 48311473, 47961482, 46579597, 44284653, 41849869, 39271333, 36700902, 34770608, 33520477, 32652289, 32073937, 31904289, 31984667, 32167238, 32595277, 33129497, 33747746, 34277312, 34592102, 34745059, 34531982, 33650701, 32164490, 30434489, 28461367, 26235786, 24443883, 23037065, 21696800, 20582702, 19743035, 18941097, 17952331, 16796770, 15670419, 14613999, 13766812, 12998516, 12249421, 11520434]
4650A1520434p26260o26656n65974n13311m09889l28094l82170l88662l36762
4641G242656k70716k43331j94335k24650j87167j82831j66699j09306j48031j40702
4631E374888j40546r7397j37231j03288k4515m5005o3215p9257o0517m4703l2751
4620D546463n7250j19085n5540l9649M555o2674J3620o822j9181J0395m721j9005
4608D191106K6197K8039K4663J9115O332L6963K1441k042P1236O6276r328M0499
4596D520497J6220P1568M3688R5450Q2233P0834J00040J12568J05493J21091O3816
4585E403498J18747P9615J40111J55577J52576J55934J32944J27530J85704K06568
4575F858804K08820J93360K64139K48247K99994L68879L65595L57946M76632M82742
$$ y = [11520434, 10794174, 10167518, 9601544, 9088233, 8678344, 8350250, 7968080, 7579418, 7242656, 6971940, 6728609, 6534274, 6309624, 6122457, 5939626, 5772927, 5663621, 5515590, 5374888, 5234342, 5136945, 4999714, 4896426, 4871911, 4826906, 4763691, 4684434, 4623917, 4579214, 4546463, 4489213, 4370128, 4314588, 4274939, 4279494, 4216820, 4230440, 4223618, 4204437, 4214832, 4210111, 4191106, 4217303, 4245342, 4270005, 4289120, 4295452, 4332415, 4353856, 4351814, 4423050, 4489326, 4479998, 4520497, 4536717, 4608285, 4651973, 4747423, 4829656, 4900490, 5000530, 5113098, 5218591, 5339682, 5403498, 5522245, 5601860, 5741971, 5897548, 6050124, 6206058, 6339002, 6466532, 6652236, 6858804, 7067624, 7260984, 7525123, 7773370, 8073364, 8442243, 8807838, 9165784, 9642416, 10125158]
4565A0125158M93442N41011O58173P15785Q20329R79622J201091J364452J647348
4556A8546411J899965K135707K298060K273229K133540J858928J574171J056444
4548C3776455M36368k024k05529j82430K29154P59234J095340J299569J348818
4539C8554955J291510R69416L78921k73046n87220o90093o07187l12892n5152
4530C8669212J32241L11423L16482q6439o22249j046426j297401j255487q40869
4521C4280487m71146r0248O8820J22675J3080k07122p54400j431786j831755k029705
4511B7668900k083284j852146j621311j337970j127195p93514o99383p26800q00951
4502A6626346r19904q10566p57321p24452o65245n64376m96609m88277l97671
$$ y = [10125158, 10618600, 11159611, 11817784, 12533569, 13353898, 14333520, 15534611, 16899063, 18546411, 20446376, 22582083, 24880143, 27153372, 29286912, 31145840, 32720011, 33776455, 34212823, 34210799, 34005270, 33822840, 34051994, 34811228, 35906568, 37206137, 38554955, 39846465, 40815881, 41194802, 40921756, 40334536, 39644443, 39037256, 38724364, 38669212, 38801453, 39112876, 39429358, 39342919, 38720670, 37674244, 36376843, 35121356, 34280487, 33809341, 33719093, 33787913, 33910588, 33923668, 33716546, 32962146, 31530360, 29698605, 27668900, 25585616, 23733470, 22112159, 20774189, 19646994, 18853480, 18154097, 17427297, 16626346, 15706442, 14895876, 14138555, 13414103, 12748858, 12184482, 11687873, 11199596, 10801925]
4493A0801925m08377m56619m35960l84005m81833m66237l45779k95232l36924
4484G190959k75295j82259k08307k20956j72551j99560j98697j70386j06313j87266
4474E269369j97044o4334j36702j31975j15913j16197p2440m2285m1770q4634
4464D266075q9125q2860q9922q7973n7194l5223k6380k1658m8343j9132m7817
4453C660448Q259l9812l8273K092M1484L896k5412J1983R5114O5815O0265J17109
4441C962968J24809J98846J68849J80850J29606Q8243Q245K0501p95j4653r9635
4430D767834r9918j29889j15529k18098j90345j21047n6553r2848j43233o4343
4420C536031o9315r4884p6630o7841n7378n5632p204P885q093K3852l5482m5598
$$ y = [10801925, 10393548, 9936929, 9500969, 9116964, 8635131, 8168894, 7823115, 7527883, 7190959, 6915664, 6733405, 6525098, 6304142, 6131591, 5932031, 5733334, 5562948, 5456635, 5269369, 5072325, 5007991, 4871289, 4739314, 4623401, 4507204, 4434764, 4392479, 4350709, 4266075, 4176950, 4094090, 4004168, 3916195, 3859001, 3823778, 3797398, 3775740, 3727397, 3708265, 3660448, 3668707, 3628895, 3590622, 3592714, 3634198, 3638094, 3612682, 3624665, 3719779, 3785594, 3845859, 3962968, 4087777, 4286623, 4455472, 4636322, 4765928, 4854171, 4862416, 4882917, 4882122, 4867469, 4767834, 4667916, 4538027, 4422498, 4204400, 4014055, 3893008, 3836455, 3743607, 3600374, 3536031, 3466716, 3371832, 3295202, 3227361, 3169983, 3114351, 3107147, 3115032, 3106939, 3130791, 3095309, 3049711]
4408C049711l800m9493n4790j6153k3583j9758o1312R666m3280P1Q623k8622r414
4395B757866Q6750o625l628r006j257l8972N6946J6553R940k7321n009K0244N2473
4382B908954N7168n966J4078Q1181L6704m5438K9964p248n597N9308k7299k8338
4370C067471j9564K5632O623p9617p8655l175k2661l3693J0510k0661m7113j4618
4358B790479l371m2715r166q963K6253M5492m5306p680j0539L7413p267j9608
4346B745022J5384L7592o2878J5551M6627p680m51n8626J1278K6277l1007k1709
4334B715380J9299j9659N4159N3884L6544M5784O9604L9892N8895M1353L9680
4323C154815J29365O3885L0151J0937j6295J0511K9738Q4400Q2076K6569m6582
$$ y = [3049711, 3045911, 2996418, 2941628, 2925475, 2901892, 2882134, 2820822, 2830488, 2787208, 2787279, 2795902, 2767280, 2757866, 2844616, 2837991, 2834363, 2825357, 2824100, 2785128, 2842074, 2858627, 2868567, 2841246, 2836237, 2856481, 2908954, 2966122, 2960156, 2974234, 3055415, 3092119, 3046681, 3076645, 3069397, 3063800, 3123108, 3095809, 3067471, 3047907, 3073539, 3080162, 3000545, 2921890, 2918715, 2896054, 2862361, 2872871, 2852210, 2805097, 2790479, 2787108, 2744393, 2735227, 2726264, 2752517, 2798009, 2752703, 2745023, 2734484, 2771897, 2764630, 2745022, 2760406, 2797998, 2735120, 2750671, 2797298, 2789618, 2789167, 2730541, 2741819, 2768096, 2737089, 2715380, 2734679, 2715020, 2769179, 2823063, 2859607, 2905391, 2974995, 3014887, 3073782, 3115135, 3154815, 3284180, 3348065, 3378216, 3389153, 3372858, 3383369, 3413107, 3497507, 3579583, 3606152, 3559570]
4312C559570J08940P0078L1826M5789J4120P2742L9213j294L2215J081j051j3265
4300C959964R2627L7599Q1679Q5131J22644Q1978J23776L4264N3197N0202M1387
4289D764448k388r7850l7190J9289N0011j5556L7518n3512K6242K2027L4148K1799
4277D768986k2811M4037O4713K6190K9800N2242J3625K5678N7710Q8495P0638
4266E219303O1311O1628Q0778O0928P0946P3052J00050J33090N0573R8615J63542
4255F173816J37564J66916J61531J38828K08643K02252J62620K17498J71811J75323
4245G916802J51336R9934M1935N9222P7475P1735N8420Q5666J21035J64484J78547
4234I026591J30531K04757K46555K00620K08926K98805L11758K45387K57012K48073
$$ y = [3559570, 3668510, 3738588, 3770414, 3816203, 3830323, 3903065, 3942278, 3940984, 3973199, 3974280, 3973229, 3959964, 4052591, 4090190, 4171869, 4257000, 4379644, 4461622, 4585398, 4619662, 4672859, 4723061, 4764448, 4762060, 4664210, 4627020, 4646309, 4696320, 4680764, 4718282, 4664770, 4691012, 4713039, 4747187, 4768986, 4746175, 4790212, 4854925, 4881115, 4910915, 4963157, 4976782, 5002460, 5060170, 5148665, 5219303, 5280614, 5342242, 5423020, 5483948, 5554894, 5627946, 5727996, 5861086, 5911659, 6010274, 6173816, 6311380, 6478296, 6639827, 6778655, 6987298, 7189550, 7352170, 7569668, 7741479, 7916802, 8068138, 8168072, 8210007, 8269229, 8346704, 8418439, 8476859, 8562525, 8683560, 8848044, 9026591, 9157122, 9361879, 9608434, 9809054, 10017980, 10316785, 10628543, 10873930, 11130942, 11379015]
4224A1379015K92711K38119K70945L09272L04345L65579K73554L19594M32145
4215A4185279L35726L07953L88533M64566M03491M26877N11900M62345M44556
4206A7931226N20092N12079N46691N69383N69702N52303N28449N33546N11456
4197B2774927N96925N13332N96301O11425N96634O49682P08446P81765Q77775
4188B8707212Q70810J009279J088525J140582J199817J310090J455520J625666
4180C8407501J733700J859459J942934K042063K161649K351572K545353K724733
4172E5768964K959966L281749L511808L786109L940130M410366N029652N610319
4164H8299063O200889O994991P818908Q985554J0522715J2209938J4058648J6501827
$$ y = [11379015, 11671726, 11909845, 12180790, 12490062, 12794407, 13159986, 13433540, 13753134, 14185279, 14521005, 14828958, 15217491, 15682057, 16085548, 16512425, 17024325, 17486670, 17931226, 18451318, 18963397, 19510088, 20079471, 20649173, 21201476, 21729925, 22263471, 22774927, 23371852, 23885184, 24481485, 25092910, 25689544, 26339226, 27047672, 27829437, 28707212, 29578022, 30587301, 31675826, 32816408, 34016225, 35326315, 36781835, 38407501, 40141201, 42000660, 43943594, 45985657, 48147306, 50498878, 53044231, 55768964, 58728930, 62010679, 65522487, 69308596, 73248726, 77659092, 82688744, 88299063, 94499952, 101494943, 109313851, 118299405, 128822120, 141032058, 155090706, 171592533]
4156A71592533J8997581K2096226K5647155K9983324L3635440L5217276L3200968
4149C70370503K4662084J2303195N08162n569784n437206m340009q191676j7396327
4141C66908942k7288388l1940043l0479589k5293596k0011430j6370353j4715492
4134B00810051j4641802j4795240j4475444j3421723j1946577j0673245r534013
4127A11322007q638288p699175o830009o044880n402509m867451m167680l690083
4119F3981932l338299l120076k889095k608860k428092k288907k095155k003583
4111D3209865j837636j786088j667093j586489j498458j408280j330913j244495
4103C0850413j215543j149813j051863j006478r34549q82376r27483q97657p81177
$$ y = [171592533, 190590114, 212686340, 238333495, 268316819, 301952259, 337169535, 370370503, 395032587, 407335782, 407843944, 402274160, 396836954, 392496945, 384305269, 366908942, 339620554, 307680511, 277200922, 251907326, 231895896, 215525543, 200810051, 186168249, 171373009, 156897565, 143475842, 131529265, 120856020, 111322007, 102683719, 94984544, 88154535, 82109655, 76707146, 71839695, 67672015, 63981932, 60643633, 57523557, 54634462, 52025602, 49597510, 47308603, 45213448, 43209865, 41372229, 39586141, 37919048, 36332559, 34834101, 33425821, 32094908, 30850413, 29634870, 28485057, 27433194, 26426716, 25492167, 24609791, 23682308, 22784651, 22003474]
4094B2003474p17780o08015o02202o36357n90292n65202n32798m77095m73192
4085A6800541m76577m00527m37267m21726l79170l09739k90068l83143l16001
4076A3386323l09164l40300k74419k51101l22396l43045k74983k80539l03424
4067A0686952l00262k39240k57868k90055k37793k81882k50000k02207k07347
4058H420298k59122j87864k11406k37859j73232j69077j51888j41888r3896j13980
4048F680086o5334l7138L4160m100K7268N1278P5349P3676J33175N8877P2427
4037G099724R5997K6135m7199j15615j08171j68776k01718j87617j83729j87095
4027F021936j30993q1172q0528j87648j86150j11317p9863j11811j43310q1066
$$ y = [22003474, 21285694, 20677679, 20075477, 19439120, 18848828, 18283626, 17750828, 17273733, 16800541, 16323964, 15923437, 15486170, 15064444, 14685274, 14375535, 14085467, 13702324, 13386323, 13077159, 12736859, 12462440, 12211339, 11888943, 11545898, 11270915, 10990376, 10686952, 10386690, 10147450, 9889582, 9599527, 9361734, 9079852, 8829852, 8627645, 8420298, 8161176, 7973312, 7761906, 7524047, 7350815, 7181738, 7029850, 6887962, 6794066, 6680086, 6614752, 6577614, 6611774, 6607674, 6634942, 6686220, 6761569, 6835245, 6968420, 7027297, 7099724, 7195721, 7221856, 7174657, 7059042, 6950871, 6782095, 6580377, 6392760, 6209031, 6021936, 5890943, 5809771, 5729243, 5541595, 5355445, 5244128, 5164265, 5052454, 4909144, 4828078]
4017D828078q5594j38449j08463j33032m5184l6106j4285m1097o0141l4272j7763
4006D113692P088k268N3062K3949M5609R3442J05107J17360O7454L0322L7769
3995D692586N0828j9019j60839j69593k90142k85979j37455j43333j64303j57698
3985C215053r7687j07674r7500r2844o7370r1885o4669j05458p2698n8208m5544
3974B313516k9217o5739k091k7848j7799O6170m8040m009M3346P011M2001M644
3962B281945L5110M3939P8116J4553K0858Q8348M9733K6957Q9275O9612R8934
3951B897380Q723j3166j4525N2662M9746N1957P4238K0758p4631j14117j46637
3940B792388j79077j26605j01311m2830j5308p0295q6510j1257k7455n3775p9502
$$ y = [4828078, 4742484, 4604035, 4495572, 4362540, 4317356, 4281250, 4266965, 4225868, 4165727, 4131455, 4113692, 4120780, 4118512, 4171574, 4195523, 4241132, 4334574, 4439681, 4557041, 4624495, 4654817, 4692586, 4743414, 4724395, 4563556, 4393963, 4103821, 3817842, 3680387, 3537054, 3372751, 3215053, 3117366, 3009692, 2912192, 2819348, 2751978, 2660093, 2595424, 2489966, 2417268, 2359060, 2313516, 2284299, 2218560, 2216469, 2188621, 2170822, 2236992, 2188952, 2184943, 2228289, 2235300, 2277301, 2281945, 2317055, 2360994, 2439110, 2453663, 2474521, 2562869, 2612602, 2639559, 2728834, 2798446, 2897380, 2906103, 2892937, 2878412, 2931074, 2980820, 3032777, 3107015, 3127773, 3053142, 2939025, 2792388, 2613311, 2486706, 2385395, 2342565, 2327257, 2256962, 2170452, 2159195, 2131740, 2077965, 1998463]
3929A998463q7094q0283m7084q0277k0096l8530k3121m6509p9270o8499o2930
3918A364770N1990m2592R349J0322n0592R182m9830J0865L7719K3648l0362L2552
3906A377021M3574M145l3754R7887L2529L935K9677m168m7149L2436N1630j3004
3894A574759J7186K9919j0355m0532l5950P1631j7858m1440K6268J8194j0050
3883A581772M3188Q3816N1330K5161l8669K3996P5261P2044k1256k8319L641R343
3871A881308N1800P2977P8818Q7148O0687P2279O2926J53319J88632J69653J68984
3860C048531K16905J29923J01024R870J7384l5238j01640k8876j8647r6692j33426
3849C109118j72243j08505j03430o4093n396o6926o0084n3590n7266k1378L0188
$$ y = [1998463, 1911369, 1831086, 1784002, 1703725, 1683629, 1645099, 1621978, 1575469, 1496199, 1427700, 1364770, 1416760, 1374168, 1383517, 1393839, 1343247, 1352429, 1302599, 1313464, 1351183, 1374831, 1344469, 1377021, 1420595, 1424740, 1390986, 1488873, 1521402, 1525337, 1555014, 1550846, 1503697, 1536133, 1587763, 1574759, 1591945, 1621864, 1611509, 1570977, 1535027, 1606658, 1588800, 1547360, 1573628, 1591822, 1581772, 1624960, 1708776, 1760106, 1785267, 1746598, 1770594, 1845855, 1917899, 1896643, 1868324, 1871965, 1881308, 1933108, 2006085, 2084903, 2172051, 2232738, 2305017, 2367943, 2521262, 2709894, 2879547, 3048531, 3265436, 3395359, 3496383, 3506253, 3523637, 3488399, 3386759, 3357883, 3339236, 3242544, 3109118, 2936875, 2828370, 2724940, 2660847, 2655451, 2588525, 2528441, 2474851, 2417585, 2396207, 2426395]
3838B426395M7093K0976M4563N7655j3905K140j376J9570L9653n439m995p1791
3826B560539p3057l5681k7367q0970p1236o8799J6377Q245j1309j5536l5012j9380
3814B146814j8051l0237j5424m753Q0131M3075L2131N1952M7419K0268l039r379
3802B340907L0627O1748J4539j7845J38K2966j0060l3958n7358J789k1656j8855
3790B312982m4658k9459j1711n7051q9745L1115l5762n4518k0089j5361M4188
3779B029931M9242J3575l3326J199J3916L4994L0685K4380O358K2699O1371N3788
3767B308812O2568j167k0883L2038p66O389l3688q5618K0850k0146o0173j9954
3755B188262o5487J1367m0409m292N0375o5724o0256j20536o1314r8806m1172
$$ y = [2426395, 2473488, 2494464, 2539027, 2596682, 2582777, 2584917, 2583541, 2603111, 2642764, 2637325, 2632330, 2560539, 2487482, 2451801, 2424434, 2343464, 2272228, 2203429, 2219806, 2228051, 2216742, 2201206, 2166194, 2146814, 2128763, 2098526, 2083102, 2078349, 2158480, 2201555, 2233686, 2285638, 2333057, 2353325, 2350286, 2340907, 2371534, 2433282, 2447821, 2429976, 2430114, 2453080, 2443020, 2409062, 2351704, 2353493, 2331837, 2312982, 2268324, 2238865, 2227154, 2170103, 2080358, 2111473, 2075711, 2021193, 2001104, 1985743, 2029931, 2079173, 2092748, 2059422, 2060621, 2074537, 2109531, 2140216, 2164596, 2170954, 2193653, 2255024, 2308812, 2371380, 2370213, 2349330, 2381368, 2380602, 2386991, 2353303, 2267685, 2288535, 2268389, 2208216, 2188262, 2122775, 2134142, 2093733, 2089441, 2139816, 2074092, 2013836, 1893300, 1831986, 1733180, 1692008]
3744A692008m7980m9769m3644j4n950k318l8055m8377j1432L9588k7758j6383
3732A439916l5909p4611n3413j5243m4144n1292l2496m7029k4363m1998k156r987
3720A007275k4465o2987l907m892k8406L079M537P412R656Q964j5562j2986j2256
3707H75462n501N0981K0670n9821l6699J6605m2288Q921j0937L927M8467j2908
3695H56879l2568j3394k0238l3572j7926l860k7640L9095j6881m409L3P873j3210
3682G20182j1935J6960q533J7294M2043O7068k9958N062O5274p3489m1339j4909
3670G53720o5943J9287L4417o4023M520J5345l4602L1306q250M3567m2561j4644
3658F72139K2610k502k295L192L6169l2342j2702k7792J6353k2188k8363O7221
$$ y = [1692008, 1644028, 1594259, 1550615, 1550601, 1544651, 1542333, 1504278, 1455901, 1444469, 1484057, 1456299, 1439916, 1404007, 1329396, 1275983, 1260740, 1216596, 1165304, 1132808, 1085779, 1061416, 1019418, 1017262, 1007275, 982810, 919823, 915916, 911024, 882618, 885697, 890234, 897646, 907302, 916266, 900704, 887718, 875462, 869961, 920942, 941612, 881791, 845092, 861697, 819409, 828330, 817393, 821320, 869787, 856879, 824311, 810917, 790679, 757107, 739181, 735321, 707681, 746776, 729895, 725486, 725519, 733392, 720182, 708247, 725207, 716674, 733968, 776011, 843079, 813121, 818183, 883457, 809968, 768629, 753720, 687777, 707064, 741481, 677458, 681978, 697323, 662721, 694027, 685777, 729344, 686783, 672139, 694749, 692247, 689952, 693144, 729313, 696971, 684269, 656477, 672830, 650642, 622279, 689500]
3646F89500k877o629K7953J0175K4232l2110J2333O907M3056j6659p990J8935
3634G66826k6393L080M1320R077J171m605m0N3060k5863k0358N4966K5943M7691
3621I25875K6465L0184J3095K4246N0339k5801L4399O9192M3309k9585L0575p630
3609A184663k3187n0403j2322O6433m8749k582K9653m5576L6910L3848K63o694
3597A162257J0440O5645j8032L2816R8110P9562Q584L7363N2976Q5941L4070O0730
3585A710462N2601M5058J8975m0889N834K459J514R968j3313q4529j7852k8620
3573A661668M0554j785k6429K5167L0173K1964O703j9837R10K8814k5262K9318
3561A771958N5327Q4995p379o0213M5680K6342M0887k7090K1726M6441M3220K5885
$$ y = [689500, 686623, 679994, 707947, 718122, 742354, 710244, 722577, 729484, 772540, 755881, 747891, 766826, 740433, 743513, 784833, 793910, 795081, 790476, 790436, 843496, 817633, 797275, 852241, 878184, 925875, 952340, 982524, 995619, 1019865, 1070204, 1044403, 1078802, 1147994, 1191303, 1161718, 1192293, 1184663, 1161476, 1111073, 1098751, 1165184, 1116435, 1113853, 1143506, 1097930, 1134840, 1168688, 1168951, 1162257, 1172697, 1238342, 1220310, 1253126, 1351236, 1430798, 1439382, 1476745, 1529721, 1615662, 1649732, 1710462, 1763063, 1808121, 1827096, 1786207, 1792041, 1794500, 1796014, 1805982, 1792669, 1708140, 1690288, 1661668, 1702222, 1700437, 1674008, 1699175, 1729348, 1751312, 1758015, 1738178, 1739088, 1767902, 1742640, 1771958, 1827285, 1912280, 1904901, 1844688, 1890368, 1916710, 1957597, 1930507, 1952233, 1998674, 2041894, 2067779]
3549B067779P648M0646L5183p6487n543K7172j4253o7406p2192l7733o5431P226
3537A846609j8163p3805o3645j7087P719q875j7816p9728r103j101N1513j2577
3525A603941r8754M7834K8434L6734R48K0127K6358P320Q441k8485N189m3612
3513A614475n7201o3088l6860r000J003n0377q7059l219k4822l2726l500K7638
3501A275264n0719k988k6527p626j9600J0821k1271j7163l0342m6323M7897K6358
3489A137781k3710M1676l4456J976q381J0826j3866j9552J1781r2360J0903K2963
3477A045581J3639l7703m4557r0622N347K1093j9285J3778l754N907l433J4678
3465I20669N193J179j2603j8083k7422j194j2825l366M656j7246J5754n6213K0109
$$ y = [2067779, 2075427, 2116073, 2151256, 2074769, 2069226, 2096398, 2082145, 2014739, 1942547, 1904814, 1839383, 1846609, 1828446, 1754641, 1690996, 1673909, 1681628, 1672753, 1654937, 1575209, 1566106, 1565005, 1616518, 1603941, 1505187, 1553021, 1581455, 1618189, 1619137, 1639264, 1665622, 1672942, 1681383, 1652898, 1658087, 1614475, 1557274, 1494186, 1457326, 1448326, 1449329, 1398952, 1311893, 1308674, 1283852, 1251126, 1247626, 1275264, 1224545, 1221557, 1195030, 1187404, 1167804, 1178625, 1157354, 1140191, 1109849, 1063526, 1111423, 1137781, 1114071, 1155747, 1121291, 1123267, 1114886, 1125712, 1111846, 1092294, 1104075, 1011715, 1022618, 1045581, 1059220, 1021517, 976960, 886338, 891685, 912778, 893493, 907271, 903517, 909424, 905991, 920669, 925862, 927041, 914438, 896355, 868933, 867739, 854914, 851548, 856204, 838958, 854712, 798499, 818608]
3452H18608K8241L9939k0165K7648J2170l4384J6326k4933L257L9091L3980l1692
3440I08086n154K2903N3811J5719j5922J101l9246K3831K1596L2161j4122q724
3428I96040Q0478L4345N0483J4828N750N5284N3130J00517L6841O444J16973N2538
3416A603651Q5485L9175K7538J8406l5257l0597Q2o3650j8051K9084L5254Q9212
3404A780332j6644k1709o6866j5605n283k4252k4263k3218J7757K7574J4654L2860
3392A675337J02723M2370K0592M4970J12476J55078R3639J34732O0111O5033Q1551
3381B588612k4978j18231j11915j30213j43358o6789n2700n0432O766l4824m4658
3370A817280J8623l0380j1005l3149J7582M176J3753k844j1174J1322M1169J9303
$$ y = [818608, 846849, 886788, 866623, 894271, 906441, 872057, 888383, 863450, 866707, 905798, 939778, 908086, 902932, 925835, 979646, 995365, 979443, 980544, 941298, 965129, 986725, 1018886, 1004764, 996040, 1076518, 1110863, 1161346, 1176174, 1181924, 1237208, 1290338, 1390855, 1427696, 1434140, 1551113, 1603651, 1689136, 1728311, 1755849, 1774255, 1738998, 1708401, 1708483, 1644833, 1626782, 1655866, 1691120, 1780332, 1763688, 1741979, 1675113, 1659508, 1654225, 1629973, 1605710, 1582492, 1600249, 1627823, 1642477, 1675337, 1778060, 1820430, 1841022, 1885992, 1998468, 2153546, 2247185, 2381917, 2442028, 2507061, 2588612, 2563634, 2445403, 2333488, 2203275, 2059917, 1993128, 1940428, 1889996, 1896762, 1861938, 1817280, 1835903, 1805523, 1794518, 1761369, 1778951, 1783127, 1796880, 1794036, 1782862, 1794184, 1835353, 1854656]
3358A854656K5880Q7263L4387J9071J09062Q6698L9420M5270N530j0583N782k1738
3346B280698r0121o0989l5270j4960p179O820m0748J1645J6867J8124r535l9963
3334B035389n2342J5310P0645L2765j9790o376P91m0527K1189M886M4750P0219
3322B176909J8666K5927M0750J3323N4579K8832Q070J9128O1701O4445N658L3084
3310B551072P4959M8706K964J5526M1459P9127O5477M5434L7092K1155P8424J00814
3298C162209N2380O5102M5491N7521R6268J21050Q2800Q2301R5019Q7022N4057
3287D001220L4968N4069L7893J20034J00439N3329J10669R8867J51506J41006
3277D904000J17815Q6761J82499K67334K59085K76931K50087L15198K62813K84418
$$ y = [1854656, 1880536, 1967799, 2002186, 2021257, 2130319, 2217017, 2256437, 2301707, 2307237, 2296654, 2302436, 2280698, 2190577, 2129588, 2094318, 2079358, 2072179, 2078999, 2038251, 2049896, 2066763, 2084887, 2075352, 2035389, 1983047, 1998357, 2069002, 2101767, 2081977, 2075601, 2076392, 2035865, 2057054, 2061940, 2106690, 2176909, 2195575, 2221502, 2262252, 2275575, 2330154, 2358986, 2367056, 2386184, 2447885, 2512330, 2517988, 2551072, 2626031, 2674737, 2677701, 2693227, 2734686, 2813813, 2879290, 2924724, 2961816, 2982971, 3061395, 3162209, 3214589, 3279691, 3325182, 3382703, 3478971, 3600021, 3682821, 3765122, 3860141, 3947163, 4001220, 4036188, 4090257, 4128150, 4248184, 4348623, 4401952, 4512621, 4611488, 4762994, 4904000, 5021815, 5108576, 5291075, 5558409, 5817494, 6094425, 6344512, 6659710, 6922523, 7206941]
3267G206941K64920K07160K11478J97995K04919R9720L0509n9721n8705j20106
3257H185110k06606l23353k90439k25590k81856k07172k26574k88475k54010j79963
3247E701072k14886j11935k03247j79638j35711r8269j40863j11254q6455l7450
3237D381364j6873k7738L4162o2679j09702j31966j86338j68470j03332n7634
3227C550794o9954m6111k7057o7583j38774j39758k0740q1742j14134r6364q2486
3216B666091o0655m1005r769j5552l0501q6402K729k5054q9751k0592J6579K6499
3204B332617k441p037L5695l994j10751k8720j00095n2357l7507n6184K6635L517
3192A999378m5949m5996p9126J1897q373R440k8454J460n4954J776l7912l7773
$$ y = [7206941, 7471861, 7679021, 7890499, 8088494, 8293413, 8393133, 8423642, 8363921, 8305216, 8185110, 7978504, 7655151, 7364712, 7139122, 6857266, 6650094, 6423520, 6135045, 5881035, 5701072, 5486186, 5374251, 5171004, 4991366, 4855655, 4757386, 4616523, 4505269, 4418814, 4381364, 4364491, 4336753, 4370915, 4308236, 4198534, 4066568, 3880230, 3711760, 3608428, 3550794, 3480840, 3434729, 3407672, 3340089, 3201315, 3061557, 3040817, 2959075, 2844941, 2748577, 2666091, 2605436, 2564431, 2554662, 2539110, 2508609, 2422207, 2424936, 2399882, 2310131, 2289539, 2306118, 2332617, 2330176, 2323139, 2358834, 2354840, 2244089, 2215369, 2115274, 2062917, 2025410, 1969226, 1995861, 1999378, 1953429, 1907433, 1828307, 1840204, 1831831, 1841271, 1812817, 1814277, 1759323, 1761099, 1723187, 1685414]
3180A685414J2432L7673j8575j09963K2976R55l1917n4668l7884K2475J0677n536
3168A534059k5768j6695j7828m7795M6451l7556k3709mm393j2757J4658l427L3694
3155A438930M41r4835r330l944J705K1359n4642j8650l9511J3596M309k442l6937
3142A220049J9208M798J84n6440J2994Q59K4865k8j09100m0354J4690K4428j2307
3129A103846j8809l1844j3630M0833N3448o5942n6226k049P3963K066K6565m4162
3117A068059j5532J2653j5737l8487J0322J5418k2199N538K231r2998k0804m2800
3105H65664N1417M8892m2652p7536N853Q7511r097K514l2663r178j3969k583M9891
3092I24064m3144l8242l4180j4200L1648O920j1451l3175r103j7802K7099j1868
$$ y = [1685414, 1697846, 1735519, 1716944, 1606981, 1629957, 1630912, 1598995, 1544327, 1506443, 1528918, 1539595, 1534059, 1508291, 1491596, 1473768, 1425973, 1472424, 1434868, 1411159, 1411155, 1406762, 1394005, 1408663, 1405236, 1438930, 1439371, 1344536, 1335206, 1331262, 1332967, 1354326, 1299684, 1281034, 1241523, 1255119, 1259428, 1256986, 1220049, 1239257, 1244055, 1244239, 1187799, 1200793, 1201652, 1226517, 1226489, 1117389, 1077035, 1091725, 1116153, 1103846, 1085037, 1053193, 1039563, 1080396, 1133844, 1067902, 1011676, 1009627, 1083590, 1085656, 1112221, 1068059, 1052527, 1065180, 1049443, 1010956, 1021278, 1036696, 1014497, 1020035, 1022266, 929268, 908464, 865664, 917081, 965973, 923321, 845785, 851638, 939149, 930052, 932566, 899903, 890725, 876756, 874173, 924064, 880920, 842678, 808498, 794298, 825946, 832866, 821415, 788240, 779137, 761335, 788434, 776566]
3080G76566j2543m7228N2138L0961J6924K1720k967m7863j3593K2008K9195m1460
3068G83858l5269j5982M2491J6923m1258k69K5185J5970P926m3211L245q009j1449
3055G40151M3065J0111o3921k1602l7109j5926N9667R865P444m858K312R210N3529
3042G91938q025l7216j4977J1585K8604p620q3985K9689L7371M4633k0878J292
3030G72411L0675k0888j1141J0834M9544J1830K9194m493o1397P4717k8735k8024
3018H24527r652j796M2486p711J6657M859k71l039O2963L4753J7344l971J6770
3005I93919N2370K545J5145l3948l7884J7379J2206K7512L8574J2871J6312j9151
2993A097850l46Q6940J8713M9165j4689M795m6686M977K962k5634N2662K8524
$$ y = [776566, 764023, 716795, 768933, 799894, 816818, 838538, 835571, 787708, 774115, 796123, 825318, 783858, 748589, 732607, 775098, 792021, 750763, 750494, 775679, 791649, 799575, 756364, 759609, 751600, 740151, 783216, 793327, 729406, 707804, 670695, 654769, 714436, 724301, 731745, 726887, 729199, 738409, 791938, 783913, 746697, 731720, 743305, 771909, 764289, 680304, 709993, 747364, 791997, 771119, 772411, 803086, 782198, 771057, 781891, 831435, 843265, 872459, 867966, 806569, 881286, 852551, 824527, 814875, 813079, 855565, 847854, 864511, 869370, 869099, 866060, 929023, 963776, 981120, 977149, 993919, 1046289, 1048834, 1063979, 1030031, 992147, 1009526, 1021732, 1049244, 1087818, 1100689, 1117001, 1097850, 1097504, 1184444, 1203157, 1252322, 1237633, 1242428, 1195742, 1200719, 1203681, 1178047, 1230709, 1259233]
2981A259233O0560k3398R469K0355K2294J548k408L1931k7396O4802O3127l318
2969A476799J888K4417L7159j3898K6680J299K5972P1242M9839K9408M676M3985
2957A779466O1152K9024K5139K3033j4727J00030J13071K7224N6137L6632J30648
2946B366829O3469o509M9542Q1607R577K7666K7241P9k497M5160P7771L7822L7299
2933B815056L8803j2578M9678M7562P6676O8521J14486J10147N0175R7208J38701
2922C594435Q7789J13884J35594M6714J01041J02491O0248N0466L1433j07586
2912D216509m4623j07648r9046n4005p0133l3164n2763k2464l3174k0530j7234
2901C661725n915k4180l8457r827n0063K8079J8730l8216P8920L9626l2338q035
$$ y = [1259233, 1319793, 1296395, 1305864, 1326219, 1348513, 1350061, 1347653, 1379584, 1352188, 1416990, 1480117, 1476799, 1478687, 1503104, 1540263, 1526365, 1553045, 1554344, 1580316, 1651558, 1701397, 1730805, 1735481, 1779466, 1840618, 1869642, 1894781, 1917814, 1903087, 2003117, 2116188, 2143412, 2199549, 2236181, 2366829, 2430298, 2423789, 2473331, 2554938, 2564515, 2592181, 2619422, 2619501, 2617004, 2662164, 2739935, 2777757, 2815056, 2853859, 2841281, 2890959, 2938521, 3015197, 3083718, 3198204, 3308351, 3358526, 3455734, 3594435, 3682224, 3796108, 3931702, 3978416, 4079457, 4181948, 4242196, 4292662, 4324095, 4216509, 4171886, 4064238, 3965192, 3911187, 3841054, 3807890, 3755127, 3732663, 3699489, 3678959, 3661725, 3655810, 3631630, 3593173, 3583346, 3533283, 3561362, 3580092, 3541876, 3620796, 3660422, 3628084, 3620049]
2889C620049n000k8068k8362J2991o4766k5249r3831j08690m1673p0375j29422
2878C037604r7390o9318m8462j8225j1647k7379o0940j49510m1447j0719q6912
2867B415655o3578p7211o0227K364o1635r1327p1193k1872l4093r0881n2478k4688
2855A768836l4410m9291o0871n3781j04909k2053l0843k8502Q027L734K1496j00461
2843A316972o2964M403J3092n5988m8930m0059k5803J7380o751k4267k2982l9807
2831A024296j8666L121k4888q364j0166J804r275p1078j9146l6344l514p0049
2819G57731M1719k7403l0971M0018O289N811l0501k8237j5678o3725p4918K1619
2807F01754J1542m412K1219p150k3965j1990j1041J4851O338O148r64o0360j5157
$$ y = [3620049, 3615049, 3586981, 3558619, 3571610, 3506844, 3481595, 3387764, 3279074, 3237401, 3167026, 3037604, 2940214, 2870896, 2822434, 2804209, 2792562, 2765183, 2704243, 2554733, 2513286, 2502567, 2415655, 2352077, 2274866, 2214639, 2217003, 2155368, 2064041, 1992848, 1970976, 1936883, 1846002, 1793524, 1768836, 1734426, 1685135, 1624264, 1570483, 1465574, 1443521, 1412678, 1384176, 1392203, 1395937, 1417433, 1316972, 1254008, 1258411, 1271503, 1215515, 1166585, 1126526, 1100723, 1118103, 1111352, 1087085, 1064103, 1024296, 1005630, 1008751, 983863, 975499, 965333, 967137, 957862, 886784, 867638, 831294, 827780, 757731, 799450, 772047, 741076, 781094, 787383, 793194, 762693, 734456, 718778, 655053, 580135, 601754, 613296, 608884, 630103, 622953, 598988, 586998, 575957, 590808, 597146, 603294, 602330, 541970, 526813]
2794E26813j2708j4057j1173l4218m599j728m4927k9777L195k3593O337L9310
2782C98875n8721M6905j6803n5741J6736L3638k5979m340Q23J6133l4098p1176
2770B46252L1658j300N9136k3367j6503K3219o2583l5067J7473n7197k2231J4707
2758A74197j6906J6646O0455J821j5922J3432k2866m6363q53k8439J6668K631
2746A54501J9991j3873m3081j7277J466M7449J1919j0304P80j0803M4122m8411
2734A36479p6738j315L3242P774j8395J9545L185j326K9219o172l6358j2558m992
2721G1590L3648J2452k2534l220l9972Q37K1546q077n3368R849L6344L0125j9334
2708F9886m7900J0821K681K8680j8829j2403N6106l5146j0771j4208m4977J976
$$ y = [526813, 514105, 500048, 488875, 454657, 450058, 448330, 403403, 373626, 376821, 353228, 359565, 398875, 340154, 387059, 370256, 314515, 331251, 364889, 338910, 334570, 335393, 351526, 317428, 246252, 277910, 276610, 335746, 312379, 295876, 319095, 256512, 221445, 238918, 181721, 159490, 174197, 157291, 173937, 234392, 236213, 220291, 233723, 210857, 164494, 163641, 135202, 151870, 154501, 174492, 160619, 117538, 100261, 101727, 149176, 161095, 150791, 151571, 140768, 184890, 136479, 59741, 58426, 91668, 99442, 81047, 100592, 103777, 102451, 131670, 125498, 89140, 76582, 71590, 105238, 117690, 95156, 91936, 51964, 52801, 74347, 66270, 12902, 22751, 59095, 89220, 69886, 21986, 32807, 35488, 64168, 45339, 32936, 89042, 53896, 43125, 28917, -16060, -14084]
2696a4084K2286j0888J686R423M1838J3465o2057J4974j3902J2052N8722j0284
2684F3231k7355l6866k1377O2265l1012K5800l1857l2615J9832l6073L6121K1885
2672A1979N901m8023K4722j2268N3827J2451m6619j4125j2990L3729M26O861J5766
2659C1637P377m3708l9853K7910L3217k266l8458k9429J5656K4635k6740m831
2647d4853N1348k9555J4537j2664n435L3184m233p7442M5168L691N0435p4414
2635e0233j3273L1189N0949k7210j6445K3765j9716k8667p473M117K0587M2976
2623A0566j3200l7729l999l8685n870L0434l1711J07675l5747l7816L9869m1162
2611e7375l660j3282M1406N3405n1593l5992k1363L1971k9977L3162J6693J0875
$$ y = [-14084, 8202, -2686, -1000, 8423, 50261, 63726, 1669, 16643, 2741, 14793, 73515, 63231, 35876, -990, -22367, 39898, 8886, 34686, 2829, -29786, -9954, -46027, -9906, 11979, 17880, -30143, -5421, -17689, 36138, 48589, 1970, -12155, -25145, 8584, 9010, 15871, 31637, 39014, -4694, -44547, -16637, 16580, 14314, -24144, -53573, -37917, -13282, -40022, -44853, 6495, -23060, -8523, -21187, -26622, 6562, 2329, -75113, -29945, -26254, 24181, -50233, -63506, -32317, 18632, -8578, -25023, -1258, -20974, -49641, -57114, -52997, -32410, 10566, -2634, -40363, -44362, -83047, -88917, -58483, -90194, 17481, -18266, -56082, -16213, -57375, -61035, -74317, -32911, 20494, -31099, -67091, -88454, -56483, -86460, -53298, -36605, -25730]
2599b5730J8604K7720o5914r762K035j5741M4662j191r104K576N4026j1138k7145
2586a6102n597l4944K0174j06q476K2110j1374J1716J1578N8418m5750l5399L0483
2573c269J5713L2347l5604k3939J022j3472l629P0843p2771n9786p52N4261p918
2560d6954l320k0670N425N0816l7161n0154j9415O5065K9413k6609k581l2702
2548h8847L4290k221l812L4427l9183k0954K6620J5204r520m7976J6473R696j8290
2535i4093K7068K1710J295M0189l0209n9232J5737K8310l5297o3874K2857o32
2523a26171k1611N7861J5447n7338o004L0387N2339J1806o3434L7585L0379p560
2511d6314l818o7681m577O2208M510m2447J1747j4641j5560K3777O0980n174n5310
$$ y = [-25730, -7126, 20594, -45320, -55082, -53047, -68788, -24126, -25317, -34421, -31845, 22181, 11043, -16102, -21699, -56643, -36469, -36575, -45051, -22941, -34315, -22599, -11021, 47397, 1647, -33752, -3269, 12444, 44791, 9187, -14752, -13730, -27202, -30831, 40012, -32759, -92545, -93297, -39036, -46954, -50274, -70944, -65519, -14703, -51864, -102018, -121433, -56368, -26955, -53564, -56145, -88847, -54557, -56778, -60590, -26163, -65346, -86300, -59680, -44476, -53996, -101972, -85499, -75803, -94093, -67025, -45315, -44020, -3831, -34040, -93272, -77535, -49225, -84522, -148396, -125539, -126171, -147782, -89921, -74474, -131812, -137816, -107429, -55090, -43284, -106718, -69133, -38754, -46314, -50132, -117813, -122390, -60182, -55672, -98119, -86372, -101013, -116573, -92796, -31816, -36990, -92300]
2498i2300K656M2267l9451K6823M3185j4576k6950J0467m9548J1803K5934J5970
2486d3720l2861k4939R963K9861l8061j1934L7101Q493p506o026M439l027k5045
2473a03262j5013J6637L7889Q757o401k018K4605k3615k9735J009K0954m581l5744
2460a10518l1450K0193J03688J2956m3332j266m1168M0951L4296l2744j5789j2111
2448g6294M2159k1586L5295J162l6401M7197o306l8902p958M2614m3554K1661
2436d0913k9101n8241L7931j7261j5410L579L3112j1058K2481P009n7457K9238
2424i6091N7067Q555l782P867o9792l2619L2388j5456J3021l7079N5273n6953
2412a37601k74L6318J4651K2682L4711K442j3570K4838K6518l5869l0182j2316
$$ y = [-92300, -89644, -47377, -86828, -60005, -16820, -31396, -58346, -47879, -97427, -85624, -59690, -43720, -76581, -101520, -91557, -61696, -99757, -111691, -74590, -66097, -73603, -79629, -75190, -78217, -103262, -118275, -101638, -63749, -54992, -61393, -63411, -38806, -62421, -92156, -91147, -70193, -74774, -110518, -141968, -121775, -18087, -5131, -48463, -49729, -90897, -49946, -15650, -48394, -64183, -76294, -34135, -55721, -20426, -19264, -55665, -8468, -14774, -53676, -61634, -19020, -62574, -40913, -70014, -128255, -90324, -107585, -122995, -119416, -86304, -97362, -74881, -67872, -125329, -96091, -39024, -30469, -34251, -26384, -96176, -128795, -96407, -111863, -98842, -135921, -80648, -137601, -137875, -101557, -86906, -64224, -29513, -27071, -40641, -15803, 10715, -25154, -55336, -67652]
2400f7652R292L6870J1841k527K2269l0967l4683j077K2280k8854R362N8277P882
2387A2313n0152J6099R9782l5466k8106R937L023Q501q570j4313K5302n4866l6015
2374e2531J8817k7126J2083j8771m7956Q837J3420L8397j7042K4126j1526k7082
2362h6354q141K2864k7176Q520K9835j5535J6704k7806L2503j0684P85R88j761
2349f5258L3547O2322j0287m8743k1033R254M985l9575k687K7739l4285J2105
2337g1916R517K7643k7686k5424k2921K9306L1013J0422j7660j320l073j8447
2325h0546L596m1463O0530K8011k8147k4051M0647K9706k4274p2997J7037P671
2313h4280P828L1007K5821q038j9975K1133j9698m7386k6867L9741k947L2794
$$ y = [-67652, -58360, -21490, -9649, -12176, 10093, -20874, -55557, -56634, -34354, -63208, -53846, 4431, 12313, -37839, -21740, 78042, 42576, 14470, 24407, 27430, 35931, 27361, 13048, 38350, -16516, -52531, -33714, -60840, -48757, -67528, -115484, -106647, -93227, -54830, -71872, -47746, -59272, -86354, -94495, -71631, -98807, -90287, -60452, -75987, -59283, -87089, -54586, -65270, -64485, -63497, -65258, -31711, 30611, 20324, -28419, -49452, -40198, -35213, -74788, -77475, -49736, -84021, -71916, -62399, -34756, -62442, -87866, -110787, -81481, -50468, -40046, -57706, -59026, -62099, -80546, -76950, -118413, -57883, -29872, -58019, -82070, -41423, -11717, -35991, -108988, -91951, -84280, -76452, -45445, -19624, -27662, -47637, -26504, -46202, -93588, -120455, -80714, -83661, -50867]
2301e0867J4329j1494R848K9055O5924N2126n8558o4954J2602M4949J2520m6133
2289I347M5109j3871p811m9916M2846M165J5324o5614O904k560L3015m289j8180
2276e531K6663J6950J4233L919J0245k6594n2698l7394O9105R914O296o826J8994
2263D7276l1929K4464r218j5559j8051K1912j6748J7638l4165N858R0732l0092
2251E2118m324J5672k0594n7727P2740j9252l3980N4218L1397n2931J774J5475
2239E4586j821m055j3895L1858j1170j3992J7244l3256J2Q2030j9726m350M7749
2226A31214K1292M17J6273l2014J775J2991L8965k5348m8529J8661L8272k696
2214A71273k7309j6532J8589L0359n2036k6780Q3908J4646l7192M4343l717J8341
$$ y = [-50867, -36538, -48032, -38184, -9129, 56795, 108921, 50363, -14591, -1989, 42960, 55480, 9347, 54456, 40585, 32774, -17142, 25704, 29869, 45193, -20421, -13517, -16077, 16938, 12649, -5531, 21132, 38082, 52315, 56234, 66479, 39885, -12813, -50207, 18898, 28812, 35108, 28282, 47276, 15347, 39811, 30593, 15034, -3017, 18895, 2147, 19785, -14380, -8522, 82210, 52118, 47794, 63466, 42872, -14855, 57885, 38633, 4653, 58871, 90268, 37337, 39111, 54586, 52765, 48710, 34815, 66673, 55503, 41511, 58755, 25499, 25511, 107541, 87815, 83465, 131214, 152506, 152923, 169196, 137182, 138957, 151948, 190913, 165565, 117036, 135697, 173969, 171273, 143964, 127432, 146021, 176380, 124344, 97564, 181472, 196118, 158926, 203269, 199552, 217893]
2202B17893l2207j5138L2571N4494N5602n313q932L0999J5508j5926k7190O5483
2190C67844M0449M775L26K3053N642K0116L1879n4405L1182q943R156K5629N6761
2177E53464K8176j333l2213J7729K1394J2834N8784J31449r091p2195K8979M5581
2165G83558r7549L3302M4295L6213M7739m881L9823P8865O4335L7384L7926M9932
2153A150942P5062Q0605O8846R1387N1556Q6628R3766N6037Q7951J12937R6472
2142B052189J24607J68332J29631J79982J89723J76202J82774K70976L28281L11966
2132D114663K76819L58307L68110M31268O16253O95716Q07073J082756J018425
2123I769390J142360J391461J756441K438831K852782K115056q39144l668153
$$ y = [217893, 185686, 170548, 203119, 257613, 313215, 307902, 298970, 329969, 345477, 329551, 302361, 367844, 408293, 413068, 413394, 436447, 442089, 462205, 494084, 439679, 470861, 461918, 471074, 496703, 553464, 581640, 580307, 548094, 565823, 587217, 600051, 658835, 790284, 781193, 708998, 737977, 783558, 686009, 719311, 763606, 799819, 847558, 842677, 882500, 961365, 1025700, 1063084, 1101010, 1150942, 1226004, 1306609, 1375455, 1466842, 1518398, 1605026, 1698792, 1754829, 1842780, 1955717, 2052189, 2176796, 2345128, 2474759, 2654741, 2844464, 3020666, 3203440, 3474416, 3802697, 4114663, 4391482, 4749789, 5117899, 5549167, 6165420, 6861136, 7668209, 8750965, 9769390, 10911750, 12303211, 14059652, 16498483, 19351265, 21466321, 20627177, 16959024]
2115A6959024l098530j847804j189533q45740j012005q93407p58438p21735o29003
2106E962829m75261m59520m27621l72360l31177l31022l34321k89809j99441j75539
2096B566758j80779j42582j39091j04860m8560j57090j32538l7612r3399m4688
2086A485559k7938o2759o9207o5292m1827l3879q1447l1556o0649m3259m0271
2075I27475K799m1818q3369m883m886L142q0315n6250j5361k3297M605K643j136
2062F29349l3265n6461j6940L9758k5543k2897m7669n4700L7217n550n3596R637
2050C99340m0783k9856L3471O7610m0319m4706K0364k5209l994n0167j523J8020
2038C02248j715k3846l1995r889L8068k3748N41J6218m8040m5639J7360n1783
$$ y = [16959024, 13860494, 12012690, 10823157, 9977417, 8965412, 8072005, 7313567, 6591832, 5962829, 5487568, 5028048, 4600427, 4228067, 3896890, 3565868, 3231547, 2941738, 2742297, 2566758, 2385979, 2243397, 2104306, 1999446, 1950886, 1793796, 1661258, 1623646, 1530247, 1485559, 1457621, 1394862, 1325655, 1260363, 1218536, 1184657, 1103210, 1071654, 1011005, 967746, 927475, 930274, 888456, 805087, 800204, 795318, 798460, 718145, 661895, 646534, 623237, 627842, 630485, 629349, 596084, 539623, 522683, 562441, 536898, 514001, 466332, 411632, 448849, 443299, 389703, 399340, 358557, 328701, 362172, 429782, 389463, 344757, 365121, 339912, 335918, 285751, 284228, 302248, 300533, 276687, 244692, 234803, 272871, 249123, 249664, 265882, 217842, 172203, 189563, 137780]
2026A37780J9895k0981M9146p173j532J372m6166l7852j3800M3276L1948n1757
2014A04156m484K8302k8724M3892l4444N1295L6277n4757L1637l4360l5766p475
2002I5549l4653j6161K4078M6585m5296J0536q337J4278J3747k9255J9680L5995
1990A26746k0724L104j0320q7298N783M8847J6445j3563j0827J0581J6279m538
1978H0515k4461m6864k9991n410J7044M419j5772K6352k7103N0530R481J2744
1966E1484l352m6153j6932K6227m6383j2887K0968J5673K724p409J3130J1971
1954I061N0952l8322j5155j8834J2591L0440L913k8414m3774J4024K205J755J5831
1941c727j4674j6754J3103p511L5604K1639k5991n2694k0756j8612j5554J1173
$$ y = [137780, 157675, 136694, 185840, 178667, 177135, 178507, 132341, 94489, 80689, 123965, 155913, 104156, 99672, 127974, 99250, 143142, 108698, 159993, 196270, 141513, 173150, 138790, 103024, 95549, 60896, 44735, 68813, 115398, 70102, 80638, 72301, 86579, 100326, 71071, 90751, 126746, 106022, 109126, 98806, 11508, 17291, 66138, 82583, 69020, 58193, 68774, 85053, 80515, 56054, 9190, -20801, -26211, -9167, -4748, -20520, 5832, -21271, 29259, 38740, 51484, 48132, 1979, -14953, 11274, -35109, -47996, -27028, -11355, -8631, -16040, -2910, 9061, 60013, 21691, 6536, -12298, 293, 30733, 34646, 6232, -37542, -23518, -21313, -19558, -3727, -18401, -35155, -22052, -29563, 6041, 27680, 1689, -51005, -71761, -90373, -105927, -94754]
1929i4754L1O2144L4606k4751k3232j6906j3049M1127L3329K6324j5795J2998
1917B2072M2732k8156l4645l69J1512k8159k3424N7641l2919o377O704L8833K2544
1904D7989l2506o3306l130n588N5590k4839k4997J5840K3257L6249j1399r406
1892C754Q135K6696l0217n4778L460L3539k4657J3141J3956K0326k4930l0999
1880d2574m6847L776L1547M8262j8694L5358l7275j8452K3009l2350l2817M3016
1868d4041K1691n7419J3383q528n578K3582J8276L2528r727Q125K3224k7914K4134
1855A1736L5572j6350K187K5836r337p8309L1379N7914l2350j9669k5628K941
1843a4078K0444J3400n9100l596O6358L447m4369k8092J1903N2440n5436K8116
$$ y = [-94754, -94723, -32579, 2027, -22724, -45956, -62862, -75911, -34784, -1455, 24869, 9074, 22072, 64804, 36648, 2003, 1634, 13146, -15013, -38437, 19204, -13715, -20092, -13388, 25445, 47989, 15483, -47823, -50953, -56541, -951, -25790, -50787, -34947, -11690, 24559, 13160, 3754, 11889, 38585, 8368, -46410, -42950, -9411, -34068, -20927, -6971, 13355, -11575, -42574, -89421, -85645, -54098, -5836, -24530, 10828, -26447, -44899, -21890, -54240, -87057, -44041, -22350, -79769, -66386, -74914, -80492, -56910, -38634, -6106, -15833, -7708, 15516, -12398, 11736, 47308, 30958, 33145, 58981, 49644, -28665, 2714, 60628, 28278, 8609, -17019, -14078, 6366, 19766, -39334, -42930, 23428, 26875, -17494, -45586, -33683, 18757, -36679, -8563]
1831h563M6943k0816m5665j7780K9206n7431K6433K5196K387l7793K1708K281
1819c3894J5681k7872K6514O23O092R711J9768K3791k7041l8519k9065N3837m0640
1806d1014j535l6748J5989J8750j906L836J9889N7362k1409l2630l4079j1864
1794f5359K7003K1330M288M745j6073l1891m2837M8180M2683n3833M7150j9211
1782c3825l1139K5807J5051j2289L3769J8947j1963o303j6216m5723J5889M8913
1770I18l1795N760m5280M988K8275j0004K5285k0579R730K2431j5037J1003j1549
1757b5854L867J9276j1126r948K2403L3015l6233O06j7981o460M355k1217l3828
1744g9125N1205j4999j9264k4619L2337K4924n08k0639J1554j948j4152K6326
$$ y = [-8563, 38380, 17564, -28101, -45881, -16675, -74106, -47673, -22477, -20090, -57883, -36175, -33894, -18213, -46085, -19571, -18948, -12856, -3145, 16623, 40414, 13373, -25146, -54211, -374, -41014, -42549, -79297, -63308, -44558, -46464, -42628, -22739, 34623, 13214, -19416, -53495, -65359, -38356, -17026, -12738, -7993, -24066, -55957, -98794, -50614, -7931, -61764, -14614, -33825, -64964, -39157, -24106, -36395, -2626, 16321, 4358, -1945, -18161, -63884, -47995, 918, -30877, -25117, -70397, -65409, -37134, -47138, -21853, -42432, -32702, -10271, -25308, -14305, -25854, -21987, -2711, -13837, -23785, -1382, 31633, -4600, -3994, -21975, -28435, -24080, -45297, -79125, -27920, -42919, -62183, -86802, -54465, -29541, -30049, -50688, -39134, -41082, -55234, -28908]
1732b8908p0462K2978L1180R832P064J5624n9515M513N7801K772k3785n0119l5179
1719a16204N6025k58J0388M5429K1114o1313Q238K5788k4784L6104j9601n1152
1707g0226p362O5039j0620k4146O2792n982l2776J5880k667o0984j1515O917N046
1694g0604p151M5381j4827K143M3181l5764r834J125m2199N1680k4243l0912M4148
1681d7876K8414q601j7139n0664o081M7370k8475j2996L4751M8437j7292j0373
1669d0525l5876J4535j7051J5685O4024M5801o1597m1960Q652j3674K8087N5865
1657B1966l9104p7260J3817M1945k1593J1099K2475O086j6180Q900K3273m0683
1645d5259R29k7390J4241M6571j5497k8976K0837K9325k7661k253K117j6681n85
$$ y = [-28908, -99370, -76392, -45212, -35380, -28316, -12692, -72207, -67694, -9893, -7121, -30906, -81025, -116204, -60179, -60437, -50049, -4620, 16494, -44819, -36581, -10793, -35577, 527, -19074, -70226, -77588, -12549, -23169, -47315, 15477, 9495, -23281, -7401, -10068, -71052, -82567, -75650, -70604, -77755, -32374, -47201, -45058, -1877, -37641, -47475, -46350, -88549, -36869, -61112, -92024, -47876, -19462, -28063, -45202, -95866, -101947, -54577, -83052, -96048, -61297, -12860, -30152, -40525, -76401, -61866, -78917, -63232, 792, 46593, -15004, -56964, -48312, -61986, -33899, 21966, -17138, -94398, -80581, -38636, -60229, -49130, -26655, -20569, -36749, -27849, -4576, -45259, -44330, -71720, -57479, -10908, -26405, -55381, -34544, -5219, -32880, -35133, -33016, -49697, -50282]
1632e0282q465O287O786l7583J3399k1745N3609N1371k771l3241k65J3246m8087
1619e7741J3545j6600j8177K1208M7337J588l0803l0472P541J6114k0356l4539
1607a01355L0555K2919R83P7466m2043m3283j7807K2641K4950l2715J986K2647
1595c3056M7286n5542Q822j8397j5834p786J2103L8952o1957K9387J2065n896
1583d9853L5581n6356J4295J5115J0994K9964j2976j1894N374n350N952J1738
1571g416k0141k9823M4906J791o6608K4524L1200K6998Q001q52j1521j7997k0911
1558c7849j9644L8258K4089m7114j917j1901K4671M1385p15m5266k7690N1449
1546a2244l8651m8139K8448l725M1064O4341j4499k5028K5984L1748m2762K6101
$$ y = [-50282, -58747, -52460, -45674, -83257, -69858, -91603, -37994, 13377, 10606, -22635, -22900, -9654, -57741, -44196, -60796, -78973, -57765, -10428, -8840, -39643, -70115, -62574, -46460, -66816, -101355, -70800, -47881, -46898, 30568, -11475, -54758, -72565, -49924, -24974, -57689, -55703, -33056, 14230, -41312, -32490, -50887, -66721, -74507, -62404, -23452, -85409, -56022, -43957, -49853, -14272, -70628, -56333, -41218, -30224, -260, -13236, -25130, -19756, -25106, -19154, -7416, -27557, -57380, -12474, -10683, -77291, -52767, -21567, 5431, 13432, 12580, 1059, -16938, -37849, -57493, -19235, 4854, -42260, -44177, -56078, -31407, 9978, 9263, -36003, -63693, -12244, -50895, -99034, -70586, -74311, -33247, 31094, 16595, -8433, 17551, 49299, 6537, 32638]
1534C2638n1713o1818O4562J2112j3921p6006K3820N4955K9463N467j2374j8170
1522a0985K740K3476L2119j9212n4635m1977J1467q699k80O5149M6435R444o4382
1509i340M676J3011o676j6429K2177k6167q777r921o029J0999P2366K2839J8953
1496H1682m8551K7334j5887p8262K216J5783o074K462N110K7586j459l0221k9325
1483d7606p612N1888J643l3284j2994j1992O899J2928j789N378P572Q732k3911
1470d4148J1025j6921J6739j2027J9821L643k4860r901j1095N7295K0934J9636
1458C0141K2170r1992L1614r130M8513j4243J1808m092j9805M2833k6018j1310
1446A0489K1032j0274r390j1866n506k70k620J0159k5189j1301L4713n168l9398
$$ y = [32638, -19075, -80893, -16331, -4219, -18140, -94146, -70326, -15371, 14092, 19559, 7185, -10985, -8245, 15231, 47350, 28138, -26497, -68474, -57007, -65706, -65986, -837, 45598, 55042, -9340, -4664, 8347, 1671, -14758, 7419, -18748, -27525, -37446, -43475, -32476, 39890, 62729, 81682, 33131, 60465, 44578, -33684, -31468, -15685, -21759, -19297, -14187, 13399, 11940, -18281, -47606, -55218, -3330, -1687, -34971, -47965, -59957, -53058, -40130, -41919, -36541, -28969, -20237, -44148, -33123, -50044, -33305, -45332, -25511, -21868, -46728, -56629, -67724, -10429, 10505, 30141, 52311, -39681, -8067, -17197, 31316, 17073, 28881, 24789, 4984, 47817, 21799, 10489, 31521, 21247, 11857, -9, -5515, -5785, -8405, 1754, -23435, -34736, -23, -5191, -44589]
1433d4589l151K2850n945l8093M9449J7117J3214j5315m1928l1175K998M7096
1421b7472j0843O8619J091j2321K3912k6576p10k1027o3897p554P543R518J6846
1408d2871J34o095L9792j6027r831L2118J275j4903k146K8370P561n1175l7356
1395g1154K1962R964R087N578J3501L175K139K2333L4688k7054k1966p8705Q787
1382f7665l386j6855J7951N5337P063K0209l5022J8073k7805P213J9481N6459
1370E1053J8547l4609P302k1846k4898J1383j9139j8279Q266P1106j975n5909
1358h998j4206J3043L7999n5966R351j5525M9470k3447n4577M7188N4310k4027
1346A4615k4358m8803k7301M1004Q192J8560N4716n0337m8345J3300K9910J0864
$$ y = [-44589, -47740, -24890, -30835, -68928, -19479, -2362, 10852, -4463, -46391, -77566, -74568, -27472, -38315, 30304, 31395, 19074, 42986, 16410, 15700, -5327, -69224, -76778, -69235, -59717, -42871, -42737, -48832, -9040, -25067, -34898, -2780, -1505, -16408, -18554, 9816, 17377, -33798, -71154, -49192, -39228, -30141, -24563, -11062, -7887, -5748, 16585, 51273, 24219, 2253, -76452, -67665, -71051, -87906, -69955, -14618, -7555, 12654, -22368, -4295, -32100, -24887, -5406, 51053, 69600, 34991, 42293, 20447, -4451, 6932, -12207, -30486, -22220, 48886, 46911, -8998, -23204, -10161, 27838, -28128, -18777, -34302, 15168, -8279, -62856, -15668, 38642, 14615, -9743, -58546, -85847, -44843, -36651, -18091, 36625, -13712, -62057, -48757, -18847, -7983]
1334g983R286o9914J6810J8240N335O5841K161j3594k2584m3787J6405K0998j7683
1321b0469k1063M1903Q864n2694K3914J466k7036n324N7188J0238k9166K8724
1309A6545J7270r329j4967j5094k8131m3627L9008M3836J6056k1406n9084l6666
1297i5589M3727M7979J5511l7267N8978K5669n5420o850K2498j8856q5721M926
1285h0415P1701K9823k4395j3611k3240Q1885j295n2368k2640K530J5952K193
1273a3880J6904j0767k0022K1668Q07k7634J7299N033J4243k3709m6654m181J9550
1260e1343K2203M1635j161K9192p974m2285m4246K3682j1165n908J6484k1048
1248e1934K024K3957K9019k2609L866N500O0271j5457p2197j2762k6751K3650
$$ y = [-7983, 1303, -68611, -51801, -33561, -28226, 37615, 39776, 26182, 3598, -40189, -23784, -2786, -20469, -41532, 371, 9235, -43459, -19545, -18079, -45115, -50439, 6749, 16987, -12179, 16545, 33815, 24486, 9519, -5575, -33706, -77333, -38325, 5511, 21567, 161, -58923, -95589, -51862, -3883, 11628, -25639, 33339, 59008, 3588, -3262, 19236, 380, -85341, -80415, -8714, 21109, -3286, -16897, -40137, 41748, 40453, -11915, -34555, -32025, -16073, -13880, 3024, -7743, -27765, -6097, -5290, -32924, -15625, -10592, 3651, -20058, -66712, -70893, -51343, -29140, 12495, 11334, 40526, 32552, -9733, -53979, -30297, -41462, -47370, -30886, -51934, -49910, -25953, 3066, -19543, -15677, -10177, 50094, 34637, -37560, -50322, -77073, -53423]
1236e3423K4631L6924l4859K47J3447K0818l171j1918p644n3577J3960K4105j9926
1223e0386j911L1576l450J5890p681K9228J1541k5733l2696r864K1229Q7043o9912
1210e126o992j3960M223o739J8100K6699k2155k7087o8142l718M5495N1740N0741
1197D3079O8442l8793p6027j6948K1817k7933m891L7898L0014n4163k7655J7701
1185b7459L0832K7173K9699n6396j5545O373j6648n809J5961M271L1954K1262
1173D5668l0009L662j7875J2003p6638J6774K7756j5821M3235k1861J1289L068
1161A251O147K4470p814J3599j7296m3581L4933l0212J5057j665j9056l2562j0543
1148f7272M6984k8705n380j4021R172J6729M4195k2996P9803P543l7778l0803
$$ y = [-53423, -28792, 8132, -26727, -26480, -13033, 7785, 4614, -7304, -14948, -68525, -54565, -30460, -50386, -52297, -20721, -24171, -8281, -15962, 13266, 24807, -926, -33622, -43486, -22257, 64786, -5126, -12118, -26078, -21855, -28594, -10494, 16205, -5950, -33037, -101179, -104897, -59402, -7662, 43079, 111521, 72728, -3299, -20247, 1570, -26363, -31254, 6644, 36658, -17505, -45160, -27459, 3373, 30546, 60245, 3849, -11696, -5323, -21971, -27780, -11819, -7548, 24406, 45668, 15659, 19321, 1446, 13449, -63189, -46415, -18659, -34480, 8755, -13106, -1817, 1251, 7398, 31868, 24054, 37653, 20357, -23224, 11709, -18503, -3446, -5111, -24167, -56729, -67272, -20288, -48993, -54373, -68394, -59222, -42493, 1702, -21294, 58509, 66052, 28274, -2529]
1136b529N591R79J9248j4396l9919J5405J2169K1472k8378P469K9141L0798j5980
1123D1070M483Q214J1305o5450j2864N1619j8076j9084j2664K0814k9610j068
1111b1311l4736k2120N7198k1827k2982M6869N2588j0842p384o1926M4167j4174
1099a6480M4103n694R393l827J1579J4513k6095N9625l5976m9465k1079K3033
1087C630M3670j5576k359L6090k7002o6330j3641K0064K2088k7784K4217K2383
1075A9450k5955K0910K2693k9035J284j0176M8468K3372m1726k9587k7207j7992
1063d5501j0250L4757l0894J9998J4749K7713J0455k3094p746K3426k2527k355
1051a1269K1456M3153k6701p277l625l5747J0680J7234l0797l474K7381j8169
$$ y = [-2529, 3062, 4041, 23289, 8893, -31026, -15621, -3452, 18020, -10358, -2889, 26252, 57050, 41070, 45553, 53767, 65072, -378, -13242, 38377, 20301, 1217, -11447, 9367, -20243, -21311, -56047, -78167, -20969, -42796, -65778, -18909, 33679, 22837, 15453, -46473, -2306, -16480, 27623, 21929, 31322, 27495, 39074, 53587, 27492, 87117, 51141, 1676, -19403, 3630, 47300, 31724, 29365, 65455, 38453, -27877, -41518, -21454, 634, -27150, -2933, 19450, -6505, 14405, 37098, 8063, 9347, -829, 47639, 71011, 29285, -302, -27509, -45501, -55751, -20994, -51888, -31890, -17141, 10572, 21027, -2067, -9813, 13613, -8914, -11269, 10187, 53340, 26639, 19362, 15737, -20010, -9330, 7904, -22893, -26367, 1014, -17155]
1039a7155j3045L0431K9300k3360K2579j3953k0386m4189P0433j1809l0792N435
1027a6511k7089l106O4277m3867m5837P5109k6001r091J6940j2175l5129N1265
1015a1215L7073J6735p9775L1285M90J9355l5828l2371J5942k0946L3771K9806
1003D322P822m6561M0310m9757k9773O3130Q321J8023J241J2205o743k423J0337
990C0454j9742q739K8361j4713Q382k6252K2964J90m5174N6381m017j2371O345
977B2069k6025J5761R509P090L9975n3007O954j8380l379L8408m1480M9732J1403
964E8630j3055K2838p018p8265k4242Q742j3507N835M7400K397r843K408n0919
951d8599N4948M3021k8910j3087k5472n806k6281j5425L8477j6138J0701J5340
$$ y = [-17155, -30200, 231, 29531, 6171, 28750, 14797, -5589, -49778, 20655, 8846, -21946, -16511, -43600, -46706, 17571, -26296, -72133, 2976, -23025, -32116, -15176, -27351, -62480, -11215, 25858, 42593, -37182, -5897, -5407, 13948, -21880, -54251, -38309, -59255, -25484, 4322, 12144, -34417, 5893, -43864, -73637, -10507, -2186, 15837, 17078, 29283, 22540, 20117, 30454, 10712, 1973, 30334, 15621, 24003, -2249, 20715, 20905, -24269, 32112, 28095, 15724, 22069, -3956, 11805, 21314, 28404, 68379, 15372, 22326, 3946, 567, 38975, -2505, 47227, 58630, 45575, 68413, 61395, -16870, -41112, -32370, -45877, -40042, 7358, 9755, -88, 2320, -48599, 6349, 49370, 20460, 7373, -18099, -23905, -50186, -65611, -27134, -43272, -32571, -17231]
939a7231M7704K4584k7140R977j2413p879p871J0453K9072n6105p84j0731K6124
926G760M1142J271j4769o8101L122Q0683J642k9651q0013L7386L0255J2246j0852
913A2121L8956m2561k0166O118Q533L6314k4610K6207J9858J2546q277k3889j3951
900B7199j1965m3190O8420j0122J0220o2569Q621L7883m4889l021N205P1810n37
887E3065n6742n712p758k5897L7285K9196l2740K886o767L8562N433l133m3200
874a5522J8041k3922j8697K367r938o860M4998N4738j9763L969k7717j1895n823
861a6024q242J0975K1426j6094r315M8092J8185m0115p750N593N745Q2496n9433
848C5539o8585N6016J3847J0324k4517k449q625L0387J682j866o888L9011K20
$$ y = [-17231, 30473, 55057, 27917, 37894, 25481, 17602, 9731, 20184, 49256, -6849, -7633, -18364, 7760, 48902, 50173, 35404, -32697, -29575, 51108, 52750, 23099, -56914, -19528, 10727, 22973, 12121, 51077, 8516, -11650, -5532, 3001, 39315, 14705, 40912, 60770, 73316, 65039, 41150, 27199, 15234, -27956, 40464, 30342, 40562, -22007, -13386, 24497, -20392, -23413, -18208, 53602, 53065, -3677, -9389, -17147, -43044, -5759, 23437, -9303, -6417, -13184, 25378, 30811, 27678, -15522, 2519, -21403, -40100, -37733, -47671, -54531, -9533, 45205, 25442, 29411, 1694, -10201, -16024, -24266, -13291, 8135, -7959, -17274, 30818, 49003, 8888, 1138, 6731, 12476, 94972, 35539, -33046, 22970, 36817, 47141, 22624, 20175, 11550, 41937, 43619, 41753, 34865, 73876, 74096]
835G4096k0360m8148k1942P306J4457J8235J2254n3442k1647K5803K4787o799
823D600L564L2644m4512j207J1294j3483j0785j628K1794J6224k9952J9318K6455
810C4326m315R407q284k6755m095M971j1660j1073l3437J5870N0523j0611l5025
797c0158K2735N752K2350l658K0860J1891P18K2553P8m4134J1639o739R901P820
$$ y = [74096, 53736, 5588, -16354, -9048, 5409, 23644, 35898, -17544, -39191, -13388, 11399, 4600, 8164, 40808, -3704, -4911, 6383, -7100, -17885, -19513, 2281, 18505, -11447, 7871, 34326, 30011, 39418, 31134, 4379, 284, 5255, -6405, -17478, -50915, -35045, 15478, 4867, -30158, -7423, -1671, 20679, 17021, 37881, 49772, 50490, 73043, 73121, 28987, 40626, 33887, 43788, 51608]
$$ [...]
##END NTUPLES=NMR SPECTRUM
##END=
