##TITLE=1H_TG-2343-2
 CDCl3
 8 sc, 
 21.1.2022
##JCAMPDX= 6.0         $$ Bruker NMR JCAMP-DX V2.0
##DATA TYPE= NMR SPECTRUM
##DATA CLASS= NTUPLES
##ORIGIN= UXNMR, Bruker Analytische Messtechnik GmbH
##OWNER= root
$$ XWIN-NMR		Version 3.5
$$ Fri Jan 21 11:25:23 2022 Russian Standard Time (UT+4h)  she@DPX200
##.OBSERVE FREQUENCY= 200.131346
##.OBSERVE NUCLEUS= ^1H
##.ACQUISITION MODE= SIMULTANEOUS
##.ACQUISITION SCHEME= undefined
##.AVERAGES= 8
##.DIGITISER RES= 18
##SPECTROMETER/DATA SYSTEM= spect
##.PULSE SEQUENCE= zg30
##.SOLVENT NAME= DMSO
##.SHIFT REFERENCE= (INTERNAL, DMSO, 0, 15.7171)
##AUDIT TRAIL= $$ (NUMBER, WHEN, WHO, WHERE, WHAT)
$$ ##TITLE= Audit trail, XWIN-NMR		Version 3.5
$$ ##JCAMPDX= 5.01
$$ ##ORIGIN= Bruker BioSpin GmbH
$$ ##OWNER= she
$$ F:/spectra/data/she/nmr/H-F/1/pdata/1/auditp.txt
$$ ##AUDIT TRAIL=  $$ (NUMBER, WHEN, WHO, WHERE, WHAT)
(   1,<2022-01-21 11:24:14.93 +0400>,<she>,<DPX200>,
      <created by zg, POWCHK disabled, PULCHK disabled
       configuration hash MD5:
       00 E9 B6 7A A2 85 ED C7 34 08 36 98 17 FE 4E 26
       data hash MD5: 16K
       A9 89 EC 38 C3 70 98 F8 68 09 4A 29 9C FE 3F E3>)
(   2,<2022-01-21 11:24:17.21 +0400>,<she>,<DPX200>,
      <Start of raw data processing
       efp BC_mod = 2 LB = 0.24 FT_mod = 6 PKNL = 1 PHC0 = -16027.05 PHC1 = 9.00078 SI = 16K 
       data hash MD5: 16K
       3D 04 46 97 68 01 A0 9A DB 3B F1 DE 88 B2 C8 7D>)
(   3,<2022-01-21 11:24:38.43 +0400>,<she>,<DPX200>,
      <pk PHC0 = 158.6344 PHC1 = 2.2 
       data hash MD5: 16K
       82 D0 4E 54 3C 03 E1 4D 4E 57 D2 44 48 8E FF F0>)
(   4,<2022-01-21 11:24:41.76 +0400>,<she>,<DPX200>,
      <abs ABSG = 5 
       data hash MD5: 16K
       E9 72 67 BB BB 90 4B 8A 08 6F 6C 39 B3 E1 FA E7>)
$$ ##END=
$$ 
$$ hash MD5
$$ 5C 60 86 6A 1B 64 8D FE 21 61 BE F9 00 8D 86 C2
##$RELAX= 
##$RELAX= 
##$RELAX= 
##$RELAX= 
##$RELAX= 
##$RELAX= 
$$ Bruker specific parameters
$$ --------------------------
##$DU= <F:/spectra>
##$EXPNO= 1
##$NAME= <H-F>
##$PROCNO= 1
##$TYPE= <nmr>
##$USER= <she>
##$AMP= (0..31)
100 100 100 100 100 100 100 100 100 100 100 100 100 100 100 100 100 100 
100 100 100 100 100 100 100 100 100 100 100 100 100 100 
##$AQSEQ= 0
##$AQ_mod= 1
##$AUNM= <au_zg>
##$AUTOPOS= <>
##$BF1= 200.13
##$BF2= 200.13
##$BF3= 200.13
##$BF4= 200.13
##$BF5= 200.13
##$BF6= 200.13
##$BF7= 200.13
##$BF8= 200.13
##$BYTORDA= 1
##$CFDGTYP= 0
##$CFRGTYP= 5
##$CHEMSTR= <none>
##$CNST= (0..31)
1 1 145 1 1 1 1 1 1 1 1 1 1 1 1 1 1 1 1 1 1 1 1 1 1 1 1 1 1 1 1 1 
##$CPDPRG= <>
##$CPDPRG1= <>
##$CPDPRG2= <>
##$CPDPRG3= <>
##$CPDPRG4= <mlev>
##$CPDPRG5= <mlev>
##$CPDPRG6= <mlev>
##$CPDPRG7= <mlev>
##$CPDPRG8= <mlev>
##$CPDPRGB= <>
##$CPDPRGT= <>
##$D= (0..31)
0 1.2 0 0 0 0 0 0 0 0.06 0 0.03 0 0 0 0 0.0002 0 0 0 0 0 0 0 0 0 0 0 0 
0 0 0 
##$DATE= 1642749854
##$DBL= (0..7)
120 120 120 120 120 120 120 120 
##$DBP= (0..7)
150 150 150 150 150 150 150 150 
##$DBP07= 0
##$DBPNAM0= <>
##$DBPNAM1= <>
##$DBPNAM2= <>
##$DBPNAM3= <>
##$DBPNAM4= <>
##$DBPNAM5= <>
$$ [...]
##$SUBNAM2= <"">
##$SUBNAM3= <"">
##$SUBNAM4= <"">
##$SUBNAM5= <"">
##$SUBNAM6= <"">
##$SUBNAM7= <"">
##$SUBNAM8= <"">
##$SUBNAM9= <"">
##$SW= 18.0517287032376
##$SWIBOX= (0..15)
0 0 2 0 0 0 0 0 0 0 0 0 0 0 0 0 
##$SW_h= 3612.71676300578
##$TD= 16384
##$TD0= 1
##$TE= 0
##$TE2= 300
##$TE3= 300
##$TEG= 300
##$TL= (0..7)
0 120 120 120 120 120 120 120 
##$TP= (0..7)
150 150 150 150 150 150 150 150 
##$TP07= 0
##$TPNAME0= <>
##$TPNAME1= <>
##$TPNAME2= <>
##$TPNAME3= <>
##$TPNAME4= <>
##$TPNAME5= <>
##$TPNAME6= <>
##$TPNAME7= <>
##$TPOAL= (0..7)
0.5 0.5 0.5 0.5 0.5 0.5 0.5 0.5 
##$TPOFFS= (0..7)
0 0 0 0 0 0 0 0 
##$TUNHIN= 0
##$TUNHOUT= 0
##$TUNXOUT= 0
##$USERA1= <user>
##$USERA2= <user>
##$USERA3= <user>
##$USERA4= <user>
##$USERA5= <user>
##$V9= 5
##$VALIST= <valist>
##$VCLIST= <CCCCCCCCCCCCCCC>
##$VD= 0
##$VDLIST= <DDDDDDDDDDDDDDD>
##$VPLIST= <PPPPPPPPPPPPPPP>
##$VTLIST= <TTTTTTTTTTTTTTT>
##$WBST= 1024
##$WBSW= 4
##$XGAIN= (0..3)
0 0 0 0 
##$XL= 0
##$YL= 0
##$YMAX_a= 364250
##$YMIN_a= -480782
##$ZGOPTNS= <>
##$ZL1= 120
##$ZL2= 120
##$ZL3= 120
##$ZL4= 120
##$ABSF1= 15.73147
##$ABSF2= -2.320379
##$ABSG= 5
##$ABSL= 3
##$ALPHA= 0
##$AQORDER= 0
##$ASSFAC= 0
##$ASSFACI= 0
##$ASSFACX= 0
##$ASSWID= 0
##$AUNMP= <proc_1d>
##$AZFE= 0.1
##$AZFW= 0.1
##$BCFW= 0
##$BC_mod= 2
##$BYTORDP= 0
##$COROFFS= 0
##$CY= -3
##$DATMOD= 1
##$DC= 0
##$DFILT= <>
##$DTYPP= 0
##$F1P= 0
##$F2P= 0
##$FCOR= 1
##$FTSIZE= 16384
##$FT_mod= 6
##$GAMMA= 0
##$GB= 0
##$INTBC= 1
##$INTSCL= 0
##$ISEN= 128
##$LB= 0.24
##$LEV0= 0
##$LPBIN= 0
##$MAXI= 10000
##$MC2= 0
##$MEAN= 0
##$ME_mod= 0
##$MI= 1.114404
##$NCOEF= 0
##$NC_proc= -5
##$NLEV= 6
##$NOISF1= 3.799351
##$NOISF2= 2.8
##$NSP= 0
##$NTH_PI= 0
##$NZP= 0
##$OFFSET= 15.71714
##$PC= 1
##$PHC0= -15868.42
##$PHC1= 11.20078
##$PH_mod= 1
##$PKNL= yes
##$PPARMOD= 0
##$PSCAL= 0
##$PSIGN= 0
##$REVERSE= no
##$SF= 200.130006887247
##$SI= 16384
##$SIGF1= 3
##$SIGF2= 2
##$SINO= 5.538805
##$SIOLD= 16384
##$SREGLST= <1H.CDCl3>
##$SSB= 0
##$STSI= 16384
##$STSR= 0
##$SW_p= 3612.71676300578
##$SYMM= 0
##$S_DEV= 0
##$TDeff= 16384
##$TDoff= 0
##$TI= <>
##$TILT= no
##$TM1= 0
##$TM2= 0
##$TOPLEV= 0
##$USERP1= <user>
##$USERP2= <user>
##$USERP3= <user>
##$USERP4= <user>
##$USERP5= <user>
##$WDW= 1
##$XDIM= 16384
##$YMAX_p= 291737076
##$YMIN_p= -474522
$$ End of Bruker specific parameters
$$ ---------------------------------
##NTUPLES= NMR SPECTRUM
##VAR_NAME=  FREQUENCY,     SPECTRUM/REAL,   SPECTRUM/IMAG
##SYMBOL=    X,             R,               I
##VAR_TYPE=  INDEPENDENT,   DEPENDENT,       DEPENDENT
##VAR_FORM=  AFFN,          ASDF,            ASDF
##VAR_DIM=   16384,         16384,           16384
##UNITS=     HZ,            ARBITRARY UNITS, ARBITRARY UNITS
##FACTOR=    0.220516191357247, 1,           1
##FIRST=     3145.47137602432, 0,            0
##LAST=      -467.245386981464, 0,           0
##MIN=       -467.245386981464, -474522,     0
##MAX=       3145.47137602432, 291737076,    0
$$ Real data points
##PAGE= N=1
##DATA TABLE= (X++(R..R)), XYDATA
$$ [...]
7286A52976N6267M5125k0718k7654l6118M7267N3941r195l351k9385j6599k4864
7274A87692Q8961n334n606m8685j0568k088l988q0052j5990R4528R221L105J8976
7261B30172P836K7508M1451p1724m0852L249K4960N686j3121K6281P5074N4345
7249C70865l5449r6055L660L3932L2021j6598L9033P2195m9416P314J494K3427
7237C86423n556l9530l841R15J9491n3805l6993N3218K6053o8846j8362J3229
7225B72396Q4364R912j2743Q74L935K4422n4010p864o506O551K5369K0551M3871
7212D11122l6123j1700N5965L1386o45q553L5315N4062j9380j8316K7313k033
7200E18413k784R4448Q826j8491j0368K1878K1642o1365L3424J1281l3738M7882
$$ y = [152976, 209243, 254368, 233650, 205996, 169878, 217145, 271086, 261891, 258540, 229155, 212556, 187692, 276653, 271319, 265713, 217028, 206460, 204372, 200384, 120332, 104342, 198870, 208091, 211196, 230172, 238008, 265516, 306967, 235243, 194391, 197640, 222600, 228286, 215165, 241446, 316520, 370865, 335416, 239361, 243021, 276953, 308974, 292376, 331409, 403604, 354188, 361502, 362996, 386423, 380867, 341337, 337496, 338411, 357902, 304097, 267104, 320322, 346375, 277529, 259167, 272396, 356760, 366672, 353929, 354803, 358738, 383160, 329150, 321286, 314780, 321331, 346700, 367251, 411122, 374999, 363299, 419264, 450650, 450005, 441452, 476767, 530829, 511449, 493133, 520446, 518413, 515629, 610077, 618903, 600412, 590044, 611922, 633564, 572199, 605623, 616904, 583166, 631048]
7188F31048L8861j6019L3203J9680n5558L7005P1874L6139M3323m2779l1154L9926
7176H05549P607m7497N1153N568l3103L4990k4026K8605L5244k1464k6790Q9850
7164I05686J6120N1983J2145K7775J9739M9310M2026J01191Q8115K9213P2015
7153A415318P4312Q7940R4292P2068Q7286L6862N6856N1737M8150N8103N4301
7142B137225N6849n3535k3151N463M5194P3445L6402P6711M4429M1368Q4937O2686
7130B588023R5103Q2072R6766O0693J74690Q9484L0059J68621J36126J41357R0559
7119C753553J92847J43271J51891J47935M3036J5875m9493k1154j08009q0928
7109D188824n0289L50M2756L3055J27437J15786J12547J97316J99076K51564K42976
$$ y = [631048, 669909, 653890, 687093, 706773, 651215, 688220, 760094, 796233, 839556, 796777, 765623, 805549, 813156, 765659, 816812, 822380, 789277, 824267, 800241, 828846, 864090, 842626, 815836, 905686, 921806, 973789, 985934, 1013709, 1033448, 1082758, 1124784, 1225975, 1314090, 1343303, 1415318, 1489630, 1577570, 1671862, 1743930, 1831216, 1868078, 1924934, 1976671, 2024821, 2082924, 2137225, 2194074, 2140539, 2117388, 2122851, 2168045, 2241490, 2277892, 2354603, 2399032, 2440400, 2525337, 2588023, 2683126, 2765198, 2861964, 2922657, 3097347, 3186831, 3216890, 3385511, 3521637, 3662994, 3753553, 3946400, 4089671, 4241562, 4389497, 4432533, 4448408, 4398915, 4377761, 4269752, 4188824, 4138535, 4138885, 4181641, 4214696, 4342133, 4457919, 4570466, 4767782, 4966858, 5218422, 5461398]
7098E461398K37855K75775K93134K86253L43215L07392L49389M06542M63699M54582
7088H879234M97347N45513N57474N68218N47283O21774P83167Q90460R69550J148301
7078A6008321J339004J610531J944614K185718K599217L012286L440178L901679
7070C6041548M584407N402808O498186P804639R182616R420638P678855M361698
7062I0975395L12908k805582n303632p827058r248151j0551157r960787p999773
7054C7592163o168232m565197l469243k574718k047755j489243j329987j135192
7046A4812596j001066r02344p94721p19427o41004o41506n70242m25565l79796
7037H736925l57111l32619k85710l40978k85371k19350k49321j88246j70981l00327
$$ y = [5461398, 5699253, 5975028, 6268162, 6554415, 6897630, 7205022, 7554411, 7960953, 8424652, 8879234, 9376581, 9922094, 10479568, 11047786, 11595069, 12216843, 13000010, 13890470, 14860020, 16008321, 17347325, 18957856, 20902470, 23088188, 25687405, 28699691, 32139869, 36041548, 40625955, 46028763, 52526949, 60331588, 69514204, 78934842, 86613697, 90975395, 91288303, 88482721, 83179089, 75352031, 66103880, 55552723, 45591936, 37592163, 31423931, 26858734, 23389491, 20814773, 18767018, 17277775, 15947788, 14812596, 13811530, 12909186, 12114465, 11395038, 10754034, 10112528, 9542286, 9116721, 8736925, 8379814, 8047195, 7761485, 7420507, 7135136, 6915786, 6666465, 6478219, 6307238, 6006911]
7027F006911k39159j86885j53492j42919j22165k05057j16373j39375q5713j25430
7017D490343j35006r5385j05780p7868o4274j66279j65130p3157l5309n0041p617
7006C514497k7892p3188l9303j6921J4290j4834J24533R2178P7698J12466J41918
6995C905442J70224K50884K63350L32533M02681M63199M98008M34182L10057O6209
6985G096769j54904l15203m59260o10460o19225o64713o24292m67529l54830k49468
6975B576885j55640j70417j32699j32867o7232m3716l8457l1411p9258n5092k4676
6964A645420j877l7191m0198n438k5215k0497k102n8284o1077m4153m4835M323
6952A308876l8484j7259q6813j00011n557n5743m9049n002l4209l3376n11J394
$$ y = [6006911, 5767752, 5580867, 5427375, 5284456, 5162291, 4957234, 4840861, 4701486, 4615773, 4490343, 4355337, 4259952, 4154172, 4076304, 4012030, 3845751, 3680621, 3607464, 3572155, 3522114, 3514497, 3486605, 3413417, 3374114, 3357193, 3371483, 3356649, 3481182, 3573360, 3651058, 3763524, 3905442, 4075666, 4326550, 4589900, 4922433, 5325114, 5788313, 6286321, 6720503, 7030560, 7096769, 6941865, 6626662, 6167402, 5556942, 4937717, 4273004, 3648712, 3181183, 2826353, 2576885, 2421245, 2250828, 2118129, 1985262, 1918030, 1874314, 1835857, 1804446, 1725188, 1670096, 1645420, 1643543, 1606352, 1566154, 1560716, 1535501, 1515004, 1512902, 1454618, 1393541, 1349388, 1304553, 1308876, 1270392, 1253133, 1166320, 1066309, 1060752, 1005009, 955960, 950958, 916749, 883373, 882862, 884256]
6940H84256K3993J8880j8988J8426l7633k5760l957l9083l3694K009L257l1822
6928G59884J6089l1477n1121J3083N2891m2433N829l727j0273O283l3225j011
6916F80792k7133m103k9614k2186L3860M2187l350J0538l0049J615O271j3339
6904F45489k7576j6549J0536Q083m432J6022n9325m3091O28L6659K7560q652k3974
6891E61378n9032m9615m3490K0095L3446k4014l4255K2735m2380J1230m8716N6894
6879D04276J187l2168M1683K3748k4264M7850N7337l6710k2570j5899j5090L0589
6867D59969j7808n4116O4883o398n0142N0934M7233O138J3869q576k8202K5049
6855E02833j01489k4037o877j9809M112L0094Q203O378j422L8613k7999k867m439
$$ y = [884256, 908249, 927129, 908141, 926567, 888934, 863174, 859217, 820134, 786440, 788449, 791706, 759884, 775973, 744496, 693375, 706458, 759349, 716916, 722745, 719018, 708745, 715028, 681803, 680792, 653659, 649556, 619942, 597756, 631616, 673803, 670453, 680991, 650942, 652557, 658828, 645489, 617913, 601364, 611900, 619983, 615551, 631573, 572248, 529157, 529785, 566444, 594004, 585352, 561378, 502346, 452731, 409241, 429336, 462782, 438768, 404513, 427248, 384868, 396098, 347382, 404276, 405463, 373295, 414978, 438726, 414462, 462312, 519649, 482939, 460369, 444470, 429380, 459969, 442161, 388045, 452928, 446530, 396388, 447322, 494555, 500693, 514562, 505986, 477784, 502833, 401344, 377307, 370430, 350621, 354733, 384827, 393030, 399408, 397986, 436599, 408600, 405733, 401294]
6842D01294M7152k162M022l8044k0759j2729K5397j6842j9952N0929l6990J1697
6830C93013k3276J9676J4761p3130M591K0917j4449j9299o1655M2012o634j0954
6818B85573J7572L975l8319k027p2850q66L9522K3073k9894o5561J7580J7092
6806A94870o156K4369j9385k3575K0301J892n0245j770L486J3834M1742K1068
6794B20431k5894N4661q7759LN045K1977J5723L7752q132J4212J0185m3310n311
6781B09583J4267M7122k2480l1474n2517L2304J2898r720j2363K619O765K7806
6769B24810l2962n2038k3354j8988L9221O0134m0485m3697K2242r513Q419M078
6757A37867o992j1534n3211j0548K0773J0214N1205l2320K9692J1150J9598o257
$$ y = [401294, 448446, 446284, 450306, 412262, 391503, 378774, 404171, 387329, 367377, 418306, 381316, 393013, 369737, 389413, 404174, 331044, 335635, 356552, 342103, 322804, 261149, 303161, 296527, 285573, 303145, 307120, 268801, 266774, 193924, 193058, 232580, 255653, 225759, 160198, 177778, 194870, 188714, 213083, 193698, 170123, 190424, 192316, 142071, 140301, 143787, 157621, 199363, 220431, 194537, 249198, 161439, 161442, 166487, 188464, 204187, 241939, 233807, 248019, 258204, 214894, 209583, 223850, 270972, 248492, 217018, 164501, 196805, 209703, 199983, 187620, 190239, 197004, 224810, 191848, 139810, 116456, 97468, 136689, 196823, 156338, 112641, 134883, 125370, 133789, 137867, 130875, 119341, 66130, 55582, 76355, 86569, 137774, 105454, 135146, 146296, 165894, 159637]
6745A59637l6441j9884M3578Q808r234m6094M312K852p849J2755n910K7248j5024
6732A18754j6277J8061k9322k2188Q2910J8826k923l1808k7024O665k4327J6827
6720A08174M6721j9055o818J50L5670j6776k4453j0889J8887M825N528o5160K0220
6707I7024k187o524M5322N447L0424o239m3915K4183Q809l3959J6044l323J9599
6694A50705p615m2646J2381k385P0000m638P441q032j2940l7586K7095q746o090
6681A36944K4140J598o679J9276K0771k9804O3152l5582N1358J2352k2007K5445
6669B60964M1499K6763Q735O6545M8759O5413M3654P422l9715j3002L2074J2365
6657E61476q7626p2172p5559l6678l9598l8617L7583N20j2227M5563o5203l0777
$$ y = [159637, 123196, 103312, 146890, 155698, 146464, 100370, 104682, 107534, 99685, 112440, 106530, 133778, 118754, 102477, 120538, 91216, 69028, 151938, 170764, 167841, 136033, 109009, 115674, 91347, 108174, 154895, 135840, 129022, 129172, 164842, 148066, 123613, 112724, 131611, 136436, 141964, 76804, 97024, 94837, 88313, 133635, 139082, 169506, 163267, 119352, 143535, 152344, 118385, 134429, 131106, 150705, 143090, 100444, 112825, 110440, 180440, 175802, 183243, 175211, 162271, 124685, 151780, 143034, 136944, 161084, 162682, 156003, 175279, 196050, 166246, 229398, 193816, 245174, 257526, 235519, 260964, 302463, 329226, 337961, 404506, 453265, 518678, 562332, 569754, 530039, 517037, 549111, 561476, 473850, 401678, 326119, 289441, 249843, 211226, 248809, 249329, 237102, 282665, 217462, 186685]
6645A86685o09K4638l4588Q214Q079j0706N504Q304J0306N020m102k9947L8473
6632B15271k9381L3730J184q556n7380j3186r87R443R043K6123m6011K9661m153
6619A64801p700j201R545J906J734m378n3936L207L2176K9983j3121j5774l1725
6606A15517K1321j8276N7599k2102K2462L2211l9710K8826k3018l6603M4474K5127
6594B07828n1365K4518J2228l1821p8835O2265M8085m0134K1618M5776q147j4265
6582A97751k563l9707n407L2222L6955o8965J0739o102m8706J11471j6398o830
6570A94460K728L614j3907k4457M2658m4773K7501K2721n2990M3005j8947N924
6558A87537k4722n5615N8953M820o5247N6963l1838K0004J3678j1673J4347K8102
$$ y = [186685, 186076, 210714, 176126, 184340, 192419, 181713, 187217, 195521, 205827, 210847, 206745, 176798, 215271, 185890, 219620, 220804, 212248, 154868, 141682, 140695, 150138, 159181, 185304, 139293, 168954, 164801, 157101, 155900, 165445, 167351, 169085, 164707, 110771, 113978, 146154, 176137, 163016, 147242, 115517, 136838, 118562, 176161, 154059, 176521, 208732, 169022, 197848, 174830, 138227, 182701, 207828, 156463, 180981, 193209, 161388, 82553, 144818, 192903, 152769, 174387, 220163, 212016, 197751, 195188, 155481, 150074, 182296, 219251, 150286, 161025, 154923, 106217, 217688, 201290, 194460, 197188, 200802, 186895, 162438, 205096, 160323, 187824, 210545, 157555, 200560, 181613, 187537, 162815, 107200, 166153, 170973, 105726, 162689, 130851, 150855, 164533, 152860, 167207, 195309]
6546A95309J8300p2844o392Q322J0063n724J2688M9643K1655J3045n2163k8537
6534A63365J8596n8031n891M2474l320j5359M1592m6692N806J8331M3507q857
6522A95521k8792K2135L1685k0380o1899j5085O6744O85r264J1045j5034l7774
6510A39587L3733k766Q820J1502k8383k5083Q317j8026o845M1818k079j3272j2201
6497A35122N9710K9243o2462K2327r926k7204M6102l536j2916J153K2106k0387
6485A79332L1038j5350n2167k2920O1355k9238o7954M0656Q371Q235O3393l0216
6473A74535J8429J0315j4602k0438k1099K6645R639j2748l7653j1689P6944n0132
6461A48146l3969O1451L4770j2944m2616R894r510k2870N1287L0300p076j0393
$$ y = [195309, 213609, 140765, 134373, 142695, 152758, 147034, 159722, 209365, 231020, 244065, 191902, 163365, 181961, 123930, 118039, 160513, 157193, 141834, 183426, 136734, 142540, 160871, 204378, 195521, 166729, 188864, 220549, 200169, 138270, 123185, 189929, 190614, 181350, 192395, 177361, 139587, 173320, 170554, 179374, 190876, 162493, 137410, 145727, 127701, 120856, 162674, 160595, 147323, 135122, 194832, 224075, 161613, 183940, 174014, 146810, 192912, 189376, 176460, 177613, 199719, 179332, 210370, 195020, 142853, 119933, 181288, 152050, 84096, 124752, 133123, 141358, 204751, 174535, 192964, 203279, 188677, 168239, 147140, 173785, 183424, 170676, 133023, 121334, 198278, 148146, 114177, 175628, 210398, 197454, 154838, 164732, 155222, 132352, 183639, 213939, 206863, 196470]
6449A96470R466J1990k7542j6991j5169L4348m0159N241P495l5571K9147N5742
6437B14467r775J1140k6505J0256L74k0496J1473l111j6929N9900j1606j5143
6425B04045m9306L3219J9238j4802J3382k3326l0326M436M7400j0479M1839k5608
6413B09712K1885K560m3318N9337L5920q573J6982k2604l3942j8246J3521Q332
6401B41566k0266P869l286m2319P869M6331J740l2771K6128J3185O298L8005r266
6388B81083k5580k0495M2565L621m7821l7593j131j8133J4088J9355O31n672K3989
6375B28907O8427o9555M2379J2243k23m9660k8830O363K0082M1301M33M6348j2026
6362C06189k568M983j2900K0748l8779k0911P9507L003n676N969j5689p798J2515
$$ y = [196470, 205936, 217926, 190384, 173393, 158224, 192572, 152413, 157654, 165149, 129578, 158725, 214467, 204692, 215832, 189327, 199583, 199957, 179461, 190934, 187823, 170894, 230794, 219188, 204045, 154739, 187958, 207196, 192394, 205776, 182450, 152124, 156560, 203960, 193481, 235320, 209712, 231597, 234157, 190839, 250176, 286096, 277523, 294505, 271901, 237959, 219713, 233234, 241566, 221300, 229169, 225883, 183564, 191433, 237764, 239504, 206733, 232861, 246046, 252344, 290349, 281083, 255503, 235008, 277573, 281194, 233373, 195780, 194649, 176516, 190604, 209959, 210590, 204918, 228907, 297334, 227779, 270158, 282401, 282178, 232518, 203688, 210051, 230133, 271434, 271867, 318215, 306189, 303621, 308604, 295704, 316452, 277673, 256762, 336269, 339272, 333596, 339565, 323876, 316078, 328593]
6349C28593K2177j1553k5404M1238J5100j9479o292K8052Q900L1490j732l62n163
6336D05565k7241K5659j9520k4990j6313n460M5229L2996N243K2956Q56K9051
6324D74031k3011k3823O6713k5535p8015K4385M0318j5409K737J1756M6846l691
6312D97302K6002l200l5296K9204k9154j753k7565J4285L8871K8466k7523J60
6300E09799m539Q438j4316L3325K748j3986n935P863j6495L939k9660M1405P6321
6287E98907j2028k0416k5428J3544l7397n5053N0808Q1962j5897M113J6556j5102
6275E84569l8454j9704N540J1078l2333k3525J2134P392L9547Q629m2901K4068
6263E36040M9915j1434n0946k0086O7872N6328J6526J3188j7967O548l5127K9183
$$ y = [328593, 350770, 339217, 313813, 355051, 370151, 350672, 344380, 372432, 381332, 412822, 411090, 410728, 405565, 378324, 403983, 384463, 359473, 343160, 337700, 382929, 415925, 421168, 444124, 444980, 474031, 451020, 427197, 493910, 468375, 390360, 414745, 455063, 439654, 442391, 454147, 500993, 497302, 523304, 520104, 484808, 514012, 484858, 483105, 455540, 469825, 508696, 537162, 509639, 509799, 505260, 513698, 499382, 532707, 535455, 521469, 515534, 523397, 506902, 510841, 481181, 522586, 598907, 586879, 566463, 541035, 554579, 517182, 462129, 512937, 594899, 579002, 583115, 599671, 584569, 546115, 526411, 531951, 543029, 510696, 487171, 499305, 506697, 546244, 554873, 511972, 536040, 585955, 574521, 523575, 503489, 571361, 627689, 644215, 657403, 639436, 645984, 610857, 640040]
6251F40040N3375J3210l9161Q94K4147l7094K5617K4585j2061K9568k1611K0706
6239G22215L572q971J3556K6988O3447l041p5871N417j242J925Q802k9410L8468
6226G65855O27J5929Q7611J0231j9324l158k4755L0334K925J8464m2001l6786
6214H05952P0860O240j5141n191k3759J5094L6154k3982J2660L9758M8119J1850
6202I78614l5404k490k4328O115M4056L9627P691o317P686N3975N0641q57l8187
6189A080822J1014Q9607n1704K4938O9145N2977M546O6361p354J7588J0679M9125
6177A417744P2994K2666j4K8667O5182j8054M8845O6243J9777o5264o36M4355
6165A702505N3758l5706K4628J8l4673L4495N840J5219J5441O5376J739Q101J6125
$$ y = [640040, 693415, 706625, 667464, 668358, 692505, 655411, 681028, 705613, 693552, 723120, 701509, 722215, 725787, 716816, 730372, 757360, 820807, 817766, 741895, 747312, 746070, 747995, 756797, 727387, 765855, 766482, 782411, 870022, 880253, 860929, 857771, 833016, 863350, 866275, 884739, 842738, 805952, 876812, 883052, 867911, 862720, 838961, 854055, 890209, 866227, 878887, 918645, 966764, 978614, 943210, 940720, 916392, 922507, 966563, 1006190, 1013881, 1007564, 1015250, 1069225, 1119866, 1119009, 1080822, 1091836, 1181443, 1129739, 1154677, 1223822, 1276799, 1281345, 1347706, 1340352, 1357940, 1368619, 1417744, 1490738, 1513404, 1513390, 1542057, 1607239, 1589185, 1638030, 1704273, 1724050, 1658786, 1658150, 1702505, 1756263, 1720557, 1745185, 1745203, 1710530, 1745025, 1750865, 1766084, 1781525, 1846901, 1848640, 1856741, 1872866]
6152A872866J358P0178k968k9377K380K8077Q3186j9494n9024m165l151r329N187
6139A935724j7348P826O936o6150J1424K4893K6897j3307K999j8887n380m2215
6127A853412L4744L5987K7046Q869K5330J6852j7392r076j3001M7742J6782j3067
6115B014228L7874O816J5679p100j4573L0955Q2916K2154q90L3854J1492o824
6103B226581L1089K6343N0254P7842J2270J1433P397M7325K5528L8003P8550J02008
6091B734623Q660N7737K3483L467K4374J8086N1372J34075J49336M8672K949m7138
6079C209696O153j8133P141J8300M6883K2634O899N1734L5415N9901K1866P881
6067C476370J7983P296N0085n8574l7555L2437r765m821P3371N0180J6568N5093
$$ y = [1872866, 1874224, 1944402, 1941434, 1912057, 1914437, 1942514, 2025700, 2006206, 1947182, 1943017, 1939866, 1930537, 1935724, 1918376, 1926202, 1933138, 1866988, 1878412, 1903305, 1930202, 1916895, 1919894, 1901007, 1895627, 1853412, 1888156, 1924143, 1951189, 1960058, 1985388, 2002240, 1984848, 1975772, 1962771, 2010513, 2027295, 2014228, 2052102, 2058918, 2074597, 2067497, 2052924, 2083879, 2166795, 2188949, 2188059, 2221913, 2233405, 2226581, 2257670, 2284013, 2334267, 2412109, 2424379, 2435812, 2443209, 2490534, 2516062, 2554065, 2632615, 2734623, 2743283, 2801020, 2824503, 2827970, 2852344, 2870430, 2921802, 3055877, 3205213, 3253885, 3256834, 3209696, 3215849, 3197716, 3204857, 3223157, 3270040, 3292674, 3299573, 3351307, 3386722, 3446623, 3468489, 3476370, 3494353, 3501649, 3551734, 3493160, 3455605, 3488042, 3478277, 3473456, 3546827, 3597007, 3613575, 3668668]
6055C668668M1866l3128K3741L5017N2655M8695O0877L5813O4276P3656O0291
6044D132427P2657K6213J4031N9683J42435Q2850L8261Q2854N7163O7144K4055
6033D799773J29905J13024J04421J12284L8430N1442K6839L0550j7800M8566K6106
6022E463540J2378M7275J34123L5597R3058J09189N7278p34n150N7725M1521J7066
6010F062866R5160o759J06223M2965J00516M0592R4293N3353Q6303Q4325N1286
5999F811123Q2410J57796R0132M7047R6228O3429R1823P3846J06988N1330J34757
5988G806909J19835Q1421J10479J35460Q1543J39359J08094J34113J00810J18803
5978H936826J57267J03809J56481J89290J28209J54904J13923R9943Q3004J61170
$$ y = [3668668, 3710534, 3677406, 3701147, 3736164, 3788819, 3837514, 3898391, 3934204, 3998480, 4072136, 4132427, 4205084, 4231297, 4245328, 4305011, 4447446, 4530296, 4568557, 4651411, 4708574, 4775718, 4799773, 4929678, 5042702, 5147123, 5259407, 5297837, 5349279, 5376118, 5406668, 5388868, 5437434, 5463540, 5475918, 5523193, 5657316, 5692913, 5785971, 5895160, 5952438, 5951704, 5946554, 6004279, 6045800, 6062866, 6158026, 6151267, 6257490, 6300455, 6400971, 6441563, 6535856, 6589209, 6675512, 6759837, 6811123, 6893533, 7051329, 7141461, 7188508, 7284736, 7348165, 7439988, 7513834, 7620822, 7672152, 7806909, 7926744, 8008165, 8118644, 8254104, 8335647, 8475006, 8583100, 8717213, 8818023, 8936826, 9094093, 9197902, 9354383, 9543673, 9671882, 9826786, 9940709, 10040652, 10123656, 10284826]
5968A0284826J49088J80389J79214J39893J29765J49382J42094J21464J68425
5959A1644540J03493J78038K05168J42581K06197J76735J32219J56530K19155
5950A3164656K47038J46076J23639J38177K21557J58457J96216K55783Q5517J43585
5940A4880701K18177J52712J58082K11770J04168J60252J78039J95473K28041
5931A6487415J86189J77973J62946J88624J38248J95280K43030J90774K40051
5922A8210530K06504K09657K76558K70678K84827K43189K20294K14009K20538
5913B0356784K55349J36906J92238J80125J29499P7126J04844J38763R8441J32192
5903B1802267R7498J08225P8463J84028J47084J60161J69429J47139K23531J99187
$$ y = [10284826, 10433914, 10614303, 10793517, 10933410, 11063175, 11212557, 11354651, 11476115, 11644540, 11748033, 11926071, 12131239, 12273820, 12480017, 12656752, 12788971, 12945501, 13164656, 13411694, 13557770, 13681409, 13819586, 14041143, 14199600, 14395816, 14651599, 14737116, 14880701, 15098878, 15251590, 15409672, 15621442, 15725610, 15885862, 16063901, 16259374, 16487415, 16673604, 16851577, 17014523, 17203147, 17341395, 17536675, 17779705, 17970479, 18210530, 18417034, 18626691, 18903249, 19173927, 19458754, 19701943, 19922237, 20136246, 20356784, 20612133, 20749039, 20941277, 21121402, 21250901, 21328027, 21432871, 21571634, 21670075, 21802267, 21899765, 22007990, 22086453, 22270481, 22417565, 22577726, 22747155, 22894294, 23117825, 23317012]
5893B3317012K04048J52766J45626J35183J71679J28150J11965J51230J09977
5884B4627636J51857J78125J98973K20582K17248K75807K63549L54458M33754
5875B6921989M09972M88960N44446O38502O39513O81526P60556P07613P62557
5866C2555634R05367Q93549R73226R66722Q88534R41563R68777R86093J054572
5857D1134037J049514J151743J332819J391468J608407J683518J745527J878695
5849E2975728K010849K179551K443860K766093L042850L436874L857672M329068
5841G7042545M860732N430454O078256O585809P191703P722963Q110595Q448519
5833A31471576Q676313Q761438Q707003Q045783O355765L557410L21455k360939
$$ y = [23317012, 23521060, 23673826, 23819452, 23954635, 24126314, 24254464, 24366429, 24517659, 24627636, 24779493, 24957618, 25156591, 25377173, 25594421, 25870228, 26133777, 26488235, 26921989, 27331961, 27820921, 28365367, 29003869, 29643382, 30324908, 31085464, 31793077, 32555634, 33461001, 34354550, 35327776, 36294498, 37183032, 38124595, 39093372, 40079465, 41134037, 42183551, 43335294, 44668113, 46059581, 47667988, 49351506, 51097033, 52975728, 54986577, 57166128, 59609988, 62376081, 65418931, 68855805, 72713477, 77042545, 81903277, 87333731, 93411987, 99997796, 107189499, 114912462, 123023057, 131471576, 140147889, 148909327, 157616330, 165662113, 172017878, 175575288, 175896743, 173535804]
5825A73535804m130443n710531p661025r449595j0185651r970780r326692q643589
5817A08457498q028628p554195p058280o410820n698661n044412m441493l882291
5809F0338718l503139l094272k727320k359061k095911j897205j755358j608348
5801D1298104j536842j395388j256606j188141j101091q67590r30770p61480p17973
5792C1542223p97487q12945q60383q93052r69099j044118j096428j077177j028116
5783B2963418j024758r74819q09110p88977p13637p08020o54621o09687n31841
5774A6147948n14880m57713m64217m75225l54283l99468l59379l86265l27576
5765A2408942l61898l27210k40549k38471k98179k42247k53714k84565k43642
$$ y = [173535804, 169405361, 163694830, 156033805, 146584210, 136398559, 126427779, 117101087, 108457498, 100428870, 92874675, 85816395, 79405575, 73706914, 68662502, 64221009, 60338718, 56835579, 53741307, 51013987, 48654926, 46559015, 44661810, 42906452, 41298104, 39761262, 38365874, 37109268, 35921127, 34820036, 33952446, 33021676, 32260196, 31542223, 30744736, 29931791, 29071408, 28178356, 27209257, 26165139, 25068711, 23991534, 22963418, 21938660, 20963841, 20154731, 19365754, 18652117, 17944097, 17289476, 16679789, 16147948, 15633068, 15175355, 14711138, 14235913, 13881630, 13482162, 13122783, 12736518, 12408942, 12047044, 11719834, 11479285, 11240814, 10942635, 10700388, 10446674, 10162109, 9918467]
5756I918467k36311k02246j79149k03365k08616k07722j91412j97184j98106k21922
5746G872434k83566j53866j76374k02644j35839j16874j44123o2287j26481j81319
5736F289061o3147q7874l4160j9662j11153l5980p201n785M945P335l2084J8467
5724E922762o12r5469o4004p4427q3583j10498r6727j34668j20862o7518j7108
5713E057286n9333l6737p6140n4987L7525n3716k071m9668r903j2257j8250N7001
5701D778750J9423n6773m4685l4725L8534n1595p6819r0593o1616m7009q8921
5690D283971m2169r6037J4426j10163p3410K6106J3845J2215P434P537j36004
5679C907751n1696n7155j3402R140J292j0157k5616m6631k7473P935p9804m4612
$$ y = [9918467, 9682156, 9479910, 9300761, 9097396, 8888780, 8681058, 8489646, 8292462, 8094356, 7872434, 7588868, 7435002, 7258628, 7055984, 6920145, 6803271, 6659148, 6596861, 6470380, 6289061, 6225914, 6138040, 6103880, 6084218, 5973065, 5937085, 5929884, 5924099, 5929044, 5936379, 5904295, 5922762, 5922150, 5826681, 5762677, 5688250, 5604667, 5494169, 5397442, 5262774, 5141912, 5074394, 5057286, 4997953, 4961216, 4885076, 4830089, 4867614, 4813898, 4811827, 4762159, 4752256, 4739999, 4721749, 4778750, 4798173, 4741400, 4696715, 4661990, 4700524, 4648929, 4572110, 4481517, 4419901, 4372892, 4283971, 4241802, 4145765, 4160191, 4050028, 3976618, 4002724, 4016569, 4028784, 4036218, 4043755, 3907751, 3856055, 3798900, 3785498, 3794638, 3795930, 3785773, 3760157, 3713526, 3686053, 3693988, 3614184, 3569572]
5667C569572n4584q9299o2549j4651n5790m2633o5666l7427m5167q6391n0980
5656B964435j6635m1061j0195m3725j592K3196j16554l8447p507k9786j9573l8879
5644B623677j6591N1733o009j4792n2446K6418k2568K4373k6725l6510L6964p2043
5632B515481L090J465m1684k1215N385n451J2698l3843J9574K4037m4612K608
5620B437533j3944J6599p3552k3131p564L2847l4908J5983m0695k3274L4822j3211
5608B307505m6694j2892N3977M154k5323r214n683J8285K8334p20m1446j1713
5596B258570J6907J2723j5424k0172k835J140K1138j9410j2599q3153l8088J1881
5584B130678k845m0609l0902L6613O9271q5651J697m8037J22M6483K591p2125
$$ y = [3569572, 3514988, 3425689, 3363140, 3348489, 3292699, 3250066, 3184400, 3146973, 3101806, 3015415, 2964435, 2947800, 2906739, 2896544, 2852819, 2851227, 2874423, 2757869, 2719422, 2711915, 2682129, 2662556, 2623677, 2607086, 2658819, 2652810, 2638018, 2585572, 2611990, 2589422, 2613795, 2587070, 2550560, 2587524, 2515481, 2518571, 2520036, 2478352, 2457137, 2462522, 2457071, 2469769, 2435926, 2455500, 2479537, 2434925, 2437533, 2423589, 2440188, 2366636, 2343505, 2335941, 2368788, 2333880, 2349863, 2309168, 2285894, 2320716, 2307505, 2260811, 2247919, 2301896, 2306050, 2280727, 2271513, 2265830, 2284115, 2312449, 2311729, 2270283, 2258570, 2275477, 2288200, 2272776, 2252604, 2249769, 2250909, 2272047, 2252637, 2240038, 2156885, 2118797, 2130678, 2127833, 2087224, 2056322, 2092935, 2162206, 2076555, 2078252, 2030215, 2030337, 2076820, 2079411, 2007286]
5572B007286l2201M3746O6559k8300l7331K3109k3723m822l9693N3164M049l5173
5560A996670l757k3530J4403J0851l9132J5483P144P37l793k3611Q2098k298j5013
5547B016252l8088K5951j4244M2461l79L9998k6658j5689J5705L4985q4248j326
5535A994720K0589m5700K6575J7982J3867N6291k6865k341K6604l2705J3288o003
5523B056302M7414k2418l4838J2154L9496K6726J0546J5120j3253J2420P6727
5512B226396L6710N2106L9857l4664N4947L5416O1641O1517M8430P3996J5410
5501B671762j8089l5561Q1307Q1857P760n3298j9402L8814P5004j134j0490M340
5489B822870J6373M2483O0817l1563N6757N4138K4955k250J27497Q923n519N1693
$$ y = [2007286, 1975085, 2018831, 2085390, 2057090, 2019759, 2042868, 2019145, 2014323, 1974630, 2027794, 2031843, 1996670, 1992913, 1969383, 1983786, 1994637, 1955505, 1970988, 1978132, 1978869, 1975076, 1951465, 2033563, 2031265, 2016252, 1978164, 2004115, 1989871, 2032332, 2031953, 2071951, 2045293, 2029604, 2045309, 2080294, 1996046, 1994720, 2015309, 1969609, 1996184, 2014166, 2028033, 2084324, 2057459, 2055118, 2081722, 2049017, 2062305, 2056302, 2103716, 2081298, 2046460, 2058614, 2098110, 2124836, 2135382, 2150502, 2137249, 2149669, 2226396, 2263106, 2315212, 2355069, 2320405, 2375352, 2410768, 2472409, 2533926, 2582356, 2656352, 2671762, 2653673, 2618112, 2699419, 2781276, 2789036, 2735738, 2716336, 2755150, 2830154, 2829020, 2818530, 2822870, 2839243, 2881726, 2942543, 2910980, 2967737, 3021875, 3046830, 3044580, 3172077, 3181000, 3175481, 3227174]
5477C227174J4674r287L8755k4185J2498Q0920K0218j3242N1087N3292M0487P7973
5465C570364P3788L0173O746J48043J00146M2710N2142N3325P2137J3264m831
5454D158007P1694J44170N2613N5429K4580N1713J45063J37916Q2636J07534J36259
5443E167614J03542Q5889J34663J52073J52898J46913J85321J89122L05107K14623
5433F837765K66694L61354K98465L43537L19132L06278L30319K52604L31624K89483
5423I937255J54064J79978J55764J77732J74525R9878K3230J20323J56770J57857
5413A1337376R9882J27982J93473J74720J76726J58181J43359K00261K38055K78435
5403A3128450K49865L29908L87461L71398L22063L55466L09985K68223K35325
$$ y = [3227174, 3241848, 3232561, 3271316, 3247131, 3259629, 3340549, 3360767, 3347525, 3398612, 3451904, 3492391, 3570364, 3644152, 3674325, 3681071, 3829114, 3929260, 3971970, 4024112, 4077437, 4149574, 4162838, 4158007, 4229701, 4373871, 4426484, 4481913, 4506493, 4558206, 4703269, 4841185, 4923821, 5031355, 5167614, 5271156, 5357045, 5491708, 5643781, 5796679, 5943592, 6128913, 6318035, 6623142, 6837765, 7104459, 7465813, 7764278, 8107815, 8426947, 8733225, 9063544, 9316148, 9647772, 9937255, 10091319, 10271297, 10427061, 10604793, 10779318, 10879196, 10902426, 11022749, 11179519, 11337376, 11437258, 11565240, 11758713, 11933433, 12110159, 12268340, 12411699, 12611960, 12850015, 13128450, 13378315, 13708223, 14095684, 14467082, 14789145, 15144611, 15454596, 15722819, 15958144]
5394A5958144J95675K53070L24032L27243L83733M67659O00128P05640P99476
5385B0014800R18000J041495J106459J285004J443201J591023J785056K098439
5377C1283477K325707K537422K737809K937772K957727K847137K742654K741217
5369E3110922K720020K565443K199010K178678K204568K277275K208196K016897
5361G1481009J674114J137633R13534O93311L10261j32314m84292n55875n41568
5352G4495813n33600o16201r16408j345883j809173k078393k220688k404875k623987
5343E9946605k738754k717662k430906k098958j933635k000123k171651k422088
5335D1432828k463149k351705k392061k554391k517983k342578k032127j682709
$$ y = [15958144, 16153819, 16406889, 16730921, 17058164, 17441897, 17909556, 18509684, 19215324, 20014800, 20932800, 21974295, 23080754, 24365758, 25808959, 27399982, 29185038, 31283477, 33609184, 36146606, 38884415, 41822187, 44779914, 47627051, 50369705, 53110922, 55830942, 58396385, 60595395, 62774073, 64978641, 67255916, 69464112, 71481009, 73155123, 74292756, 75206290, 75899601, 76209862, 76077548, 75593256, 75037381, 74495813, 73962213, 73346012, 72429604, 71083721, 69274548, 67196155, 64975467, 62570592, 59946605, 57207851, 54490189, 52059283, 49960325, 48026690, 46026567, 43854916, 41432828, 38969679, 36617974, 34225913, 31671522, 29153539, 26810961, 24778834, 23096125]
5327B3096125j388774j193994j027033q59674p92908o79972n84353n09091m43246
5318A5617080l94292l35710k82409k97090j67627j23936j59866k04906j86315
5309A3464929j88228k34842k49731k30043k17573l29369k61386k90051k57653
5300A1206053k51669k11417k47445k43194k39783k16634k88046k84965j99019
5291I023881k39390k41327k06842j49776k43186k70984k55153k89174k92563k97048
5281F538438l07316l09710l08291k46437k20971k65050j26123j09072j71223j47445
5271D326800r7416j54850r8941o9605o5288p5451r8426o1831m1875q9859m0378
5260C432880j00037p4293q8653n4980m0134l1949r2349o4864n5894q9648p2424
$$ y = [23096125, 21707351, 20513357, 19486324, 18626650, 17833742, 17153770, 16569417, 16060326, 15617080, 15222788, 14887078, 14604669, 14307579, 14139952, 14016016, 13856150, 13651244, 13464929, 13276701, 13041859, 12792128, 12562085, 12344512, 12015143, 11753757, 11463706, 11206053, 10954384, 10742967, 10495522, 10252328, 10012545, 9795911, 9507865, 9222900, 9023881, 8784491, 8543164, 8336322, 8186546, 7943360, 7672376, 7417223, 7128049, 6835486, 6538438, 6231122, 5921412, 5613121, 5366684, 5145713, 4880663, 4754540, 4645468, 4474245, 4326800, 4229384, 4074534, 3975593, 3905988, 3840700, 3765249, 3666823, 3604992, 3563117, 3473258, 3432880, 3332843, 3258550, 3169897, 3114917, 3074783, 3042834, 2950485, 2885621, 2829727, 2740079, 2667655]
5249B667655J1521k3028o3749m2897j12035l7786q1723N915J2356k4657n4916
5238B256656l5289k0584m4905l6225m206p3911k7113l9055l0083m8219O934m4177
5226A859823m4837l6211J4309m8285k3383k9794n400p0362r785k274l9846O0683
5214A624638o1959r995J0915k0307J2003L76k655l2348k7589M7655n5320O881
5202A492295L4316m1850L586N4099q611m7540m7407l6232N4746K5834J5728l6115
5190A462849n4178J1264m0794L3741L2129O319M8059O794l014L2221M2845O5586
5178A643821n591n135k9396K9838Q190k6501k5071m2370n3282j07278j9219m6665
5166A321341l0160p2160j5167p106m8613k1701J623O038L0478J5276n9569J59
$$ y = [2667655, 2679176, 2656148, 2592399, 2549502, 2437467, 2399681, 2317958, 2323873, 2336229, 2311572, 2256656, 2221367, 2200783, 2155878, 2119653, 2115447, 2041536, 2014423, 1975368, 1945285, 1897066, 1904000, 1859823, 1814986, 1778775, 1793084, 1744799, 1721416, 1691622, 1686222, 1615860, 1606075, 1603801, 1563955, 1624638, 1562679, 1552684, 1563599, 1543292, 1555295, 1555671, 1553016, 1520668, 1493079, 1540734, 1485414, 1492295, 1526611, 1484761, 1488347, 1542446, 1533835, 1486295, 1438888, 1402656, 1457402, 1483236, 1498964, 1462849, 1408671, 1419935, 1379141, 1412882, 1445011, 1451330, 1499389, 1506183, 1503169, 1535390, 1578235, 1643821, 1638230, 1633095, 1603699, 1633537, 1641727, 1615226, 1590155, 1547785, 1494503, 1387225, 1368006, 1321341, 1291181, 1219021, 1203854, 1196748, 1148135, 1126434, 1128057, 1134095, 1164573, 1179849, 1120280, 1120439]
5154A120439l0845j2458K0470K4985L0951j2429k3323l449K1087j6102R91K9873
5142A150190p2800J1757K5466l6069K1922Q311l1265N6425L7732j9256K4744k6588
5130A150569o044m3602O077k6808j3061J7422J3470k4363o403O4255n7578k0890
5118A053044L944M0138m0495k8850p2730m506R330o7458N3209m1971m4047l097
5106H56511r095O6465n9186p4503L5843J2626o52J5635o7917o7674N6060K3613
5094G87726L129j2486K5682o86m3484k548L6852J0336k8483m966j4747j8116j4534
5081G23675L7240K8205P014L0493M2079l2906K7298J06470N7607j8812m9863J4673
5069I73173J9235l4719n9183K6779j7287k7724q061J1550n35O311P387M2150q387
$$ y = [1120439, 1089594, 1077136, 1097606, 1122591, 1153542, 1141113, 1117790, 1114341, 1135428, 1119326, 1120317, 1150190, 1077390, 1089147, 1114613, 1078544, 1100466, 1108777, 1077512, 1133937, 1171669, 1152413, 1177157, 1150569, 1144525, 1100923, 1107000, 1080192, 1067131, 1084553, 1098023, 1073660, 1067257, 1131512, 1073934, 1053044, 1056988, 1097126, 1056631, 1027781, 955051, 950545, 959875, 892417, 945626, 903655, 859608, 856511, 847416, 913881, 854695, 780192, 816035, 828661, 828009, 843644, 775727, 708053, 764113, 787726, 790855, 778369, 804051, 803365, 759881, 757333, 794185, 804521, 776038, 771072, 756325, 738209, 723675, 760915, 789120, 796134, 826627, 868706, 835800, 863098, 969568, 1027175, 1008363, 958500, 973173, 992408, 957689, 898506, 925285, 907998, 880274, 872213, 883763, 883228, 889539, 896926, 939076, 930689]
5056I30689Q9729K8890m044L8197R6276N7284K4857Q8282M0444M0126n1468p181
5044A372081n3763r5813l5063l0690o6067j09681j11592o888Q173J131l1222J3119
5032H53725J3603l2592N3326Q6797r709J2388P9434L2806L001O5370j3409p8064
5020A066676l6995l5143L025R741l8914J1872K5448n6321O0535J9369j0682J4274
5008A032885m350K2048m1979K7867j7106j513Q487k4483j4914K2613J3055k8691
4996I93919N3197J0102l3069l3532K7437j818k5743K5774O0521j726o0664n2895
4984I61503j934k5921n12n642L111k7233n5659J6326k2273o7752O5211K9532j8716
4971H50041J1281j1853j4436j6760J4559J5031P671m7848J6647k5918J6876n5661
$$ y = [930689, 1020418, 1049308, 1045264, 1083461, 1179737, 1237021, 1261878, 1350160, 1390604, 1430730, 1379262, 1372081, 1318318, 1222505, 1187442, 1156752, 1090685, 981004, 869412, 862524, 870697, 871828, 840606, 853725, 867328, 834736, 888062, 974859, 965150, 977538, 1056972, 1089778, 1092779, 1158149, 1144740, 1066676, 1029681, 994538, 997563, 1007304, 968390, 980262, 1005710, 949389, 1009924, 1029293, 1018611, 1032885, 1028535, 1050583, 1008604, 1036471, 1019365, 1017852, 1026339, 1001856, 986942, 1009555, 1022610, 993919, 1047116, 1057218, 1024149, 990617, 1018054, 1016236, 990493, 1016267, 1076788, 1075062, 1014398, 961503, 959569, 933648, 933136, 927494, 930605, 903372, 847713, 864039, 841766, 774014, 839225, 868757, 850041, 861322, 849469, 835033, 818273, 832832, 847863, 855534, 807686, 824333, 798415, 815291, 759630]
4959G59630K0193K2748j5416l3056l4654M3862l9489K1806j8N2619j3706l1958
4947G52561R352j2856K6968M267J3776n4509o1015M98q802K4894K4990o2432P294
4934F64986J4886Q176l1711l7458K9260L1759j5194k0190J4680r964L3280j6164
4922F66346l8979n990j7566L8251j1368N7191k885j3794O116k0336o6663k76M1008
4909F31055l6403o409k2314j8599K617k1644P658N8968j3732l9269J3428J0528
4897E65884m0133P569M6825j838j8881k0101q101L9046J2138q294O308L5413k1144
4884E94691m1701l2514L3132O0465n2469k7896Q263j0395J2580K6555K8587r606
4872E89692l79R825j7850L8304p001q084P7597j638J3211p613j891j0272j981
$$ y = [759630, 779823, 802571, 787155, 754099, 719445, 763307, 723818, 745624, 745606, 798225, 784519, 752561, 761913, 749057, 776025, 780292, 794068, 739559, 678544, 679042, 670240, 695134, 720124, 657692, 664986, 679872, 688048, 656337, 618879, 648139, 679898, 664704, 644514, 659194, 649230, 682510, 666346, 627367, 621377, 603811, 642062, 630694, 687885, 685000, 671206, 677322, 656986, 590323, 590047, 631055, 594652, 588243, 565929, 547330, 549947, 528303, 535961, 594929, 581197, 541928, 555356, 565884, 525751, 533320, 580145, 578307, 559426, 539325, 531224, 570270, 582408, 574114, 580422, 615835, 594691, 552990, 520476, 553608, 614073, 561604, 533708, 541971, 531576, 544156, 570711, 599298, 589692, 589313, 599138, 581288, 619592, 612591, 604507, 682104, 680466, 693677, 686064, 684173, 673901, 671920]
4859F71920M0700J322j3671j0593N2092P9589j2696P703k0379l7171o545j3719
4847G38552N5154k0903K5403L572N530K8285j1733j1557m1730M2042M450J6997
4835H34062j6828Q5051L4495M1589M7494P335j811O0231R848P8710P8155N9630
4823A317961J8648J1373J22333K3050K6616P0847j2958j7674M0601L8599K8355
4812A667751K6330j0481J5358o663k2577J06637M7743O6825L676j1199M3401L4831
4800A961632Q0895O7058O4314K023N6015N1058j9015J9996K7463M6709j4249P176
4788B351075j6179P0920P0742K2028J3742P5695O7000r294Q5801L9409M4130J42664
4776B957733J16071J21648J69203J74832J52953J96243J95828K09172J85086K18548
$$ y = [671920, 712620, 713942, 700271, 689678, 741770, 821359, 808663, 816366, 795987, 758816, 752271, 738552, 793706, 772803, 798206, 801778, 807308, 835593, 823860, 812303, 770573, 812615, 817065, 834062, 817234, 902285, 936780, 978369, 1025863, 1033198, 1031387, 1091618, 1101466, 1180176, 1258331, 1317961, 1336609, 1347982, 1470315, 1493365, 1519981, 1590828, 1577870, 1560196, 1600797, 1639396, 1667751, 1694081, 1683600, 1698958, 1692295, 1669718, 1776355, 1824098, 1890923, 1894599, 1883400, 1926801, 1961632, 2042527, 2109585, 2173899, 2175922, 2231937, 2282995, 2263980, 2283976, 2311439, 2358148, 2343899, 2351075, 2334896, 2405816, 2476558, 2498586, 2512328, 2588023, 2655023, 2645729, 2731530, 2770939, 2815069, 2957733, 3073804, 3195452, 3364655, 3539487, 3692440, 3888683, 4084511, 4293683, 4478769, 4697317]
4766D697317K37910J80707K83885K96176K97830L15674L15465L50451L49299L18338
4756G643052M20795M77645M24174N32245N51400O95881Q46186R98463J233148
4747A3822989J515489J715261J978586K188983K545537K973440L438673M073855
4739C4252813N102024O148470O022661M171880J205597j350870k619517l774011
4731D9159047n295029o505109o612772n377439l935629k918868k107465j562989
4723A4843747j203228q04427p06300o27295n07370m55570m05260l59533l56767
4714I417997k93626k01092j26226q5029q0635m5767j1418N4588L9077R6907P6209
4703H840985J62582J98185J72255K35701K30587J92356K58337K51877L19890M34947
$$ y = [4697317, 4935227, 5115934, 5399819, 5695995, 5993825, 6309499, 6624964, 6975415, 7324714, 7643052, 8063847, 8541492, 8965666, 9497911, 10049311, 10745192, 11591378, 12589841, 13822989, 15338478, 17053739, 19032325, 21221308, 23766845, 26740285, 30178958, 34252813, 39354837, 45503307, 51525968, 55697848, 56903445, 55552575, 52933058, 49159047, 43864018, 37358909, 30746137, 25368698, 21433069, 18514201, 16406736, 14843747, 13640519, 12836092, 12129792, 11502497, 10995127, 10539557, 10134297, 9774764, 9417997, 9124371, 8923279, 8797053, 8712024, 8631389, 8585622, 8574204, 8628792, 8667869, 8764776, 8840985, 9003567, 9201752, 9374007, 9609708, 9840295, 10032651, 10290988, 10542865, 10862755, 11297702]
4693A1297702M68853N45587P52112R34525J053917J380264J597992J877357K196865
4684B2105174K513694K929812L443880M184879N099490N489795M919543L436289
4676E4122556J592925l30510k796117m885617n520023o046563o213632n249528
4668B4673491l954818k938698k253819j661163j291383j032799q70294p42448
4660I928069o10068n49677m91114m52787l59945l47953l29306k42515l24867k17980
4650F001857j96472k12751k11058k16091j47735j12341j17004j95243j21487r1980
4640D379695l9670j39513o7292m6935r3939r0781q374j34498j38305k7736n3773
4629C538879j08991j09136j13981o3062m6897n7485r6178p2039k496m1613k8911
$$ y = [11297702, 11766555, 12312142, 13064254, 13998779, 15052696, 16432960, 18030952, 19908309, 22105174, 24618868, 27548680, 30992560, 35177439, 40276929, 45766724, 50686267, 54122556, 55715481, 55384971, 52588854, 47703237, 42183214, 36136651, 29923019, 24673491, 20718673, 17779975, 15526156, 13864993, 12573610, 11540811, 10670517, 9928069, 9318001, 8768324, 8277210, 7824423, 7464478, 7116525, 6787219, 6544704, 6219837, 6001857, 5805385, 5592634, 5381576, 5165485, 5017750, 4905409, 4788405, 4593162, 4471675, 4379695, 4340025, 4200512, 4133220, 4086285, 3992346, 3901565, 3893191, 3758693, 3620388, 3592652, 3538879, 3429888, 3320752, 3206771, 3143709, 3096812, 3039327, 2943149, 2871110, 2868614, 2827001, 2798090]
4618B798090m5803l2307L4513p8377J1399N585K5411j426j936R2784m625L9765
4606B843073P85l4812k7154K3341n7393p8762l6190m1871o3597n544j440j4440
4594B505996m0246j9365m739j5153J5550M71n9033j9555r758l8518K5252l6962
4582B303940J672Q536o032p5233N5838O3344J4168o3652q3808m4077q0889l9834
4570B053973k2040L3573J5940m2580J0583L0291m9402J5186p6364q6680q0087
4559A802393K4622K362J8434K3703N708R47K3355K9936J611K075p768j1589O3835
4546A979624Q2749P4357R3332J20889M4467K6455K1343l215q323j5799n9770k6009
4534B330100p2827n281l1155k4876J1645r875m4900n6832k3156M7035R0490Q936
$$ y = [2798090, 2752287, 2719980, 2754493, 2676116, 2687515, 2693100, 2718511, 2717085, 2715149, 2807933, 2803308, 2843073, 2843858, 2809046, 2781892, 2805233, 2747840, 2669078, 2632888, 2591017, 2527420, 2521876, 2520436, 2505996, 2465750, 2446385, 2441646, 2426493, 2442043, 2442514, 2383481, 2363926, 2354168, 2315650, 2340902, 2303940, 2305612, 2314148, 2308116, 2232883, 2288721, 2352065, 2366233, 2302581, 2218773, 2174696, 2093807, 2053973, 2031933, 2065506, 2081446, 2038866, 2049449, 2079740, 2030338, 2045524, 1969160, 1882480, 1802393, 1827015, 1829377, 1847811, 1871514, 1877222, 1878169, 1901524, 1931460, 1933071, 1935146, 1927378, 1915789, 1979624, 2062373, 2136730, 2230062, 2350951, 2395418, 2421873, 2443216, 2440001, 2431678, 2415879, 2356109, 2330100, 2257273, 2251992, 2220837, 2195961, 2207606, 2197731, 2152831, 2095999, 2072843, 2119878, 2210368, 2219304]
4522B219304K5969M7584J3468n512k7205J752k2477m9502r7765q7707n6063p7740
4510A884106l3521j37690j9868l8558k3325k3198l3881l7596k9433J8391K941
4499A528368R557k9672l1052p7112l4327J7461k7064l8932N546j9225j2981k8978
4487A261589k4210L1007M2159l0333n0617O2205N6652k0928J1835j6739M594M028
4475A331242O8370l1281r6620k8889K6213L7038j8817j2134m63K9102L6293J9378
4463A359432n8225Q1348N812L564J9753j5624r477L1042j2082r5855K9606M3646
4451A382940L4477O3338M9217J1899P366L4810P6212M2538O3920P8133K1795P5697
4439A942342J11141J77896J43162J34879R4593M6555n126j79807q8796j55026
$$ y = [2219304, 2245273, 2292857, 2306325, 2300813, 2273608, 2275360, 2252883, 2203381, 2105616, 2017909, 1961846, 1884106, 1850585, 1712895, 1693027, 1654469, 1631144, 1607946, 1574065, 1536469, 1507036, 1525427, 1528368, 1537925, 1508253, 1477201, 1400089, 1365762, 1383223, 1356159, 1317227, 1322773, 1303548, 1290567, 1261589, 1237379, 1268386, 1310545, 1280212, 1229595, 1291800, 1348452, 1327524, 1339359, 1322620, 1327214, 1331242, 1399612, 1368331, 1271711, 1242822, 1269035, 1306073, 1287256, 1275122, 1274659, 1303761, 1340054, 1359432, 1301207, 1382555, 1388367, 1391931, 1411684, 1396060, 1386583, 1417625, 1405543, 1309688, 1339294, 1382940, 1417417, 1480755, 1529972, 1541871, 1549237, 1584047, 1660259, 1702797, 1766717, 1844850, 1866645, 1942342, 2053483, 2231379, 2374541, 2509420, 2604013, 2650568, 2645442, 2465635, 2376839, 2221813]
4429B221813j67561j45593j06774j3951q8884K3341Q420k2477P465o43m8881L0751
4417A697026m0191n5169q915l7667m475k7072j7414Q0675j6136K2522J6330J5249
4405A624763L9633k7372j2410m6580K9399Q178J5159J0643j7611P5630j7127N9442
4393A741747L1092j746j4038K2398K6582M140k121j4920N0712J7103l1916M6332
4381A875365Q4829N6834O0664Q0783J28734J06361R6326J08774Q7649L1647L3438
4370B751404Q1883R8816M9442J9145K6811k362j22J5308N6414K8715P775J3474
4358C146703k730j3435j0278k8139p4303J438m1435o1957q623r7616j4554j0024
4346B785047p8548m0439o5845l745q5388j37221q5456m6868K484L3624J1006L4899
$$ y = [2221813, 2054252, 1908659, 1801885, 1787934, 1699050, 1722391, 1730811, 1708334, 1715799, 1715156, 1666275, 1697026, 1656835, 1601666, 1592751, 1555084, 1550609, 1523537, 1506123, 1586798, 1570662, 1593184, 1609514, 1624763, 1664396, 1637024, 1624614, 1578034, 1607433, 1615611, 1630770, 1641413, 1623802, 1699432, 1682305, 1741747, 1772839, 1771093, 1757055, 1779453, 1806035, 1810175, 1808054, 1793134, 1843846, 1860949, 1829033, 1875365, 1960194, 2017028, 2077692, 2158475, 2287209, 2393570, 2489896, 2598670, 2686319, 2717966, 2751404, 2833287, 2932103, 2981545, 3000690, 3027501, 3025139, 3025017, 3040325, 3096739, 3125454, 3133229, 3146703, 3143973, 3130538, 3120260, 3092121, 3017818, 3019256, 2977821, 2915864, 2907241, 2809625, 2795071, 2785047, 2706499, 2666060, 2600215, 2596470, 2511082, 2373861, 2288405, 2241537, 2244021, 2277645, 2288651, 2323550]
4334B323550p221J00765P5828l7295P466M6677K4560q397j6926O1341K9710L4774
4322B634832K5637L5188l6386K7988J6953k5663O186M2780k7731K7528J00371
4311B827683J8753M6703L2807j1440j2498J9810J6444J6117M9212L1279N6329
4300C091199P4381l3776L6416j4693o1771J6324p56L1868M6702N4855N3401O2523
4288C356673N5931K5374P2137L9184N5791O1447K7861O434R428K0455n429l737
4276C721549M1975L230O1485K8527k6908J4573P7813r66k3024P2907O0833N2641
4264D084635o017J9021n9761M8642O1753J265j2355J9520n6858j30R4444L6033
4252D230192L1990J18395Q2026J10880J01873J02071J19659J58719J70889K00852
$$ y = [2323550, 2316329, 2417094, 2492922, 2455627, 2463093, 2509770, 2534330, 2525933, 2509007, 2570348, 2600058, 2634832, 2660469, 2695657, 2659271, 2687259, 2704212, 2678549, 2684735, 2727515, 2699784, 2727312, 2827683, 2846436, 2893139, 2925946, 2914506, 2902008, 2921818, 2938262, 2954379, 3003591, 3034870, 3091199, 3165580, 3131804, 3168220, 3153527, 3091756, 3108080, 3107324, 3139192, 3185894, 3240749, 3294150, 3356673, 3412604, 3437978, 3510115, 3549299, 3605090, 3666537, 3694398, 3700832, 3710260, 3730715, 3725286, 3721549, 3763524, 3766754, 3828239, 3856766, 3829858, 3844431, 3922244, 3921278, 3898254, 3971161, 4031994, 4084635, 4078618, 4097639, 4037878, 4086520, 4148273, 4149538, 4137183, 4156703, 4099845, 4099715, 4194159, 4230192, 4262182, 4380577, 4462603, 4573483, 4675356, 4777427, 4897086, 5055805, 5226694, 5427546]
4242E427546J74124K23239J97409J84383K27664K30259K87744K33761K78041J55613
4232G619783J91118J71142J17389J01297Q8090J14008Q0818K0752M1011R6901
4222H642309P2328R1035J01465K16327J92825K54698K08438J65697K34366K15964
4212A0395452K14551J78353J51237J49249J87371J55674J24848J11857J33810
4203A1802402J50265J47161J53942J22266J57712J71965K18830J97243K21643
4194A3343429K93820K83533L85114L39324M06512M38332N46225N52554O51124
4185A7239967P53849Q30397Q52248Q86114R01128R57317R81175J092200J106694
4176B5601089J283978J391241J560526J569648J684900J750655J845871J929986
$$ y = [5427546, 5601670, 5824909, 6022318, 6206701, 6434365, 6664624, 6952368, 7186129, 7464170, 7619783, 7810901, 7982043, 8099432, 8200729, 8288819, 8402827, 8483645, 8504397, 8545408, 8642309, 8714637, 8805672, 8907137, 9123464, 9316289, 9570987, 9779425, 9945122, 10179488, 10395452, 10610003, 10788356, 10939593, 11088842, 11276213, 11431887, 11556735, 11668592, 11802402, 11952667, 12099828, 12253770, 12376036, 12533748, 12705713, 12924543, 13121786, 13343429, 13637249, 13920782, 14305896, 14645220, 15051732, 15490064, 16036289, 16588843, 17239967, 17993816, 18824213, 19676461, 20562575, 21463703, 22421020, 23402195, 24494395, 25601089, 26885067, 28276308, 29836834, 31406482, 33091382, 34842037, 36687908, 38617894]
4168C8617894K028045K233377K595520K877555L370634L849029M498921N245492
4160F5316467O237764P226181Q543566R790577J1197141J2835338J4934605J7137162
4152A53218801J9948747K3726830K8229574K9713027K4593070J2307027j003860
4145B90733216j3112795k4881066l2616116l5560893l0098794k2276656j6390883
4138A15796013j2598367j0227412q565291p422340o647229o090772n247271m469049
4130E4528282l849574l404724l029202k622060k249708j926036j786822j612579
4122C4047577j373102j279542j176775j077507j015640r41295q67640p67157p37944
4113B4810975p79980p90663o45625n91928n23115m30544l91679l95602m17061
$$ y = [38617894, 40645939, 42879316, 45474836, 48352391, 51723025, 55572054, 60070975, 65316467, 71554231, 78780412, 87323978, 97114555, 108311696, 121147034, 136081639, 153218801, 173167548, 196894378, 225123952, 254836979, 279430049, 291737076, 290733216, 277620421, 252739355, 220123239, 184562346, 154463552, 132186896, 115796013, 103197646, 92970234, 84404943, 76982603, 70335374, 64244602, 58997331, 54528282, 50678708, 47273984, 44244782, 41622722, 39373014, 37446978, 35660156, 34047577, 32674475, 31394933, 30218158, 29140651, 28125011, 27183716, 26316076, 25548919, 24810975, 24030995, 23240332, 22594707, 22002779, 21479664, 21049120, 20657441, 20261839, 19844778]
4104A9844778m94139n25855n29626m69227m21622m31283l97489l45520k98836
4095A5931181l13424k52975k03389k26093j34172j03281j623N0503K6320k7989
4085A4745058m2494k8080J8788p3792K967R8577J92810J80135L52959M85548O11973
4074A6544449P32540Q84759R96004J212285J253637J476792J817855K264220K465920
4065B9648461L238550M675930N937339M178260O47837k410666j270772l877403
4057D0767536p669803n353602l594571k055721j264912o89200l38827L44182O68630
4048B0813712P83354L27861k31751o67304q54287j169760j606466j699714j424214
4039A4271431j226492r19482p96818n74505n39454m17822l73750k65580l29312
$$ y = [19844778, 19350639, 18824784, 18295158, 17825931, 17404309, 16973026, 16575537, 16230017, 15931181, 15617757, 15364782, 15161393, 14935300, 14801128, 14697847, 14696224, 14746727, 14773047, 14745058, 14702564, 14674484, 14693272, 14619480, 14622447, 14721024, 14913834, 15093969, 15446928, 15932476, 16544449, 17276989, 18161748, 19157752, 20370037, 21623674, 23100466, 24918321, 27182541, 29648461, 32887011, 37562941, 43500280, 47678540, 48326377, 45915711, 44644939, 40767536, 33097733, 27744131, 24149560, 22093839, 20828927, 20139727, 19800900, 20145082, 20813712, 21597066, 21924927, 21693176, 21025872, 20171585, 19001825, 17395359, 15695645, 14271431, 13044939, 12125457, 11328639, 10754134, 10214680, 9796858, 9423108, 9157528, 8828216]
4030H828216k85553k63260k91505k35911k12704j73153r6053q6178r2026j24353
4020F967520j29136j55300j46461j41768j91777k25053j44196j19220j32716j04988
4010E476905r7101q1049l5721l7625n5178j8582M6767O319L8917L1532q3L2264
3998E307365M8738k7572o5639n0383l8723r0389q0139p9420k6495o4754l3999
3987D798590r165q3050m2507M3005J17161P3403P8208J05765R0049M2147L6562
3976E250168L734o0906m9010j8110j22366j01591n1483p9443q8105m3847J2422
3965D651463k7473j1419m6402j69220j23661j88054r6635j35758j72193j59739
3955C520909q3511o7691j53458j15012j24703p6367o2225q2622J3284k8023L9322
$$ y = [8828216, 8542663, 8279403, 7987898, 7751987, 7539283, 7366130, 7270077, 7183899, 7091873, 6967520, 6838384, 6683084, 6536623, 6394855, 6203078, 5978025, 5833829, 5714609, 5581893, 5476905, 5379804, 5298755, 5263034, 5225409, 5170231, 5151649, 5198416, 5204735, 5243652, 5275184, 5275101, 5307365, 5356103, 5328531, 5262892, 5212509, 5173786, 5083397, 5003258, 4923838, 4897343, 4832589, 4798590, 4789425, 4706375, 4663868, 4706873, 4824034, 4897437, 4975645, 5081410, 5171459, 5213606, 5250168, 5253902, 5192996, 5143986, 5125876, 5003510, 4901919, 4850436, 4770993, 4682888, 4639041, 4651463, 4623990, 4612571, 4566169, 4396949, 4273288, 4085234, 3988599, 3852841, 3680648, 3520909, 3437398, 3369707, 3216249, 3101237, 2976534, 2900167, 2837942, 2755320, 2768604, 2740581, 2779903]
3944B779903J4309l5492l5938K9139K455o2597J2277L8751O6993O9426Q1751K9780
3932B990757n8464p8033l4505l1636j09793j11906j16034j54771j07368l1723
3922B156524k6221M7994j05044p4952k8150k5477m3381l0219l2627J5344j9455
3911A834336j6622o3836o2689m8645j3750j9116k7144J3168n0817m1755l5704
3900A467426l9882j0284n6947k9192M4743j2982m3701M2228k1008j6959R263J0449
3888A343154K1448j4337P0595L071O1345j806J21817P4398L4247K8325J8270K5710
3876A786237j7608P9159j5446o723J8127M1563k2093K6864j064P1608J03638P7128
3864B141390L281P7648J30092R4863K05032J59248K02661J63881P0361K8842p8244
$$ y = [2779903, 2794212, 2758720, 2722782, 2751921, 2754376, 2691779, 2704056, 2742807, 2809800, 2879226, 2960977, 2990757, 2932293, 2854260, 2819755, 2788119, 2678326, 2566420, 2450386, 2295615, 2188247, 2156524, 2130303, 2178297, 2073253, 1998301, 1970151, 1944674, 1901293, 1871074, 1838447, 1853791, 1834336, 1817714, 1753878, 1691189, 1642544, 1628794, 1609678, 1582534, 1595702, 1544885, 1503130, 1467426, 1427544, 1417260, 1360313, 1331121, 1375864, 1362882, 1319181, 1361409, 1340401, 1323442, 1332705, 1343154, 1364602, 1350265, 1420860, 1423931, 1485276, 1483470, 1605287, 1679685, 1713932, 1742257, 1760527, 1786237, 1768629, 1847788, 1832342, 1825619, 1843746, 1885309, 1863216, 1890080, 1889016, 1960624, 2064262, 2141390, 2144671, 2222319, 2352411, 2447274, 2652306, 2811554, 3014215, 3178096, 3248457, 3277299, 3199055]
3853C199055r8452n6648m0002q283J15536J75099K43897K17899r0838j60968j17631
3842C378664j09604k38664l94272l00082j86013j09094j40971j29590r0051r8772
3832A581551k5689j2473j9856O865L35j7001j417p3423p6545l2829o130n9683
3820A263705j02782k3078N5686K6530O85j1786L5397K52l0932k3179Q410N1150
3808A250058Q600l8086L9857k7901K7185n9758j7894N5566L702j8866J227K5281
3796A248971M8860k4655P603O9934P5348K8814j9893M6596O6071K5523r703M197
3784A567666M1880K7536Q555M1319p7422n7247k1148j9902j180n3248q2319K4473
3772A398963J9584l1737p9912k2034l8842n3925r590n3244m4978m2774m1950p6275
$$ y = [3199055, 3100603, 3043955, 3003953, 2995670, 3111206, 3286305, 3530202, 3748101, 3657263, 3496295, 3378664, 3269060, 3030396, 2636124, 2336042, 2150029, 2040935, 1899964, 1770374, 1680323, 1581551, 1555862, 1543389, 1523533, 1530398, 1530733, 1513732, 1512315, 1438892, 1362347, 1329518, 1323388, 1263705, 1160923, 1137845, 1193531, 1220061, 1220746, 1208960, 1244357, 1244609, 1213677, 1190498, 1198908, 1250058, 1258658, 1220572, 1260429, 1232528, 1259713, 1199955, 1182061, 1237627, 1241329, 1222463, 1223690, 1248971, 1297831, 1273176, 1280779, 1350713, 1426061, 1454875, 1434982, 1481578, 1547649, 1573172, 1563469, 1567666, 1609546, 1637082, 1645637, 1686956, 1609534, 1552287, 1531139, 1511237, 1510057, 1456809, 1374490, 1398963, 1418547, 1386810, 1306898, 1284864, 1246022, 1192097, 1182507, 1129263, 1084285, 1041511, 999561, 923286]
3760I23286J3752j6978k3577j4457l0999j3526L406j5638k1680j0597j9466k3553
3748G49973p093O631K0193j2217k9588k0611m2257n2231m5907j5010j5207Q8733
3736F25409j555M1270j3632k9895m218m8246M6681k4095l5107r42k9879l619N734
3723E27906m9447l3465l483o013K6571j0885J987n247k5012K8997n1669j2440
3711C87800J0128R86Q916L5262j3821J778L459k6033N5838k7653j3221N613m3511
3698C85541n414K7098l8068m7871K7923m4846p911L6868p2107L2177L9828K29
3686C33447n0929O934O4672m2791l0239K8424k151N6333k5635o0884L5952J3132
3674C26265K3415J1386k2708o0963j7600N4042M633j2946j6545K1273k1621O05
$$ y = [923286, 937038, 920060, 896483, 882026, 851027, 837501, 840907, 825269, 803589, 792992, 773526, 749973, 742880, 749511, 769704, 757487, 727899, 707288, 665031, 612800, 566893, 551883, 536676, 625409, 623854, 665124, 651492, 621597, 617379, 569133, 615814, 591719, 556612, 555670, 525791, 522172, 527906, 478459, 444994, 441511, 435498, 462069, 451184, 453171, 447924, 422912, 451909, 400240, 387800, 397928, 398914, 407830, 443092, 429271, 431049, 434508, 408475, 464313, 436660, 423439, 429052, 385541, 380127, 407225, 369157, 321286, 349209, 304363, 296452, 333320, 261213, 293390, 333218, 333447, 282518, 289452, 354124, 311333, 281094, 309518, 307367, 363700, 338065, 277181, 313133, 326265, 349680, 361066, 338358, 277395, 259795, 313837, 318470, 305524, 288979, 310252, 288631, 289236]
3662B89236M2724l2636j3847k9522l01J9893j1822M8220j3743j7906l962M142
3650B80476L3868K3665J7026j8233j1931M5656M78m1551l011j0190K1594J8460
3638C56307k0206M161K6739L7556K1071R708p3021R949j6447j1466k2395j6285
3626C05671M1315m4678J699M9762l3593n6527k1695M5561L3708j8368R3178M183
3614D00216l2893j2160k7340J9084R405k2258M866o647k6144M601L4770K67k3666
3601C22101J633K3938J0496K9886q972k9493N0684m3287j0267n6141n3796K3662
3589B60444L1972k417m5439M1132m271N4652k4723j7453j7833J9629N2861k0869
3577C27685K107N057p9923j4029L5388K3558k0964P110N409Q41l5124Q952J7026
$$ y = [289236, 331960, 299324, 285477, 255955, 255654, 275547, 263725, 311945, 298202, 280296, 276334, 280476, 314344, 338009, 355035, 336802, 324871, 370527, 371005, 329454, 326443, 316253, 337847, 356307, 336101, 340262, 367001, 404557, 425628, 435336, 362315, 372264, 355817, 344351, 321956, 305671, 346986, 302308, 304007, 353769, 320176, 263649, 241954, 287515, 321223, 302855, 396033, 400216, 367323, 355163, 327823, 346907, 356312, 334054, 338920, 332273, 306129, 310730, 345500, 345767, 322101, 323734, 347672, 358168, 388054, 379082, 349589, 400273, 356986, 346719, 290578, 236782, 260444, 292416, 289999, 244560, 285692, 281421, 336073, 311350, 293897, 276064, 295693, 348554, 327685, 329792, 334849, 254926, 240897, 276285, 299843, 278879, 285989, 291398, 292239, 257115, 266067, 283093]
3564B83093j7032O025J2549k6394m406j3152j3163N1719j0692m481k7368P231
3552B43929L2279k6834n7306r909M9991j5874R865m3906j9282J9998L6007L0307
3540B49265l6391N1994j8529j3424J3525R355k3299K3014m395J9238p329j7949
3528B45075L1353k0626L560o3706j8424K5978k1599K7309j6893J4148J9906p665
3516B18416M0746O060J3849k5066l9353k8767O0928K5883l7265k2150j4663L3092
3504B31710o2544J8118Q693j3422L5728J0337j7724o983r605r230M3130R146j6724
3491B20630j7928l0366n974o683m680K6397J1072J2943k7039J9665k4457k8826
3479A44754K819L5867l8999j7465p569o557m824L197p59N96O749N6322M2118k3241
$$ y = [283093, 266061, 272086, 284635, 258241, 253835, 240683, 227520, 279239, 268547, 264066, 236698, 243929, 276208, 249374, 192068, 182159, 232150, 216276, 226141, 182235, 162953, 182951, 218958, 249265, 212874, 264868, 246339, 232915, 246440, 255795, 232496, 255510, 251115, 270353, 263024, 245075, 276428, 255802, 259362, 195656, 177232, 203210, 181611, 208920, 192027, 206175, 226081, 218416, 259162, 265222, 279071, 254005, 214652, 185885, 246813, 272696, 235431, 213281, 198618, 231710, 169166, 187284, 195977, 182555, 218283, 228620, 210896, 203913, 194308, 185078, 228208, 237354, 220630, 202702, 172336, 166362, 159679, 154999, 181396, 192468, 205411, 178372, 198037, 173580, 144754, 147573, 183440, 144441, 126976, 119407, 112850, 108026, 111223, 110464, 111060, 117809, 174131, 216249, 193008]
3465A93008j5889j6041O7927l358l3455l5394n137P11K8821j9507O4320k6610
3453A99396k5425J1440k8446p344q184J8725r843k0354M818M114L420M4732q031
3440A79018n0684r450J0517l266j5836P3477K0008l1765M3949L7028j5557j9420
3428B18019k4027k5994J2683O205n4499m6115K9689L562p11L4307J9656k9728
3416A43047j0902J5807q037O350n0377k1085P2221j1986J5825K4261L0365K7635
3404B33124K0253j0313j1076L1516j3423l4367k3977k2690j0684K6088K1817r62
3392B05306l3421M9211K6129L566l4999K9067l3402m0023j325J449J0353M4255
3380B26166j7940l6860J5135K7984k8427k3951L575k8032k3136O6210J0142p76
$$ y = [193008, 177119, 161078, 229005, 225647, 192192, 156798, 151661, 152372, 181193, 161686, 226006, 199396, 173971, 185411, 156965, 149621, 141437, 160162, 150319, 129965, 134783, 138897, 142317, 187049, 179018, 128334, 118884, 129401, 126135, 110299, 183776, 203784, 172019, 215968, 252996, 237439, 218019, 193992, 167998, 180681, 186886, 132387, 86272, 115961, 119523, 118812, 153119, 172775, 143047, 132145, 147952, 139915, 146265, 95888, 74803, 147024, 135038, 150863, 175124, 205489, 233124, 253377, 243064, 231988, 263504, 250081, 215714, 191737, 169047, 158363, 184451, 206268, 205306, 171885, 221096, 247225, 250791, 215792, 244859, 211457, 171434, 170109, 171558, 181911, 226166, 208226, 171366, 186501, 214485, 186058, 162107, 165682, 137650, 114514, 180724, 190866, 190090]
3368A90090n603j0210L6125J0816j6724k8612N3527q3048L3233l4111k0537N3364
3356A78310J7248l6463O56r575L8713L7649l1746L3283k2119l441k9197M3735
3344B17053L3946l8779m0955o0032J6719K5380k4430j5070R8275N8187J1269p5959
3332B05604N980o969J3670J0945k7670L8327M044n9147M5252j4688j8082P6795
3320B74061R487m0603Q1771L919l6782J4790P941M4298J7311L8027O040q78l6185
3307C83197K3313P989l121O704r81J9797q991L833r749R155K5726O239p985j1068
3293D44058K3662M304K2064K9250L8185q224j0577q173K2942O2173J5959j9699
3281F15924O7828O4778O946q427p605k204J3267N3901M1102n1967l9230N542L6673
$$ y = [190090, 184487, 174277, 210402, 221218, 204494, 175882, 229409, 146361, 179594, 145483, 124946, 178310, 195558, 159095, 159751, 150176, 188889, 226538, 194792, 228075, 205956, 202515, 173318, 217053, 250999, 212220, 171265, 111233, 127952, 153332, 128902, 113832, 212107, 270294, 281563, 205604, 211584, 204615, 218285, 229230, 201560, 239887, 243931, 184784, 230036, 215348, 197266, 274061, 283548, 242945, 324716, 328635, 291853, 306643, 314584, 358882, 376193, 414220, 420260, 419382, 383197, 406510, 414499, 411378, 418082, 417101, 436898, 427907, 431740, 421991, 431146, 456872, 463111, 455126, 444058, 467720, 472024, 494088, 523338, 561523, 553299, 542722, 534549, 557491, 619664, 635623, 615924, 683752, 748530, 755476, 747049, 739444, 737240, 750507, 804408, 845510, 793543, 754313, 759855, 796528]
3268G96528O0510j5429J8821k65k8569N2873L546k021J6126K0364l9543k0933
3256H62008l8071m500K7269j6251m6949m6111l4756O0397J4241m9444L0098j6964
3244G40967M423L6985K924P725m0968k7J0327l2734J7783N6614K9364j7724k857
3231H12802k3147K4493k341q3376n6486J1016q035N7768j5433L7998N4369M8003
3219H57631K5536N5614P7633O1135J22169J36123J95720K06081R6233q8963q1470
3208A663442n7710k092j59250j95673j40833j13994o2822q4090j9336P8475J5108
3197I21225o9468l2865O9314n466N1628R5227J7430N1253L6986Q7196J55284J07812
3185A485556J36359J48965J85882L31708L23827K82961Q1385q5827j66281r3595
$$ y = [796528, 857038, 841609, 860430, 860165, 831596, 884469, 888015, 885994, 902120, 922484, 882941, 862008, 823937, 819437, 846706, 830455, 783506, 737395, 702639, 763036, 777277, 727833, 757931, 740967, 745390, 782375, 785299, 793024, 752056, 752029, 762356, 729622, 747405, 804019, 833383, 815659, 812802, 789655, 814148, 811807, 728431, 671945, 682961, 674926, 732694, 717261, 755259, 809628, 857631, 883167, 938781, 1016414, 1077549, 1199718, 1335841, 1531561, 1737642, 1833875, 1744912, 1663442, 1605732, 1603640, 1444390, 1248717, 1107884, 993890, 931068, 846978, 827642, 906117, 921225, 851757, 818892, 888206, 882740, 934368, 1029595, 1047025, 1098278, 1135264, 1222460, 1377744, 1485556, 1621915, 1770880, 1956762, 2288470, 2612297, 2895258, 2976643, 2890816, 2724535, 2630940]
3175B630940j25605l82301l98699k29329j57310j52862j46601o3431q2952k5966
3165H65884k850n450q056k9687J6409M1003k7433m3309J0173L7991Q1846j4706
3153I21815Q7029M1447J61324J06166J60461J54750k9989o3855j47028J1070r7052
3142A306138j88689k15662j23574j11041n7224j7941r0596l6306M849n0665m2697
3131C76592L7182k3714k6576N486M9406k4499m6425m6431R751j1115l3217P548
3119B73988r475j2639j686L411k2695K5312K4466r654l2066q95l4432J4182j9182
3106A98635o499j2420l16L3068l8350N112j3145k852J2554l5114k819K2030k7282
3093A32602L2564j4860n083K5332j6228l6935l1237k0525J619N2264j1868k6207
$$ y = [2630940, 2505335, 2123034, 1724335, 1495006, 1337696, 1184834, 1038233, 974802, 891850, 865884, 863034, 857584, 849528, 819841, 836250, 877253, 849820, 806511, 816684, 854675, 936521, 921815, 1008844, 1050291, 1211615, 1317781, 1478242, 1632992, 1603003, 1539148, 1392120, 1403190, 1306138, 1117449, 901787, 778213, 667172, 609948, 592007, 501411, 465105, 469954, 419289, 376592, 413774, 390060, 363484, 368970, 418376, 393877, 347452, 301021, 310772, 299657, 266440, 273988, 264513, 251874, 250188, 253599, 230904, 256216, 280682, 271028, 238962, 238067, 203635, 217817, 198635, 192136, 179716, 179400, 212468, 174118, 179230, 166085, 163233, 175787, 140673, 137854, 159884, 132602, 165166, 150306, 145223, 170555, 154327, 117392, 86155, 65630, 67249, 119513, 107645, 81438]
3081H1438j1027P948J1081K5607k1525j2166R399J8805K2075l857m3068J6457
3069A01167M5946j9569n4815j3697K3231k959m2767N6458j6323n2106L8751O8156
3057A31473N415n3444K580M96m167J5475j0773M741k9908K951K7537l6362N5221
3044A11235l1971o7018L5139K7761o701j780L7219k6995p71M4817M8022R80m5508
3031A24429l0754R933Q926P454j2347K9661j4291n3438K0786J6126j3229k5156
3019F8100K0586o2331o6L3336K0376j9042k1345k439K9909j2557l0196k2099j147
3006A085J4115J4769K6415j4551L4036L8715m4586J3456n2310k9987J142K4036
2994B6335M2793K4261k4118K911K4560j0068j4596J0501R362P82k2668J0688L9207
$$ y = [81438, 70411, 78359, 89440, 115047, 93522, 81356, 90755, 109560, 131635, 127778, 84710, 101167, 147113, 127544, 72729, 59032, 82263, 79304, 36537, 92995, 76672, 24566, 63317, 131473, 136888, 83444, 86024, 86520, 82353, 97828, 87055, 91796, 61888, 64839, 92376, 56014, 111235, 79264, 12246, 47385, 75146, 68445, 66665, 103884, 76889, 76118, 120935, 168957, 169937, 124429, 93675, 103608, 112534, 119988, 107641, 137302, 123011, 69573, 90359, 106485, 93256, 68100, 88686, 26355, 26289, 59625, 80001, 60959, 39614, 37175, 67084, 54527, 24331, 2232, 1085, 15200, 29969, 56384, 41833, 75869, 114584, 69998, 83454, 31144, 1157, 2299, 26335, 69128, 93389, 69271, 72182, 96742, 86674, 72078, 82579, 91941, 92723, 70055, 80743, 119950]
2981A19950k2171j4609P079Q140m6995k6375j6934L1291k757N2079L2047p0546
2969E0199P510K0312J1757l3856R930J8609m797J7337k7211L2433k156l2772K6322
2956I3617P774q28L1323j1567j4206M6935M073J3757L737k296j5957J450J17K6400
2942A84329k9115l06J8999n8056J9586K7146J4812j0777k525l3987O747j5659
2930A21194M4776K8122M169l3156L2340L7669k5080N5909K585k8991k4842P4901
2918B89596N764o5205L2349k4285J1657l884o451l4866k4958J9225k3686j7948
2906A57308q72j9738k555p660K1970M6262M6192p0309l1970j7128k636K7163o685
2893A39342J8100m016l230j0800L861l9575O1906l0393p2454N0150J7548j3909
$$ y = [119950, 97779, 83170, 90249, 98389, 51394, 25019, 8085, 39376, 36619, 88698, 120745, 50199, 57709, 78021, 89778, 55922, 65852, 84461, 79664, 97001, 69790, 102223, 100067, 67295, 93617, 101391, 100563, 131886, 120319, 106113, 153048, 157121, 170878, 174615, 172319, 156362, 157812, 157929, 184329, 155214, 154908, 173907, 115851, 135437, 162583, 177395, 166618, 164093, 130106, 136853, 121194, 165970, 194092, 198261, 165105, 197445, 235114, 210034, 265943, 268528, 239537, 214695, 289596, 295360, 230155, 262504, 238219, 249876, 245992, 239541, 204675, 179717, 198942, 175256, 157308, 156436, 136698, 134143, 126483, 148453, 194715, 240907, 170598, 138628, 121500, 118864, 146027, 139342, 157442, 153426, 150196, 139396, 143257, 103682, 165588, 135195, 62741, 112891, 130439, 116530]
2881A16530k8385M7665l8309m6620Q6451j4004l0362k3719k4135K2197K5982j0725
2869H2566J7865k9781j4035J8126q443M1L0304m3094L1711L2554o533n2222J2713
2856G1772K825l656o744J3690J8676n3078K4909M7430o181k6794j198k0707M207
2843F5151m7811k2287M4405K4631N61K9666j5060m4952K3042j9249m3513M4346
2831C8930j0868l0270L8457J4620k1043L0126k9777l6571l0162Q927N4100N7519
2819H3988j3120o8965L649K9138r159M198P843k1802m5649J4298L6960K8528J9112
2806F9019m9888K4215k0803J1912J0584l3339K3813N0436o830l9250l0213l6139
2794b6483K8511J8662l8293r725L0601k284j9656l6864P051L084L1194L7956J9735
$$ y = [116530, 88145, 135810, 97501, 50881, 137332, 123328, 92966, 69247, 45112, 67309, 93291, 82566, 100431, 70650, 56615, 74741, 66298, 66339, 96643, 53549, 85260, 117814, 111281, 59059, 71772, 74597, 70941, 64197, 77887, 96563, 43485, 68394, 115824, 109643, 82849, 81651, 60944, 65151, 17340, -4947, 39458, 64089, 64650, 94316, 79256, 34304, 57346, 38097, -5416, 38930, 28062, -2208, 36249, 50869, 29826, 59952, 30175, -6396, -36558, -27631, 26469, 83988, 70868, 1903, 5552, 34690, 25531, 29729, 37572, 15770, -29879, -15581, 21379, 49907, 69019, 19131, 43346, 22543, 34455, 45039, 11700, 35513, 85949, 79119, 39869, 9656, -26483, 2028, 20690, -17603, -27328, 3273, 989, -18667, -55531, -48480, -45396, -14202, 23754, 43489]
2781D3489l0042K407p232k967k5198j0049J3415l3583L4948N0156k1488l9484
2769b5628p236j1593j6762L0481J1168j58o255j8762L7011K365k4840J6765K2130
2756H686l2726p621q698j6992L3095L9501l5379l2634K7560J392m602l86M0568
2743A1764O7016l7734l8795j3229J2168L753P709l7014K5431K9428l0714K4443
2731B4226K4985l2808m9408L9354q503j2690j3186K7286K71K6722M924n8696K151
2718b5372K3805n802j2987r208o710M7445J7734j955N0004j6438p797m143l9673
2705H903j3714N3804P493m8780J9299k4650k4851l2544M1487j814k0786o88K9750
2692g091M3967K6704k3667j0692j0695n2095R454k167j8182J8210J6576l2075
$$ y = [43489, 13447, 15854, 8622, 5655, -19543, -29592, -16177, -49760, -14812, 35344, 13856, -25628, -32864, -44457, -61219, -30738, -19570, -19728, -25983, -44745, -7734, -5369, -30209, -13444, 8686, -24040, -31661, -40359, -57351, -24256, 15245, -20134, -52768, -25208, -23816, -28418, -28804, 11764, 78780, 41046, 2251, -10978, 1190, 4943, 12652, -24362, 1069, 30497, -217, 24226, 49211, 16403, -33005, 6349, -2154, -14844, -28030, -744, -473, 26249, 31173, -27523, -25372, -1567, -7369, -20356, -29564, -36274, 11171, 28905, 26950, 76954, 60516, 52719, 48576, 8903, -4811, 48993, 56486, 7706, 27005, 2355, -22496, -55040, -13553, -15367, -36153, -36841, -7091, 36876, 63580, 39913, 29221, 18526, -33569, -24115, -26282, -44464, -26254, -9678, -41753]
2680d1753Q487j3966j3168M2652r137M7431k3347M5623j3819k542J9117l1462
2668A4116k86j2096k2919j300K8457o9774J0550M7045j5989M1064k0389j4125
2656a5646l4875j7007N2533P570j7263K8931J3129k9856L0997k194j1333j6138
2644a1152k2866p11k5617n4388N870l585K8455M2078n1481K2701N6174l9070J0344
2631d3248l332O555k6329k625J7190l969M0601J8364m9654Q450m0662L4660N1408
2618G409K0232j1898j6165J7713l0872M5636k2938J9537j6063l7990k7844J227
2606e2016P8774l240m2749j0574P9261n1267j0282j4802k0162L0886j740L3110
2594A5199L2464m5267o745N304K7857K30l3689j4931k9987L1857L519r980j8862
$$ y = [-41753, -33266, -47232, -60400, -17748, -26885, 20546, -2801, 42822, 29003, 26461, 45578, 14116, 13830, 1734, -21185, -22485, 5972, -63802, -53252, -6207, -22196, 18868, -1521, -15646, -50521, -67528, -14995, -7425, -24688, 4243, 17372, -12484, 18513, 16319, 4986, -11152, -34018, -34729, -60346, -114734, -108864, -112449, -83994, -41916, -93397, -70696, -14522, -53592, -43248, -46580, -40025, -66354, -68979, -51789, -55758, -15157, 3207, -46447, -37997, -78659, -43999, 7409, 27641, 15743, -422, 17291, -13581, 32055, 9117, 28654, 12591, -25399, -53243, -52016, 26758, 23518, -19231, -29805, 49456, -1811, -12093, -26895, -47057, -16171, -17911, 15199, 47663, 2396, -4349, 955, 28812, 29042, -4647, -19578, -49565, -17708, -14189, -24169, -43031]
2581d3031K106L925J6107M617J2903J9357J0523m1770l5403J2963J8302l4600
2569e4001k4024Q1315K8177m554J9167L099l1431J1095Q085m7000n654n4492L3361
2556c6857Q0863J4280n4758k1392K3683L5992p6297n2517Q445L523j8732K2904
2544g0863N3907m9230N2932K1634k8428O133K3917l6317J4628k5816K5736P43
2532a1024k7684N7454k2130j2684r121P591P3674K4076r090J6805m7526m0403
2520f2j401M7041J7049o4449j0232n650j4401J4948K3840l0080j4407k8380L1855
2507c4329q974L3717L8857n1522L3056n7299m687L3375R783k9303L8855P3189
2495G4718n0549j05789O65L6420J5547K0444k9917j039L521j8319M5795K9924
$$ y = [-43031, -40925, -37000, -20893, -16276, -3373, 15984, 26507, -15263, -50666, -37703, -19401, -54001, -78025, 3290, 31467, 26913, 46080, 49179, 17748, 28843, 36928, -10072, -15726, -70218, -36857, 44006, 58286, 3528, -17864, 5819, 41811, -34486, -87003, -78558, -75035, -93767, -70863, -16956, -66186, -13254, 8380, -20048, -13915, 10002, -26315, -11687, -37503, -11767, -11024, -38708, 18746, -3384, -16068, -25189, -17598, 56076, 80152, 71062, 87867, 40341, -62, -1463, 45578, 62627, -1822, -12054, -17704, -32105, -17157, 6683, -23397, -37804, -66184, -34329, -43303, -9586, 29271, -22251, 10805, -46494, -51181, -17806, -8023, -37326, 1529, 74718, 24169, -81620, -80955, -44535, -28988, -8544, -38461, -39500, -35979, -54298, -8503, 21421]
2483B1421o928l8517M7633K5242o0855J2534o6236K1776P4275o9384N267M9421
2471A5649j0428j424j9722N3091J6802j5525m0393L285J6025o0602M1046n388
2459g584k6548j8163M6499l631k1700J1598j2048R821L9983o4118K1501j4220
2447c8610m780m1437M1048K4943n3674M2659j5757L3107M4498m0419M076M5407
2435D1061k1855o6195K4587J0648k4889L0232l0103k2097N6551o337j5301l5274
2423e8972l063M2047k0483K1092l0745j6782M1238j921m2052Q1025L9422m1357
2411I449J939j527j0005K8885k9438J0340k675K1457M125k3036K2405o0853k0479
2398d9413P7752o34j6989K7451J00j4990K6658k5800J0291L4616Q3337o443k4606
$$ y = [21421, 14493, -24024, 23609, 48851, -12004, 530, -65706, -43930, 30345, -39039, -33772, 15649, 5221, 3797, -15925, 37166, 53968, 38443, -1950, 1335, 17360, -43242, -2196, -7584, -34132, -52295, -5796, -9427, -31127, -19529, -31577, -21756, 18227, -45891, -24390, -38610, -43390, -84827, -43779, -18836, -72510, -29851, -45608, -12501, 31997, -8422, -4346, 41061, 19206, -46989, -22402, -11754, -36643, -6411, -36514, -58611, -2060, -8397, -23698, -58972, -62035, -19988, -40471, -19379, -50124, -66906, -25668, -27589, -69641, 11384, 50806, 9449, 11388, 9861, -144, 28741, -697, 9643, 6968, 28425, 32550, 9514, 31919, -28934, -49413, 28339, 27705, 10716, 38167, 38267, 23277, 49935, 24135, 34426, 69042, 152379, 145936, 121330]
2385A21330k2921m8464L826N320n680L3675J766j2472j4762l9981k6359K2969
2373A8247L460j547N2862j6514K0517q81m1500m0127K0545M1141n6600j1041J6715
2360E277j3498p482J5788j5722K252J9038O761M3367n9858l6660K4056L1630j8027
2347c078J9879j858j8710J0207j6974K2721J2988k1267n9949N9326l543K9512
2335B9254J58o3345N459k5899j3066L419P970K1980K9606J9230m9816K7294K2239
2322A4483J5111J9905L5826L6428n6183M315k8914m7387m366M354j6387J3597
2310i218M5067l8909L4639J9008n9052j3211N5445j8167j7884K4974k04J1950
2298C4438j1887m9319M5401N9271k3579l7077K4171K2042l0665J0469j2359Q172
$$ y = [121330, 98409, 49945, 53771, 59091, 53411, 87086, 88852, 76380, 61618, 21637, -4722, 18247, 21707, 20160, 73022, 56508, 77025, 76144, 34644, -5483, 15062, 56203, -397, -11438, 5277, -8221, -15703, 85, -15637, -13385, 5653, 12414, 55781, -4077, -40737, -16681, 14949, -3078, 16801, 14943, -3767, 6440, -10534, 12187, 25175, 3908, -56041, 3285, -258, 29254, 29412, -33933, -28474, -54373, -67439, -64020, -56050, -34070, -4464, 14766, -35050, -7756, 14483, 29594, 49499, 85325, 121753, 65570, 69885, 40971, -6416, -10782, -6428, -22815, -9218, 35849, -3060, 31579, 50587, -8465, -21676, 33769, 15602, -2282, 22692, 22488, 34438, 22551, -26768, 18633, 77904, 54325, 17248, 41419, 63461, 32796, 43265, 30906, 39078]
2286C9078l2468N3626K1517j5221n233r934k6840L3392L5424j2702j5045Q696
2274G4290j6765J6553j2463N223K836J0339k6172l5721N595J4741O157K0196n0546
2261A4263j2867K814J0562p454L3202N6145K9381n9702j3960K4573R80J5852M935
2248I8724n53K3801o5995j2740J6728j1936L3838l3778J5452L7312J4880K7073
2236A42806K3083o782q362J4571P967n4950j2109N6410L0256l7877n2494N4144
2224A56663n810k8537M4036J3571q302j8615M558K6962K2375J278J7882J6704
2212B42765k1070L4455O9838k7685K6387j0459K5550J4882o439j7034N7269M3317
2200D31776K4268j7601n0189K0769k5581o2812K6091K9515J0121j3445P6056L2467
$$ y = [39078, 6610, 60236, 81753, 66532, 61299, 51365, 24525, 57917, 93341, 80639, 65594, 74290, 57525, 74078, 61615, 66838, 69674, 80013, 53841, 18120, 23715, 38456, 44613, 64809, 14263, 1396, 4210, 14772, 7318, 40520, 96665, 126046, 66344, 52384, 76957, 77937, 93789, 98724, 98171, 121972, 55977, 43237, 59965, 48029, 81867, 48089, 63541, 100853, 115733, 142806, 165889, 159107, 150745, 165316, 173283, 118333, 106224, 162634, 192890, 155013, 102519, 156663, 150853, 122316, 166352, 179923, 171621, 153006, 157564, 184526, 206901, 208179, 226061, 242765, 221695, 256150, 325988, 298303, 324690, 314231, 339781, 354663, 348224, 331190, 388459, 431776, 456044, 438443, 388254, 409023, 383442, 320630, 346721, 376236, 386357, 372912, 448968, 481435]
2188D81435l0052K382P4486n259j4688R122k175K0686L7455M086o0073L3711J1209
2175E62325J0267M1437K8500j3557K2569P7677l9498o5609M0839O0539k7768M496
2163G02217M766k224M5373O2761O3462K4340O2685O171P5152R4467P342R7793
2151A244305R2177P3191P3096J02026M5672Q9544J49149J44756R0848J27729P2728
2140B305221J13367J60276J51258J60368K43807K64511K67491L07219L73256L99859
2130D746633M64400M68378N36946O96568R75650R98879J177946J375627J625316
2121A3066343K230063L006368L168541K480349P03179j531787l526825m681013
2113A4915218l385866k302194j635371j215520q36358o34706n10324l34383k05625
$$ y = [481435, 451383, 453765, 528251, 522992, 508304, 517426, 515251, 535937, 573392, 577478, 517405, 551116, 562325, 572592, 614029, 642529, 628972, 651541, 729218, 689720, 624111, 664950, 725489, 697721, 702217, 706983, 704759, 750132, 812893, 876355, 900695, 963380, 969551, 1044703, 1139170, 1146512, 1244305, 1336482, 1409673, 1482769, 1584795, 1630467, 1720011, 1869160, 2013916, 2104764, 2232493, 2305221, 2418588, 2578864, 2730122, 2890490, 3134297, 3398808, 3666299, 3973518, 4346774, 4746633, 5211033, 5679411, 6216357, 6912925, 7888575, 8887454, 10065400, 11441027, 13066343, 15296406, 18302774, 21471315, 23951664, 24654843, 23123056, 19596231, 14915218, 11529352, 9227158, 7591787, 6376267, 5539909, 4905203, 4394879, 4060496, 3854871]
2104C854871k01065j36027j57402k16253k29209k32166k57297j13177j31374j53048
2094B027853r8302j21373k5266p6851n4997q5409q2176m0562o908l0326j01317
2083A304366p8300m9069n0480l4309k1676m7249k1164l2323p4598J2599K1708
2072I29505m7987n2860m1854p8665j7853o5K685k4597k0649l5735M111k8518k9735
2059E57783k5634q8378N372M0742O95m5417j2104K7973J5466m5779p611K2278
2047D45386n5985K0595j3501l755L7509o0568k3833N577P322j6854p479q6703
2035B47711k538L242j6422K5069k4298l9314L3136L7923m6687M0003M4279K35
2023C02339j4668l6538l2234k0816K8058L4894j1939o379J3228k2107j6894k2106
$$ y = [3854871, 3653806, 3517779, 3360377, 3144124, 2914915, 2682749, 2425452, 2312275, 2180901, 2027853, 1929551, 1808178, 1782912, 1706061, 1651064, 1565655, 1483479, 1442917, 1436009, 1405683, 1304366, 1226066, 1176997, 1126517, 1092208, 1070532, 1023283, 1002119, 969796, 895198, 907797, 929505, 881518, 828658, 786804, 708139, 690286, 690221, 692906, 668309, 647660, 611925, 616036, 587518, 557783, 532149, 443771, 449143, 489885, 490580, 445163, 433059, 461032, 476498, 430719, 423108, 445386, 389401, 409996, 396495, 392740, 430249, 369681, 345848, 351425, 358747, 341893, 334414, 247711, 245173, 248415, 231993, 257062, 232764, 193450, 226586, 264509, 217822, 257825, 302104, 302339, 287671, 251133, 218899, 198083, 226141, 261035, 249096, 242717, 255945, 233838, 216944, 194838]
2011A94838l1712J1312k673J1691M0251J9868n8578l2065o7001K3040j9592N1543
1999A40922k8908l8514K9317j2985N6727N025l4382m4843M172K0004m7423J873
1987E0985O175j8484M4003O1830k211m7572k5655j1855n626J4332J7350K9172
1975A12444j0124Q00k22K9530J9939o674k6913j8612l3989k3341J9952l455M898
1962F4233M2059O8774m5599n0428k6396k15L1798J3012l949q696j1711O270N9853
1949A39005N893l7703m3190k9150L0135o1762K8058j8910M394l9905m400N9142
1937C1607m181p309j3025o266L1280j1459m1346J5876M7628N0683N041m1200m5453
1924A1876P388k2681Q0052k3473j4210L2467l092k890j3920n772L7895l0246k9033
$$ y = [194838, 163126, 174438, 171765, 183456, 223707, 243575, 184997, 152932, 85931, 108971, 89379, 140922, 112014, 73500, 102817, 89832, 146559, 151584, 117202, 72359, 76531, 96535, 49112, 50985, 57160, 38676, 82679, 144509, 142298, 94726, 69071, 57216, 51590, 65922, 83272, 112444, 102320, 103120, 102898, 132428, 152367, 145693, 118780, 100168, 66179, 42838, 62790, 59335, 64233, 106292, 175066, 129467, 79039, 52643, 52428, 84226, 97238, 93289, 84593, 72882, 79152, 139005, 144898, 107195, 64005, 34855, 64990, 3228, 31286, 12376, 16770, -23135, -27535, 31607, 27426, 20117, 7092, 826, 32106, 20647, -20699, -4823, 42805, 93488, 98529, 57329, 11876, 19264, -3417, 76635, 53162, 38952, 71419, 68327, 65437, 51517, 45745, 83640, 53394, 24361]
1911B4361M4413K2957K1113m5277m5919M9766j3089N739L9605k1263J7440l2752
1899F7094J297j8945k8708K4056j7756K7941K3633j5373m6137l3962l611K2663
1887B192k133j9628K6429Q3j299K0926J6580o8432k6181K7537M3864J751j7940
1874C749K6627l968k0557l53K8574j4437Q827n800j3608j6226l428M8389J2149
1861D9938J3621L5414k2993k1933l0262K3722j0737J1618O3585n6582j0667k9794
1849A4930Q3692L2731J1227k8940k278m2849J0993P3716l6008l7407Q806K464
1837I1077j754r685l6979k9204J1417K9259L0002m1952J881j7320n6391K451J3273
1824a3925O6440l7104j416N3382L9359l2039k9813j4665o6817l0346Q5806j4810
$$ y = [24361, 68774, 91731, 112844, 67567, 21648, 71414, 58325, 64064, 103669, 82406, 99846, 67094, 68391, 49446, 20738, 44794, 27038, 54979, 78612, 63239, 17102, -16860, -20471, 2192, 59, -19569, 6860, 6943, 5644, 26570, 43150, -25282, -51463, -23926, 19938, 21689, 3749, 30376, 26408, 5851, 5498, 34072, 19635, 28462, 22662, 9054, -7172, -10600, 37789, 49938, 63559, 98973, 75980, 54047, 23785, 47507, 36770, 48388, 111973, 55391, 44724, 14930, 98622, 131353, 142580, 113640, 111362, 68513, 79506, 153222, 117214, 79807, 88613, 91077, 89323, 79638, 42659, 13455, 24872, 54131, 84133, 42181, 44062, 26742, -29649, -27198, -13925, 52515, 15411, 13995, 67377, 106736, 74697, 44884, 30219, -36598, -66944, 18862, 4052]
1812D052j3331K2986K4202j3893l3890L028j4359K8136m110J4462j894j2329K6603
1799B9663K6052k699p3909J5727K1244k2032J3635J7262L8077j2491n9160J3536
1787D905K0363J9244l8149J2554K8228j05477L1866Q0132k8561n4306J5324R605
1775d272J5795O6770l0972l0417R358p443l275J7146j0728k6997j3216j7188K6956
1762h483L2537j3324K0058k6461L4931q36n8655k6227Q348K9867J6802l7160n0511
1749g9114P3472K3889m8198m2713M9065r29j3783N2092L0389l7984l5116m337
1737c3267m125K0237k4711K2901L0998l1525n749K2034j3388M6484P546k1406
1725A6029j7040o366l0917M1528L9648k1364n4682Q7J3070j839L3897o072n51
$$ y = [4052, -9279, 13707, 37909, 24016, -9874, -6846, -21205, 6931, 2821, 17283, 15389, 3060, 29663, 55715, 53016, -20893, -5166, 16078, -5954, 7681, 24943, 63020, 50529, -8631, 4905, 25268, 44512, 6363, 18917, 47145, -58332, -26466, 53666, 25105, -29201, -13877, -4272, 11523, 78293, 47321, 16904, 26262, 18819, 15544, 32690, 21962, -5035, -18251, -35439, -8483, 24054, 10730, 30788, 4327, 39258, 38422, -20233, -46460, -38112, -8245, 8557, -28603, -79114, -5642, 18247, -29951, -72664, -23599, -24528, -38311, 13781, 44170, 6186, -28930, -33267, -37392, -17155, -41866, -18965, 12033, -19492, -25241, -3207, -16595, 29889, 37435, 16029, -1011, -7377, -38294, 3234, 42882, 21518, -33164, -33077, -20007, -21846, 12051, 5979, 5428]
1712E428q657k8474k196K2258q2976j9218R4558L5814n3197q504k4607R151J2363
1699d8257P580K5930J9551j7185M5316K5278l0756L357M477m1506j1009J4650
1687b574J4120n7343J8664K8918O7262l1037K075L5478j5347R859k7303n8070
1675a5298k2480K439L9853N0610K0327j3254j5653k5248J3968R237j9317J9971
1663D5155O571j0267m8210L6041L44J6637n0713K117k8041J6885N492m9242o490
1650f3721L1317K3202L7377j3208n6711k4345L7080j5390O96l213J1533J4057
1638b1326L9671m405r6662M4302J3913j1676J0087J4598J9730l297J1214j453
1626A4696n5091n9628N4407J2719j5884K6817O7405l5022J8046l2761k0599K0778
$$ y = [5428, -3229, -31703, -33899, -11641, -94617, -113835, -19277, 16537, -36660, -45164, -69771, -60620, -48257, -40677, -14747, 4804, -12381, 32935, 58213, 27457, 30814, 35291, -6215, -17224, -2574, 11546, -45797, -27133, 1785, 69047, 38010, 40085, 75563, 60216, 70075, 42772, -15298, -37778, -35339, 4514, 55124, 75451, 62197, 46544, 21296, 35264, 44501, 25184, 45155, 51726, 41459, -6751, 29290, 29634, 46271, -4442, -2325, -30366, -13481, -7989, -57231, -63721, -32404, -9202, 28175, 14967, -41744, -66089, -29009, -44399, -43703, -46916, -35383, -21326, 18345, 13940, -82722, -38420, -24507, -36183, -26096, -11498, 8232, 4935, 16149, 14696, -40395, -100023, -45616, -32897, -48781, -21964, 45441, 10419, 28465, -4296, -24895, -4117]
1614d117J3699j0237k4075N1381m773k1099k5720J3839L4333l4309Q506N2312
1602D9740n2115l8638J3301L0943J364J4919k1011J3770j7724r864l523M786m1759
1589e5811K3938L6134L5638J0706m1291l9951j508L5719M3134l5351m4372l4101
1577f7116K2025J4114J1802J8019o432J7144l904m0049j0887P644L9089J6795
1565A8244l4711K627l6291J2413L2814J301m3220K5609n450J3977R785k3610K8142
1552A630k6203J2988k0576k3356L4964r819J2175j4760O34j244k2372M6023P449
1539b467l0239Q621k5206N088P3806l1081L370k7089j6126M2322M1205o1391L2219
1526A3032N3202j5736l9897l7377L2046n3268l9847M5598J4872K4769K4904R501
$$ y = [-4117, 9582, -655, -24730, 26651, 21878, 779, -24941, -11102, 23231, -11078, -2572, 49740, -2375, -41013, -27712, 3231, 4595, 19514, -1497, 12273, -5451, -15315, -18838, -14052, -55811, -31873, 4261, 39899, 50605, 9314, -30637, -32145, 3574, 46708, 11357, -33015, -67116, -45091, -30977, -19175, -1156, -7588, 9556, 5652, -34397, -45284, -37640, 1449, 18244, -16467, -13840, -50131, -37718, -4904, -3603, -46823, -21214, -26664, -12687, -2902, -26512, 1630, -24573, -11585, -32161, -55517, -20553, -30372, -18197, -32957, -32323, -33567, -55939, -9916, -2467, -32706, -24085, -49291, -44203, 29603, -1478, 1892, -25197, -41323, 999, 42204, -19187, 13032, 66234, 50498, 10601, -26776, 5270, -47998, -87845, -42247, -27375, -2606, 22298, 31799]
1514C1799l8698m9307P090M5261J05129k0862m8250k4032K4335k6756L5336N017
1502D6062o4315j2939j1325J9759N481L0735M1077p379L8601m8304J4133L2621
1490H4207m7476k6440K4038Q21n2929k2002k1040L546O461L5540r855j3317k015
1477d0461k1356L2650O0403m5162N024Q500l6264k532J8409O1190l0466k0366
1465a0431m0508K339L870M4645R109K571l707j8292J173N8914j0367m5834j5639
1452b2157J196m98P847j1303k9413M8632J7559L0270r587K885m2018N003J5649
1439A4065p1380j41J7659K7046M8461k1039N821l944l7075n5006k0645K3328K010
1426g0840N0987p099K7420J3386k3509K6445j2500N286l0784k9053K5040q684
$$ y = [31799, -6899, -56206, -49116, -3855, 101274, 80412, 32162, 8130, 32465, 5709, 41045, 46062, -18253, -31192, -42517, -22758, -17277, 13458, 54535, 47156, 85757, 37453, 51586, 84207, 36731, 10291, 34329, 35150, -17779, -39781, -60821, -57275, -50814, -15274, -25129, -38446, -40461, -61817, -29167, 31236, -13926, -8902, -402, -36666, -39198, -20789, 40401, 9935, -10431, -50939, -48600, -44730, -85, 9024, 11595, 7888, -10404, -9231, 49683, 39316, -6518, -22157, -20961, -21459, -13612, -24915, -54328, -5696, 11863, 42133, 32546, 35431, -6587, -1584, 14065, -57315, -57456, -39797, -12751, 35710, 14671, 20492, 16548, -20527, -75533, -96178, -72850, -70840, -19853, -26952, 468, 13854, -9655, 16790, 4290, 9576, -21208, -50261, -25221, -33905]
1414c3905m824M8735l4646K5821L2833m4629K3617N98N639J7031k1656k6773o275
1401a8434Q137n654l7701k4624P4358j9778J2596m1673Q689K2182p10q556j1958
1388d3126J5290j2204l6671P5855K0351P346K877p2814K5428J9224n377K950M7158
1375D6287K31k5303n871k4654k8622L2220K775j3284J7272o899P411j3534l6645
1362d8616J0603M3948j5221M1409k6833j7065K5195m8375M735L8199k211m8649
1350d2881K6769j0312J5659k5511r747L548O1811K4590n1212K464L7208o482N593
1337C1497J13j2577m7053M3119j9322q872K9309o127l1448K6425n8756p909N628
1324e5973k9043M2811m211J6391m1013K1628L1099K1473J5297Q356R505J8530
$$ y = [-33905, -38729, 10006, -24640, 1181, 34014, -10615, 13002, 13600, 19239, 36270, 14614, -12159, -18434, -10297, -15951, -53652, -78276, -3918, -23696, -11100, -52773, -44084, -21902, -22612, -31168, -43126, -27836, -40040, -76711, -856, 19495, 26841, 29718, -43096, -17668, 1556, -3821, -871, 46287, 46518, 21215, 15344, -9310, -37932, -5712, -2937, -16221, 1051, -5848, 1563, -11971, -48616, -38013, 5935, -9286, 32123, 5290, -11775, 13420, -34955, -30220, 7979, 5768, -42881, -16112, -26424, -10765, -36276, -46023, -42475, 19336, 43926, -7286, -4822, 32386, 25904, 31497, 31610, 19033, -28020, 15099, -4223, -13095, 16214, 10087, -21361, 5064, -53692, -61601, -55973, -85016, -42205, -46416, -30025, -71038, -49410, -18311, 3162, 18459, 26815, 36320, 54850]
1312E4850p9040l6722j4232N6377O4581m5682m6158K2882M937K5145M3416q916
1300D1438l9889q772k8662L2379J3875p562n687j680N7535k4039J2256M779k8362
1287A7609l0028M6395N206j5936n2227m186j2850J5999K4236k5405j8484J3126
1275c6545L738j0257J4580o499q729K1203j1700k3447K6526k645K1696l4451J1742
1262c4788j3716J7699M729L8066M080k2737k1807k7096K5916J1239m8491N4672
1250a2234m41j6620K74K2070l938J3168m9129R547M7616k3532M982p252K4425
1237H936k4656M24N5103n478K772K0722n4504N657n6407l2874P176N0652j2014
1224c4491n215M8016k8863l0830M672M0913K5635m1997J2564j8925j6336j3208
$$ y = [54850, -24190, -60912, -75144, -18767, 45814, 132, -46026, -23144, -18207, 6938, 50354, 41438, 1549, -7223, -35885, -3506, 10369, 2807, -2880, -4560, 52975, 28936, 41192, 45971, 17609, -12419, 33976, 39182, 23246, -28981, -33167, -46017, -30018, -5782, -31187, -49671, -36545, -32807, -43064, -28484, -34983, -43712, -22509, -34209, -57656, -31130, -33775, -12079, -46530, -34788, -48504, -30805, -26076, 11990, 16070, -6667, -28474, -55570, -29654, -18415, -66906, -12234, -12675, -29295, -29021, -6951, -10889, 2279, -46850, -37303, 10313, -13219, -8237, -15489, 8936, -15720, -15296, 39807, 34329, 37101, 57823, 3319, 8976, -47431, -80305, -73129, -22477, -34491, -39706, 8310, -20553, -51383, -46711, -5798, 19837, -22160, -9596, -28521, -44857, -58065]
1212e8065L4722j5049K453N3590K760k5774M204L1043j9420Q891l4881j266K8493
1199A1701K5094J198k2129N553j5195N0558k4733m14n6579r530L5184o984m8277
1186e4553k1835N3692K619j7346j8727J9607J6317M2163k3674l4575L3086p00
1174c926j6275L8003N8058k4224o2192K245k3473l0929L0944j600k0561j0392
1162f4322J2117K3752k620L4262j1274J0193l5490j6562n049L0690O5108n2614
1150a1809J9444j2288l6663M0501j3959m4119K0714J120m4916N2580K1002M3379
1138C4986L8933m8051J7445m9755m0846N942L9882K8314M139J3702l5127q811
1126G53L7478o994m6422k110m809o164k7074Q2664K6994m1480j346l6584n4284
$$ y = [-58065, -23343, -38392, -35939, 17651, 20411, -5363, -1159, 29884, 10464, 19355, -15526, -16792, 11701, 36795, 37993, 15864, 21417, 6222, 56780, 32047, 31633, -24946, -34476, 708, -6276, -54553, -76388, -22696, -20077, -37423, -56150, -36543, -20226, 21937, -1737, -36312, -3226, -3926, -20201, 17802, 75860, 51636, -10556, -8311, -31784, -62713, -31769, -33369, -53930, -64322, -52205, -28453, -31073, 3189, -8085, 2108, -33382, -49944, -54993, -24303, 40805, -11809, 7635, -4653, -41316, -815, -14774, -58893, -38179, -37059, -81975, -29395, -8393, 34986, 73919, 25868, 43313, -6442, -47288, -41346, -1464, 26850, 30989, 44691, 9564, 753, 38231, 31237, -15185, -17295, -22104, -28268, -55342, 27322, 54316, 12836, 11490, -25094, -79378]
1113g9378K2976O6795J1137j727k303k3301m648K2529J6345k4348k3412j6891
1101c6226k5629M6604P8256l8937O095J8196m7005p903m8505O8983j2969j7676
1089a6716L7845m0205N2612M017K8242j2175o9653j3940N023L2887M5255P565
1077F0757o1957J576L4174j6767R249k948j9116R29R8882k9787k4680k2271m9030
1064b0989K8978M8206k8644n5829m451M9388m887l3209R215L2449J8426p1878
1052c3225O0803J9792N271l7586L3250m5280J8533j3910k8705J5195k2446N4712
1040B6404r437J252l101j2042L6164M1656k0151l6343k2848l9462Q062O8076K5291
1027F3521k4726p874J476N497l0865o137J7667m6082k7245N8026L9503k580j1649
$$ y = [-79378, -56402, 10393, 21530, 19803, 17500, -5801, -10449, 12080, 28425, 4077, -19335, -36226, -61855, -15251, 63005, 24068, 30163, 48359, 1354, -6549, -55054, 13929, 960, -16716, 21129, -19076, 33536, 37553, 65795, 53620, -16033, -29973, -24950, 7937, 53192, 60757, -1200, 376, 34550, 17783, 27032, 24084, 4968, 5897, 104779, 74992, 50312, 28041, -20989, 7989, 56195, 27551, -28278, -32729, 16659, 11772, -21437, -12222, 20227, 38653, -33225, 27578, 47370, 52641, 15055, 48305, 3025, 21558, 7648, -21057, -5862, -28308, 26404, 16967, 18219, 15118, 3076, 39240, 80896, 60745, 24402, 1554, -37908, -29846, 38230, 63521, 38795, 30921, 32397, 37894, 7029, 892, 18559, -27523, -54768, 3258, 42761, 40181, 28532]
1014B8532k2282Q4337q577o9370l4481j6129K2754M855K5145n699k0277N5459
1002D4267n5172n954L5423l938L7753j9380k7370N071K5428K0674r889k6150k7328
989f565R073j8760J5442K8733q294k3799j6134K4067L9590K2480m1236p5978l876
976e5257M1258M5967O621j8125k6750j2839O2281m1741j4614j9224o3075K640
964i2858M9749k5476K7555K5994J621J2143L4690j8742j6688k730J6812L4954
952D7024J6132q919l2604K3861j8122k2336J0373l5675L786M1938L187j8090m0501
939b9946K5459M5780R660l098m0086m0019K2761k8359l0664P038j5189K7388K2299
926b6976l6816O609L7086M281o165j4644k8171P1194K9951m9547o294j7964l8172
$$ y = [28532, 6250, 90587, 82010, 12640, -21841, -37970, -15216, -10361, 14784, 9085, -11192, 44267, -10905, -16859, 18564, 14626, 52379, 32999, 5629, 10700, 36128, 56802, 46913, 20763, -6565, 2508, -16252, -810, 27923, 19629, -4170, -20304, 3763, 43353, 65833, 24597, -51381, -55257, -13999, 31968, 38589, 20464, -6286, -19125, 43156, 1415, -13199, -32423, -95498, -92858, -43109, -68585, -41030, -15036, -13415, -1272, 33418, 14676, -2012, -4742, 12070, 47024, 63156, 54237, 21633, 45494, 27372, 5036, 15409, -20266, -16480, 25458, 28645, 10555, -29946, -4487, 41293, 50953, 47855, 7769, -32250, -9489, -37848, -68512, -61474, -76663, -49275, -26976, -63792, -57183, -20097, -15816, -21981, -36625, -64796, 6398, 36349, -13198, -19492, -37456, -75628]
913g5628J8961K2735K8195R674L832L453k5474N059J0758m3399N7356M448j8526
900A444Q276r850n5964L0970K2814J576K5024j0793J8435l4067j5206k224K154
887a7411L538n1768k5771N7650K8426K2133l5408J5720j9859R746J3348j9005
875a8661m1050j7009K655L9523J344o1349k384M2526L351L3362J2808R671O7l5710
861c0856M0647L9676k6543k9810l1998l5990K1931J5664m809l8234R6746l3974
849a7550k5453J4719N091K6823J1196n441l1301K0018J1286m9976o094K8576j8699
836c6805J0864k7798N324Q104J5411j286M8844r062j359M192n3006m7838m600
823h9015O6742O1237J587J8981j3865N73J0233m1721J3500r300J6636O348J5815
$$ y = [-75628, -56667, -33932, -5737, 3937, 7769, 11222, -14252, -9193, 1565, -41834, 15522, 19970, 1444, 9720, -130, -56094, -25124, -2310, -734, 24290, 13497, 31932, -2135, -17341, -19565, -17411, -13873, -65641, -91412, -33762, -5336, 16797, -18611, -2891, -22750, -13004, 344, -18661, -59711, -76720, -74065, -34542, -33198, -94547, -96931, -54405, -51054, -17692, -4884, 4787, 4854, -30856, 9791, 49467, 22924, -6886, -38884, -74874, -52943, -37279, -42088, -80322, 16424, -17550, -43003, -28284, -23193, 3630, 14826, 9385, -21916, -1898, 9388, -40588, -46682, -18106, -36805, -25941, -53739, -48415, -40311, -24900, -26186, 22658, 13596, 12237, 16429, -36577, -84415, -89015, -22273, 38964, 40551, 59532, 45667, 46240, 56473, 14752, 28252, 18952, 35588, 41936, 57751]
810E7751m1526j2936o355l1618J7034L3379J4106L6165m5896l243R912k3777J4331
797A7327l074J1565M1758j1567l8289M715j0876m0528j3151K180M9328J2177O265
784B7830Q104m0571o4405K5591N6435m4128l1705L9334m313n974L3706l082L1469
771B8291p402k9728j3204M0388Q549l2531L7383M9n8066n876K6609k0457o0701
758h6696K3308K5080O3111k5144J766j3581K4952J1146j7698l2103k673j606o984
745c7122K25j8326j3588k5223J7677L3290K7866k9290R7959L0956o4054J216p0154
732d8568L2493p246J631K064l278R733j9273O9748J840j9522m7246k9427N4622
719b429J5381r039M130k5962k6246K9040J1402m357k1003j0715r915k17P5501
$$ y = [57751, 16225, 3289, -3066, -34684, -17650, 15729, 29835, 66000, 20104, 16861, 26773, 2996, 17327, 14253, 25818, 67576, 56009, 17720, 22435, 11559, -28969, -42120, -39940, 9388, 21565, 27830, 35934, -4637, -69042, -43451, 12984, -31144, -62849, -23515, -27828, -33802, -96, -3178, 28291, 20889, -8839, -22043, 18345, 26894, -5637, 31746, 31795, -26271, -32147, -5538, -25995, -86696, -63388, -38308, 24803, -341, 1425, -12156, 12796, 23942, 6244, -25859, -28532, -30138, -37122, -36897, -55223, -68811, -94034, -76357, -43067, -15201, -44491, 53468, 84424, 20370, 21586, -48568, -16075, -23321, -21690, -19626, -22904, -13171, -32444, 37304, 39144, 19622, -27624, -57051, -2429, 12952, 3913, 8043, -17919, -44165, -15125, -3723, -8080, -29083, -39798, -49713, -49930, 25571]
$$ [...]
##END NTUPLES=NMR SPECTRUM
##END=
