##TITLE=1H_TG-2343-1
 CDCl3
 8 sc, 
 21.1.2022
##JCAMPDX= 6.0         $$ Bruker NMR JCAMP-DX V2.0
##DATA TYPE= NMR SPECTRUM
##DATA CLASS= NTUPLES
##ORIGIN= UXNMR, Bruker Analytische Messtechnik GmbH
##OWNER= root
$$ XWIN-NMR		Version 3.5
$$ Fri Jan 21 11:36:46 2022 Russian Standard Time (UT+4h)  she@DPX200
##.OBSERVE FREQUENCY= 200.131346
##.OBSERVE NUCLEUS= ^1H
##.ACQUISITION MODE= SIMULTANEOUS
##.ACQUISITION SCHEME= undefined
##.AVERAGES= 8
##.DIGITISER RES= 18
##SPECTROMETER/DATA SYSTEM= spect
##.PULSE SEQUENCE= zg30
##.SOLVENT NAME= DMSO
##.SHIFT REFERENCE= (INTERNAL, DMSO, 0, 15.7205)
##AUDIT TRAIL= $$ (NUMBER, WHEN, WHO, WHERE, WHAT)
$$ ##TITLE= Audit trail, XWIN-NMR		Version 3.5
$$ ##JCAMPDX= 5.01
$$ ##ORIGIN= Bruker BioSpin GmbH
$$ ##OWNER= she
$$ F:/spectra/data/she/nmr/H-F/1/pdata/1/auditp.txt
$$ ##AUDIT TRAIL=  $$ (NUMBER, WHEN, WHO, WHERE, WHAT)
(   1,<2022-01-21 11:35:44.14 +0400>,<she>,<DPX200>,
      <created by zg, POWCHK disabled, PULCHK disabled
       configuration hash MD5:
       00 E9 B6 7A A2 85 ED C7 34 08 36 98 17 FE 4E 26
       data hash MD5: 16K
       29 7D 46 61 84 52 3C 1B 7B 31 F2 65 AA 34 06 4D>)
(   2,<2022-01-21 11:35:46.89 +0400>,<she>,<DPX200>,
      <Start of raw data processing
       efp BC_mod = 2 LB = 0.24 FT_mod = 6 PKNL = 1 PHC0 = -15868.42 PHC1 = 11.20078 SI = 16K 
       data hash MD5: 16K
       D8 E4 56 A5 AF 14 63 7B 56 0B 46 7F C9 F9 CF D8>)
(   3,<2022-01-21 11:36:01.40 +0400>,<she>,<DPX200>,
      <pk PHC0 = -2.650329 PHC1 = 2.599999 
       data hash MD5: 16K
       66 C5 AF 02 91 28 0C 85 29 5C 5C E5 78 81 D1 AF>)
(   4,<2022-01-21 11:36:04.82 +0400>,<she>,<DPX200>,
      <abs ABSG = 5 
       data hash MD5: 16K
       64 B6 F5 83 49 4A E0 F7 FE 81 0E DD 32 88 26 6B>)
$$ ##END=
$$ 
$$ hash MD5
$$ DD 4C D8 61 60 92 00 83 14 B9 B3 B7 A0 45 18 1C
##$RELAX= 
##$RELAX= 
##$RELAX= 
##$RELAX= 
##$RELAX= 
##$RELAX= 
$$ Bruker specific parameters
$$ --------------------------
##$DU= <F:/spectra>
##$EXPNO= 1
##$NAME= <H-F>
##$PROCNO= 1
##$TYPE= <nmr>
##$USER= <she>
##$AMP= (0..31)
100 100 100 100 100 100 100 100 100 100 100 100 100 100 100 100 100 100 
100 100 100 100 100 100 100 100 100 100 100 100 100 100 
##$AQSEQ= 0
##$AQ_mod= 1
##$AUNM= <au_zg>
##$AUTOPOS= <>
##$BF1= 200.13
##$BF2= 200.13
##$BF3= 200.13
##$BF4= 200.13
##$BF5= 200.13
##$BF6= 200.13
##$BF7= 200.13
##$BF8= 200.13
##$BYTORDA= 1
##$CFDGTYP= 0
##$CFRGTYP= 5
##$CHEMSTR= <none>
##$CNST= (0..31)
1 1 145 1 1 1 1 1 1 1 1 1 1 1 1 1 1 1 1 1 1 1 1 1 1 1 1 1 1 1 1 1 
##$CPDPRG= <>
##$CPDPRG1= <>
##$CPDPRG2= <>
##$CPDPRG3= <>
##$CPDPRG4= <mlev>
##$CPDPRG5= <mlev>
##$CPDPRG6= <mlev>
##$CPDPRG7= <mlev>
##$CPDPRG8= <mlev>
##$CPDPRGB= <>
##$CPDPRGT= <>
##$D= (0..31)
0 1.2 0 0 0 0 0 0 0 0.06 0 0.03 0 0 0 0 0.0002 0 0 0 0 0 0 0 0 0 0 0 0 
0 0 0 
##$DATE= 1642750543
##$DBL= (0..7)
120 120 120 120 120 120 120 120 
##$DBP= (0..7)
150 150 150 150 150 150 150 150 
##$DBP07= 0
##$DBPNAM0= <>
##$DBPNAM1= <>
##$DBPNAM2= <>
##$DBPNAM3= <>
##$DBPNAM4= <>
$$ [...]
##$SUBNAM2= <"">
##$SUBNAM3= <"">
##$SUBNAM4= <"">
##$SUBNAM5= <"">
##$SUBNAM6= <"">
##$SUBNAM7= <"">
##$SUBNAM8= <"">
##$SUBNAM9= <"">
##$SW= 18.0517287032376
##$SWIBOX= (0..15)
0 0 2 0 0 0 0 0 0 0 0 0 0 0 0 0 
##$SW_h= 3612.71676300578
##$TD= 16384
##$TD0= 1
##$TE= 0
##$TE2= 300
##$TE3= 300
##$TEG= 300
##$TL= (0..7)
0 120 120 120 120 120 120 120 
##$TP= (0..7)
150 150 150 150 150 150 150 150 
##$TP07= 0
##$TPNAME0= <>
##$TPNAME1= <>
##$TPNAME2= <>
##$TPNAME3= <>
##$TPNAME4= <>
##$TPNAME5= <>
##$TPNAME6= <>
##$TPNAME7= <>
##$TPOAL= (0..7)
0.5 0.5 0.5 0.5 0.5 0.5 0.5 0.5 
##$TPOFFS= (0..7)
0 0 0 0 0 0 0 0 
##$TUNHIN= 0
##$TUNHOUT= 0
##$TUNXOUT= 0
##$USERA1= <user>
##$USERA2= <user>
##$USERA3= <user>
##$USERA4= <user>
##$USERA5= <user>
##$V9= 5
##$VALIST= <valist>
##$VCLIST= <CCCCCCCCCCCCCCC>
##$VD= 0
##$VDLIST= <DDDDDDDDDDDDDDD>
##$VPLIST= <PPPPPPPPPPPPPPP>
##$VTLIST= <TTTTTTTTTTTTTTT>
##$WBST= 1024
##$WBSW= 4
##$XGAIN= (0..3)
0 0 0 0 
##$XL= 0
##$YL= 0
##$YMAX_a= 272930
##$YMIN_a= -427477
##$ZGOPTNS= <>
##$ZL1= 120
##$ZL2= 120
##$ZL3= 120
##$ZL4= 120
##$ABSF1= 15.71714
##$ABSF2= -2.334709
##$ABSG= 5
##$ABSL= 3
##$ALPHA= 0
##$AQORDER= 0
##$ASSFAC= 0
##$ASSFACI= 0
##$ASSFACX= 0
##$ASSWID= 0
##$AUNMP= <proc_1d>
##$AZFE= 0.1
##$AZFW= 0.1
##$BCFW= 0
##$BC_mod= 2
##$BYTORDP= 0
##$COROFFS= 0
##$CY= -3
##$DATMOD= 1
##$DC= 0
##$DFILT= <>
##$DTYPP= 0
##$F1P= 0
##$F2P= 0
##$FCOR= 1
##$FTSIZE= 16384
##$FT_mod= 6
##$GAMMA= 0
##$GB= 0
##$INTBC= 1
##$INTSCL= 0
##$ISEN= 128
##$LB= 0.24
##$LEV0= 0
##$LPBIN= 0
##$MAXI= 10000
##$MC2= 0
##$MEAN= 0
##$ME_mod= 0
##$MI= 1.114404
##$NCOEF= 0
##$NC_proc= -5
##$NLEV= 6
##$NOISF1= 3.799351
##$NOISF2= 2.8
##$NSP= 0
##$NTH_PI= 0
##$NZP= 0
##$OFFSET= 15.72045
##$PC= 1
##$PHC0= -15871.07
##$PHC1= 13.80078
##$PH_mod= 1
##$PKNL= yes
##$PPARMOD= 0
##$PSCAL= 0
##$PSIGN= 0
##$REVERSE= no
##$SF= 200.130006225641
##$SI= 16384
##$SIGF1= 3
##$SIGF2= 2
##$SINO= 5.538805
##$SIOLD= 16384
##$SREGLST= <1H.CDCl3>
##$SSB= 0
##$STSI= 16384
##$STSR= 0
##$SW_p= 3612.71676300578
##$SYMM= 0
##$S_DEV= 0
##$TDeff= 16384
##$TDoff= 0
##$TI= <>
##$TILT= no
##$TM1= 0
##$TM2= 0
##$TOPLEV= 0
##$USERP1= <user>
##$USERP2= <user>
##$USERP3= <user>
##$USERP4= <user>
##$USERP5= <user>
##$WDW= 1
##$XDIM= 16384
##$YMAX_p= 394737420
##$YMIN_p= -243542
$$ End of Bruker specific parameters
$$ ---------------------------------
##NTUPLES= NMR SPECTRUM
##VAR_NAME=  FREQUENCY,     SPECTRUM/REAL,   SPECTRUM/IMAG
##SYMBOL=    X,             R,               I
##VAR_TYPE=  INDEPENDENT,   DEPENDENT,       DEPENDENT
##VAR_FORM=  AFFN,          ASDF,            ASDF
##VAR_DIM=   16384,         16384,           16384
##UNITS=     HZ,            ARBITRARY UNITS, ARBITRARY UNITS
##FACTOR=    0.220516191357247, 1,           1
##FIRST=     3146.13383668328, 0,            0
##LAST=      -466.582926322499, 0,           0
##MIN=       -466.582926322499, -243542,     0
##MAX=       3146.13383668328, 394737420,    0
$$ Real data points
##PAGE= N=1
##DATA TABLE= (X++(R..R)), XYDATA
$$ [...]
9477 465438 487652 475630 487785 533820 566782 573248 603555 669156 633934 663535 694075 611957
9465 611957 596416 582488 658418 669464 647201 675229 690552 638296 636802 672221 615272 576823
9453 576823 557817 592648 624599 581892 512435 504262 533167 524910 516992 470722 490423 483611
9441 483611 495840 553485 603389 622425 625676 702666 698211 735658 703376 718828 702684 704139
9429 704139 760870 781072 809127 846131 836178 835857 810544 736721 736388 748187 688171 704048 670318
9416 670318 611815 636570 678277 604979 579299 575028 574380 595092 570894 530265 522448 465021
9404 465021 483399 440183 451372 464009 506466 517729 476328 427421 446611 496585 500452 499843
9392 499843 501596 498245 529946 554688 547084 529923 489967 554186 565495 583049 599693 583589
9380 583589 559093 583902 551726 585111 593561 589710 605333 564599 616832 640690 618108 620797
9368 620797 625838 588434 589427 610802 643732 605226 631906 657430 708327 670914 708607 690370
9356 690370 684343 717623 732590 757598 738593 779702 784347 842664 825628 800495 794310 858860
9344 858860 876630 885298 930106 906541 931922 977598 982237 971978 963510 958280 980146 1044585
9332 1044585 958928 958189 988491 981685 976433 987253 978119 1009346 1044991 1098813 1100571 1140117 1120044
9319 1120044 1098166 1118934 1169478 1245039 1291538 1293001 1252850 1243853 1284561 1256637 1271808 1281602
9307 1281602 1331863 1385076 1367471 1364903 1405485 1397702 1411288 1461053 1491843 1449893 1473249 1453266
9295 1453266 1398606 1329602 1297995 1311131 1328235 1366075 1343063 1373163 1347153 1361028 1411792
9284 1411792 1411765 1401419 1399450 1443027 1515875 1552715 1592180 1599995 1662410 1655974 1670983 1745652 1800342
9271 1800342 1915266 1978858 2025676 2101076 2220005 2330594 2415365 2481665 2489814 2532952 2579454
9260 2579454 2599961 2553280 2500153 2409213 2345751 2236348 2163827 2131688 2128771 2137857 2089655 1992437
9248 1992437 1896387 1878409 1856612 1843012 1815538 1824751 1831733 1817132 1807405 1832810 1896559 1956848
9236 1956848 2005999 2038034 2144090 2212075 2279832 2325953 2411542 2484478 2622761 2699127 2753624
9225 2753624 2856476 2893100 2937308 2947815 2881945 2812393 2848352 2820442 2799352 2734656 2655059
9214 2655059 2614855 2544943 2506192 2441692 2355637 2267026 2223674 2227620 2240047 2242969 2295776 2333925
9202 2333925 2338549 2335034 2330899 2356899 2433921 2516017 2566036 2606042 2663123 2686633 2681887 2763570
9190 2763570 2832700 2831989 2795063 2738792 2778654 2812667 2843706 2931520 2996791 3034269 3028396 3004202
9178 3004202 2995600 3067787 3085304 3078558 3143963 3133037 3165279 3182724 3256791 3322371 3452053 3534604
9166 3534604 3543761 3617076 3712101 3799185 3967339 4089842 4159651 4256862 4339994 4463101 4539698
9155 4539698 4602915 4696444 4844999 4952850 5103524 5182038 5285796 5317008 5374038 5445736 5551016
9144 5551016 5674758 5755997 5869777 6024512 6180208 6342114 6446265 6631630 6847859 7003734
9134 7003734 7225112 7457812 7673146 7877233 8180094 8478969 8799679 9152551 9550905 9918898
9124 9918898 10347740 10854656 11345409 11975491 12640516 13288462 13970486 14669384 15480983 16387872
9114 16387872 17460915 18609816 19857209 21237086 22854319 24898774 27532313 30753306
9106 30753306 34355994 38351327 42403069 46539240 51564995 57317545 62906605 67184121
9098 67184121 68846034 69174764 70856538 74441032 78724177 81339660 79346007 73323777
9090 73323777 65058977 56800847 50349414 46137736 43791923 42413651 41397945 40070667
9082 40070667 38109009 35942017 34239108 33185099 32653777 32695163 33216435 34174400 35634062
9073 35634062 37607403 40306076 43902970 48319610 53353280 58712533 63599948 68129042
9065 68129042 72460316 76298459 80022033 84745628 90451559 96728792 100738084 100952544
9057 100952544 99786568 97723194 93727068 87188842 76973300 65026279 54593871 46873429
9049 46873429 41504032 37514557 34623651 32710060 31362802 30229184 29063592 27197251
9041 27197251 24769015 22351536 20359152 18737597 17467261 16430825 15498318 14692593
9033 14692593 13960609 13250002 12529872 11886129 11383974 10877643 10448723 10135696 9854915
9024 9854915 9685198 9519031 9427782 9411674 9513637 9709512 9790306 9850863 9963720 10075672
9014 10075672 10191546 10358660 10567613 10834027 11135965 11249323 11146757 11008221 10684524
9005 10684524 10233329 9612094 8794798 7909808 7138388 6578232 6138828 5833946 5647252
8996 5647252 5514263 5310919 5140055 4969904 4820984 4627865 4433590 4310016 4160377 4032935
8986 4032935 3919834 3841660 3740371 3632484 3510417 3446272 3399142 3321115 3244118 3149436 3080316
8975 3080316 2986032 2940713 2862703 2839284 2806398 2772585 2757268 2776778 2724650 2696793 2676570
8964 2676570 2649262 2690716 2664760 2654754 2661713 2646031 2621533 2637999 2659394 2679460 2666901 2710570
8952 2710570 2717537 2751301 2771217 2800212 2807503 2809896 2884598 2856431 2825334 2803565 2787237 2834340
8940 2834340 2888128 2901055 2928980 2956531 2948140 2990979 2947541 2992058 3046700 3116339 3130305 3193631
8928 3193631 3226759 3273682 3328848 3363922 3427739 3492404 3584087 3644592 3725771 3793571 3862155
8917 3862155 3938871 4000914 4066619 4137659 4260245 4314518 4323430 4397846 4473313 4604996 4688587
8906 4688587 4838779 4952115 5011080 5133696 5273188 5367674 5494245 5616198 5777084 5895863
8896 5895863 6091433 6190536 6397252 6577598 6749543 7008221 7275633 7588230 7903016 8229254
8886 8229254 8546007 8912438 9339513 9729941 10136954 10541330 10922239 11475429 12130959 12777334
8876 12777334 13560395 14399836 15373063 16629181 18081771 19878724 21910518 24199190 26663894
8867 26663894 29243916 31978106 35087904 38667705 42630781 46403018 49384616 51209169
8859 51209169 51823653 51207731 48846966 44899823 40532449 37107972 35121004 34231299 34004473
8850 34004473 33853149 33336322 32278586 30889510 29715742 29041205 28916854 29358928 30178457
8841 30178457 31432868 33151573 35231525 37662981 40455904 43510420 46777456 50499589
8833 50499589 55135980 60876369 67580790 74853693 82290185 89233516 94867566 98190146
8825 98190146 98464789 95607442 89882446 82743907 75858753 70465184 66538445 63099557
8817 63099557 58949198 53755133 48187097 43513525 40059311 37354869 35130802 33320350
8809 33320350 32015211 31167086 30762188 30701412 31029093 31711933 32754014 34083473 35847182
8800 35847182 38040992 40519919 43269210 45908718 48190722 49995916 51489039 53446354
8792 53446354 56283271 59463648 62001918 62990344 61718831 58025779 52194217 45490002
8784 45490002 38937665 33447649 29515186 26871664 25009277 23674106 22541113 21320593
8776 21320593 19983888 18613750 17419683 16559805 15840663 15348503 14988580 14635941 14319951
8767 14319951 14040245 13822628 13598094 13387261 13181845 12869336 12360977 11816806 11234073
8758 11234073 10674262 10129224 9627073 9148244 8805800 8556892 8354768 8114048 7933051
8749 7933051 7765615 7585633 7495265 7359866 7242914 7219559 7196907 7088214 7082070 7099467 7115215
8738 7115215 7140585 7128155 7100060 7149570 7295460 7506554 7742371 7890856 8130972 8359568
8728 8359568 8587288 8854899 9159330 9521335 9930370 10413700 10977337 11689575 12514132 13492380
8718 13492380 14621078 16159160 17922900 19639736 20733733 20952749 21399685 22569081
8710 22569081 24490095 26824850 29286924 31485791 33398699 34897296 36262756 37840551
8702 37840551 39218405 39540581 38411836 35931410 33213341 31331463 29918567 28362612
8694 28362612 26322295 23869715 21724015 20244978 19366479 18850993 18601466 18640673 18764790
8685 18764790 19061350 19506187 20150856 20962764 22037839 23481607 25134464 26819505 28368427
8676 28368427 29698373 31010740 32838256 35554853 39185896 43048403 46381054 48455293
8668 48455293 48485347 46331224 42496431 37686357 32701664 28619946 25835919 24118518
8660 24118518 23008787 22202754 21332239 20254037 18994920 17744447 16795348 15997263 15329654
8651 15329654 14749530 14223550 13791731 13414881 13271346 13315707 13679722 14317773 15010729 15890874
8641 15890874 16760940 17447905 17994801 18239374 18472179 18796117 18973266 18573514 17526751
8632 17526751 16102958 14774268 13737280 12843812 11832217 10592659 9375474 8348467
8624 8348467 7617033 7076782 6639649 6290916 6036914 5737191 5443488 5221940 4968478 4754077
8614 4754077 4527340 4333105 4179658 4009244 3817803 3632001 3479222 3363415 3216242 3011370
8604 3011370 2896139 2758715 2606742 2482287 2417983 2353576 2261671 2154184 2093262 2006219
8594 2006219 1844026 1749730 1661369 1588197 1494411 1482407 1407761 1321342 1250253 1259792 1273499
8583 1273499 1205861 1190330 1156953 1165962 1116746 1092524 1093597 1066797 973725 995437 1012674 968451
8571 968451 934890 881335 873339 872842 880604 860312 842642 724214 733577 736812 653572 592687 592188
8558 592188 621781 574839 598572 575641 540112 516378 428312 420574 399540 407413 379920 356880
8546 356880 318322 369119 365082 349052 345231 286954 223468 251499 241370 250674 292604 241251
8534 241251 231986 259257 231821 205488 237602 214980 174012 171392 175450 161255 239976 249544
8522 249544 239186 201215 211870 186328 229768 201487 206483 220515 209192 130879 139247 157216
8510 157216 152580 143452 100813 110196 174575 169937 171853 154222 226424 186378 215393 228539 242503
8497 242503 239901 215066 244002 282189 302162 344001 400059 379794 378101 297384 315564 245509
8485 245509 208193 169644 176117 157189 134673 163129 193475 177311 154024 138498 128052 135362
8473 135362 142012 90546 93493 159141 222388 270589 305638 286695 290974 316656 330689 391365
8461 391365 381899 363920 416766 400044 425711 443709 438737 378259 314427 330877 360506 315913
8449 315913 265799 283925 239613 239103 231728 193626 172343 109880 96582 70028 76059 101808
8437 101808 112247 123224 147848 108597 105512 94533 147334 198463 198177 171588 157390 212942
8425 212942 227060 238384 189811 168102 146309 155327 150033 185564 118559 80228 118821 109750
8413 109750 132212 144012 142742 60768 55667 28533 3008 -12413 -39955 -46571 -45357 -11999
8401 -11999 11357 20072 -13112 -53662 -74107 -31545 6728 6713 26828 20164 22811 -7891 -3293
8388 -3293 1360 -8427 -7682 -20433 -37923 -21016 -15016 -55831 -34352 -32158 -57434 -71220 -81426
8375 -81426 -80118 -52189 -61367 -70025 -67438 11157 18232 -13673 -16352 22744 15460 -42973 -67546
8362 -67546 -12619 -30595 -51965 -67430 -75080 -32328 -1217 -65718 -75585 -62686 -49291 -15419
8350 -15419 1994 -30392 -73488 -74564 -37983 31958 30862 58618 54944 84462 64232 44916
8338 44916 82614 120589 36115 55653 41016 6107 -1300 -52768 -26327 402 -18215 -13164
8326 -13164 -40689 -72359 -102545 -70716 -56408 -41264 15617 -19980 -5858 -15038 -20717 -5832
8314 -5832 900 -7984 8062 39226 40474 102406 104664 105504 171293 165724 172655 217410 155436 74205
8300 74205 14821 99692 61542 -14840 -549 -22114 -15286 -50713 -22361 -29247 13259 407
8288 407 -24095 -27198 -59256 -82881 -44076 -33732 -9771 -75961 -73310 13692 33628 15213 -9652
8275 -9652 -7150 -14654 -25671 -19245 21477 8887 15995 388 -7745 20940 1064 -70832 -67564
8262 -67564 -58152 -57842 -115302 -138218 -127117 -112897 -61432 -51548 -60328 -118438 -108237 -88674 -108138
8249 -108138 -169343 -149336 -138520 -120511 -90568 -122514 -156505 -107567 -59398 -96072 -97135 -89645
8237 -89645 -77674 -82645 -100376 -104003 -174528 -171930 -158981 -169794 -123270 -85018 -132029 -162439
8225 -162439 -146623 -187308 -169724 -146258 -114073 -110725 -108544 -129131 -103421 -107247 -139937 -121764
8213 -121764 -126955 -177523 -139082 -132517 -149927 -197213 -167175 -162577 -152998 -138069 -108334 -83741
8201 -83741 -124323 -130073 -111417 -145914 -146930 -105184 -91541 -163204 -178157 89483 40586 -54839
8189 -54839 -83644 -138028 -179560 -120991 -131560 -155952 -105474 -105379 -135407 -129318 -138059 -97042 -161191
8176 -161191 -195950 -152991 -198775 -154282 -154891 -99441 -95164 -124915 -165644 -125948 -92800 -87963
8164 -87963 -131431 -178218 -111679 -139453 -155732 -150449 -146639 -124987 -114284 -127047 -192429 -243542
8152 -243542 -199703 -188619 -200070 -166915 -147694 -175106 -188661 -178949 -187680 -155136 -196261 -208500
8140 -208500 -185224 -133886 -145138 -174502 -157416 -152055 -164122 -202849 -182249 -172946 -165216 -196066
8128 -196066 -191623 -173764 -158831 -183903 -212657 -184207 -205234 -197797 -170093 -170564 -225120 -167602
8116 -167602 -165616 -125502 -106953 -128759 -106466 -171335 -172987 -133255 -126759 -156709 -234647 -178827
8104 -178827 -135525 -207180 -221760 -170772 -171966 -143917 -130234 -110848 -131489 -143586 -154100 -172927
8092 -172927 -137979 -151970 -158018 -166774 -131314 -141739 -152203 -166538 -140154 -146666 -125352 -131406
8080 -131406 -98194 -95558 -109082 -115521 -181090 -152726 -188114 -196485 -180750 -169282 -184823 -147598
8068 -147598 -192018 -149493 -124521 -174774 -183579 -198650 -167850 -204724 -193498 -191373 -171816 -139284
8056 -139284 -148108 -170835 -137302 -107883 -91642 -45596 -77677 -131205 -147110 -127570 -92938 -102586
8044 -102586 -124097 -94104 -84719 -111805 -110358 -145785 -105834 -112819 -150626 -184183 -133626 -126725
8032 -126725 -168176 -149367 -167964 -160016 -130242 -157073 -187150 -150295 -161315 -178159 -114802 -64586
8020 -64586 -74680 -156575 -144972 -151717 -152237 -109103 -78894 -104501 -118670 -126274 -140863 -116193 -88805
8007 -88805 -52474 -64737 -107735 -124184 -123488 -111020 -108461 -109247 -94659 -106582 -138962 -138180 -108412
7994 -108412 -105109 -108870 -88214 -95477 -134132 -120560 -74807 -107344 -101252 -96349 -115300 -162091 -193516
7981 -193516 -150496 -142291 -115292 -64770 -115221 -104973 -92213 -67787 -89969 -116995 -143387 -144350
7969 -144350 -111097 -117715 -74673 -17846 -29965 -41808 -11712 -53414 -38455 -11716 -59352 -45957
7957 -45957 -34766 -54407 28677 3045 4319 -47936 -52413 -122760 -105480 -92573 -96353 -141834
7945 -141834 -110377 -79115 -99866 -151418 -166872 -128334 -96923 -65088 -81226 -99234 -96512 -72311
7933 -72311 -72634 -73989 -86668 -48935 -71377 -112654 -120943 -93815 -80036 -116463 -118600 -118711 -108129
7920 -108129 -98346 -140248 -129508 -89974 -74307 -77508 -56716 -76044 -101508 -78219 -77931 -80669 -115904
7907 -115904 -79996 -107780 -95404 -116417 -158910 -108666 -47436 -68873 -105279 -79137 -130263 -186275
7895 -186275 -170584 -162797 -147378 -115902 -121212 -86850 -48205 -21182 -83213 -96528 -60080 -110834
7883 -110834 -163364 -119180 -106218 -99974 -145909 -130311 -142608 -140607 -109023 -90938 -95195 -126150
7871 -126150 -102732 -111218 -139750 -164294 -138785 -88680 -76081 -85813 -71960 -51466 -85003 -89123
7859 -89123 -103648 -104008 -129991 -194729 -129902 -89217 -75183 -33467 -8871 -73569 -134521 -126880
7847 -126880 -122877 -117295 -101352 -46228 -54310 -86796 -110676 -81276 -99043 -144248 -157724 -86487
7835 -86487 -43034 -23898 -81404 -82432 -65552 -129161 -155532 -137485 -90713 -93395 -119432 -85697
7823 -85697 -89369 -102597 -75397 -58298 -29496 -29999 -85339 -95339 -83635 -85538 -88899 -58584 -48072
7810 -48072 -64761 -85249 -115926 -134822 -145796 -173967 -171742 -150345 -134343 -141773 -96863 88916
7798 88916 58170 11847 -28648 -81360 -85278 -58483 -78597 -78988 -51161 -86870 -54662 -65792
7786 -65792 -98646 -61654 -38936 -69486 -53319 -67271 -82453 -84698 -96359 -90539 -101985 -41257
7774 -41257 -38366 -55290 -90603 -128057 -120464 -117762 -63920 -69443 -124175 -110486 -116636 -165465 -117061
7761 -117061 -67243 -98575 -87369 -68653 -25835 -70591 -118763 -152316 -153297 -112872 -80362 -65064
7749 -65064 -46931 -74820 -35918 -35267 -65584 -74907 -64806 -69407 -94501 -81309 -91344 -64827 -51689
7736 -51689 -95161 -100563 -56456 -59232 -89470 -90769 -42304 41373 -16166 -73032 -73190 -71237 -40714
7723 -40714 -88029 -56968 -36572 -86353 -70960 -44710 -109077 -102933 -58589 -74036 -92632 -48535
7711 -48535 -31422 -18796 -42572 -37217 -61762 -63826 -6796 -39581 -99661 -138658 -105986 -81618
7699 -81618 -71989 -38306 -68247 -112836 -93928 -113589 -80007 -46167 -42445 -20908 -51719 -37962
7687 -37962 -24758 -13498 -47057 -24703 -16540 -23516 -77979 -71528 -48047 -22524 -34214 -50823
7675 -50823 -50119 -26989 -19108 -59173 -37368 -14239 -9046 1938 17109 1152 -29459 -19477 36691
7662 36691 62824 64642 35661 13687 25507 57287 41990 102569 45679 76639 50302 66156
7650 66156 74830 54143 65998 58867 45694 -11515 -12843 -5596 6053 14787 -32296 -35929 -36049
7637 -36049 -30531 27585 19052 -54692 -94931 -83821 -80854 -61630 -64880 -35201 -37236 -69789 -28217
7624 -28217 -12153 -17067 -49081 -60755 -46821 -82808 -69451 -68117 -38666 -64333 -68032 -51046
7612 -51046 -19290 -37221 -46209 -31281 -49283 -12684 -39754 -10748 15903 -34784 -46851 -8422
7600 -8422 -19622 -46297 -44821 -27442 -41916 -67904 -46161 -74615 -60033 -23946 -16409 -15225 -25733
7587 -25733 -58094 -19327 -32969 -18701 -36091 -16850 -22298 -47943 -38497 -34844 -27977 -54267 11213
7574 11213 13128 -62997 -28923 -4282 230 -8858 -66337 -74619 -17991 -11855 2259 64298 9917
7561 9917 -13344 28506 -49966 -68436 -90056 -89205 -25019 13277 37357 22499 31152 19525 -2602
7548 -2602 -9095 -17794 1620 17638 789 4578 32159 16711 14649 19741 32608 -12306 31250
7535 31250 131416 88854 46494 50302 13229 29283 32459 41227 65923 36615 93240 55747
7523 55747 82164 119364 144109 128806 115454 39321 124206 141661 158056 150140 127430 164552
7511 164552 269977 388898 425705 442512 511332 564947 589249 657252 668031 616116 512040
7500 512040 452613 323163 271550 292112 263764 286044 244961 200717 160722 157353 177671 116365
7488 116365 104554 97640 118060 134927 140632 75672 66592 82440 101613 83684 147308 137819
7476 137819 62979 110457 124084 70688 84518 135902 105245 91215 134598 148296 168315 142051
7464 142051 132332 125115 136603 181209 162925 117809 96586 104860 51138 70850 108916 32569
7452 32569 81898 137760 129101 100310 101565 123073 90423 73245 62476 83753 101039 96510
7440 96510 68512 126854 141107 130181 116923 120795 105673 140776 116562 84061 126064 157085
7428 157085 132497 105015 115314 84453 120495 109290 127790 168490 140567 101928 87561 97769
7416 97769 89082 75388 71829 49887 55364 77114 48393 70013 33684 45468 83758 70998
7404 70998 79168 80939 106817 80719 85899 21584 30263 42392 34498 77691 103475 129023 91124
7391 91124 69387 94861 132210 108584 90593 96781 85426 88896 125981 169341 140398 60542
7379 60542 64115 139236 127275 74924 91906 113767 108775 107942 138818 129614 82519 110745 79720
7366 79720 77805 34672 27692 15505 -16297 74427 92802 103270 113731 159949 136447 110769
7354 110769 151854 152709 111575 81540 107591 119595 160385 118015 77422 92578 111664 125765
7342 125765 129437 130727 91021 118803 163201 130441 98172 147054 226465 235054 207917 190271
7330 190271 157749 158609 193852 187749 180862 170529 130601 161461 196112 198055 243359 274242 269767
7317 269767 260373 279110 322499 282574 221220 235485 248078 204071 172830 168685 185592 228427
7305 228427 262140 239366 205250 198337 202257 213793 196085 165912 203229 220612 232940 246301
7293 246301 249979 296281 295098 300684 306307 255549 239028 284651 291133 300966 313376 281465 307271
7280 307271 314307 305963 326272 322852 344132 306863 295087 308313 340688 369343 366327 362226 363604
7267 363604 348104 400774 390952 406458 413462 411604 438174 413098 423819 402287 408975 445923
7255 445923 418000 390142 434842 444547 410094 507493 516457 475574 541187 584845 575425 534034
7243 534034 589120 537424 489558 554888 556290 562763 618998 575266 586226 593480 612376 610160
7231 610160 632392 688609 726078 685987 730190 702252 762479 853949 840963 814285 828029 824644
7219 824644 799297 831919 851401 847984 871835 845866 861523 870259 862145 886299 927591 926692 930036
7206 930036 987673 1037472 1079450 1081965 1115547 1128011 1134706 1163721 1240217 1223859 1293197 1302887
7194 1302887 1314292 1306319 1320889 1323402 1339263 1373751 1338097 1353684 1404683 1482241 1583796 1566264
7182 1566264 1602386 1702620 1710945 1786211 1824402 1866032 1872155 1935933 2026334 2066519 2178707
7171 2178707 2243404 2307767 2354595 2485169 2573690 2658097 2806758 2879737 2951139 3029159 3100540
7160 3100540 3189910 3290575 3364879 3500045 3632065 3681839 3762570 3911168 4062049 4138972
7150 4138972 4202993 4352221 4523296 4660713 4780272 4903990 5030058 5221255 5383958 5528544
7140 5528544 5734425 5937466 6194569 6496047 6784192 7082516 7469760 7842200 8178821 8653213
7130 8653213 9197140 9765318 10479410 11143092 11986521 12884849 13857669 14978811 16235784
7121 16235784 17655539 19360813 21372121 23838812 26846083 30679918 35545152 41769334
7113 41769334 49548149 59242657 70611587 83551542 96833137 108456935 116248291 118281050
7105 118281050 113195875 101566435 86324612 70092316 56053080 45227428 37371059
7098 37371059 31679345 27517386 24264839 21718246 19698042 17952156 16469915 15199398
7090 15199398 14050849 13105417 12231236 11451352 10746131 10087328 9522494 9045280 8501232
7081 8501232 8031007 7622158 7252629 6943515 6651565 6339600 6150467 5963663 5780489 5660938
7071 5660938 5577258 5578686 5559769 5564637 5638174 5698675 5619851 5453294 5155391 4877772 4517785
7060 4517785 4199315 3906313 3696473 3578015 3489223 3357423 3278646 3229283 3238183 3204966 3129267
7049 3129267 3131293 3135679 3156684 3118512 3208633 3298781 3297827 3444665 3631839 3776768 4022493
7038 4022493 4296949 4731927 5240101 5755063 6373573 6980912 7570633 8103022 8349613 8386357
7028 8386357 8046278 7413199 6596148 5709785 4861841 4090741 3510418 3075415 2695103 2418454
7018 2418454 2205450 2004612 1867737 1748254 1620611 1535238 1461693 1349102 1286957 1274909
7008 1274909 1190738 1055972 1025980 1042836 970371 942784 909285 901121 880745 821938 807640
6997 807640 762334 710938 717601 700849 621310 642421 612291 613818 520178 491152 486151 462850
6985 462850 467548 462727 431091 406798 431651 443300 432771 465158 449484 441976 383584 397607
6973 397607 377428 383254 358871 305468 357632 343184 346010 354155 365080 393629 372789 348948
6961 348948 380539 318703 278678 314654 311139 289944 266893 287718 271412 251443 218799 205572
6949 205572 198016 239968 216604 247542 197623 165434 172603 195942 198501 174933 151027 149131
6937 149131 188004 139287 160936 141408 167351 127642 84548 141874 101354 106062 168897 132919
6925 132919 159674 178443 174823 148804 176039 151233 151366 180470 145423 127746 121813 137568
6913 137568 135437 138206 189577 145886 133046 156628 175917 136381 169672 175433 118517 138038
6901 138038 129294 74201 82622 106918 142157 152335 141950 129377 159205 181704 164321 154091
6889 154091 178789 169949 154787 104120 148954 133193 74809 60889 39854 40809 100710 61137
6877 61137 35522 54730 4347 65392 72542 59230 99311 94893 32847 73631 111123 52924
6865 52924 77987 79357 53853 52231 43121 34303 12491 24980 -3154 22066 3039 18672 40455
6852 40455 67371 108830 115817 100301 21422 18746 66359 14545 53185 20843 3064 85789
6840 85789 69639 37315 -1742 24743 3757 -65696 -84742 -66959 -44704 35328 46483 2183
6828 2183 33172 22805 70780 66188 62192 43147 50977 51949 20436 40482 54957 53601 55420
6815 55420 117868 73064 52057 82099 90562 101486 72001 87177 110887 88216 93303 87077
6803 87077 71604 101650 69101 137710 168423 189361 147035 145475 179294 192297 206267 162399
6791 162399 123883 152718 125207 127935 91720 134315 157737 110778 152545 120679 124960 103540
6779 103540 80345 40121 81774 89960 46030 73511 139061 160479 157738 144367 150662 168911
6767 168911 155963 195454 204059 209834 159147 151342 114921 102860 129008 158538 169167 155132
6755 155132 192943 152037 182293 142650 179413 161467 130955 176755 185644 172556 189404 171743
6743 171743 176105 272920 242289 191252 207359 210499 219046 219859 238281 244494 223314 231256 209439
6730 209439 184529 202478 172315 166039 162948 181249 142388 163676 187821 233938 209190 218340
6718 218340 276764 290263 278275 304699 339474 323138 347226 372128 441084 548569 587490
6707 587490 642444 662215 685852 647562 577243 535776 495595 436450 341944 274149 188887 169616
6695 169616 192450 159361 117713 138457 101892 133123 164698 156025 111646 86769 85429 121568
6683 121568 119115 110501 124506 153501 128972 108523 75531 49298 46497 -17342 36948 58155
6671 58155 49619 37796 32713 42305 57969 88592 84710 100571 114013 151753 90299 78257 65252
6658 65252 43845 60952 55167 65721 49232 32509 57476 71940 41546 22264 60865 67105
6646 67105 74522 136224 150916 151957 127692 53466 72309 60454 58789 46442 23278 70480
6634 70480 119153 100595 82766 81273 82493 62989 99214 135543 97202 96389 100177 100508 97435
6621 97435 89859 84825 112007 88653 73489 107997 129627 103711 77520 89837 70342 56183
6609 56183 91773 159910 136742 146677 105927 113010 86126 62615 35923 56996 93667 68107
6597 68107 55163 68318 73821 43262 29123 23872 69026 70152 50776 31130 10906 52542
6585 52542 91565 92501 100158 70382 105964 47320 46340 55400 43463 71384 120274 99886 122964
6572 122964 113153 91871 56945 70911 71890 114178 56958 47260 96296 79268 134197 66995
6560 66995 93588 83244 54475 42951 76099 84743 75636 70376 80779 59298 81474 71628 49101
6547 49101 103688 76438 60141 22113 93116 81431 77572 79467 98840 90615 83668 100228 84590
6534 84590 100127 117272 93839 103417 90497 93571 80998 78934 116356 111729 114154 107375 59110
6521 59110 63937 88415 49967 47614 86905 108584 99795 74438 85956 97352 67282 59813 103838
6508 103838 123878 164711 133032 118521 142356 113082 114516 99039 179196 180151 165047 103872
6496 103872 97403 86958 47976 94422 163968 160228 162294 145373 136682 149379 137165 156351
6484 156351 159108 156297 143885 142213 152393 136143 157266 155407 87401 165784 191094 152441
6472 152441 144048 158079 105664 103549 152737 148601 183154 169587 153849 126769 166859 174547
6460 174547 117548 131048 118193 157618 170979 159063 183828 165218 217802 177942 162048 188707
6448 188707 153967 147220 188457 152627 183633 128784 135510 173866 155953 103137 148192 221398
6436 221398 292688 221983 184060 220331 208713 211438 196431 188539 249469 257613 233423 235464
6424 235464 280503 299670 243119 262745 279902 264021 226185 235467 214318 235567 259263 236820
6412 236820 212130 253852 285117 235221 252150 319010 289024 278789 259911 296663 281834 292606
6400 292606 323243 367834 355662 372203 394927 410637 415553 461440 434952 427229 484826 439039
6388 439039 443214 427852 424572 430851 378398 374066 419358 460930 476036 438857 462150 454365 460138
6375 460138 450676 366578 343000 392667 430411 448120 431763 416877 414201 407276 441210 391769
6363 391769 433908 458451 446456 433388 419261 411354 451027 432725 451011 498126 505823 490553
6351 490553 500828 497344 496876 538619 582463 602548 638060 661086 647965 642047 677647 694027
6339 694027 713001 754682 731010 688549 672724 713483 743448 715050 722637 724618 749058 749786
6327 749786 720784 756601 748481 702437 679606 695031 713554 729814 714674 732733 696509 722730
6315 722730 751515 729703 738395 744144 664211 691440 714857 766895 799898 807131 849622 833296
6303 833296 826080 880184 852074 862971 900612 873938 889498 883558 908853 880822 933161 963162
6291 963162 934013 946699 925012 957242 1009510 1008222 967692 952664 1001722 1043646 991975 983912
6279 983912 969205 1004463 1029707 1074118 1087947 1101057 1111630 1052303 1048896 1078697 1086623 1115503
6267 1115503 1114016 1082737 1117442 1124066 1108809 1163167 1221183 1162172 1138984 1124210 1164976 1199596
6255 1199596 1186420 1194492 1209793 1215485 1229200 1230088 1227767 1234233 1253037 1283789 1209915 1254701 1260188
6242 1260188 1258282 1322094 1322291 1267160 1248329 1293280 1319296 1318109 1284686 1267983 1251146 1256560
6230 1256560 1257714 1223316 1239095 1281303 1294383 1280177 1245925 1236705 1230287 1289700 1301770 1241627
6218 1241627 1249760 1254510 1273526 1336839 1359723 1301702 1275131 1322531 1308250 1305359 1330847 1360197
6206 1360197 1363370 1333356 1297251 1311860 1320882 1319662 1330805 1308652 1320494 1330088 1336320 1330018 1378984
6193 1378984 1380693 1373728 1438457 1425023 1438438 1408703 1455828 1469177 1469794 1470840 1467024 1425031 1424369
6180 1424369 1427500 1463416 1495132 1532325 1552841 1538100 1545145 1589200 1577898 1583694 1613140 1621280
6168 1621280 1622424 1554633 1566304 1641688 1672307 1704079 1724688 1714574 1722168 1725251 1699736 1700720
6156 1700720 1745100 1762679 1807831 1817340 1825642 1803663 1861890 1856437 1823294 1814234 1862896 1893277
6144 1893277 1971650 1992166 1999676 2017082 2035777 2118261 2088574 2079279 2150726 2128979 2147815 2187915
6132 2187915 2168135 2219914 2268288 2303917 2386519 2418537 2454290 2513481 2560234 2609874 2620453
6121 2620453 2623874 2654624 2703083 2749698 2778239 2864826 2967724 3026064 3030011 3129463 3194907 3180990
6109 3180990 3218636 3300238 3404843 3494030 3594038 3652202 3708905 3777410 3864414 3914000 3894213
6098 3894213 3990793 4102438 4197648 4267052 4351655 4515844 4612593 4702583 4849549 5025983 5149712
6087 5149712 5328616 5504579 5746508 5948493 6209294 6481754 6755192 7077210 7471934 7869095
6077 7869095 8387261 9017455 9724492 10528908 11579113 12934738 14566413 16582942 19055778
6068 19055778 21894268 24924745 28045165 31028985 33051728 33855018 33589890 32093141
6060 32093141 29727023 27563575 26480410 26690926 27762030 29416437 31407681 33148308
6052 33148308 34160895 33951550 32525093 29682861 25818520 21836613 18733312 16459555
6044 16459555 14805415 13616914 12723463 11978024 11390503 10940790 10631675 10402726 10228335
6035 10228335 10112791 10118611 10179299 10281386 10394080 10519303 10732077 11004762 11368481 11805084
6025 11805084 12319939 13016315 13884570 15035293 16515717 18398056 20723184 23580290 26974525
6016 26974525 30699503 34753019 38731771 41955127 43696905 43903950 42520307 39721650
6008 39721650 36425300 34044042 33328754 34086233 35746266 38049693 40540640 42377305
6000 42377305 42773988 41573882 38614228 33958057 28431697 23453046 19706360 16960466
5992 16960466 14891065 13256032 11961422 10978560 10075959 9319372 8706042 8161722 7695880
5983 7695880 7320670 6936380 6575302 6282718 5971808 5701284 5442313 5150560 4892636 4633810
5973 4633810 4346553 4232936 4056283 3928754 3846126 3764540 3580496 3425750 3348786 3208910
5963 3208910 3112905 3022284 2981780 2923657 2832858 2790233 2703153 2695217 2671806 2603332 2558080 2591783
5951 2591783 2563233 2471531 2436068 2387175 2334246 2245682 2208518 2188471 2125334 2090853 2089902 2070918
5939 2070918 2080154 2074307 2031892 2024798 2026579 1992911 1968307 1989840 1958093 1954229 1935916 1887134
5927 1887134 1867210 1853572 1884056 1905868 1939844 1961108 2044511 2162309 2206506 2278795 2302410
5916 2302410 2317469 2387858 2412528 2436111 2505782 2520841 2510075 2499145 2418023 2344778 2252582
5905 2252582 2105750 2049090 1952104 1879595 1854284 1837356 1819541 1793121 1770827 1721546 1672721
5894 1672721 1707342 1745320 1811089 1869446 1924164 1970611 1989742 2031480 2105624 2117631 2081299
5883 2081299 2037982 1993306 2003511 2038054 2023424 1955418 1856561 1739457 1795311 1798294 1766457
5872 1766457 1715997 1736589 1729003 1754421 1787394 1732220 1726103 1728766 1768162 1826903 1861718 1889909
5860 1889909 1930061 1969233 2020607 2091983 2195202 2338550 2492467 2575009 2733583 2891263
5850 2891263 2996730 3103511 3148124 3125857 3064733 2906274 2707746 2580998 2468524 2409343
5840 2409343 2380592 2434609 2390319 2389411 2396066 2457538 2425142 2438256 2525524 2616158 2695105 2797280
5828 2797280 2960287 3013480 3097170 3244729 3439246 3582401 3748620 3905748 4129359 4245732
5818 4245732 4385271 4562203 4688971 4746648 4697464 4631277 4485767 4377960 4354674 4400377
5808 4400377 4454463 4520367 4647512 4769789 4950506 5206025 5424554 5719953 6091524 6490921
5798 6490921 6990750 7561884 8157616 8815832 9553639 10374459 11163917 11933270 12619123 13329029
5788 13329029 13947495 14454344 14783022 14919286 14853370 14516041 14028460 13367075 12556573 11770547
5778 11770547 11015180 10276949 9577351 8984270 8432871 7908484 7416616 7029943 6757226
5769 6757226 6454582 6280606 6141667 6012939 5883735 5796832 5745014 5770290 5758047 5751842 5723418
5758 5723418 5724606 5674069 5754673 5810682 5870217 5932229 6065116 6218254 6440396 6701624 6933984
5747 6933984 7186275 7418337 7686302 7935783 8259504 8560572 8967402 9486278 10121352 10908423
5737 10908423 11879543 13233490 14901288 16958246 19346952 21901127 24748091 27893925
5729 27893925 31151308 33799539 35016377 34881017 34142562 32497152 29185684 24946909
5721 24946909 21327805 18709906 16909695 15685350 14787965 14244742 13915598 13767404 13852698
5712 13852698 14152825 14641107 15463312 16676956 18317061 20390639 22808014 25445539 28339978
5703 28339978 31570311 34877477 37288419 38134373 37671976 36658032 34531307 30546691
5695 30546691 25901380 21989410 19152420 17169189 15792255 14828402 14186602 13809843 13578214
5686 13578214 13644221 13994757 14630545 15683475 17097219 18695540 20441462 22361686 24532536
5677 24532536 26567691 27814635 27980755 27407721 26537300 24621735 21550690 18376777 15991177
5668 15991177 14286721 13123077 12270479 11662589 11211487 10886312 10784708 10844660 11039288
5659 11039288 11447984 12092280 13052451 14368714 16007848 17785082 19775621 22008840 24390814
5650 24390814 26599611 27812920 27762050 27104086 25988188 23513041 19861116 16255398 13459449
5641 13459449 11471328 9977155 8908015 7980542 7266807 6601087 6064159 5609579 5272242
5632 5272242 4919511 4638995 4354090 4130926 3967728 3791028 3622491 3434146 3253696 3114779
5622 3114779 3009967 2872492 2739218 2637834 2553659 2479487 2391939 2306288 2240161 2138509
5612 2138509 2096662 2032712 1993391 1871494 1819694 1775120 1709640 1663117 1684189 1717680 1706607
5601 1706607 1620361 1651443 1639286 1573168 1607541 1644449 1637382 1621767 1565272 1548142 1507239 1459775
5589 1459775 1400293 1332451 1275813 1245249 1158151 1154477 1164455 1174334 1149278 1110222 1039924 1010994
5577 1010994 1015247 964683 1016736 1069498 1012243 984965 994175 986400 984944 978040 944467 883026
5565 883026 911166 951804 963575 912063 854680 921562 943099 887931 816243 860256 918660 961107
5553 961107 929850 850132 893271 907164 907002 914424 889469 893180 890106 862871 878504 841596 845065
5540 845065 846373 876321 874677 833698 814568 804054 867291 862149 838265 850850 880270 870274
5528 870274 861993 872070 837464 819655 832487 842366 851442 782572 760785 760481 819055 876407 849379
5515 849379 849390 828790 814805 795596 828226 891951 827081 783571 784012 799047 796765 827309 819990
5502 819990 802708 799917 794366 805553 780870 781268 738117 770897 743012 744743 741250 762223 735920
5489 735920 744869 764009 789503 828622 813917 793571 759454 769150 717084 750293 783138 798233
5477 798233 844571 846828 828471 818304 844025 898530 939632 986767 1055036 1048557 1063170 1119664
5465 1119664 1130666 1137283 1207703 1228203 1284577 1293785 1340908 1360728 1372595 1373267 1335164 1361699
5453 1361699 1406983 1419535 1425464 1449228 1480328 1491290 1589157 1666611 1815707 1950157 2024986
5442 2024986 2170693 2255899 2336433 2462999 2562689 2671204 2718762 2748675 2800877 2770879 2754465
5431 2754465 2638459 2550800 2541494 2525901 2490974 2499505 2608849 2648084 2673147 2769939 2921781
5420 2921781 3085740 3240241 3466383 3680368 3888879 4102359 4191908 4293122 4385604 4404605
5410 4404605 4353617 4241236 4156036 4055579 3916435 3812366 3739035 3599272 3486549 3438742
5400 3438742 3459068 3437614 3507160 3586084 3696385 3817294 3932183 4134210 4299767 4460982
5390 4460982 4585652 4667766 4663955 4598417 4537359 4429462 4293682 4174053 4062788 3842045
5380 3842045 3689505 3641860 3559021 3523646 3454358 3431739 3478139 3498927 3562796 3601981 3623431
5369 3623431 3662378 3732475 3808989 3853311 3879851 3862771 3885778 3839800 3693395 3664721 3605660
5358 3605660 3548068 3475108 3439629 3395030 3368529 3380915 3447957 3528708 3641614 3692749 3801133
5347 3801133 3977482 4139137 4315011 4503690 4835165 5161300 5470070 5810029 6234442 6724767
5337 6724767 7224003 7831996 8565307 9404997 10405031 11533873 12623388 13795884 15155368
5328 15155368 16689273 18200954 19386108 19945897 19985759 19961733 19542660 18213683 16386104
5319 16386104 14776393 13562008 12666688 12047725 11637571 11356284 11331291 11378764 11420328 11540227
5309 11540227 11683737 11906219 12170912 12479373 12649389 12526758 12439362 12549886 12423993 11988639
5299 11988639 11376322 10667745 9988429 9355228 8606142 7760385 6881353 6024609 5398729
5290 5398729 4892554 4500523 4163116 3854203 3615052 3434818 3302450 3143845 2982841 2834588
5280 2834588 2741319 2699255 2668536 2617244 2521592 2460090 2419462 2320230 2308841 2263334 2217374
5269 2217374 2287947 2220014 2131737 2080544 2031585 1970330 1946310 1891526 1949798 1847725 1792405
5258 1792405 1759055 1743129 1750966 1759288 1696712 1668020 1677161 1718612 1705754 1677173 1610404 1585621
5246 1585621 1538756 1502531 1520201 1465150 1421421 1385378 1396012 1376451 1279033 1247500 1271554
5235 1271554 1278875 1275885 1286084 1283474 1256555 1242203 1244137 1279238 1292042 1288000 1294702 1301293 1285331
5222 1285331 1322318 1341569 1380602 1411016 1398025 1346206 1378786 1399864 1452250 1457533 1444063 1392104
5210 1392104 1384236 1472816 1502456 1531976 1557268 1557207 1605687 1594238 1700376 1701171 1657909 1642913
5198 1642913 1696839 1710511 1794718 1845831 1909944 1960151 1997627 2043294 2088542 2158226 2233168
5187 2233168 2274957 2359691 2446677 2531145 2596399 2646922 2818527 2932658 3040905 3216696 3364986
5176 3364986 3564918 3800414 4001377 4177410 4351530 4516301 4628281 4724924 4779415 4813624
5166 4813624 4804826 4795632 4800416 4794730 4857341 4920076 4999911 5107034 5202693 5339166 5502588 5801317
5154 5801317 6050139 6417956 6821512 7296908 7876576 8553347 9358199 10315960 11253284 12319471
5144 12319471 13379022 14235829 14781735 15253508 15664837 15748474 15831416 16264004 17200248 18503297
5134 18503297 20039350 21896352 23733952 25234468 26128905 26857339 27304599 27012934 26676862
5125 26676862 26896114 27512854 28193423 29170109 30323291 31263869 32029866 32971562 34120352
5116 34120352 35137542 35523574 35976912 36414631 36253976 35628168 35176116 34770373 33791756
5107 33791756 32932104 32974776 33629875 34298333 34712568 35314187 35565242 34915519 33940092 33298449
5097 33298449 32613922 31399076 30331510 29457039 28466086 27571604 26959668 26701744 26582670
5088 26582670 26387114 26438407 26577314 26376910 25592988 24767661 23571616 21568412 19761335
5079 19761335 18662601 18187278 18123909 18310305 18884847 19454306 19776801 19564818 18943793
5070 18943793 17992068 16628346 14929761 13172414 11797248 10842655 10190585 9721193 9416496
5061 9416496 9272437 9299326 9420466 9605572 9956946 10404290 11033132 11736275 12214363 12512368
5051 12512368 12763862 13019534 12912523 12403160 11603126 10774016 10033048 9158836 8184361
5042 8184361 7324136 6739853 6402739 6133184 5987416 5942353 5930785 6063619 6248710 6433859
5032 6433859 6670633 6998163 7310756 7363889 7204514 6947682 6672791 6236521 5602019 4953585
5022 4953585 4354756 3968645 3639896 3367760 3213243 3101862 2942749 2806622 2717825 2654141
5012 2654141 2680305 2703672 2704557 2790640 2816863 2844222 2824214 2692480 2600034 2563326 2402693
5001 2402693 2167507 2044974 1922460 1832830 1746599 1664470 1601164 1539875 1505326 1539346 1525048
4990 1525048 1515187 1577607 1602815 1614068 1676537 1747679 1845431 1897477 1959600 1920801 1829902 1766600
4978 1766600 1731428 1572162 1407237 1296387 1200454 1180156 1133917 1100795 1077395 1046331 1006198
4967 1006198 961760 910317 909105 909339 907098 856905 853808 872218 832776 834239 875213 913453 915496
4954 915496 891730 905385 934196 961855 937322 893999 881371 879197 835579 836976 797064 713611
4942 713611 802030 799263 808752 825135 843506 859819 859065 881674 879803 860900 820230 771742 757262
4929 757262 713332 711815 715586 671232 666415 684646 699493 688740 674692 717608 655070 646927
4917 646927 704040 692608 630931 580818 534530 560076 612977 614258 560956 527166 562091 546350
4905 546350 550275 537204 594629 526822 512810 535170 501049 477106 509683 490285 470804 467646
4893 467646 483110 505558 464554 489662 507052 493688 525668 520936 495205 491427 475196 456485
4881 456485 458274 484851 484486 430696 506349 482747 463703 498685 532786 540898 474490 492674
4869 492674 560557 506792 492984 519628 495068 520170 543103 536227 612044 587126 529467 576386
4857 576386 586497 593824 638318 606010 604981 614821 624028 666374 687115 713839 710212 689997 700938
4844 700938 710008 700890 673911 606193 607836 623981 662539 626872 624001 642771 688859 664402
4832 664402 684772 690834 664033 691604 703932 686680 695144 715582 774935 726119 730861 797906
4820 797906 756963 817023 870774 819377 761506 799749 846981 830547 843672 888904 917776 916620
4808 916620 886194 863175 865709 939232 962166 961703 1024171 1037251 1048952 1054997 1074187 1087986
4796 1087986 1034950 1069476 1153282 1156678 1205455 1257283 1248052 1282376 1333090 1333001 1264999 1304592
4784 1304592 1332708 1364801 1440053 1425855 1418973 1454578 1487549 1565699 1646588 1652561 1688986 1718953
4772 1718953 1750160 1774127 1828799 1871145 1970664 2050231 2133416 2127754 2171200 2258872 2269596 2310185
4760 2310185 2416592 2518910 2620962 2680443 2736998 2811259 2880885 2978014 3068543 3211908 3310861
4749 3310861 3405079 3601878 3714035 3786964 3917569 4056051 4200282 4344459 4492773 4645841
4739 4645841 4813147 5023414 5293845 5561835 5890393 6237164 6560886 6917081 7333642 7797913
4729 7797913 8249354 8703873 9220197 9828918 10487795 11323256 12377221 13716947 15472682
4720 15472682 17615427 20138848 22852531 25852222 29125032 32107545 33826948 34001813
4712 34001813 33811230 32773445 29694447 26110552 23532558 22110782 21455727 21563156 22223255
4703 22223255 23504160 25509894 28219275 31616678 35696293 40574745 46096614 51446102
4695 51446102 55918899 59430420 62074222 62190742 58667136 54166300 49296917 42852030
4687 42852030 36366163 31411389 28107394 25888461 24537071 23927842 24054526 24809058 26191360
4678 26191360 28102745 30303726 32870110 35835050 38337941 39175919 38255261 36960166
4670 36960166 34397473 29464147 24131582 19984564 17025700 14817497 13198519 11900431
4662 11900431 10872814 10003903 9255806 8649175 8169539 7701144 7266279 6930936 6631156
4653 6631156 6340914 6130718 5832916 5599072 5380007 5239134 5068466 4882370 4687473 4572633
4643 4572633 4516231 4368425 4227438 4089598 4003435 3885187 3776566 3720147 3644345 3583630
4633 3583630 3568606 3503570 3434599 3427032 3384786 3333762 3249737 3240631 3232189 3218971 3111349 3100826
4621 3100826 3114220 3024702 3045053 3078468 3046642 3074437 3086271 3058598 3060489 3099920 3182726 3217964
4609 3217964 3219340 3233846 3258170 3283671 3312816 3341045 3303369 3367676 3415841 3485726 3548677 3617240
4597 3617240 3699405 3751658 3879923 3922938 3970916 4088686 4170457 4297393 4400558 4503436
4587 4503436 4649522 4747969 4854857 5017783 5147568 5260426 5418742 5641658 5857194 6052891
4577 6052891 6305421 6576389 6836861 7157253 7546790 7965878 8398662 8848204 9414330 10009582
4567 10009582 10764243 11685722 12723164 14038426 15696266 17749916 20287396 23250021
4559 23250021 26658410 30358773 34420694 38496613 41895730 43943458 44638603 44441514
4551 44441514 43010176 40428231 38210599 37301921 37810360 39364332 41752352 44508352
4543 44508352 46768445 47828688 47866628 47204355 45427133 42697464 40351290 39247839 39426720
4534 39426720 40356922 41244909 41330117 40668241 39482015 37391591 34591581 32066176 30770590
4525 30770590 30531996 31074695 32187100 33586092 34478464 34226270 33095965 31228739 28188408
4516 28188408 24183466 20330608 17269967 15014799 13328988 12069257 11015822 10153757
4508 10153757 9441094 8885591 8313665 7872449 7488988 7108629 6755784 6410693 6064307
4499 6064307 5777094 5522046 5256497 5039753 4853596 4676665 4451265 4304109 4113755 4002438
4489 4002438 3836173 3749843 3663520 3564284 3382469 3282674 3209259 3128980 3034268 2946450 2841856
4478 2841856 2816473 2797915 2734816 2585163 2540244 2513785 2468853 2449483 2398152 2364370 2346851
4467 2346851 2315764 2302074 2332849 2260820 2225113 2237479 2265782 2288670 2333988 2401047 2421709
4456 2421709 2464134 2622050 2830760 2996576 3230412 3454374 3640082 3741874 3674364 3446930
4446 3446930 3081344 2710899 2401737 2216145 2084025 1964810 1856069 1799145 1725083 1703970
4436 1703970 1669167 1564185 1508941 1510857 1450890 1451537 1441969 1399503 1306234 1333575 1354404 1309045
4424 1309045 1305673 1271715 1205239 1207873 1179271 1208683 1249016 1272595 1266697 1242147 1224783 1224698 1252711
4411 1252711 1208872 1207696 1202397 1206586 1191263 1202463 1202300 1204819 1221771 1246217 1235638 1196735 1214044
4398 1214044 1250299 1266453 1262703 1251893 1325056 1370150 1390606 1415479 1408933 1471922 1557096 1639053
4386 1639053 1717201 1779844 1841025 1833045 1841018 1748150 1590283 1542520 1483361 1518017 1503601 1427426
4374 1427426 1446752 1484134 1473044 1478316 1460562 1473673 1501125 1499683 1452674 1445741 1486272 1502768
4362 1502768 1438142 1396497 1424992 1395164 1360515 1336571 1362027 1356702 1320638 1318931 1348637 1367417
4350 1367417 1386526 1362916 1328695 1326756 1357700 1360482 1401575 1448470 1450340 1489047 1517833 1520520
4338 1520520 1555698 1532755 1607604 1634939 1631918 1614158 1684768 1667375 1684954 1759807 1743506 1763129
4326 1763129 1804008 1818468 1805405 1846858 1871503 1945741 1989817 2050438 2085610 2087769 2098065 2086688
4314 2086688 2136301 2248889 2290632 2323947 2300985 2388804 2503316 2544482 2613634 2716349 2826980
4303 2826980 3010936 3204876 3376273 3557555 3780878 4038450 4252673 4362348 4389466 4352548
4293 4352548 4214872 4028619 3851749 3750630 3682038 3631735 3601543 3594197 3574836 3518521 3531990
4282 3531990 3564164 3547390 3500865 3504623 3496309 3542935 3603820 3627358 3688471 3758236 3757655 3775041
4270 3775041 3849785 3885121 3947323 3990758 4029120 4092299 4156491 4219992 4267245 4355936 4426205
4259 4426205 4499687 4584736 4725978 4904011 5046702 5274513 5507981 5753834 5984061 6193591
4249 6193591 6351605 6505863 6508583 6511607 6471062 6416175 6372820 6353351 6417176 6497078 6667371
4238 6667371 6786580 6912698 7095660 7197613 7253526 7439461 7555665 7626429 7720079 7811308
4228 7811308 8000202 8248099 8474268 8714477 8961887 9217760 9477965 9781064 10115167 10470668
4218 10470668 10826546 11133732 11440510 11773725 12118596 12376604 12662031 12955201 13165483
4209 13165483 13444490 13768122 14035080 14360797 14763780 15259356 15611596 16059959 16507883
4200 16507883 16852355 17246231 17720668 18270688 18870786 19514074 20228460 21076165 22045164
4191 22045164 23108654 24236793 25358471 26610390 28024129 29556522 31276071 33130656
4183 33130656 35231880 37741577 40513400 43490260 46851287 50600910 54783378 59495903
4175 59495903 64832862 71011518 78770638 88768396 101790621 118152747 138664826 164081076
4167 164081076 195898797 234911790 280174904 327387812 369175653 394737420 394113267
4160 394113267 364134157 313687981 258689124 211844501 176802199 150113107 128715672
4153 128715672 110966620 96566753 85057965 76041590 68872301 63100072 58219716 54074461
4145 54074461 50344865 46955969 43831778 41021821 38543873 36311005 34215216 32299067
4137 32299067 30420409 28621899 26965355 25528543 24184146 22989886 21874159 20812614
4129 20812614 19825311 18893501 18043692 17184477 16303013 15547556 14827238 14186119 13628036
4120 13628036 13101427 12666837 12267823 11910409 11555224 11156093 10821126 10486212 10180958
4111 10180958 9910452 9619607 9324916 9092172 8846114 8646610 8438314 8256196 8120326
4102 8120326 7900607 7729777 7557770 7407989 7276379 7110495 6888216 6692357 6507646 6378331
4092 6378331 6171148 6021063 5858574 5632331 5432393 5235106 5048531 4847268 4665688 4580668
4082 4580668 4434360 4328665 4250562 4117857 3988707 3826349 3713196 3580555 3384949 3289909
4072 3289909 3238340 3136648 3125738 3167732 3175531 3099068 3076103 3059836 3042991 3022379 3001289
4061 3001289 3025392 3041389 3077253 3015269 2981024 2995796 3052039 3065494 3136906 3253115 3327311
4050 3327311 3441924 3600314 3851685 4054511 4241945 4373945 4454996 4372846 4272281 4165130
4040 4165130 3892294 3653048 3389981 3136899 2949174 2782450 2564507 2422653 2310119 2283657
4030 2283657 2182326 2070089 1964364 1935032 1920342 1856834 1843051 1796013 1761264 1732052 1698401
4019 1698401 1702423 1656102 1637433 1600418 1631629 1635175 1608127 1622500 1575670 1577350 1572869 1590548
4007 1590548 1552887 1576300 1643838 1682838 1764899 1876806 2044149 2190238 2279455 2442563 2530093
3996 2530093 2604055 2632686 2568009 2484690 2243701 1987052 1777774 1636032 1502368 1396607
3986 1396607 1359832 1294477 1243374 1220328 1188830 1154244 1107179 1064852 1048618 1013649 997253
3975 997253 960796 980281 935123 888552 876991 855419 843337 833255 814129 812585 793146 731323
3963 731323 733285 732926 717165 701663 691843 609586 566017 561325 562273 577042 562566 526556 494428
3950 494428 535010 497111 526087 521255 572965 596620 563073 565084 601503 594452 561505 532585
3938 532585 476610 504518 493403 523968 531152 524493 485693 507474 558591 579281 557276 550203
3926 550203 527985 528015 572268 533978 473937 460591 499686 523736 452194 464649 504085 483007
3914 483007 483835 465689 440120 442374 483081 495407 515737 492026 454918 463793 487856 479707 445425
3901 445425 474446 481618 476547 519714 477562 480910 499777 577371 542151 530368 516922 510074
3889 510074 493384 523474 570248 601451 655760 700958 703167 732643 796106 882133 979918 1128197
3877 1128197 1291649 1455815 1658262 1909838 2138746 2339939 2469904 2342960 2124761 1830559
3867 1830559 1588737 1392151 1235028 1027217 925767 867010 815007 780226 728331 675606
3857 675606 605339 625213 605175 573851 582843 538752 469765 491485 516821 479821 464522 473255
3845 473255 492929 431971 437255 467779 439452 471701 474535 393313 357110 323820 390407 426110
3833 426110 447025 439111 414678 345049 441057 424309 388531 381200 374294 411940 400106 391730
3821 391730 415814 430146 391813 384419 446518 463237 435165 433875 431767 412625 412524 463129 434578
3808 434578 430906 466732 457172 449587 420590 449185 490534 497205 459019 397595 435356 480851
3796 480851 477570 478176 450050 447601 437075 446071 463853 465393 481803 525062 523045 542417 540369
3783 540369 494649 510541 474513 534457 516044 488875 433685 461848 449241 500543 514938 526537
3771 526537 490234 513664 530340 517798 503295 536266 579117 610851 588737 571251 537895 528927
3759 528927 547582 528590 516004 509606 548909 508005 522562 500206 501650 461876 430623 432164
3747 432164 492127 459959 446841 477715 449068 462867 435380 441364 442956 427139 441164 406625
3735 406625 388591 434811 433314 475738 475547 417296 439214 417980 409726 448530 498047 480446
3723 480446 439896 432112 445685 424722 409680 449996 449917 450735 481329 510885 513734 463982 416327
3710 416327 458244 509499 460835 446593 494676 505189 483919 490175 488442 454035 481101 481570
3698 481570 504365 493054 572896 550084 526203 561031 588553 572602 539393 574383 578141 580446
3686 580446 530285 529382 577293 619760 568666 546980 562712 581464 573308 562417 573045 578219
3674 578219 586835 588506 621009 609862 599352 654980 583995 607581 633425 589125 575789 588279
3662 588279 555112 586078 635102 634798 639999 669440 624160 639035 693301 694187 614491 601675 635836
3649 635836 639793 678079 685502 696330 668298 669379 627790 632698 691734 662180 613147 629343
3637 629343 655626 642254 648461 639903 666555 661416 629942 682526 686046 590812 585796 560253 541040
3624 541040 561943 621609 646808 603214 623803 643623 665885 640205 612292 582504 596640 568971
3612 568971 603248 594232 582504 581749 590605 606979 636565 631711 628656 637012 638489 702156 693517
3599 693517 637587 620468 592655 605186 596930 620637 573440 563673 643397 600246 598819 590075
3587 590075 631299 639724 576371 602470 604175 650852 648917 610700 624042 610371 584671 574042
3575 574042 629263 637782 636304 603248 619253 668168 671272 686228 690878 721204 679374 641651
3563 641651 677685 719748 704552 721545 748138 717800 720272 713299 705740 683142 708865 712376
3551 712376 680019 649124 663962 662245 627769 684471 699446 698484 745032 729908 660071 613226
3539 613226 655430 715056 706686 720629 776245 753414 753309 716866 660121 676240 705122 757430
3527 757430 771179 716902 722834 706993 740589 759481 739949 762547 748170 762931 818779 778854
3515 778854 759488 771634 748161 745885 741706 806375 815269 769509 755033 775401 754835 738241
3503 738241 774315 849766 842405 815713 756008 794452 790763 806806 819411 805110 813391 831850
3491 831850 857657 835616 811481 801708 823352 821703 878423 858892 802560 829864 885756 917898
3479 917898 908995 874786 887640 866792 871278 827148 900078 891628 876472 846500 903544 914572
3467 914572 896126 923674 875605 941538 926051 910605 932610 943157 887667 837286 853966 877415
3455 877415 902717 913435 936747 921630 902934 957914 978688 944683 919039 931328 926357 945142
3443 945142 942084 992053 1015500 1039897 1064094 1078486 1142292 1143585 1131144 1157747 1198477 1213454
3431 1213454 1227603 1310396 1361560 1424658 1492945 1583743 1704964 1830749 1954392 2130242 2323258
3420 2323258 2489649 2572950 2588820 2523989 2373233 2144508 1959767 1824935 1716230 1693174
3410 1693174 1654111 1635525 1598142 1558840 1576366 1560624 1579287 1626015 1640491 1651158 1692138
3399 1692138 1760427 1847991 1951562 2050837 2186702 2353288 2515025 2790173 3163246 3503841
3389 3503841 3822314 4130952 4343709 4362687 4242059 3837022 3320337 2904742 2588900 2380208
3379 2380208 2203228 2122138 2058837 1979957 1961018 1911421 1908735 1894601 1896219 1897139 1883888 1879839
3367 1879839 1896509 1930916 1973646 2041454 2137003 2229071 2257337 2370828 2566551 2718553 2930653
3356 2930653 3087118 3210160 3232623 3138055 2985063 2704350 2497844 2360982 2207724 2119311
3346 2119311 2075745 2043413 2078614 2025164 1981041 2006099 2004062 1986895 2041500 2058066 2039684 2036854
3334 2036854 2012025 2036323 2018142 2010591 2071017 2081913 2155065 2154252 2184927 2233945 2258793 2313564
3322 2313564 2308905 2391423 2450234 2468332 2463396 2501322 2535877 2560347 2539897 2557802 2544513 2607356
3310 2607356 2699545 2710601 2715510 2714719 2775250 2825961 2884287 2945477 2989577 3046974 3148407 3272738
3298 3272738 3360293 3443343 3512942 3595168 3743017 3847736 3872019 3834770 3781963 3799162 3865326
3287 3865326 3958528 3993602 4009842 4052976 4132173 4252866 4346392 4461722 4584330 4689740 4850179
3276 4850179 4982176 5149021 5316972 5542024 5762921 6063384 6384989 6766233 7136580 7531349
3266 7531349 7923695 8413095 8984125 9461566 10004856 10501034 10915791 11153133 11204217 11028992
3256 11028992 10753012 10339665 9865558 9236812 8639579 8076905 7559331 7107905 6747277
3247 6747277 6434686 6169179 5943225 5745334 5535228 5344808 5159754 5048929 4952528 4824451
3237 4824451 4786397 4720209 4615655 4512990 4399921 4337831 4284739 4238917 4203662 4129387 4014658
3226 4014658 3853017 3709928 3554473 3395550 3295668 3235044 3168959 3052369 2963449 2882961
3216 2882961 2841143 2829408 2736917 2705740 2663151 2637201 2638162 2607977 2609013 2563133 2543296 2497180
3204 2497180 2448957 2406263 2392255 2322667 2229577 2204348 2163564 2118618 2115968 2166899 2105797 2041351
3192 2041351 2048417 1992406 2000638 1993566 1965707 1893427 1863516 1920380 1855803 1818979 1790654 1832242
3180 1832242 1817968 1840103 1767656 1725969 1772691 1713351 1676452 1654950 1671221 1660606 1676001
3169 1676001 1656101 1653389 1616750 1574917 1546192 1540719 1500576 1484929 1537091 1540136 1531349 1505296
3157 1505296 1490919 1513631 1502126 1445515 1422037 1382355 1425794 1361503 1362756 1371639 1384039 1369301
3145 1369301 1369911 1366090 1334246 1370929 1352690 1292609 1285976 1323520 1287600 1282497 1305778 1284940
3133 1284940 1245754 1169182 1203223 1242392 1292361 1282864 1240117 1201056 1171297 1158653 1144185 1148724
3121 1148724 1108159 1125125 1138822 1088489 1128876 1200028 1195117 1114770 1109272 1054491 1039486 1085167
3109 1085167 1089911 1144195 1131971 1115046 1067083 1103902 1101049 1102778 1074052 1002187 1015714 1055538
3097 1055538 1058183 1053991 1050953 1101170 1084792 1063150 1042285 1004694 1024783 1033026 1023985 943222
3085 943222 900544 953193 978464 1004420 973104 908927 922563 954145 976628 957894 968133 929670
3073 929670 907597 930252 962230 918192 858268 904933 931096 943641 945591 942444 945003 966253
3061 966253 954780 938508 956506 911233 883029 888064 832983 823131 837582 873586 863760 855811
3049 855811 839494 855078 880184 893284 905404 900345 880528 852465 828895 858197 900088 895463
3037 895463 877237 860391 865346 842034 855187 900097 928454 969243 918170 855726 885337 902256
3025 902256 890803 920538 893997 922073 948228 940452 914861 918980 935391 916457 923086 979488
3013 979488 998134 978012 994738 1046182 1019325 989812 1007588 1021410 1036366 1084771 1043680 1030574
3001 1030574 1055569 1044409 1056016 1099037 1057837 1080663 1145035 1163919 1220836 1243195 1242805 1233402
2989 1233402 1217967 1204219 1236561 1241300 1280436 1295405 1339645 1354752 1343371 1350908 1431304 1398641
2977 1398641 1420987 1486137 1500356 1456224 1418759 1404437 1436734 1406001 1409261 1456241 1443656 1459708
2965 1459708 1490846 1505778 1536213 1573098 1606925 1585834 1594534 1621963 1707439 1732082 1734575 1815240
2953 1815240 1883502 1898618 1913159 1932886 1979876 2066236 2164202 2232895 2258578 2252974 2274803 2296353
2941 2296353 2367862 2432430 2413181 2412130 2441724 2464604 2432886 2463928 2530779 2572466 2610597 2673873
2929 2673873 2701819 2732407 2783406 2833955 2920429 3020587 3100865 3191035 3265213 3397497 3544213
2918 3544213 3695649 3782112 3892047 4028798 4086600 4071352 4030819 3985447 3899391 3789111 3711526
2907 3711526 3592581 3510576 3449175 3420038 3406591 3429921 3438580 3485539 3510104 3519977 3550333 3580194
2895 3580194 3601179 3660185 3696053 3704946 3778844 3767373 3737922 3727839 3748783 3758317 3705241 3621592
2883 3621592 3542833 3457912 3361341 3245469 3197593 3102561 3045511 3011982 2958382 2888768 2836418
2872 2836418 2814639 2781057 2733293 2715953 2712877 2630614 2583083 2519668 2430765 2393745 2305450 2205279
2860 2205279 2158432 2121375 2079135 1975801 1930058 1844363 1769686 1721359 1638669 1636814 1637103 1649805
2848 1649805 1614064 1497209 1438639 1469478 1444489 1438647 1398794 1308337 1299150 1266517 1297435 1322800
2836 1322800 1283086 1221012 1159544 1183958 1132379 1105017 1024661 1004112 1039159 960326 948565
2825 948565 894840 937525 962239 960277 968575 930990 890642 859918 884100 896954 889235 881418
2813 881418 822680 819596 838696 798598 716604 690364 689750 690311 710192 668966 641528 702534 655301
2800 655301 626148 633446 614958 592706 595795 579376 560512 546863 522349 484817 448468 480646
2788 480646 514345 532628 502088 445718 470154 482061 445346 481364 474433 470591 464263 459604
2776 459604 378822 410235 467048 451089 455097 435181 416084 414509 368115 377684 422669 439370
2764 439370 370057 346024 329997 310122 292273 328969 334087 350478 343967 339714 334618 312986
2752 312986 331635 293085 295662 286205 274972 256404 202888 223225 227421 230557 242314 196255
2740 196255 230924 224921 277182 218129 215752 196758 208475 232869 202580 245834 233277 186353
2728 186353 178710 218412 226777 252284 232847 236378 216236 186222 196116 226681 186500 141171
2716 141171 137334 107628 154794 133260 109011 125625 140956 161313 139780 135460 143469 135002
2704 135002 141868 142677 125410 89164 125909 131431 133523 147928 133710 128596 139237 173592 137903
2691 137903 189568 157140 83103 96452 163161 110495 80585 67863 62594 65149 70342 95400
2679 95400 80823 90515 107264 89997 76784 71306 70510 99869 126903 129720 108549 73770 62248
2666 62248 65396 95691 131677 109758 130122 126461 106404 114600 139395 106562 108806 83373 91692
2653 91692 103123 120271 94766 49871 83391 121579 99101 108559 124612 73563 75349 78927
2641 78927 84041 119912 110099 39209 20301 97057 111974 118914 104288 33678 51422 87961
2629 87961 80419 66350 77910 64115 62684 99323 103547 125750 102183 102723 94821 73468 81570
2616 81570 109528 117503 88042 123441 134481 121072 121716 124211 134654 76949 66491 85937 70569
2603 70569 98275 63782 69067 48384 64739 53943 74128 80565 56400 57912 82485 77423 3449
2590 3449 16790 14475 -18789 20579 73492 69781 99844 70646 62475 74129 73281 42771 18625
2577 18625 65781 85348 26377 10487 18012 50685 59450 -4975 -27712 19421 21738 14639 44137
2564 44137 55333 40644 70876 16470 -9807 -27336 -29171 29946 7803 -12690 5435 25565
2552 25565 -39016 -15088 -3434 29792 13586 -15259 11825 8784 26435 52231 66839 45098
2540 45098 7380 19851 63857 75839 25586 -27320 -51179 -41550 10787 75966 41797 13305
2528 13305 -10886 40708 57939 4991 52227 68123 17692 -16333 -1488 38249 34330 55721
2516 55721 36438 1003 14873 35548 -40008 -51981 -33031 -17345 26427 48537 26304 33381
2504 33381 58247 38128 18817 17427 1040 -1635 8356 -22523 15349 -11788 5097 58623
2492 58623 31006 21888 -14780 -28047 -17257 8358 22201 -46879 11876 20995 31497 1570
2480 1570 26911 35779 -8238 22800 33441 8984 39890 33237 25406 46893 -1506 -48412 -74745
2467 -74745 -91389 -24130 -11829 -13085 49020 30688 15634 -3256 -19976 -7519 -19317 18187
2455 18187 -7678 4446 42863 49232 25517 -34584 16152 -17888 -8900 15644 -25073 -30935
2443 -30935 -41391 -29206 -45098 -94955 -51370 -18404 19592 29126 -690 -24224 -74009 -15245
2431 -15245 -24831 -20369 -7888 -2523 18381 59660 38302 48345 22542 -48671 -47482 22198 69924
2418 69924 22145 22443 5643 -1934 -13126 -30745 -6154 -15355 -35037 -2672 -13048 -17785 -58836
2405 -58836 -55524 -29277 -36298 19024 -24838 -38374 -6456 -22843 13267 5477 58570 -24501
2393 -24501 -9095 -11226 -16818 -5653 25428 24836 2250 24396 44863 62836 57352 93724 91933
2380 91933 65512 12074 453 68358 52943 27501 32120 16530 -31542 -70864 -71676 -29584
2368 -29584 -53630 -72236 -11255 5384 -36791 -14028 19949 44895 34090 19289 28560 -6855
2356 -6855 -4567 -14743 -19733 -14729 -21363 -24811 45221 25314 36691 -41157 -56814 -39411 -4012
2343 -4012 8155 -52935 -35239 -19905 -39479 -54278 1047 -1767 -14298 43494 28660 10018
2331 10018 10631 14785 -23992 -8413 21937 -21048 3626 18302 -1206 -13652 -5965 12482 -10104
2318 -10104 -24498 -5923 26717 38541 26606 -9427 2935 -43196 9359 3008 -40734 -2198
2306 -2198 74517 94508 54778 53861 17553 19292 9401 -19937 6145 -5559 3024 539 -19539
2293 -19539 -11203 -23690 -10805 -44968 -2710 37784 92638 17955 -16929 3842 25673 5705
2281 5705 21155 21196 -16361 -41328 -39431 -18458 -29364 47592 30610 24065 79993 95063 36022
2268 36022 4210 23018 73452 34197 -2744 43052 83885 77767 34356 51030 68475 44362
2256 44362 45309 -5977 11037 5118 41780 84418 21259 55473 85640 66706 27758 -3110
2244 -3110 63988 98309 108618 110790 67587 75051 35906 33637 39875 81976 75163 54800 57382
2231 57382 84851 58346 16757 5283 64842 96656 76076 62939 79449 52729 54131 12406
2219 12406 35978 108661 158203 130402 99491 107233 93210 50367 76672 119424 104182 121577
2207 121577 65952 136808 183590 185297 198031 191907 152495 137379 146320 136788 140862 193915 190127
2194 190127 161594 165238 156269 222674 223824 210120 219049 195650 193514 180886 181685 191835 213540
2181 213540 233291 218247 218332 293497 287123 296037 323226 305382 303697 347987 341411 334843 346181
2168 346181 357630 387563 404268 402234 442819 433361 436392 439885 474689 464184 474058 545058 514701
2155 514701 522387 616313 635101 594264 590895 620107 669431 718897 798729 849237 818724 874844
2143 874844 907547 988955 1051857 1084613 1111016 1179743 1312002 1405510 1567912 1719423 1860065
2132 1860065 2039414 2263342 2504129 2695727 2797015 2950133 3206380 3597320 4159978 4865952
2122 4865952 5741281 6972510 8487799 10325562 12757996 15712302 18289085 20115018
2114 20115018 18988339 15202302 11488036 8812643 7153719 5903661 4968106 4264262
2106 4264262 3738048 3314259 3052771 2864780 2742226 2570981 2414031 2289144 2107111 1921938
2096 1921938 1730949 1644895 1527067 1381844 1338564 1270365 1154666 1129749 1079799 1039090 1003009
2085 1003009 887514 825353 793447 819021 770095 745425 639566 598367 572468 534867 528085
2074 528085 484157 513193 525777 503500 486867 494066 513486 449651 433343 421077 364277 367500
2062 367500 329045 391772 362844 324608 389000 407745 398633 368706 321833 305502 273045 237537
2050 237537 311976 332705 292376 303423 330775 272957 253118 219697 260041 209042 177813 153737
2038 153737 178853 168211 185447 226857 235439 181299 132427 160249 130046 124777 126706 120895
2026 120895 60177 61116 96630 69427 38357 44138 60721 44583 2795 47782 69714 77534
2014 77534 73278 72319 88120 118103 52039 43324 74710 68037 44815 24195 -6443 9960 -2169
2001 -2169 65459 11193 1506 59670 46490 11840 7372 56406 79152 38312 3073 18064
1989 18064 19124 28269 36725 63803 45495 46410 75567 113946 117389 75032 37476 52152 84015
1976 84015 69271 63336 19294 -22850 10142 41276 22407 -5982 -12219 44088 8055 -2671
1964 -2671 6975 32476 22783 -1801 13367 5005 -30867 -6269 -10934 -40331 -42883 -28824 31302
1951 31302 9513 14931 -8624 -16649 -655 17614 25959 8785 -963 30905 44064 16521 -57768
1938 -57768 49782 54171 17703 -16917 -18405 1766 -14756 -9823 1531 -8966 -8312 -14616 37099
1925 37099 60666 28080 4501 -23785 -6353 17289 -20631 -30366 -16871 -57197 -60013 -50995
1913 -50995 -2372 51640 33874 60114 54927 -26060 -34615 -20931 -38135 291 35357 -31354
1901 -31354 -42452 -19616 15151 -27824 -39028 -13418 -34423 -27062 -26274 -32586 44869 59385 -11157
1888 -11157 -33436 -80892 -33875 -22776 -75043 -28708 -18426 -12621 -17499 -24233 -24360 -64201 13058
1875 13058 41076 -2377 20421 71540 47507 -24408 2804 36958 10895 -5552 -32027 -10081
1863 -10081 -6602 -204 14518 -23138 -21237 -11718 46847 8433 32866 60361 94724 76258 13321
1850 13321 42755 60338 30239 70840 111828 97731 115686 88922 59467 112805 85383 77490
1838 77490 62437 48245 87063 37721 -3383 -13936 5357 -2338 -15300 -54763 -65620 -24462
1826 -24462 -2559 -35281 -31105 -36976 -17069 -25280 -50335 -57814 -39149 12560 -38017 -31077 -6795
1813 -6795 39033 20520 2302 23931 17363 -6344 659 -12458 -39051 -10758 14628 28252
1801 28252 10141 -12967 -44274 -66506 -58411 -31646 -22215 -13942 16159 14084 -24127 -20471 23334
1788 23334 28035 -22340 27285 55199 39189 8169 18402 7523 -5616 -62603 -39923 -59627
1776 -59627 -71681 -73431 -118190 -77033 -39210 -24125 27259 -5287 -83650 -58791 -9708 -53635
1764 -53635 -77444 -69743 -27491 6336 -44238 -49081 -64348 -7261 38117 48426 9547 -1750
1752 -1750 -25144 8569 3355 -66149 -16283 47110 43407 -44275 -65051 -8371 -54873 -18484
1740 -18484 -23557 17671 54576 10172 15450 73138 32984 4227 -38059 -62828 -27115 -59493
1728 -59493 -17347 4569 -55099 -17799 16757 7039 -19296 4795 -37622 -51190 -24984 -26216
1716 -26216 -42835 -18461 -23294 -16269 15130 4951 -45025 -40326 -36600 -30005 20641 -5164 3653
1703 3653 -26796 3400 -13791 -47830 -72984 -25287 -45441 -50238 -22669 7489 3926 9366 -301
1690 -301 36767 22464 -9864 -40446 -19017 -46338 -19059 15950 -3335 51867 15516 -24688
1678 -24688 -7128 15365 -13959 -65154 -44543 -63310 -76693 -38521 43746 15109 53842 31327
1666 31327 -13498 28467 -1090 -35865 -25326 -27300 -20716 -36342 -15881 -15225 -30615 -58368 -29031
1653 -29031 19619 -23767 -23359 5149 -24839 -20443 26492 -33879 -35684 -22509 -29039 -33520 -30589
1640 -30589 -60151 -8241 11881 28164 -1569 23324 -2132 10917 -15057 -7679 18699 -53360
1628 -53360 -20895 37269 -9556 -49211 -74252 -24288 -37500 -43220 -20872 32651 31066 -42127
1616 -42127 8970 43205 31638 5144 8083 -37358 -89531 -43254 -58578 -54104 -72398 -55608
1604 -55608 -50754 -83492 -35622 -17329 -78793 -66645 -9042 19585 -31916 -45610 -25203 35977
1592 35977 -8967 -34395 -12504 -18648 -3584 -27711 -3982 -9734 -28631 14837 32185 -20099
1580 -20099 -53578 -45412 46724 57026 20128 -4121 30619 22457 12907 36680 26808 -7190 -22065
1567 -22065 -29842 -25216 -41677 -68470 -72596 -11169 -14395 9737 -7432 -31637 -27102 -52030 -65866
1554 -65866 -74715 -84110 -43082 -37794 -52002 -57922 -79221 -52602 -59987 -57701 -23945 -13748 -7774
1541 -7774 -61065 -37577 7079 11378 -20002 6729 10090 7235 -7220 24003 -33111 1519 10001
1528 10001 12221 -359 -78613 -60637 -80038 -84804 -64927 -51889 -22172 -52115 -85590 -58731
1516 -58731 -59523 -17643 -4455 11498 -39598 2989 71586 48020 16838 24236 -30806 -46062
1504 -46062 -70648 -24948 12009 20175 6007 -5283 -24487 -28678 -15849 -15406 -15769 -34324 -12959
1491 -12959 -2014 -42036 5292 -6601 -34637 -38211 -24888 9160 -70361 -41086 -2561 -6187
1479 -6187 34481 11674 -23865 22881 49465 10560 6912 5601 2077 52917 35481 -2341 -1160
1466 -1160 -31776 7898 -22200 -27471 -63713 -56021 -63594 -93828 -46292 -62955 -58109 -45127 -56277
1453 -56277 12439 30878 20476 13508 -27391 -5327 10336 3943 -31436 5130 -23838 -42244
1441 -42244 -26067 -42893 875 7919 -11829 20992 7435 -15587 5285 3263 -60662 -26700
1429 -26700 -16346 -40997 -37026 -22048 -29022 -53550 -62483 -46065 -15472 -16773 -25848 18689 -21892
1416 -21892 -84629 -68819 -53531 -51755 -21171 20480 4090 -16322 11903 8379 -5041 42408
1404 42408 -31919 -63770 13274 48169 70770 48080 14198 12789 -2873 -12091 -11492 -6050 -11589
1391 -11589 -7790 13764 -8342 -22655 39701 -1237 -45984 6104 67840 7243 -12993 -2503
1379 -2503 5978 -6559 -57084 -25490 -61169 -6459 39568 19289 -66559 -75563 -51342 -16739
1367 -16739 -23634 -34007 -31879 -54058 167 -16898 -77053 -8547 -49531 -26605 2254 23559
1355 23559 31934 31740 48044 23437 15675 -39766 -41644 -44032 -26876 -9108 -30971 -51882 -32793
1342 -32793 -51190 -24280 -8121 48654 42653 23626 40130 6690 -23354 33965 9997 -10755
1330 -10755 -54303 -45961 -18346 -30706 8897 -2656 -16206 14793 -12792 -5143 2323 -10879
1318 -10879 -2483 -17827 6179 51004 8034 -857 6051 25789 -4919 -38687 -22631 -19737 -24429
1305 -24429 -68275 -16417 1261 -40038 -62950 -31578 13701 -16319 -33803 -28600 -26678 751
1293 751 -1246 23839 65655 82471 77354 15432 -1705 10359 -19249 -23154 -27479 -43448 -23206
1280 -23206 3110 -38335 -13305 8542 -2694 -39570 -36516 332 4938 -477 -17312 5836
1268 5836 16064 -15043 -23393 -27120 -24780 -26881 -15147 16629 37251 19760 -8139 -54393 -92928
1255 -92928 -65757 -57379 -70666 -16637 -21270 -17693 39603 38642 -10241 -37407 -68013 -49316 -39719
1242 -39719 16853 17053 -18459 -22628 -10801 -14563 9876 -9467 18284 20793 3502 -6002 -45585
1229 -45585 -32488 -16807 31520 -61066 -44310 -6596 42476 55610 42298 47118 11059 29815
1217 29815 46627 68285 32034 -998 -28875 -28086 -3600 -39789 -12166 -15985 -52998 -54762 -1822
1204 -1822 60738 24755 17742 -18589 -50316 -17884 -14992 25280 5372 28744 64915 57391 1063
1191 1063 -10107 -28268 5196 20231 -9824 -37615 5485 5948 -20277 -44096 -40805 -19220 27107
1178 27107 -21144 -30610 -15247 -3234 29147 51580 6995 4352 29040 -46408 -38271 -36611 -10024
1165 -10024 -27312 -19099 -51449 -3143 -18911 -31073 -8600 17420 -8009 19387 13447 -43977
1153 -43977 -51733 -44847 -40064 2927 26928 7553 -8550 -9670 22425 -27274 -38531 8389 11484
1140 11484 13655 42032 8663 5748 56352 -24700 -11337 -1829 -25267 -4771 33511 28411 3926
1127 3926 28016 25420 -5325 -13641 2355 13900 -19661 -43145 -39992 -30271 -26716 -29205 26445
1114 26445 39031 -26521 -100622 -46895 10191 21665 3398 12705 45337 93466 59194 31549
1102 31549 20725 -7906 -2194 8904 39115 38660 32873 -47375 -58328 -17166 20598 -995 -79227
1089 -79227 -72749 -13181 -5321 -12579 -83 -2803 -18036 -53913 -45688 -7361 1356 -34836 -4808
1076 -4808 -14410 23 13638 12692 1508 53660 58719 29551 24414 -5325 19159 8455 -48395
1063 -48395 -36407 -41487 -58088 -4516 3901 18153 8951 -4757 28672 -19626 -9921 22961 -8778
1050 -8778 -7006 -7966 25627 42907 -7732 12322 -18445 -6473 3628 -5352 17255 26102 -36228
1037 -36228 -65390 -50315 -24444 -28108 7491 17584 6537 39101 17107 -5261 -5035 21152
1025 21152 -31694 -14268 -1143 -11631 -9172 20508 -47144 -44940 -23215 -9756 -18159 12684
1013 12684 21578 5177 4748 -10264 -18555 11843 7726 12924 2768 -33539 -24768 -57698 -81839
1000 -81839 -21521 -37701 -59718 -63631 -52784 2750 -13358 -29980 -48497 -55483 -4017 11607
988 11607 -63423 -20295 6773 -3021 29008 21116 -33094 -8297 -32545 -28747 -1031 -7438 62466
975 62466 68596 83554 17927 -2556 -7717 -40433 -41636 -1834 -16471 1255 9839 468 16694
962 16694 -8998 -27532 -21064 24475 2210 4376 -8360 15285 45562 46774 16983 20551 -2483
949 -2483 -17544 15644 -2738 -31904 -47554 -43165 -22727 -53045 -54298 11896 -8910 -23428 -28025
936 -28025 439 40309 49791 60552 -3791 45802 59793 41672 57498 35858 -20734 -15209
924 -15209 55043 38465 -13736 -8832 -20470 -2680 49564 27312 48696 78459 39172 16538
912 16538 4645 67206 67895 31944 3202 10515 23889 -40607 2506 40869 8089 -21368 -2156
899 -2156 -682 20418 10735 -2601 14520 -8829 -13026 -7847 -52421 -98034 -33987 -36086 -28749
886 -28749 -46333 -71236 -36372 -43083 -29387 -5901 10163 45749 47865 10221 -31426 -39135 -14839
873 -14839 -3545 -12785 -17562 -41207 -21609 -14581 1691 49907 61085 27071 -11356 -13017 14148
860 14148 -8437 -27613 -14929 -2756 -6721 -27503 -20403 -21402 -493 5559 -15897 -19307 20737
847 20737 17562 32013 -1262 10181 -3811 -29591 -1930 -741 -34244 -7064 8806 -18341
835 -18341 -16679 15819 44226 21066 -38600 19867 42419 49108 64232 25810 -12170 -54493
823 -54493 1285 24676 29569 49869 22067 -11690 -32485 1951 17816 -11703 -21707 2282
811 2282 -8478 144 -217 -2173 -11311 1055 -13559 -65333 -43472 -47876 -50425 2714 42200 -2984
797 -2984 10657 32315 -12190 -9154 -32690 -45568 -23914 25136 15702 -14586 -34305 -8817 -4313
784 -4313 -29895 -58184 -39797 28157 16365 24638 42379 16046 -14132 -31086 -16856 4997
772 4997 -13347 -27866 -33598 27777 11786 -45769 -54417 -12617 -18781 -40423 -58650 -45717 -65979
759 -65979 -68196 -46724 -18391 -17002 -14473 -11776 -9479 -36880 -25582 -43097 -12853 8037 -25755
746 -25755 -9291 -4442 13264 -25764 -10289 21470 -9194 30994 18013 40144 37433 -2584
734 -2584 -70 28058 -8025 -7342 -3343 2086 -6701 -48535 15982 18006 15402 6371 23224 24016
720 24016 33501 25677 32378 50626 58919 29047 -23748 -45041 -38724 -15443 15355 -35782 -33106
707 -33106 -88284 -85067 -24301 -12621 638 -14474 -11016 1659 22865 26098 27949 -4967 -6914
694 -6914 23463 10995 804 -2993 -7678 -43684 -65072 -44091 -9254 -8473 -4497 -13382 -33872
681 -33872 -9682 -12605 27689 46861 14479 -2419 -26389 -3392 11042 -48134 -32100 -6274
669 -6274 7674 11750 -45689 -25575 9311 -3008 16077 -25490 -49972 -92438 -76088 -10015
657 -10015 -11519 -9011 -9776 11286 45695 59944 43762 39747 18321 5872 2974 25800 4724
644 4724 -37201 3310 -12957 -50184 -51925 984 -14852 3250 77435 42382 7808 18503
632 18503 68674 79567 76962 -12551 -19955 -15680 6871 -47234 -59747 -19966 -11670 10436 38180
619 38180 14283 -20293 27754 80493 88721 25467 25308 37484 28795 -1292 29794 41050 6071
606 6071 -27044 7268 8784 -18597 -13535 -1102 9146 37560 -6141 30570 34207 -24124 4449
593 4449 6602 -7406 9055 14662 -37871 21539 96422 52882 -8779 -918 37774 49710 -9939
580 -9939 -24651 -29006 -15266 -14363 -14241 35504 31940 12510 8959 39604 33076 7920 61474 72853
566 72853 23904 27464 58469 41109 54092 -1432 17590 12748 -50706 -6084 3267 -33880 -8005
553 -8005 -13609 -28975 -16341 -34455 -60294 -110690 -72051 -25506 -67553 -73197 8284 26376 -38892
540 -38892 -118099 -46987 -42329 -36948 -35590 -40777 -20086 -17371 13744 34467 -9444 -21698 -22860
527 -22860 -13804 506 3758 -23030 12124 -7552 -7333 41783 31077 32431 64077 -2935 -5043
514 -5043 -6866 -30006 -82522 -103172 -68103 -16793 35566 25992 50472 17173 46804 50425 -9043
501 -9043 -19660 17148 1726 -11499 -26130 5541 20032 1357 -21081 12471 43182 24112
489 24112 -41016 -43187 -12419 12242 -9222 -33651 -7952 9873 35209 62485 47043 32955
477 32955 -25256 -33691 -21716 1283 27271 -7831 -21592 -21182 461 -49502 -33870 23278 13584
464 13584 57550 51230 46785 1205 -10064 -33352 22649 25184 -24633 -18599 -27608 15678 -35196
451 -35196 -69392 -14299 -2096 18946 34431 -19278 15722 73289 60790 38001 -35109 -38419
439 -38419 -14645 5118 35715 26750 20612 -20709 -9887 -11727 -30194 -2941 40143 3092 -27657
426 -27657 19204 90203 53870 357 42111 13273 -7039 2206 53732 69427 6367 18071
414 18071 8174 18062 63672 51856 58335 24035 14373 -31102 7284 -27277 -15056 15611 -37854
401 -37854 -22626 6011 9825 -35569 -42915 -59657 -27073 -44027 -31859 30038 -2320 -108294
389 -108294 -32619 8394 45567 -362 45317 52560 -1017 19221 10753 1823 -8539 -47835
377 -47835 -18559 -5264 1221 34820 43868 45862 15643 -16373 -36105 -13497 -13280 6216 29104
364 29104 26821 -2018 5707 -44048 -40536 -33225 -31860 -47545 -61397 3305 22387 29263 37297
351 37297 -2754 -16673 17792 31640 -63311 -23560 66662 74354 50881 41154 29450 41495
339 41495 12508 24571 11369 -6260 -6266 -16029 70905 9538 -38059 -33586 30877 14271 13021
326 13021 -1684 -33530 -28833 -86635 -71273 2744 4651 -8391 -3328 -30908 -40719 -20818 45
313 45 -6085 -596 -17595 -30065 -23006 -62010 -34336 -4331 -28425 -4944 -42593 -41729 -44739 35890
299 35890 45817 49664 55455 7331 -16908 -57471 6685 -14738 -52177 -54752 -13409 -31736 -19209
286 -19209 -26083 -27916 -23707 1708 377 -1926 1346 -10601 -23317 -29151 -22670 16193 24124 7996
272 7996 9595 -14123 36480 20134 -6737 4547 -11427 9066 51862 76231 40969 -46598
260 -46598 24060 73252 16180 25778 48563 36522 -7490 18735 77307 9569 -33381 -55148
248 -55148 -33524 -20438 32601 19444 29087 -4810 -35580 12971 49065 59405 79984 54872
236 54872 -6429 -59669 -51320 -80882 -78438 -56299 24581 66251 18744 21979 9898 -9131 -3741
223 -3741 -29928 296 65740 62912 24089 21384 45091 57077 93590 29604 -13458 -16115 7547
210 7547 -22171 -33023 -19570 13421 -14709 -17212 33350 29775 10856 -27490 -38310 -1006 13462
197 13462 -2844 -8111 12789 30942 -16589 -26239 -30857 -31721 7772 -8605 2213 24653 26930
184 26930 -3146 20420 16884 21580 39459 44154 30686 -919 -43999 -15615 13220 24751 -2981
171 -2981 -8781 -1845 8246 16575 -17198 -40353 -24695 -16818 -47198 -25709 -6460 -45570 -13186
158 -13186 -2261 3592 16679 38647 25634 2899 -22693 -56830 -48890 3410 35911 -6215
146 -6215 30867 44688 64002 39870 20861 5433 -19487 -22473 -1389 -25575 -21394 -8290 22745
133 22745 36838 42353 33826 34601 34693 -9554 7850 17150 -954 905 14173 -15108 38617 51662
119 51662 22723 219 -38355 -29294 3063 -13128 22520 39620 770 7270 23761 6383
107 6383 -2274 -1138 -20481 -22934 -16928 11602 36689 7036 48065 36527 -13823 -9603 13321
94 13321 17968 -17241 11261 28754 -8426 -28475 10547 24747 25651 26610 54139 30152 -10252
81 -10252 -11757 19778 -563 -30239 -17877 29834 52325 39878 52045 43234 -7680 -4239 9148
68 9148 17310 -6720 35274 33715 22476 29330 11458 33481 22112 16328 10085 -1344 3477 12078
54 12078 32589 35025 5484 -4956 19127 16981 -1839 -27032 16838 15217 31251 14050 16385
41 16385 -22992 -14421 19620 -18834 5969 10391 38190 7260 22394 25888 25052 15377 -2319
28 -2319 1270 -7034 -7611 -19245 -49897 -31387 -18050 5070 -7877 -15457 -18387 15076 33084 35252
14 35252 34974 32582 43609 45573 -1394 21033 30658 30365 30680 11323 16845 4650 7288 31094
0 31094
$$ Imaginary data points
##PAGE= N=2
##DATA TABLE= (X++(I..I)), XYDATA
16383 -469601 -475459 -463971 -435203 -427090 -383650 -383013 -386797 -355147 -313853 -327612 -323720 -303140 -309277
16370 -309277 -313966 -298312 -253276 -230314 -185541 -239849 -260964 -220156 -210660 -172333 -161336 -154004
16358 -154004 -138905 -179850 -156277 -119199 -126849 -114710 -95063 -98079 -55975 -47676 -64545 -3471
16346 -3471 32821 63248 38416 35684 81161 79240 93441 88839 58886 74590 115456 123128 164471
16333 164471 154677 141786 180638 204611 245415 283365 236347 191202 179844 207404 254717 269584
16321 269584 229078 259115 309156 328412 333372 334679 343213 346924 368632 360015 370427 355140
16309 355140 392604 427930 414619 400629 411563 426099 412501 399268 460438 484119 474210 488040
16297 488040 539446 549898 509266 469638 497448 532284 529232 543111 595844 591236 599874 624043
16285 624043 637741 584009 567279 605790 628318 618061 564539 592791 615616 662396 646100
16274 646100 667579 719112 702271 674576 686243 739518 781119 769917 751936 761248 773149 770063
16262 770063 784757 773465 792628 841434 847908 843905 898331 904086 885009 890945 872362 890003
16250 890003 879103 896850 892225 910732 938568 911265 906783 901886 858483 915134 938999 924303
16238 924303 937652 946984 923396 912287 970532 988130 1013704 1059390 1050634 1071472 1057313 1052825
16226 1052825 1050039 1029567 1023944 1052582 1088803 1086525 1064817 1019608 1024006 1034572 1047209 1057118
16214 1057118 1099656 1089813 1124332 1128863 1105021 1126753 1106035 1076738 1052607 1115511 1136103 1100441
16202 1100441 1118775 1127781 1138296 1116866 1134490 1146489 1198935 1179653 1129933 1174585 1185220
16191 1185220 1152635 1244391 1234591 1141916 1175558 1235271 1269491 1282966 1224970 1167527 1182078
16180 1182078 1219062 1186596 1169133 1255019 1226807 1220206 1236908 1251265 1298487 1310887 1233014
16169 1233014 1231063 1268955 1252586 1245875 1288383 1292492 1265849 1320191 1335714 1333778 1306637 1299443
16157 1299443 1295408 1283001 1269657 1282674 1340566 1346761 1351610 1346962 1365405 1351057 1334176 1336892
16145 1336892 1332897 1315897 1337493 1290544 1328296 1363090 1319785 1360410 1345944 1322521 1302095
16134 1302095 1280451 1345119 1405995 1401554 1377588 1353634 1383882 1375158 1360825 1407145 1443815 1369991
16122 1369991 1315480 1301831 1354213 1369481 1320439 1330133 1351292 1402898 1423960 1415879 1422186 1391025
16110 1391025 1420390 1405685 1387588 1348422 1374892 1397775 1392335 1362901 1376822 1363768 1411741
16099 1411741 1419145 1357337 1369069 1369072 1400396 1414507 1437995 1380334 1394186 1397006 1330887 1339244 1337281
16086 1337281 1378121 1392830 1408690 1434482 1392800 1418089 1416098 1423560 1403088 1358535 1384222 1395482
16074 1395482 1382726 1380632 1359890 1374723 1419223 1456246 1453711 1470758 1364648 1360899 1377444 1381131
16062 1381131 1375573 1381554 1384601 1389762 1386555 1430629 1411588 1331503 1359018 1408843 1397273 1353800
16050 1353800 1358802 1393226 1365468 1397154 1399312 1393263 1394901 1432007 1433150 1376160 1382864 1380326 1391600
16037 1391600 1401256 1445003 1412591 1427582 1458922 1471476 1455810 1430156 1406701 1395848 1419150
16026 1419150 1426213 1453723 1463093 1447145 1421679 1425462 1492298 1461183 1460794 1485531 1453267 1454225 1466042
16013 1466042 1440832 1492913 1547451 1504840 1434064 1427015 1478454 1461767 1449532 1423976 1380969
16002 1380969 1400374 1452303 1506702 1452994 1481274 1436861 1438552 1456395 1454068 1472115 1435044 1475009
15990 1475009 1478460 1435310 1442065 1431947 1403680 1389528 1421620 1483953 1521680 1518313 1479796 1444829
15978 1444829 1392379 1432585 1446909 1509307 1520503 1501349 1468819 1418717 1442700 1440442 1503759
15967 1503759 1470842 1500313 1514173 1482821 1441984 1465338 1429645 1414006 1400235 1404211 1450768
15956 1450768 1428626 1471296 1469836 1414927 1407699 1424438 1461456 1438022 1439601 1476060 1489086 1524489
15944 1524489 1490345 1459271 1456343 1449738 1405593 1401888 1399715 1418512 1377374 1403494 1429001 1415372
15932 1415372 1410059 1448690 1462589 1444026 1414431 1437822 1475007 1441455 1422677 1438892 1410853
15921 1410853 1419148 1470894 1441218 1453603 1473375 1487406 1451250 1442942 1398510 1388468 1446944 1460919
15909 1460919 1490846 1511592 1513834 1474284 1489970 1464234 1447125 1410316 1475467 1442899 1449013 1468029
15897 1468029 1443432 1452430 1490973 1440840 1414847 1429248 1432834 1466661 1417964 1450872 1454091 1524463
15885 1524463 1507897 1488491 1453923 1406205 1431121 1440583 1465112 1463393 1413944 1424034 1461070 1460571
15873 1460571 1467815 1461847 1453621 1456722 1496530 1509414 1521217 1519929 1473412 1496249 1517246 1522670
15861 1522670 1485291 1475663 1545928 1535616 1489259 1480605 1440483 1447649 1506372 1522237 1467923 1504417
15849 1504417 1524014 1507414 1432709 1421631 1453432 1505851 1470432 1460932 1488039 1475914 1487852
15838 1487852 1492129 1466460 1441324 1520563 1529507 1498130 1503088 1557794 1471429 1496640 1517748 1553234
15826 1553234 1476025 1382410 1440220 1494110 1496072 1445648 1462908 1475843 1458232 1516141 1538977
15815 1538977 1526606 1500528 1509143 1506575 1480833 1504383 1490829 1536504 1513570 1497557 1525430 1522871
15803 1522871 1428105 1428506 1472152 1444477 1435843 1418139 1434059 1460060 1485081 1471446 1454290 1438508
15791 1438508 1409780 1458176 1456097 1425728 1464592 1487096 1491381 1460201 1442705 1448962 1430989 1481500
15779 1481500 1475985 1488529 1488818 1542197 1508697 1479730 1516102 1509912 1522402 1535754 1550313 1492664
15767 1492664 1440701 1456677 1418147 1450647 1474898 1477007 1511553 1500037 1513812 1497304 1497177 1500996
15755 1500996 1527863 1534618 1484121 1478729 1447096 1460066 1455980 1487604 1482701 1477969 1503704 1505769
15743 1505769 1510888 1463897 1470080 1495667 1501731 1484294 1532566 1547688 1544251 1510553 1473006 1459838
15731 1459838 1451222 1445122 1501770 1515981 1518983 1499728 1543274 1493949 1469916 1454319 1467513 1501354
15719 1501354 1478645 1503167 1503404 1498529 1493130 1471365 1507240 1538100 1533763 1492098 1446964 1462113
15707 1462113 1485429 1472899 1425879 1390054 1415455 1460156 1481642 1461081 1440608 1488921 1504686
15696 1504686 1526484 1515083 1501496 1463830 1476798 1509729 1454876 1434419 1459486 1480914 1475996
15685 1475996 1501218 1507459 1463592 1411000 1432246 1452434 1498009 1492426 1478411 1466096 1446687 1478027
15673 1478027 1495018 1501753 1489488 1478047 1494726 1451798 1456481 1498852 1482655 1416059 1422995 1467741
15661 1467741 1509643 1491685 1456323 1460173 1416900 1428118 1414036 1412486 1416098 1446848 1492366 1503260
15649 1503260 1497567 1522997 1452868 1493046 1483394 1510235 1491575 1504111 1496445 1494542 1465237 1481310
15637 1481310 1493228 1490211 1511581 1525995 1515673 1464666 1473383 1476674 1523772 1501010 1458745 1423106
15625 1423106 1439348 1495075 1499346 1462376 1434851 1475612 1477691 1471301 1490107 1454241 1488153 1536695
15613 1536695 1532549 1492246 1527861 1549541 1482314 1476979 1548281 1519945 1471086 1514200 1498278 1482972
15601 1482972 1494586 1502980 1495228 1496413 1508248 1492301 1547017 1528493 1516617 1544465 1531642 1452804
15589 1452804 1470437 1530842 1526701 1529992 1520791 1504440 1482183 1465461 1489302 1514457 1519742 1525928
15577 1525928 1531329 1500478 1484220 1499913 1549230 1585290 1576800 1586284 1520991 1512284 1538872 1492426
15565 1492426 1521089 1551885 1517202 1515135 1534672 1504321 1521782 1527872 1520276 1486777 1525277 1516679
15553 1516679 1518330 1494909 1471940 1502335 1551606 1564496 1534324 1546512 1559663 1521887 1483032
15542 1483032 1542684 1544882 1553264 1512663 1535468 1502130 1473141 1452674 1501756 1546150 1476451 1503860
15530 1503860 1502400 1475525 1481846 1474734 1476441 1496143 1490665 1506057 1500513 1514812 1549213 1543730 1511974
15517 1511974 1499268 1538155 1535674 1511513 1540997 1559203 1532381 1558012 1551683 1534372 1551156 1512472
15505 1512472 1500925 1493111 1553367 1564071 1569400 1558509 1557954 1522649 1538111 1542510 1543690 1575359
15493 1575359 1578281 1543485 1557600 1584207 1525985 1495914 1488378 1501820 1520254 1517441 1531609 1566447
15481 1566447 1591683 1558842 1483584 1504141 1506490 1553627 1601147 1591947 1563214 1506556 1503966 1542668
15469 1542668 1568571 1575776 1548638 1549533 1511872 1535547 1538518 1566038 1540670 1551112 1521699 1537722
15457 1537722 1510422 1530794 1499570 1520786 1532970 1528234 1595047 1507407 1513717 1516815 1538683 1552901
15445 1552901 1490025 1467189 1507270 1500945 1546723 1570717 1505830 1515918 1506113 1491541 1513618 1560648
15433 1560648 1559182 1556318 1565775 1553088 1512222 1522822 1559024 1569293 1547231 1529285 1539676 1530139
15421 1530139 1502804 1517293 1584138 1564950 1531834 1534519 1530882 1533621 1545616 1504849 1496924 1519839
15409 1519839 1514898 1507550 1498717 1495255 1548409 1490963 1481553 1514605 1505082 1525328 1581363 1567361
15397 1567361 1551315 1496928 1523471 1534737 1562230 1530696 1464784 1447119 1475108 1531182 1528185
15386 1528185 1529043 1548026 1535730 1498487 1485041 1508258 1499122 1509056 1515986 1525886 1528760 1507499 1549883
15373 1549883 1588354 1588455 1542456 1545615 1510816 1523614 1524956 1523156 1542638 1527440 1556800 1578284
15361 1578284 1572575 1549699 1590805 1551333 1534194 1543936 1599178 1553788 1494189 1525222 1552530 1568821
15349 1568821 1511511 1480089 1551143 1573402 1574796 1606910 1610234 1576333 1503086 1545619 1554362 1585486
15337 1585486 1556476 1567738 1581684 1588561 1558323 1562543 1564117 1511080 1508402 1531689 1559573 1544333
15325 1544333 1474189 1509746 1551174 1543932 1556571 1542046 1546129 1583687 1558048 1581919 1557729 1534276
15313 1534276 1548166 1538912 1500487 1514505 1515216 1508665 1540679 1585840 1625483 1629858 1573114 1527188
15301 1527188 1571429 1584849 1560047 1530345 1547182 1574042 1602471 1538935 1542113 1586461 1604741
15290 1604741 1566766 1550204 1550438 1575883 1549463 1532556 1536085 1557149 1560492 1548445 1554858 1567589
15278 1567589 1560153 1515658 1514103 1562973 1552933 1547750 1553907 1510188 1549326 1545022 1547671 1508186
15266 1508186 1518596 1547679 1566773 1614963 1580130 1590123 1608521 1586021 1611202 1631000 1600410
15255 1600410 1594638 1555558 1548436 1569451 1560870 1615729 1573354 1547939 1586951 1522338 1493844 1499465
15243 1499465 1503080 1515711 1532646 1499920 1535910 1546617 1484925 1534956 1556727 1569770 1491320
15232 1491320 1515025 1618356 1586702 1569946 1561287 1573096 1567944 1604053 1608824 1561257 1545505 1558758
15220 1558758 1569016 1611511 1606711 1560062 1525955 1501977 1505224 1570455 1563861 1522764 1538511 1475464
15208 1475464 1462414 1497289 1519062 1533216 1555977 1541155 1518433 1554614 1600152 1580002 1594843
15197 1594843 1576537 1576865 1566123 1562118 1574151 1598711 1554449 1564930 1561639 1624340 1623700 1612469
15185 1612469 1592906 1610464 1659006 1610926 1583585 1600957 1642202 1624980 1654550 1624817 1615928
15174 1615928 1616368 1606292 1554893 1602690 1639149 1608011 1593129 1607781 1574015 1563297 1580463 1597035
15162 1597035 1548332 1588366 1591208 1573258 1563230 1612204 1621899 1601398 1564613 1516959 1541121 1565013
15150 1565013 1569608 1615870 1606266 1570106 1551314 1587105 1606848 1653496 1613340 1585168 1634064 1564226
15138 1564226 1578692 1590792 1617507 1566867 1525199 1548920 1590535 1594098 1603802 1575096 1615583 1633645
15126 1633645 1574921 1592511 1597839 1571442 1565039 1613845 1637628 1660964 1609258 1620627 1603721 1578259
15114 1578259 1604554 1605494 1607592 1582118 1572356 1572188 1609867 1591706 1597222 1596344 1588842 1601541 1635125
15101 1635125 1626383 1605897 1657977 1681185 1638855 1627229 1597844 1570836 1596439 1661158 1583480
15090 1583480 1586129 1665993 1676848 1645866 1641222 1637786 1576309 1572678 1563059 1598538 1598467 1582196 1553258
15077 1553258 1544094 1613574 1654137 1650863 1661682 1610672 1604336 1612607 1632725 1625777 1585578 1571087
15065 1571087 1562590 1599486 1580800 1582391 1556258 1558115 1591469 1632807 1616651 1612441 1640506 1645213
15053 1645213 1606498 1646738 1634339 1652639 1654214 1617304 1566503 1617034 1612090 1602702 1606233 1610451
15041 1610451 1571466 1584384 1592448 1593920 1638824 1618772 1629867 1619254 1602936 1649453 1690401 1667328
15029 1667328 1651372 1650507 1638376 1612818 1653851 1611517 1633455 1633886 1637391 1581606 1587718 1640158
15017 1640158 1625206 1574105 1587210 1583473 1572883 1590366 1598111 1577637 1574096 1560673 1587258 1651175
15005 1651175 1659401 1594855 1618165 1665790 1644877 1610512 1592218 1572393 1576141 1561099 1551611 1589583
14993 1589583 1609553 1573929 1565950 1595903 1666561 1654384 1618742 1618899 1628986 1599579 1610895 1638578
14981 1638578 1627911 1618471 1627588 1582871 1598414 1658434 1618152 1583889 1597154 1644402 1659431 1650706
14969 1650706 1633450 1629987 1662023 1644033 1667460 1688584 1678030 1631514 1632536 1628507 1610056 1633438
14957 1633438 1574413 1585473 1599445 1594984 1582905 1584068 1629232 1611930 1591887 1591007 1631155 1657917
14945 1657917 1602968 1670401 1649767 1668527 1615907 1549077 1593139 1581340 1614830 1702498 1660321
14934 1660321 1598020 1616832 1668501 1643180 1591875 1594507 1591288 1657573 1677854 1681132 1744776 1710735
14922 1710735 1669769 1641468 1622983 1632773 1658942 1632612 1654602 1673991 1708960 1681708 1707428
14911 1707428 1718841 1655388 1661170 1638540 1651504 1638490 1658563 1593406 1649977 1686038 1648549
14900 1648549 1677030 1635028 1658699 1603803 1656753 1642425 1609207 1629027 1648628 1662228 1662638 1622849
14888 1622849 1633131 1648424 1660520 1691036 1629243 1638390 1650538 1644808 1634792 1646101 1673911 1703432
14876 1703432 1703479 1675662 1616304 1587963 1587801 1653040 1662818 1683940 1720697 1699671 1689389 1682657 1701244
14863 1701244 1657470 1613453 1637477 1613941 1658103 1648153 1648639 1624750 1588177 1604285 1594138 1651239
14851 1651239 1681770 1643544 1664967 1642265 1642554 1631945 1599167 1615686 1654451 1688401 1652922 1651849
14839 1651849 1666082 1649224 1598947 1655484 1663890 1616517 1647276 1637885 1574967 1639283 1668787 1634210
14827 1634210 1657430 1625538 1610126 1581463 1613016 1624175 1638576 1639292 1644566 1674155 1710376 1700098
14815 1700098 1685812 1705511 1693993 1653976 1576996 1606274 1661754 1643340 1587115 1632972 1654853
14804 1654853 1633814 1657281 1644654 1665807 1674882 1677487 1697132 1702140 1691980 1667516 1633688 1675410
14792 1675410 1707071 1656276 1678142 1680650 1652355 1552799 1577644 1638462 1654500 1680764 1645544
14781 1645544 1638393 1688616 1720425 1698971 1696848 1707389 1707351 1688355 1691726 1668259 1671419 1663781 1610423
14768 1610423 1625281 1668935 1717508 1678399 1632589 1671996 1607353 1616363 1642662 1701625 1697067 1711008
$$ [...]
##END NTUPLES=NMR SPECTRUM
##END=
