##TITLE=1H_TG-2342
 CDCl3
 8 sc, 
 14.1.2022
##JCAMPDX= 6.0         $$ Bruker NMR JCAMP-DX V2.0
##DATA TYPE= NMR SPECTRUM
##DATA CLASS= NTUPLES
##ORIGIN= UXNMR, Bruker Analytische Messtechnik GmbH
##OWNER= root
$$ XWIN-NMR		Version 3.5
$$ Fri Jan 14 14:32:13 2022 Russian Standard Time (UT+4h)  she@DPX200
##.OBSERVE FREQUENCY= 200.131346
##.OBSERVE NUCLEUS= ^1H
##.ACQUISITION MODE= SIMULTANEOUS
##.ACQUISITION SCHEME= undefined
##.AVERAGES= 8
##.DIGITISER RES= 18
##SPECTROMETER/DATA SYSTEM= spect
##.PULSE SEQUENCE= zg30
##.SOLVENT NAME= CDCl3
##.SHIFT REFERENCE= (INTERNAL, CDCl3, 0, 15.7271)
##AUDIT TRAIL= $$ (NUMBER, WHEN, WHO, WHERE, WHAT)
$$ ##TITLE= Audit trail, XWIN-NMR		Version 3.5
$$ ##JCAMPDX= 5.01
$$ ##ORIGIN= Bruker BioSpin GmbH
$$ ##OWNER= she
$$ F:/spectra/data/she/nmr/H-F/1/pdata/1/auditp.txt
$$ ##AUDIT TRAIL=  $$ (NUMBER, WHEN, WHO, WHERE, WHAT)
(   1,<2022-01-14 14:30:43.68 +0400>,<she>,<DPX200>,
      <created by zg, POWCHK disabled, PULCHK disabled
       configuration hash MD5:
       00 E9 B6 7A A2 85 ED C7 34 08 36 98 17 FE 4E 26
       data hash MD5: 16K
       B1 B8 D1 04 0C B6 E9 15 2C A6 FF 80 17 40 1E 48>)
(   2,<2022-01-14 14:30:47.17 +0400>,<she>,<DPX200>,
      <Start of raw data processing
       efp BC_mod = 2 LB = 0.24 FT_mod = 6 PKNL = 1 PHC0 = -15868.16 PHC1 = 9.00078 SI = 16K 
       data hash MD5: 16K
       57 8F AF 3C EC 6C E8 74 88 5F D1 E0 A7 8D 43 D2>)
(   3,<2022-01-14 14:31:08.34 +0400>,<she>,<DPX200>,
      <pk PHC0 = -3.670633 PHC1 = 6.6 
       data hash MD5: 16K
       2F 48 D9 F7 C7 EF 8D 61 B2 35 70 3C 6B CA 19 C2>)
(   4,<2022-01-14 14:31:24.82 +0400>,<she>,<DPX200>,
      <abs ABSG = 5 
       data hash MD5: 16K
       19 CA B6 FA DC 0E 52 D1 E9 EB 71 78 71 B3 5F 3F>)
$$ ##END=
$$ 
$$ hash MD5
$$ EF 45 3F 15 5F 09 01 A0 D3 18 83 5B 7D 92 E7 DF
##$RELAX= 
##$RELAX= 
##$RELAX= 
##$RELAX= 
##$RELAX= 
##$RELAX= 
$$ Bruker specific parameters
$$ --------------------------
##$DU= <F:/spectra>
##$EXPNO= 1
##$NAME= <H-F>
##$PROCNO= 1
##$TYPE= <nmr>
##$USER= <she>
##$AMP= (0..31)
100 100 100 100 100 100 100 100 100 100 100 100 100 100 100 100 100 100 
100 100 100 100 100 100 100 100 100 100 100 100 100 100 
##$AQSEQ= 0
##$AQ_mod= 1
##$AUNM= <au_zg>
##$AUTOPOS= <>
##$BF1= 200.13
##$BF2= 200.13
##$BF3= 200.13
##$BF4= 200.13
##$BF5= 200.13
##$BF6= 200.13
##$BF7= 200.13
##$BF8= 200.13
##$BYTORDA= 1
##$CFDGTYP= 0
##$CFRGTYP= 5
##$CHEMSTR= <none>
##$CNST= (0..31)
1 1 145 1 1 1 1 1 1 1 1 1 1 1 1 1 1 1 1 1 1 1 1 1 1 1 1 1 1 1 1 1 
##$CPDPRG= <>
##$CPDPRG1= <>
##$CPDPRG2= <>
##$CPDPRG3= <>
##$CPDPRG4= <mlev>
##$CPDPRG5= <mlev>
##$CPDPRG6= <mlev>
##$CPDPRG7= <mlev>
##$CPDPRG8= <mlev>
##$CPDPRGB= <>
##$CPDPRGT= <>
##$D= (0..31)
0 1.2 0 0 0 0 0 0 0 0.06 0 0.03 0 0 0 0 0.0002 0 0 0 0 0 0 0 0 0 0 0 0 
0 0 0 
##$DATE= 1642156243
##$DBL= (0..7)
120 120 120 120 120 120 120 120 
##$DBP= (0..7)
150 150 150 150 150 150 150 150 
##$DBP07= 0
##$DBPNAM0= <>
##$DBPNAM1= <>
##$DBPNAM2= <>
##$DBPNAM3= <>
##$DBPNAM4= <>
$$ [...]
##$SUBNAM2= <"">
##$SUBNAM3= <"">
##$SUBNAM4= <"">
##$SUBNAM5= <"">
##$SUBNAM6= <"">
##$SUBNAM7= <"">
##$SUBNAM8= <"">
##$SUBNAM9= <"">
##$SW= 18.0517287032376
##$SWIBOX= (0..15)
0 0 2 0 0 0 0 0 0 0 0 0 0 0 0 0 
##$SW_h= 3612.71676300578
##$TD= 16384
##$TD0= 1
##$TE= 0
##$TE2= 300
##$TE3= 300
##$TEG= 300
##$TL= (0..7)
0 120 120 120 120 120 120 120 
##$TP= (0..7)
150 150 150 150 150 150 150 150 
##$TP07= 0
##$TPNAME0= <>
##$TPNAME1= <>
##$TPNAME2= <>
##$TPNAME3= <>
##$TPNAME4= <>
##$TPNAME5= <>
##$TPNAME6= <>
##$TPNAME7= <>
##$TPOAL= (0..7)
0.5 0.5 0.5 0.5 0.5 0.5 0.5 0.5 
##$TPOFFS= (0..7)
0 0 0 0 0 0 0 0 
##$TUNHIN= 0
##$TUNHOUT= 0
##$TUNXOUT= 0
##$USERA1= <user>
##$USERA2= <user>
##$USERA3= <user>
##$USERA4= <user>
##$USERA5= <user>
##$V9= 5
##$VALIST= <valist>
##$VCLIST= <CCCCCCCCCCCCCCC>
##$VD= 0
##$VDLIST= <DDDDDDDDDDDDDDD>
##$VPLIST= <PPPPPPPPPPPPPPP>
##$VTLIST= <TTTTTTTTTTTTTTT>
##$WBST= 1024
##$WBSW= 4
##$XGAIN= (0..3)
0 0 0 0 
##$XL= 0
##$YL= 0
##$YMAX_a= 374400
##$YMIN_a= -662828
##$ZGOPTNS= <>
##$ZL1= 120
##$ZL2= 120
##$ZL3= 120
##$ZL4= 120
##$ABSF1= 15.71494
##$ABSF2= -2.336909
##$ABSG= 5
##$ABSL= 3
##$ALPHA= 0
##$AQORDER= 0
##$ASSFAC= 0
##$ASSFACI= 0
##$ASSFACX= 0
##$ASSWID= 0
##$AUNMP= <proc_1d>
##$AZFE= 0.1
##$AZFW= 0.1
##$BCFW= 0
##$BC_mod= 2
##$BYTORDP= 0
##$COROFFS= 0
##$CY= -3
##$DATMOD= 1
##$DC= 0
##$DFILT= <>
##$DTYPP= 0
##$F1P= 0
##$F2P= 0
##$FCOR= 1
##$FTSIZE= 16384
##$FT_mod= 6
##$GAMMA= 0
##$GB= 0
##$INTBC= 1
##$INTSCL= 0
##$ISEN= 128
##$LB= 0.24
##$LEV0= 0
##$LPBIN= 0
##$MAXI= 10000
##$MC2= 0
##$MEAN= 0
##$ME_mod= 0
##$MI= 1.114404
##$NCOEF= 0
##$NC_proc= -7
##$NLEV= 6
##$NOISF1= 3.799351
##$NOISF2= 2.8
##$NSP= 0
##$NTH_PI= 0
##$NZP= 0
##$OFFSET= 15.72706
##$PC= 1
##$PHC0= -15871.83
##$PHC1= 15.60078
##$PH_mod= 1
##$PKNL= yes
##$PPARMOD= 0
##$PSCAL= 0
##$PSIGN= 0
##$REVERSE= no
##$SF= 200.13000490307
##$SI= 16384
##$SIGF1= 3
##$SIGF2= 2
##$SINO= 5.538805
##$SIOLD= 16384
##$SREGLST= <1H.CDCl3>
##$SSB= 0
##$STSI= 16384
##$STSR= 0
##$SW_p= 3612.71676300578
##$SYMM= 0
##$S_DEV= 0
##$TDeff= 16384
##$TDoff= 0
##$TI= <>
##$TILT= no
##$TM1= 0
##$TM2= 0
##$TOPLEV= 0
##$USERP1= <user>
##$USERP2= <user>
##$USERP3= <user>
##$USERP4= <user>
##$USERP5= <user>
##$WDW= 1
##$XDIM= 16384
##$YMAX_p= 476325490
##$YMIN_p= -554770
$$ End of Bruker specific parameters
$$ ---------------------------------
##NTUPLES= NMR SPECTRUM
##VAR_NAME=  FREQUENCY,     SPECTRUM/REAL,   SPECTRUM/IMAG
##SYMBOL=    X,             R,               I
##VAR_TYPE=  INDEPENDENT,   DEPENDENT,       DEPENDENT
##VAR_FORM=  AFFN,          ASDF,            ASDF
##VAR_DIM=   16384,         16384,           16384
##UNITS=     HZ,            ARBITRARY UNITS, ARBITRARY UNITS
##FACTOR=    0.220516191357247, 1,           1
##FIRST=     3147.45665855085, 0,            0
##LAST=      -465.260104454931, 0,           0
##MIN=       -465.260104454931, -554770,     0
##MAX=       3147.45665855085, 476325490,    0
$$ Real data points
##PAGE= N=1
##DATA TABLE= (X++(R..R)), XYDATA
$$ [...]
5961B8654814q7662l45686l23548j70288P4115L26059L7142J49557P460j66804
5951B8155159k34194m71540o02861n34494k67523k88472l62484m50915l32480
5942B4610196j69300k9169q7145k37423l76240K0463J74473L9068K8010K51150
5932B4224083j23738Q5202K78394Q8003n1298M9411K49558K0415Q5769K97726
5922B5203525K09054L34136J37461J58599N02258N44874N25179K64355N59561
5913B8439002N33091N69708O37557P24503R26302J068911J161811J346270J392191
5904C6799346J220706P81988J21925n70714r96455j356401r88523n22885n75434
5895C3913553n71853j97279m67550j47955L38738P5937J14085Q11305P85375J133153
$$ plain form
5961 28654814 28567152 28221466 27897918 27727630 27801745 28127804 28164946 28314503 28321963 28155159
5951 28155159 27920965 27449425 26846564 26312070 26044547 25756075 25393591 24942676 24610196
5942 24610196 24440896 24411727 24324582 24087159 23710919 23731382 23905855 23944923 23972933 24224083
5932 24224083 24100345 24185547 24463941 24551944 24500646 24550057 24799615 24820030 24905799 25203525
5922 25203525 25412579 25746715 25884176 26042775 26545033 27089907 27615086 27879441 28439002
5913 28439002 28972093 29541801 30179358 30903861 31830163 32899074 34060885 35407155 36799346
5904 36799346 38020052 38802040 38923965 38353251 37356796 36000395 35011872 34488987 33913553
5895 33913553 33341700 33144421 32676871 32528916 32867654 32943591 33057676 33868981 34654356 35787509
5885C5787509J445728J277140J215628R85723O92142K69362n50443j180527j293119
5876C8649143j649655j454049j161624q08628p09529n65939l58966k35192m05741
5867C1299820l33134j26316J21181P7232o6240o1481j49283l46693r6065J11990
5857C0431011J81501L61430K63224J14505K84782K99266K81473L18313j85570
5848C2349935k35813j10555o50954q46226l91422o1207P8863J01332K30160m7448
5838C0416665J636J0721p8902N4076j11462j76634O0731k21982N7861r288l60467
5827B9642955o8148l32263n14061l60903l99357j26409l87575j00048l21319k2678
5817B7010194K9399l64831J9239J52046J20871N8462K27628J79396L02298M52814
$$ plain form
5885 35787509 37233237 38510377 39726005 40711728 41403870 41673232 41122789 39942262 38649143
5876 38649143 36999488 35545439 34383815 33575187 32865658 32299719 31940753 31705561 31299820
5867 31299820 30966686 30840370 30961551 31038783 30972543 30911062 30761779 30415086 30319021 30431011
5857 30431011 30612512 30973942 31237166 31351671 31636453 31935719 32217192 32535505 32349935
5848 32349935 32114122 32003567 31352613 30506387 30114965 30053758 30132621 30233953 30464113 30416665
5838 30416665 30418301 30429022 30350120 30404196 30292734 30116100 30176831 29954849 30012710 30003422 29642955
5827 29642955 29574807 29242544 28728483 28367580 27968223 27841814 27454239 27354191 27032872 27010194
5817 27010194 27039593 26674762 26694001 26846047 26966918 27025380 27253008 27432404 27734702 28187516
5807B8187516N40755P3296N8793j5550j70614j21478R9081j86814J22459K3630
5797B8611074J43613K63414o7143l16500n09358o16624l40668n16629n53729k81193
5787B5816257k21194p8923j24718l89M3755L0017m6524j2453J39904J17477J36610
5776B5799819J89084K20687j479p0267r2113k91564n300r9659L67719J59376M2636
5765B6218939Q8843J75860p5690j80591k34088m61213j46239m06252J1928k16490
5755B4775007k00260O4058J34222K2780o145J31689q0802N3776J28209k47673
5745B4774861k5528m2455k83305j44015m7522Q6277N6941k3510Q5400Q3669l100
5734B4517713J12327m6624J47384l5524N3409N9360p1370L4320L54326J27734
$$ plain form
5807 28187516 28728271 28801567 28860360 28844810 28674196 28552718 28651799 28464985 28587444 28611074
5797 28611074 28754687 29018101 28950958 28634458 28125100 27508476 27167808 26651179 26097450 25816257
5787 25816257 25595063 25516140 25391422 25391033 25434788 25464805 25418281 25405828 25545732 25663209 25799819
5776 25799819 25988903 26209590 26208111 26137844 26045731 25754167 25748867 25649208 26016927 26176303 26218939
5765 26218939 26307782 26483642 26407952 26227361 25993273 25532060 25385821 24979569 24991497 24775007
5755 24775007 24574747 24638805 24773027 24795807 24789662 24921351 24840549 24894325 25022534 24774861
5745 24774861 24749333 24706878 24423573 24279558 24232036 24318313 24375254 24351744 24437144 24520813 24517713
5734 24517713 24630040 24583416 24730800 24695276 24748685 24808045 24736675 24770995 25125321 25253055
5724B5253055K90743J91833M16220M58427M10939M14407K35560L43232J08141
5715B8122557K61516j24927j57497j92174r9806k87588o6891k91555m07499o6813
5705B6689323L33466K40939Q8233K18656Q7042K68107K69810K97792K54256J92428
5695B8940052j25859R2005J32637r0461K15225L74265N87299M43150J077721J040903
5685C2686937P71718N47038J87247K38478J478l00541m91569j69771m97966n70656
5675C2402393l36317k81292k05971K0162P2649N5340J07662N99627J24773L07001
5665C2866027M15072K38119K77707k18221j93630l32854m85712j90211p0240J25139
5655C2431196M45935M58782P76213O22196M16189K5911k38702n08788n59805l46317
$$ plain form
5724 25253055 25543798 25735631 26151851 26610278 27021217 27435624 27671184 28014416 28122557
5715 28122557 28384073 28259146 28101649 27909475 27809669 27522081 27455190 27163635 26756136 26689323
5705 26689323 27022789 27263728 27351961 27570617 27657659 27925766 28195576 28493368 28747624 28940052
5695 28940052 28814193 28906198 29038835 28948374 29163599 29537864 30125163 30568313 31646034 32686937
5685 32686937 33458655 34005693 34192940 34431418 34432896 34132355 33640786 33471015 32973049 32402393
5675 32402393 32066076 31784784 31578813 31598975 31671624 31726964 31834626 32434253 32559026 32866027
5665 32866027 33281099 33519218 33796925 33578704 33385074 33052220 32566508 32376297 32306057 32431196
5655 32431196 32877131 33335913 34112126 34734322 35150511 35176422 34937720 34428932 33869127 33522810
5645C3522810n72203p67053r67555p32910n34861n87647k29194p3610J64390L05005
5635B9527172M61757M23893M10312O14083K39544K34652J92808R285j35228l30688
5625C1647590m34905n76171o72584o64087n95741m82098m29064m05911m02464
5616B6984565n45750k73979l34480j15820j64685m66594k19638j94836j26384
5607B4542399p6753J9898m6433J52137J73513K71355L60331M36801K74441J10783
5597B6218472N69279N09588M73805N48997L89124p8781m51728p65358j205667
5588B6207731j258739j013954p21406m32037m18984j30657j38429l17746q0401
5579B1695378j55677J25631P2072K22407K14740O8594J88681J51313J67221L32478
$$ plain form
5645 33522810 32950607 32183554 31215999 30483089 29948228 29360581 29131387 29057777 29222167 29527172
5635 29527172 29988929 30412822 30823134 31437217 31676761 31911413 32104221 32113506 31978278 31647590
5625 31647590 31212685 30636514 29963930 29299843 28704102 28222004 27792940 27387029 26984565
5616 26984565 26438815 26164836 25830356 25714536 25549851 25083257 24863619 24668783 24542399
5607 24542399 24465646 24485544 24439111 24591248 24764761 25036116 25396447 25833248 26107689 26218472
5597 26218472 26787751 27297339 27771144 28320141 28709265 28630484 28178756 27413398 26207731
5588 26207731 24948992 23935038 23213632 22781595 22362611 22231954 22093525 21775779 21695378
5579 21695378 21539701 21665332 21737404 21959811 22174551 22243145 22431826 22583139 22750360 23082838
5569B3082838K41613j32513J75631N62614M83206M81640M63682O08957O67011
5560B6634679M64870J5582j50157j77883o77491n04766l12928l12880q1300j66537
5550B4731189m01980p8233R6419k5982q6364p9262O4329j77873R2971M2495Q4738
5539B4262447J52159J73915J16215J93243L05856M79239N65695M84603M98086
5530B7231458O61199M77502J75101M21881L39885L40301K13803J15158j1413k24840
5520B9740035k68935k49585l6373l52143m31345l5952L6465K9950l4594r574J14428
5509B8502377K8110R789L61462K40431K11499L56841P07777O24330P43659R02038
5499C2688313N76149N21962L96241o6765l52203m63206k12249p7606K73476O8035
$$ plain form
5569 23082838 23324451 23191938 23367569 23930183 24413389 24895029 25358711 25967668 26634679
5560 26634679 27099549 27115131 26964974 26787091 26109600 25604834 25291906 24979026 24897726 24731189
5550 24731189 24329209 24250976 24347395 24321413 24235049 24155787 24220116 24042243 24135214 24177709 24262447
5539 24262447 24414606 24588521 24704736 24897979 25203835 25683074 26248769 26733372 27231458
5530 27231458 27892657 28370159 28545260 28967141 29307026 29647327 29861130 29976288 29964875 29740035
5520 29740035 29471100 29221515 29185142 28832999 28401654 28365702 28402167 28432117 28397523 28387949 28502377
5509 28502377 28530487 28540276 28901738 29142169 29353668 29710509 30418286 31042616 31786275 32688313
5499 32688313 33264462 33786424 34182665 34115900 33763697 33300491 33088242 33010636 33284112 33352147
5489C3352147J79139k09959j33379N4261l8577K09726K63240J42142Q9093k58732
5479C3649101k54551m26843l92996k98369k69716j27731j9459M84549K47057M32637
5469C3023679M55570N46833O82240N68447J4670k92454n49994q40468r05928o73849
5459C2028746j33897k25334k12041Q8841L35648N23153O68182M58006N66626M35275
5449C4533205J04435j51036m61821o21543o89954n04258n95716n31035k39326
5440C0842951R8541k04225l80175j2057J73162J92709j02953l677J40585k72867
5430C0471994o6415l18543k43168k08932j17932J89123n918j7791J09918N40654
5420C0332990K77217L4876J19392L00473M7661j14483j73378K1823m14157j96569
$$ plain form
5489 33352147 33531286 33321327 33187948 33242209 33203632 33413358 33676598 33818740 33907833 33649101
5479 33649101 33394550 32967707 32574711 32276342 32006626 31878895 31859436 32343985 32591042 33023679
5469 33023679 33479249 34026082 34708322 35276769 35291439 34998985 34448991 33608523 32702595 32028746
5459 32028746 31894849 31669515 31457474 31546315 31881963 32405116 33073298 33531304 34097930 34533205
5449 34533205 34637640 34486604 34024783 33403240 32713286 32209028 31613312 31082277 30842951
5440 30842951 30941492 30737267 30357092 30345035 30518197 30710906 30607953 30604276 30744861 30471994
5430 30471994 30405579 30087036 29843868 29634936 29517004 29706127 29700209 29682418 29792336 30332990
5420 30332990 30610207 30645083 30764475 31064948 31112609 30998126 30824748 30846571 30432414 30235845
5410C0235845N4251K23844p4038n01621l29617k78812r3808j31024J54259K3030
5400B9282309O6855k03125J60294Q0517L85829r032J27334J06414L98995K20347
5390C0616737R8579K57863J41859p5986J8775M2393K05316r9328k73701P5481
5380C1007988K36390L42494L63030L04483N51740L93536O41612P10144N77649
5371C5129066P06710O25744L15719M37180M5551p2709k09082p43381q05438o31633
5361C4797727l93724n24557k66503k84129k8520j38676K9279J6176J99458J1188
5351C3417719L51096M33675K25284J5742M95374N77780L82805M55108N04841R25955
5341C7785379O63268O52375P46541N94662L68161J24164k1953k04157J24j51425
$$ plain form
5410 30235845 30290096 30513940 30439902 29938281 29608664 29329852 29236044 29105020 29259279 29282309
5400 29282309 29349164 29146039 29306333 29386850 29772679 29763647 29890981 29997395 30396390 30616737
5390 30616737 30715316 30973179 31115038 31039052 31057827 31100220 31305536 31206208 30932507 31007988
5380 31007988 31244378 31586872 31949902 32254385 32806125 33199661 33841273 34551417 35129066
5371 35129066 35835776 36461520 36777239 37214419 37259970 37187261 36978179 36234798 35429360 34797727
5361 34797727 34404003 33879446 33612943 33328814 33300294 33161618 33190897 33207073 33406531 33417719
5351 33417719 33768815 34202490 34427774 34443516 34938890 35516670 35899475 36354583 36859424 37785379
5341 37785379 38448647 39101022 39847563 40442225 40810386 40934550 40912597 40708440 40708564 40557139
5331D0557139J85216K28142N09334K62142J95353o3039m80115k88962p8344k10229
5321D0816637K10036M73062N14876O93367Q86409J126379J027696J106078J024115
5312D7878655Q98220O61392J57508K4274j08149p4686l48809n63259n60658j057213
5302D6907275j213024p04017o97192k85807m51046l32710k10827o35587k40493
5293D2136572N5959j31594L00590L38861N08531Q75163P62283O28114N47918M57095
5283D6479492Q670m06301l71655p38074r47556r61147o48164p10458k42924j2933
5273D1448950l24902m86538m12865l39959l34157k93829n98024n52912l97773
5264C7707991m79717o31920j47848l75388l51557l36137j65334m05057m5021j13182
$$ plain form
5331 40557139 40742355 40970497 41479831 41741973 41937326 41874287 41394172 41105210 41026866 40816637
5321 40816637 41026673 41499735 42014611 42707978 43594387 44720766 45748462 46854540 47878655
5312 47878655 48776875 49438267 49595775 49620049 49511900 49437214 49088405 48525146 47964488 46907275
5302 46907275 45694251 44990234 44293042 44007235 43556189 43223479 43012652 42377065 42136572
5293 42136572 42192531 42060937 42361527 42700388 43208919 44084082 44846365 45474479 46022397 46479492
5283 46479492 46488162 46081861 45710206 44972132 44024576 43063429 42415265 41704807 41461883 41448950
5273 41448950 41124048 40637510 40224645 39884686 39550529 39256700 38658676 38105764 37707991
5264 37707991 37228274 36596354 36448506 36073118 35721561 35385424 35220090 34815033 34770012 34656830
5254C4656830j88666j74929r4190j09606k6347J31881K28738j11949n5160o6075
5244C4190527N667n979J38453J55233P1712K27073J59317j19512k840k92441l26790
5233C4200420n60758m29622j15419k34314j85292k24297J46017M9480j31830k3965
5223C2490420l6020n5289N990P60M9398K50062j1921J62075K13156J07765q4659
5212C3091737J59645J27132o1486M31286K10215J39007M3184r4879m987j62664
5202C3878190k60868l40021l64228m85787j85798p2299k89011M612R8344j1664
5192C1971470r1698R206J44272J522K9563J05765J02024L57464J06996L14590
5182C3051174L16676K26617L60892K94776Q7678K41528J96924M7666J08073J1410
$$ plain form
5254 34656830 34468164 34293235 34199045 34089439 34063092 34194973 34423711 34311762 34256602 34190527
5244 34190527 34196194 34190215 34328668 34483901 34555613 34782686 34942003 34822491 34819651 34527210 34200420
5233 34200420 33639662 33210040 33094621 32860307 32675015 32450718 32596735 32646215 32514385 32490420
5223 32490420 32454400 32399111 32405101 32405861 32455259 32705321 32693400 32855475 33068631 33176396 33091737
5212 33091737 33251382 33378514 33317028 33748314 33958529 34097536 34140720 34045841 34040854 33878190
5202 33878190 33617322 33277301 32913073 32427286 32241488 32169189 31880178 31884790 31983134 31971470
5192 31971470 31879772 31888978 32033250 32034772 32064335 32170100 32272124 32629588 32736584 33051174
5182 33051174 33367850 33594467 33955359 34250135 34337813 34579341 34776265 34823931 34932004 34943414
5172C4943414m64031m08008k93806l20440l11417l02623p6177l3175p1257j36534
5162C2525946j86590p3295M8962K76433O3983J29554l2503Q8003O19227L71842
5152C3831562Q7822K66959N70477O42806M78794N73743O18571R27975O55506N39038
5142C9193253K65823l45427k98935m81322l78775l69802j35407K4259p4769n9919
5132C7338979K09969M75452N47931J00559L167l35717m09690m90803l69782j32520
5122C6937545J8007j39853j54097J54877J09876p8085k81925L5632L33123N12555
5112C7447655P74466O39850N72007M54131k9470k33646l94392o75995p04693o14630
5102C7235283o58246k68954P1594j64474m05989o6402k32160o6924j50849k81533
$$ plain form
5172 34943414 34479383 34071375 33777569 33457129 33145712 32843089 32766912 32733737 32662480 32525946
5162 32525946 32339356 32266061 32315023 32591456 32655439 32784993 32752490 32840493 33459720 33831562
5152 33831562 33919384 34186343 34756820 35399626 35878420 36452163 37070734 37998709 38654215 39193253
5142 39193253 39459076 39113649 38814714 38333392 37954617 37584815 37449408 37473667 37398898 37338979
5132 37338979 37548948 38024400 38572331 38672890 38676057 38340340 37930650 37439847 37070065 36937545
5122 36937545 36955552 36815699 36661602 36816479 36926355 36848270 36566345 36601977 36935100 37447655
5112 37447655 38222121 38861971 39433978 39888109 39858639 39624993 39230601 38554606 37849913 37235283
5102 37235283 36577037 36308083 36379677 36215203 35809214 35742812 35510652 35443728 35292879 35011346
5092C5011346k2323l24577j01722k03970l0052K83220o4275k47377q4361k19340
5082C3996569J65736K78618K76230J61941J52440J92620k02455m08526o08603
5073C4004570m89261o81266m63343j93690N3983j54940P3797k40825J1038o1556
5063C1858507l56470n31001n05900k03975j74733m75849J51881K15244j9328O06597
5053C0564973P25535N77002N93759O00591O66377M22781N33145L28214j56036
5044C4856341n55635r96506j214681j436603j382443r90389p26208p62308p79118
5035B6012450j28416k98074p6559N5184l03810Q2964O4715K87077K34762M99044
5025B6429337M84019P72301R78391J064061J247215J303568R64231O61059K01146
$$ plain form
5092 35011346 34989023 34664446 34562724 34358754 34328702 34611922 34547647 34300270 34215909 33996569
5082 33996569 34162305 34440923 34717153 34879094 35031534 35224154 35021699 34613173 34004570
5073 34004570 33515309 32834043 32370700 32177010 32230993 32076053 32149850 31909025 31920063 31858507
5063 31858507 31502037 30971036 30465136 30261161 30086428 29610579 29762460 29977704 29958376 30564973
5053 30564973 31290508 31867510 32461269 33061860 33728237 34151018 34684163 35012377 34856341
5044 34856341 34300706 33304200 32089519 30652916 29270473 28280084 27553876 26791568 26012450
5035 26012450 25884034 25585960 25509401 25564585 25260775 25343739 25408454 25695531 25930293 26429337
5025 26429337 26913356 27685657 28664048 29728109 30975324 32278892 33243123 33904182 34105328
5016C4105328L2417m82403n93445j37978o11652q57728j225659j734647j498602
5007B6995631j218082p85304p78180k75575k81377l36028j82952l4876l20961
4998B2782296k60663l2566K14785K39105M25411N46077N70205O07666P46563J297544
4988B7136423J137219N46276M54432k69329p90080r91854j097010r03943p78493
4979B4443641p01913n89462n34364n69491o97072m20175j40928K4770P7929n2425
4969B0840510j30995k15353k89556m60700l20278j75580k078k813K3112K24294
4959A9490563J74768J39958M07882M12224M08570R2498p4110m30737o90621p71320
4949A9159675n90580m32878n28036k38020j75999O3672J63431p3714L33945M25861
$$ plain form
5016 34105328 34137745 33655342 33061897 32923919 32312267 31454539 30228880 28494233 26995631
5007 26995631 25777549 24992245 24214065 23938490 23657113 23321085 23138133 23103257 22782296
4998 22782296 22521633 22489067 22703852 22942957 23368368 23914445 24484650 25092316 25838879 27136423
4988 27136423 28273642 28819918 29274350 29005021 28214941 27223087 26126077 25222134 24443641
4979 24443641 23741728 23152266 22617902 22048411 21351339 20931164 20790236 20815006 20892935 20840510
4969 20840510 20709515 20494162 20204606 19743906 19423628 19248048 19245970 19243157 19266269 19490563
4959 19490563 19665331 19805289 20213171 20625395 21033965 21126463 21052353 20621616 19930995 19159675
4949 19159675 18569095 18136217 17608181 17370161 17194162 17257834 17421265 17347551 17681496 18107357
4939A8107357j4211J97593j56535n1655k50354l30753l88341j99043j15697j06288
4929A6692073j50173r64l5923n6381J82237L10366K70243P9177J69066k89528
4919A7170193k43588l20691J2453l10338j9874j65462r1036K63922M6674m3752
4909A6298501P3193K38419J50471M2896K14303J60922K82120j04215j59804J57983
4899A7354789P1085J75601r0243O6696Q8995N2287J59909K23913J83571J02607
4889A8389210K62648O6204j1052K02443o3151k23598K5449K69277K12110K563
4879A9132103L59025K27501J48986L33456L27748L84483L44534K73479O49720
4870B2181035K09459K38433J0491J92671L43014L3414K29572K28651j42726L52061
$$ plain form
4939 18107357 18093146 18290739 18134204 18082549 17832195 17501442 17113101 16914058 16798361 16692073
4929 16692073 16541900 16540936 16505013 16448632 16630869 16941235 17211478 17290655 17459721 17170193
4919 17170193 16926605 16605914 16618367 16308029 16288155 16122693 16031657 16295579 16342253 16298501
4909 16298501 16371694 16610113 16760584 16803480 17017783 17178705 17460825 17356610 17196806 17354789
4899 17354789 17425874 17601475 17511232 17577928 17666923 17719210 17879119 18103032 18286603 18389210
4889 18389210 18651858 18718062 18707010 18909453 18846302 18622704 18648153 18917430 19129540 19132103
4879 19132103 19491128 19718629 19867615 20201071 20528819 20913302 21257836 21531315 22181035
4870 22181035 22390494 22628927 22639418 22832089 23175103 23208517 23438089 23666740 23524014 23876075
4860B3876075J27218n4955K44236j7773k05005l7257j9295J29403p3710O1823
4850B4030760o0604P4807n2693J24967K98035K30783K35810M94741O75972N3691
4840B6106269K84312K14080m1074K79275J93310k10255K68917J20729J67787K06861
4830B7590211R5754l2478P1338K8944N2470j57857k49806P358L953K25480J57422
4819B7792789J67358R5470K3833J09571j88997k557M47321J70880m7392J4862
4809B8583138O6983j2323j16813J7221l57754K5994J0156P4221N7188J50705j73113
4798B8325603j11509r0085K48516r1605j33720K38975L97994M33268M31681Q12972
4788C0462090J106527J168627J390010J492034J800590J593921J030119P2775
$$ plain form
4860 23876075 24003293 23948338 24192574 24174801 23969796 23932539 23913244 24042647 23968937 24030760
4850 24030760 23970156 24044963 23992270 24117237 24415272 24646055 24881865 25376606 26052578 26106269
4840 26106269 26390581 26604661 26563587 26842862 27036172 26825917 27094834 27215563 27383350 27590211
4830 27590211 27685965 27653487 27724825 27753769 27806239 27648382 27398576 27405934 27409887 27635367 27792789
4819 27792789 27960147 28055617 28079450 28189021 28000024 27997467 28444788 28615668 28568276 28583138
4809 28583138 28650121 28637798 28520985 28538206 28180452 28206446 28216602 28290823 28348011 28498716 28325603
4798 28325603 28214094 28124009 28372525 28280920 28147200 28386175 28784169 29217437 29649118 30462090
4788 30462090 31568617 32737244 34127254 35619288 37419878 39013799 40043918 40116693
4780D0116693q34768j845948j823438k257241k235043j517294j009834q81936
4772B7711191o92823n38788m97917j16944k28573l57406q6667l9749j42625J21950
4762B5131649L3383P5696K86418n8295j02012n5942j74626k82684l70155n03118
4752B3980314l80592m39852l81899k93932l01664p9149o6541J88767l880M2796
4742B2264368r498p169k13631m84180l07916j34191l51231k23158m51980l78551
4732A9702863m28979l41564l41030J0964k71883r3447J31565K34061L41935P38300
4722A9682785N61886R63919J117101J251728J349303J013603Q44636N56535l78492
4713B6963004j472435j648627j795055j963708j834056j370268p89830o49203
$$ plain form
4780 40116693 39281925 37435977 35612539 33355298 31120255 29602961 28593127 27711191
4772 27711191 27018368 26479580 25981663 25864719 25636146 25278740 25192073 25152324 25009699 25131649
4762 25131649 25165032 25240728 25527146 25468851 25366839 25310897 25136271 24853587 24483432 23980314
4752 23980314 23599722 23159870 22777971 22484039 22182375 22103226 22036685 22225452 22221572 22264368
4742 22264368 22254870 22247701 22034070 21549890 21241974 21107783 20756552 20533394 20081414 19702863
4732 19702863 19273884 18932320 18591290 18602254 18330371 18236924 18368489 18602550 18944485 19682785
4722 19682785 20244671 21208590 22325691 23577419 24926722 25940325 26784961 27341496 26963004
4713 26963004 25490569 23841942 22046887 20083179 18249123 16878855 16089025 15439822
4705A5439822k76224l78093m50452k29532l68568k98641k65631j21966l49359
4696A2701356n5415j60650j55041j8097m4469k88565m2740k5002P6158o1834k4670
4685A1901031J35719k33188M1442o0735J65008m9524l8193o8352j74972p9884
4675A1538352O3831o8061j07538J68148l610j8798K17033Q3514O2335K03791K14933
4664A2353930J07040J56354L32185L64568m3134L17476q6656M833J5245p3018
4654A3448823r9223m86511k71345k24348l86194l43900k63181p2923J81161J24202
4644A1606561p3563j02619J38862J40755M6249K08748J26183R6409K81501K06113
4634A2675199K82845J09603K36399Q6537J89104p3227J6899j97899m1946m05012
$$ plain form
4705 15439822 15163598 14785505 14335053 14105521 13736953 13438312 13172681 13050715 12701356
4696 12701356 12645941 12485291 12330250 12312153 12267684 11979119 11936379 11911377 11987535 11925701 11901031
4685 11901031 12036750 11803562 11845004 11784269 11949277 11899753 11861560 11793208 11618236 11538352
4675 11538352 11602183 11534122 11426584 11594732 11591122 11572324 11789357 11872871 11935206 12138997 12353930
4664 12353930 12460970 12617324 12949509 13314077 13270943 13588419 13501763 13506596 13521841 13448823
4654 13448823 13349600 12863089 12591744 12367396 11981202 11637302 11374121 11301198 11482359 11606561
4644 11606561 11532998 11430379 11569241 11709996 11756245 11964993 12091176 12187585 12469086 12675199
4634 12675199 12958044 13067647 13304046 13390583 13579687 13506460 13523359 13325460 13283514 12878502
4624A2878502k56937k36336k83310m04055l32857q8867p4890j28028J9290j3371
4614A1079141p9954J41603j91988J1756J53261j73350M72648M8606L5492J34007
4604A1631222l6433L74485J48467K04123r290K11978p1984k00342k93699o5381
4594A1893146j57232k20791l35117k49852k2329Q587j64345m7810K80171J03220
4584A1087648Q946j13722N4926J40783p4930J22970K75992o3311J14550J16409
4574A1670261R467O2864K65259O0875p4883j61917m47840m62019k78074j64507
4564A0479486M0934j03757k09812k821j08610l34953j28375N6358J3482l22492
4554I379440p0105J78314j1000j08796j75696j58450O0171J33404J34494j13359
$$ plain form
4624 12878502 12621565 12385229 12101919 11697864 11365007 11276140 11201250 11073222 11092512 11079141
4614 11079141 10999187 11140790 10948802 10960558 11113819 10940469 11413117 11461723 11497215 11631222
4604 11631222 11594789 11969274 12117741 12321864 12312574 12524552 12452568 12252226 11958527 11893146
4594 11893146 11735914 11515123 11180006 10930154 10907825 10916412 10752067 10704257 10984428 11087648
4584 11087648 11096594 10982872 11037798 11178581 11103651 11226621 11502613 11439302 11553852 11670261
4574 11670261 11679728 11742592 12007851 12068726 11993843 11831926 11384086 10922067 10643993 10479486
4564 10479486 10520420 10416663 10206851 10204030 10095420 9760467 9632092 9688450 9701932 9379440
4554 9379440 9309335 9487649 9476649 9367853 9192157 9033707 9093878 9227282 9361776 9248417
4544I248417k05216J75646m7217P2221j38359N8544J74952j92987N2287M6126
4534I244414J34789O8006j80920k42322m0942R5796j82843J3326J20263j56124
4524H873443K6851j93699n4151P0863j02623j43121J32147N3809k1586k9449m210
4513H608274M6060j83340p2127J90110J65619J32707J13710J1247K25565q7541
4503I150284j60960j1866R1400J46019N3559k07661P1491J63294P5049k3868J22473
4492I469214j02148j35775P8425j23576j44260J60316l6136q1598O3081J88028
4482I335571j71563o3219J48486N6116Q2157j5941N2053L3276p0987J74144M7387
4471I607480K5171J0172Q9454Q6074J553K16602P1180r5026O6065L7888l5793
$$ plain form
4544 9248417 9043201 9218847 9171630 9243851 9105492 9164036 9338988 9146001 9198288 9244414
4534 9244414 9379203 9447209 9266289 9023967 8983025 9078821 8895978 8909304 9029567 8873443
4524 8873443 8900294 8706595 8652444 8723307 8620684 8477563 8609710 8663519 8641933 8612484 8608274
4513 8608274 8654334 8470994 8398867 8588977 8754596 8887303 9001013 9012260 9237825 9150284
4503 9150284 8989324 8977458 9068858 9214877 9268436 9060775 9132266 9295560 9370609 9346741 9469214
4492 9469214 9367066 9231291 9309716 9186140 9041880 9202196 9166060 9084462 9147543 9335571
4482 9335571 9164008 9100789 9249275 9305391 9387548 9371607 9423660 9456936 9385949 9560093 9607480
4471 9607480 9632651 9642823 9732277 9818351 9819904 10036506 10107686 10012660 10078725 10116613 10080820
4460A0080820J08385Q3692L1653K17736L2418J18622m7213l1671p7170k7572n5405
4449A0434295k20555J2420k5674R1041j65356j24050L6470K93654j99522r6426
4439A0036297p3791K0468p2067k80726r0197J88946j3100q4278O5311L9414m609
4428I731668k5963l0826J10160j89495p9846l5014n5685j08351r3650J997j02962
4417I122033j14982j50418M6795j16665l0958K0653J1554j5191p9996J89754J10900
4406H993479n4488J30337L8884K19048j55855Q9626J4832j37265j7566J27090
4396I248122k04862j62365Q9005O7152k65734Q761K33542q8339R9120k18852R6343
4385H901893J11104j28887N407p5087R6302K7532k7118j949K8680j04367j6970
$$ plain form
4460 10080820 10189205 10272897 10304550 10522286 10554704 10673326 10626113 10594442 10517272 10489700 10434295
4449 10434295 10213740 10226160 10200486 10291527 10126171 10002121 10038591 10332245 10132723 10036297
4439 10036297 9962506 9982974 9910907 9630181 9539984 9728930 9715830 9631552 9696863 9736277 9731668
4428 9731668 9705705 9674879 9785039 9595544 9515698 9480684 9424999 9316648 9222998 9224995 9122033
4417 9122033 9007051 8856633 8903428 8786763 8755805 8776458 8788012 8772821 8692825 8882579 8993479
4406 8993479 8938991 9069328 9108212 9327260 9171405 9261031 9275863 9138598 9121032 9248122
4396 9248122 9043260 8880895 8969900 9037052 8771318 8780079 9013621 8925282 9024402 8805550 8901893
4385 8901893 9012997 8884110 8889517 8814430 8910732 8938264 8911146 8909197 8937877 8833510 8816540
4374H816540L59613R2261J31379K705m8860P6937p2896P2023K00246j40927j37198
4363I351823Q4585J18908j0428O4046J0248l9033j50622K00051j6779J7746r7176
4352I533369K22575j18113l5595P6366J90719M1715k29919O2132k22383k41138
4342I279728P3409J83001q5777J24462j14515O7083j34020J8068j9037j29245
4332I263157J85074J31378k21783P7562L6508K01360L6966K16760L6648j70444
4322I793186J06284L251J55090K62790P9198J29360q6551j95336J75955l4230
4312A0388997J13522j07550N3179J21497N7989J01787J09121J09696K24056j61940
4302A1010354p0L09522K4195K8073J95281j95682j6484J56089K97859J48487K37407
$$ plain form
4374 8816540 9176153 9268414 9399793 9402498 9353638 9430575 9357679 9429702 9629948 9489021 9351823
4363 9351823 9436408 9555316 9544888 9608934 9619182 9580149 9429527 9629578 9612799 9630545 9533369
4352 9533369 9755944 9637831 9602236 9678602 9869321 9911036 9681117 9743249 9520866 9279728
4342 9279728 9353137 9536138 9450361 9574823 9460308 9527391 9393371 9411439 9392402 9263157
4332 9263157 9448231 9579609 9357826 9435388 9471896 9673256 9710222 9926982 9963630 9793186
4322 9793186 9899470 9902721 10057811 10320601 10399799 10529159 10442608 10247272 10423227 10388997
4312 10388997 10502519 10394969 10448148 10569645 10627634 10729421 10838542 10948238 11172294 11010354
4302 11010354 11010284 11319806 11344001 11372074 11567355 11371673 11355189 11511278 11809137 11957624 12195031
4291A2195031J92755j10197J23633J56755J13675K58125J47817j09695Q5186M5095
4281A3098180l2173O4897J68589K10626J94341J78249N02634J17332L40854K79254
4271A5122783M58505J85596J68935o4474j23767K35539L5450J6583j53060P6783
4261A5958873K75961J40708K46762L21648J50672J40690O4476K62952N53805N40615
4251A8657162M3980K52115K39474K71721P76087O58557N37053O52515L73268N27082
4241B2989014Q3393q0610o5604j25072j13877m5844N574O2311L40875K33750K81497
4230B3565407M43738O06602O46328L23155N47919M51055L84273O87663O14964
4221B8271104N25113M14927R26529M29530K20127P19181J66858L50990N54052
$$ plain form
4291 12195031 12387786 12277589 12401222 12557977 12671652 12929777 13077594 12967899 13053085 13098180
4281 13098180 13066007 13130904 13299493 13510119 13704460 13882709 14385343 14502675 14843529 15122783
4271 15122783 15581288 15766884 15935819 15871345 15747578 15983117 16018567 16035150 15882090 15958873
4261 15958873 16234834 16375542 16622304 16943952 17094624 17235314 17299790 17562742 18116547 18657162
4251 18657162 18701142 18953257 19192731 19464452 20240539 20899096 21436149 22088664 22461932 22989014
4241 22989014 23072407 22991797 22926193 22801121 22687244 22641400 22646974 22709285 23050160 23283910 23565407
4230 23565407 24009145 24615747 25262075 25585230 26133149 26584204 26968477 27656140 28271104
4221 28271104 28796217 29211144 30137673 30567203 30787330 31506511 31673369 32024359 32578411
4212C2578411L84444P61468O06078N91031N74356R85519R36811J128812J078085
4203C9625015J242371J165432J330723J148233J341629J559663J478304J503651
4195E0395021J426302J721637J794243K083275K335585K394529K757392L223199
4187F8131183L600393M107133M415144M981306N988498O620709P512781Q781447
4179A14138594J0559748J2013802J3503071J5375282J6746988J7275503J6689463
4172B16302451J6044145J4701208J2450531R042270L840895k370425r172641j5248549
4164B45589885j8476289j8098979j4623110j1343971r903118r937599j0692221
4157A52514598j1506728j2490308j1753758r735932p844505o672446o177268n070849
$$ plain form
4212 32578411 32962855 33724323 34330401 34921432 35495788 36481307 37418118 38546930 39625015
4203 39625015 40867386 42032818 43363541 44511774 45853403 47413066 48891370 50395021
4195 50395021 51821323 53542960 55337203 57420478 59756063 62150592 64907984 68131183
4187 68131183 71731576 75838709 80253853 85235159 91223657 97844366 105357147 114138594
4179 114138594 124698342 136712144 150215215 165590497 182337485 199612988 216302451
4172 216302451 232346596 247047804 259498335 268540605 272381500 270011075 260838434 245589885
4164 245589885 227113596 209014617 194391507 183047536 173144418 163206819 152514598
4157 152514598 141007870 128517562 116763804 107027872 99183367 92510921 86333653 81262804
4149H1262804m699309m092836l932208l587602l417825k834391k697790k480600
4141E3520243k301659k321282k042158j830035j687560j591271j450250j351529
4133C8944499j171883r90868j130557j026799o75629r40265o56552n61881m16790
4124C1373275o75919n09357j76458m17884n35973m85488j50503j05962j45119
4115B8170612j31561o1316j43677k38267q3439k19934L6659K18402k49984o0204
4105B7237291j8574J14835R3008P1281O9227J86001K55369R2780J53808M21465
4095B8676491M38747j5129L3251J69075J50238K24323K15790J71641K68829N16172
4085C0849428O86562Q37816Q65622O84972N84636R39702Q89175R16936J034648
$$ plain form
4149 81262804 76563495 72470659 68538451 64950849 61533024 58698633 56000843 53520243
4141 53520243 51218584 48897302 46855144 45025109 43337549 41746278 40296028 38944499
4133 38944499 37772616 36781748 35651191 34624392 33948763 33008498 32351946 31790065 31373275
4124 31373275 30697356 30187999 30011541 29593657 29057684 28572196 28421693 28315731 28170612
4115 28170612 28039051 27977735 27834058 27595791 27512352 27292418 27329077 27547479 27297495 27237291
4105 27237291 27218717 27333552 27426560 27497841 27567068 27753069 28008438 28101218 28255026 28676491
4095 28676491 29115238 29100109 29133360 29302435 29452673 29676996 29892786 30064427 30333256 30849428
4085 30849428 31535990 32373806 33239428 33924400 34509036 35448738 36337913 37254849 38289497
4076C8289497J419378J212160R32695P78979L76569N60242K86822M03340J055053
4067D5314735J013611R33871Q83635J120880J137818J302950J358509R97104J011403
4058E5074516J018406J086571Q21850R24504Q77911Q73499N80499P06175O72612
4049F2636543N80669O78643M77652M45746L40767L94943M32667O12358M33037
4040F7033025J65253M15983J75639M01682K33746J21790L57268N7425j63771J81405
4030F8979445R8217K2512L110r6578J4480N704j32786q8289P9098J86710k4740
4019F9046883J62743O5271J9726J68107Qn599q872k09669r8714J91198L7866L7118
4007F9406066J10063J58680l7335j47242p5762J69546O1421o3330J03750j31868
$$ plain form
4076 38289497 39708875 40921035 41853730 42632709 43009278 43569520 43856342 44259682 45314735
4067 45314735 46328346 47262217 48145852 49266732 50404550 51707500 53066009 54063113 55074516
4058 55074516 56092922 57179493 58001343 58925847 59803758 60677257 61257756 61963931 62636543
4049 62636543 63217212 63895855 64373507 64819253 65160020 65554963 65987630 66599988 67033025
4040 67033025 67198278 67614261 67789900 68191582 68425328 68547118 68904386 68961811 68798040 68979445
4030 68979445 69077662 69100174 69103284 69006706 69021186 69026890 68894104 68805815 68884913 69071623 69046883
4019 69046883 69209626 69274897 69294623 69462730 69462738 69457139 69448267 69238598 69139884 69331082 69368948 69406066
4007 69406066 69516129 69674809 69637474 69490232 69414470 69584016 69645437 69582107 69685857 69553989
3997F9553989k12592l9849k03878r1131J92614p5106j16220Q207N300l91534l39465
3986F8290335l42009m69607l73509o79256p48766o69068r57508o97125n19865
3977F2833622p62117r13981r58912r08829p85830q50093p07524q47131q76484
3968E5222721n49582o70907p48487o25680p52102p19948o78092p88167p29994
3959D8959762r35927j055970j187354p99461q91870r40565m55380n37889o40269
3950D1515077p28757n38539m89606m01705m87208n16768l82641m89656j18152
3941C7362045l18941k10426m26060l80315k39486r6459l06371q1743p1152j52333
3931C5078759j8858l4564J62403L86538K8749L83959M88316P11883O15621O55381
$$ plain form
3997 69553989 69341397 69301548 69097670 69006539 69199153 69124047 69007827 69016034 69021334 68629800 68290335
3986 68290335 67948326 67478719 67105210 66425954 65677188 65008120 64050612 63353487 62833622
3977 62833622 62071505 61157524 60198612 59289783 58503953 57653860 56946336 56099205 55222721
3968 55222721 54673139 54002232 53253745 52628065 51875963 51156015 50477923 49689756 48959762
3959 48959762 48023835 46967865 45780511 44981050 44089180 43148615 42693235 42155346 41515077
3950 41515077 40786320 40247781 39758175 39356470 38869262 38352494 37969853 37480197 37362045
3941 37362045 37043104 36832678 36406618 36026303 35786817 35690358 35383987 35302244 35231092 35078759
3931 35078759 35059901 35025337 35187740 35574278 35603027 35986986 36475302 37187185 37802806 38458187
3921C8458187J017656J130375J354213J282951J829423K061481K358654K568797
3913E2061737K484311K314570K444858K229132J898499J477575N44198J82575
3905F5637455j19356l97799o70038m82402p73187o31232r8991l96833l54817l75002
3895F1337798n67149q09559j230002j516872j844323k148166k304123k338671
3887D8578933k030663j900875j645405j493880j020208j001182q52837n11499
3879C8122384l81858k6895j39194j93432M9972K48845N69355O97019Q16707R07553
3869D0670456J197322J321018J457917J870117K134303K033895K215419K202523
3861E5102970K272177J950241J689108J044599O95962M47761R4033k76573m25375
$$ plain form
3921 38458187 39475843 40606218 41960431 43243382 45072805 47134286 49492940 52061737
3913 52061737 54546048 56860618 59305476 61534608 63433107 64910682 65454880 65637455
3905 65637455 65518099 65120300 64450262 63967860 63194673 62563441 62464450 62067617 61712800 61337798
3895 61337798 60770649 59961090 58731088 57214216 55369893 53221727 50917604 48578933
3887 48578933 46548270 44647395 43001990 41508110 40487902 39486720 38633883 38122384
3879 38122384 37740526 37713631 37574437 37381005 37430977 37679822 38249177 38946196 39762903 40670456
3869 40670456 41867778 43188796 44646713 46516830 48651133 50685028 52900447 55102970
3861 55102970 57375147 59325388 61014496 62059095 62755057 63202818 63296851 63020278 62594903
3852F2594903k19440n01771m22480l16574m39170n07969o52627p29327j198997
3843E7606548j465194j584082j944763k131123k175271k185268k050872k032897
3835D2037078j847116j604642j386839j376548q79142j046519r27566o00827q42102
3826C1525777o89278m34289n05907n68215l17983m47837j21689l41029k6054l40028
3816B7733468m69970J39191M8421j14404J21580l65357J73060J6078j21305k61929
3806B6898833m619O4692M3310M746J3755K20358L7864R8766M2700M105J36048
3795B7560558M1304P5291L79332l6451M28084J41161J52494L34536J81029K07946
3785B9465284j1115o0471K31478K56876L09298o2128l11886K9465M5695m0422
$$ plain form
3852 62594903 62375463 61873692 61451212 61134638 60695468 60187499 59534872 58805545 57606548
3843 57606548 56141354 54557272 52612509 50481386 48306115 46120847 44069975 42037078
3835 42037078 40189962 38585320 37198481 35821933 34942791 33896272 32968706 32367879 31525777
3826 31525777 30836499 30402210 29896303 29328088 29010105 28562268 28440579 28099550 28073496 27733468
3816 27733468 27263498 27402689 27451110 27336706 27458286 27092929 27265989 27282067 27160762 26898833
3806 26898833 26894214 26958906 27002216 27006962 27020717 27241075 27278939 27377705 27420405 27424510 27560558
3795 27560558 27601862 27677153 28056485 28020034 28448118 28589279 28741773 29076309 29257338 29465284
3785 29465284 29454169 29393698 29625176 29882052 30191350 30129222 29817336 29846801 29892496 29852074
3775B9852074r8387J2036R8102Q2192M1015r059L7467j49544r8768p5126j16752
3764B9575250N4961m3879r6911Q4263J07704K64012K8175J71508l3259Q7129K89372
3753C0488325J11534K67528K42842M82080K94605N37048M75808M30212K11738
3744C3541720L51043L14979K57076N40516J70829M57531J62833K19838M64143
3735C6480508J89005j9864K29747J60262L6199K1586J55404M6816K67827J58728
3725C7726218O6901N4985J40349J30074l1510R6273K21382o525J639K62140L53910
3714C9015836M97108J75981J17757R5583L93225L44500K95531L30093L17103M57508
3704D2040225M01541L88614N10594L11516L63936L96856N54793L80775N33121
$$ plain form
3775 29852074 29753687 29765723 29863825 29946017 29987032 29977973 30015440 29865896 29767128 29692002 29575250
3764 29575250 29630211 29586332 29489421 29573684 29681388 29945400 29973575 30145083 30111824 30198953 30488325
3753 30488325 30599859 30867387 31110229 31592309 31886914 32423962 32899770 33329982 33541720
3744 33541720 33892763 34207742 34464818 35005334 35176163 35633694 35796527 36016365 36480508
3735 36480508 36669513 36649649 36879396 37039658 37075857 37097443 37252847 37299663 37567490 37726218
3725 37726218 37793119 37848104 37988453 38118527 38087017 38183290 38404672 38398147 38399786 38661926 39015836
3714 39015836 39512944 39688925 39806682 39902265 40295490 40639990 40935521 41265614 41582717 42040225
3704 42040225 42441766 42830380 43340974 43652490 44016426 44413282 44968075 45348850 45881971
3695D5881971L65144M76797M89019L74785O97191N64043N23487M39216N66401
3686E0378054R00361P15039M34595M33152Q56600Q27875R38258R64262P05300
3677E7153496P89983R12786J138715J189562J140115J040786R55666J087749J122998
3668F6531856J258440J408388J288613J247343J170488J436182J690037J693828
3660G7725175J628133J540036J847534J793642J841113J719750J821005K217178
3652I2133566K116096K016444K143013K241810K002658K270965K480316K424159
3644A09829027K159682K099610K137810K080332K022893K034332K003648J891723
3636A26259057J784687J924201K062102J828028J712460J656107J519076J441905
$$ plain form
3695 45881971 46247115 46723912 47212931 47587716 48284907 48848950 49372437 49811653 50378054
3686 50378054 51278415 51993454 52428049 52861201 53717801 54545676 55483934 56448196 57153496
3677 57153496 57943479 58856265 59994980 61184542 62324657 63365443 64321109 65408858 66531856
3668 66531856 67790296 69198684 70487297 71734640 72905128 74341310 76031347 77725175
3660 77725175 79353308 80893344 82740878 84534520 86375633 88095383 89916388 92133566
3652 92133566 94249662 96266106 98409119 100650929 102653587 104924552 107404868 109829027
3644 109829027 111988709 114088319 116226129 118306461 120329354 122363686 124367334 126259057
3636 126259057 128043744 129967945 132030047 133858075 135570535 137226642 138745718 140187623
3628A40187623J498061J224903J080808R48278O81038Q80875R28534O48433P40361
3619A48818914N71616O66369P36422P27964O39119O94206M99145K23909L14670
3610A53892334J51114M2053l14038k73164l69168o45518p50593p66039q29870
3601A50137111j030718q85815n94075p99686q84329j060001r42037o20947q14293
3592A42505210j273394r65702r66566j190195j232683j012033p95434p54312p66486
3583A33548405m42194o85709n83639k71743l72631j46913k6974M8904K87449K5200
3573A31380155q4064K5561K06488J36771J09283J06280k860J45574K06762J04038
3563A32333988K209K69548M39201K81005K34192K96526K42991J34555j10204n4540
$$ plain form
3628 140187623 141685684 142910587 143991395 144939673 145620711 146501586 147430120 148078553 148818914
3619 148818914 149390530 150056899 150793321 151521285 152160404 152854610 153353755 153577664 153892334
3610 153892334 154043448 154085501 153771463 153498299 153129131 152483613 151733020 150966981 150137111
3601 150137111 149106393 148220578 147626503 146826817 145942488 144882487 143940450 143319503 142505210
3592 142505210 141231816 140266114 139299548 138109353 136876670 135864637 135069203 134314891 133548405
3583 133548405 133106211 132420502 131836863 131565120 131192489 131045576 131018602 131067506 131354955 131380155
3573 131380155 131296091 131321652 131528140 131664911 131774194 131880474 131877614 132023188 132229950 132333988
3563 132333988 132336197 132605745 133044946 133325951 133560143 133856669 134099660 134234215 134124011 134069471
3553A34069471r0877l64141k60972j52901j92383r327j34184K23457K81042N07800
3543A33876985M47711P17547R66288R12857N70238M61395N01505K0249n71447
3534A37903328q92497j089696j113445j554980j767629j482091j646104j652270
3526A26704616j369376j371952j286996j576163j515062j847233j943170k005686
3518A13788978k721870k824092k640118k907279k962030k698339k311284k217157
3510I2506809j896170j365447j351357j142014r07032p25042q45743p09328m57434
3501H3107242m32828m99560o24899n65732o41835n68566o51632l89454k82736
3492G8450000m89539k27773l11214m10781o96806n89131p64876o21846p44235
$$ plain form
3553 134069471 133978594 133614453 133353481 133200580 133008197 132998870 132864686 133088143 133369185 133876985
3543 133876985 134324696 135042243 136008531 136921388 137491626 137953021 138454526 138474775 137903328
3534 137903328 137010831 135921135 134807690 133252710 131485081 130002990 128356886 126704616
3526 126704616 125335240 123963288 122676292 121100129 119585067 117737834 115794664 113788978
3518 113788978 111067108 108243016 105602898 102695619 99733589 97035250 94723966 92506809
3510 92506809 90610639 89245192 87893835 86751821 85844789 85119747 84274004 83564676 83107242
3501 83107242 82674414 82174854 81549955 80984223 80342388 79773822 79122190 78732736 78450000
3492 78450000 77960461 77732688 77421474 77010693 76313887 75724756 74959880 74338034 73593799
3483G3593799p40272r29084p53886q18424o44780p43589p54575n35205o57634
3474F7016350o71751l21625n03657k50455l80305l56373l70155l48897k47005
3465F3566127j68505N1459l35052j73559m6212p5620n0674m7784J95910R253p3289
3454F2852054K73125L68726R403l6186L8380j16957K67029l2752l5664l9920J74938
3443F3722176L18936K1321K41708K44495L70672L08197M28266M78812L84843N08897
3433F7028323K06994O08485O75993P56541P38781N76238J90072O30286K47699
3424G1659412l821n0008R664J42100M30633L37293N87830P78892O16528P69824
3414G5278347J234731J296680J361844J760531J553325J789900K045031J744855
$$ plain form
3483 73593799 72853527 71924443 71170557 70352133 69707353 68963764 68209189 67673984 67016350
3474 67016350 66344599 66022974 65519317 65268862 64888557 64532184 64162029 63813132 63566127
3465 63566127 63397622 63449081 63114029 62940470 62894258 62818638 62767964 62720180 62916090 62925343 62852054
3454 62852054 63125179 63493905 63503308 63467122 63505502 63388545 63655574 63622822 63587158 63547238 63722176
3443 63722176 64041112 64062433 64304141 64548636 64919308 65227505 65655771 66134583 66519426 67028323
3433 67028323 67235317 67843802 68519795 69276336 70015117 70591355 70781427 71411713 71659412
3424 71659412 71655591 71605583 71615247 71757347 72187980 72525273 73113103 73891995 74508523 75278347
3414 75278347 76513078 77809758 79171602 80932133 82485458 84275358 86320389 88065244
3406H8065244J375784J438471R81987K63514n9236p9256p21103n30698J31858
3397I0866565M65571J053239R13438J087171J090043P85683J119656J045902J556664
3388I9983932J946415K510930K925406L314655L247003K442172K043771R54190
3380A19368474j30703p16861m62609O50035J047385R58805P13679N19734K29795
3371A22177734q41782j175803q10907p67926o65779j81292K49083R12602J393909
3362A20289839J595623J717107J454070J255043J523474J127876J104724K018281
3354A32086037K404044K828112K956525K027060J259149O40019j92491p11932
3346A43296523j09636R45040J612583J968970J890747J882016K118670J640712
$$ plain form
3406 88065244 89441028 90879499 91861486 92125000 92065764 91986508 91265405 90734707 90866565
3397 90866565 91332136 92385375 93298813 94385984 95476027 96261710 97381366 98427268 99983932
3388 99983932 101930347 104441277 107366683 110681338 113928341 116370513 118414284 119368474
3380 119368474 119237771 118520910 118058301 118708336 119755721 120714526 121428205 121947939 122177734
3371 122177734 121335952 120160149 119349242 118581316 117915537 117734245 117983328 118895930 120289839
3362 120289839 121885462 123602569 125056639 126311682 127835156 128963032 130067756 132086037
3354 132086037 134490081 137318193 140274718 142301778 143560927 144200946 144008455 143296523
3346 143296523 143186887 144131927 145744510 147713480 149604227 151486243 153604913 155245625
3338A55245625J313660J366838J529744J968329K090375K603475L457573L590020
3330A73165639L500220L268001K216782J619254R96298P43510J116081J678770
3322A88304555K403868K933454L102607K495220J475073J080391r1010p87178
3314B00916980j37549O10178R81664J548711K042066K505554K867200L093206
3306B14428010L162900L379318L824628M116270M507454N362284N881928O016404
3298B50679196N521647L938007J611654L32780l56371j334651j695238q77763
3290B57819261R488M21527Q91344J631392K094490K312457K506551K624138K996156
3281B73306804L164713L537073L578099L561125L971119M562818M724559M769647
$$ plain form
3338 155245625 156559285 157926123 159455867 161424196 163514571 166118046 169575619 173165639
3330 173165639 176665859 179933860 182150642 183769896 184766194 185509704 186625785 188304555
3322 188304555 190708423 193641877 196744484 199239704 200714777 201795168 201704158 200916980
3314 200916980 200779431 201389609 202371273 203919984 205962050 208467604 211334804 214428010
3306 214428010 217590910 220970228 224794856 228911126 233418580 238780864 244662792 250679196
3298 250679196 256200843 260138850 261750504 262083284 261726913 260392262 258697024 257819261
3290 257819261 257828749 258250276 259141620 260773012 262867502 265179959 267686510 270310648 273306804
3281 273306804 276471517 280008590 283586689 287147814 291118933 295681751 300406310 305175957
3273C05175957N207743N443414N503047N691098O055463N463515M023988L324246
3265C45888471M000135L021161K583793M827755O184569O885920P353344Q568391
3257C89313539R316638R276101J0306296J1707135J2048060J1868319J0336318
3250D64172406P756572M396512o97991o214035j1165373j4973682j6744319j7465206
3242D09064884j6969814j5357394j3782479j1734786r733489p903359o902654
3235C26680909o558210o762228o742093o843599o632548n317575m430607l683355
3227B79710694l588093l417149l656255m009430l883822l379317k745649k204545
3219B52826434j899063j615898j839278k401362k365082k503328k309393k288118
$$ plain form
3273 305175957 310383700 315827114 321330161 327021259 333076722 338540237 342564225 345888471
3265 345888471 349888606 352909767 355493560 360321315 366505884 373391804 380745148 389313539
3257 389313539 398630177 407906278 418212574 429919709 441967769 453836088 464172406
3250 464172406 471928978 476325490 475627499 469413464 458248091 443274409 426530090 409064884
3242 409064884 392095070 376737676 362955197 351220411 341486922 333583563 326680909
3235 326680909 320122699 313360471 306618378 299774779 293142231 287824656 283394049 279710694
3227 279710694 276122601 272705452 269049197 265039767 261155945 257776628 255030979 252826434
3219 252826434 250927371 249311473 247472195 245070833 242705751 240202423 237893030 235604912
3211B35604912k924686k736290k736969k742936k560881k279846k101151k083966
3203B15438187k235825k531051k808968k641437k150924j039958k49119m18438
3195B01362467N3370K24464K10906P34333R24390J420082J899834J429006J18501
3186B08377353j507839l362579n383940n955400n535303m789540m273924l912015
3178A73656813l149265k800897k535689k232719j892494j733370j746137j695601
3170A55870641j693899j509970j633225j040024j21518m23927k42823J67998L25146
3161A49698399R30984J535974K490390L534731M409673M318110K019532j080548
3153A67857245m005896p214575r071291q361780o737363n496065m268744l478503
$$ plain form
3211 235604912 232680226 229943936 227206967 224464031 221903150 219623304 217522153 215438187
3203 215438187 213202362 210671311 207862343 205220906 203069982 202030024 201780905 201362467
3195 201362467 201415837 201640301 201851207 202585540 203509930 204930012 206829846 208258852 208377353
3186 208377353 206869514 203506935 198122995 192167595 186632292 181842752 177568828 173656813
3178 173656813 170507548 167706651 165170962 162938243 161045749 159312379 157566242 155870641
3170 155870641 154176742 152666772 151033547 149993523 149872005 149448078 149205255 149373253 149698399
3161 149698399 150629383 152165357 154655747 158190478 162600151 166918261 168937793 167857245
3153 167857245 163851349 156636774 147565483 139203703 132466340 126970275 122701531 119223028
3145A19223028l254502k624785j991980j797454j687192j580011j472709j317640
3137A03496755j115975j103640p22298q72616p58408n23418o41896o68730n22934
3128I6566840K1382K58617R82028J504606J704619J249325j95297j256738k866152
3119I7969230l896524m047717l294086k624149k256387j959962j904430j458966
3111G6527009j233993j027928j133745p97114q88773q53761o14468o67993q69913
3102F8439321o86889p40960q22159r50325j142360q94635j003143j011789o20556
3093F0566505p16709l79256n17912q42947m52258l97715l88758o40131j31600
3084E6099219l50673n10736o84593o67102n99387m73783m03316k64169n14534
$$ plain form
3145 119223028 115968526 113343741 111351761 109554307 107867115 106287104 104814395 103496755
3137 103496755 102380780 101277140 100554842 99682226 98923818 98400400 97758504 97089774 96566840
3128 96566840 96588222 96846839 97828867 99333473 101038092 102287417 102092120 100835382 97969230
3119 97969230 94072706 90024989 86730903 84106754 81850367 79890405 77985975 76527009
3111 76527009 75293016 74265088 73131343 72334229 71445456 70591695 69977227 69309234 68439321
3102 68439321 67752432 67011472 66189313 65238988 64096628 63201993 62198850 61187061 60566505
3093 60566505 59849796 59470540 58952628 58109681 57657423 57259708 56870950 56230819 56099219
3084 56099219 55748546 55237810 54553217 53886115 53286728 52812945 52409629 52145460 51630926
3075E1630926o25579n05946n51539m08301l65900l50618l91944o18132n02358
3066D7310609l09795m62196n60617n82576k86837l21571l58015k84393m56497
3057D3688112m66442l04151l57180m43067j82333k27807m88389k79827j80618
3048D0758298k02173k44010k97452k49911k77933j79932k74942j80184j38008
3039C8713753k41549k50885j47969j78945n3115l20873k28651j24644p8095k54346
3029C6834681P5964M1066k59382M8497N1811J70998J12949J14504P8954p8572
3019C7191470K76117M19712L31672N89558M33081K47378L17416L15083N7934j99856
3009C9979565l37268k20313k30532l31726l97525j31857k39360R6462J09271r1295
$$ plain form
3075 51630926 51005347 50499401 49947862 49539561 49173661 48823043 48431099 47812967 47310609
3066 47310609 47000814 46538618 45978001 45395425 45108588 44787017 44429002 44144609 43688112
3057 43688112 43221670 42917519 42560339 42117272 41934939 41707132 41218743 40938916 40758298
3048 40758298 40556125 40312115 40014663 39764752 39486819 39306887 39031945 38851761 38713753
3039 38713753 38472204 38221319 38073350 37894405 37841290 37520417 37291766 37167122 37089027 36834681
3029 36834681 36910645 36951711 36692329 36740826 36792637 36963635 37076584 37191088 37270042 37191470
3019 37191470 37467587 37887299 38218971 38808529 39241610 39488988 39806404 40121487 40179421 39979565
3009 39979565 39642297 39421984 39191452 38859726 38462201 38330344 38090984 38187446 38296717 38205422
2999C8205422M1571L20888K50195J40590R7402O1162J59239L71260J61239N84505
2989D0393473M81152O40285N81404M78961P99936Q33786Q43053R74118P33417
2980D6759585P89574N33804J21684O0476l56069n68902m17950l80987k26575j04734
2970D6209906j86245k93817k57371M4668P0220n4363J28567L23019K78436P8077
2960D6341097K06949L41200O40400M76970M88643O19430O32098O26609P13259
2951E1086655R57841Q29758J047335J182097J020775R42970Q98275R16515Q03721
2942E9685942O87057N92880N60677Q69647Q88326Q90047N40661L08104O03465
2933F5626806M67898J84729L73209K93133L50997M25731K90918O08632L69429
$$ plain form
2999 38205422 38246993 38567881 38818076 38958666 39056068 39117230 39276469 39647729 39808968 40393473
2989 40393473 40874625 41514910 42096314 42575275 43375211 44208997 45052050 46026168 46759585
2980 46759585 47549159 48082963 48204647 48265123 47909054 47340152 46922202 46541215 46314640 46209906
2970 46209906 46023661 45729844 45472473 45517141 45587361 45532998 45661565 45984584 46263020 46341097
2960 46341097 46548046 46889246 47529646 48006616 48495259 49114689 49746787 50373396 51086655
2951 51086655 52044496 52874254 53921589 55103686 56124461 57067431 57965706 58882221 59685942
2942 59685942 60372999 60965879 61526556 62396203 63284529 64174576 64715237 65023341 65626806
2933 65626806 66094704 66279433 66652642 66945775 67296772 67722503 68013421 68622053 68991482
2924F8991482N51240P86970P19122J293251J303690J458271J454347K225144J884569
2915H0668086K251236K567495K644620K838792K706609K683613J948031J412638
2907I9721120N90848r89456j885114k668050l179078k931821k441502k117389
2899H4099558j373952j102406o97257j03225P8783J40862J16383P45413R61713
2890H2865872J000953Q25634R06378R46931M71826O17024O70770M86090L00211
2881H9091689J81246m30234p06366j330541j742832j932232k307314k312704k452354
2872G6058358k364286k014065j915553j698396j196485j257071q39486o29266
2864F4143750o19336m01100m68360p62117p14560o83484j013631j157961j355460
$$ plain form
2924 68991482 69542722 70329692 71048814 72342065 73645755 75104026 76558373 78783517 80668086
2915 80668086 82919322 85486817 88131437 90970229 93676838 96360451 98308482 99721120
2907 99721120 100311968 99322512 97437398 94769348 91590270 88658449 86216947 84099558
2899 84099558 82725606 81623200 80925943 80822718 80901501 81042363 81158746 81904159 82865872
2890 82865872 83866825 84692459 85598837 86545768 87017594 87634618 88305388 88791478 89091689
2881 89091689 89272935 88842701 88136335 86805794 85062962 83130730 80823416 78510712 76058358
2872 76058358 73694072 71680007 69764454 68066058 66869573 65612502 64773016 64143750
2864 64143750 63524414 63123314 62654954 61892837 61178277 60494793 59481162 58323201 56967741
2855E6967741j473926j489223j406494j429619j348385j573667j502409j471386
2847D5272632j369854j234964j166925j054777j290732p33779r10297p69422o27827
2838C6114055o82877m76937o55979p92521l71561m96430n55660m45410m30086
2829C1206594n88797o07835p13502o63695l30657q71879m18477l18742l62991
2820B6330019n50261m68503n91891j18847j73280m19678j33782l42068n80478
2811B2951231n36098m08880k94030l09796l50682k95010o40844n35027j51752
2802A9429112q0799m23608j55532m34813j34256k0040j68472l46417j62927k48679
2792A7253569k12220l53639k22938j12146j29495l13501l45711m74290m3409k96947
$$ plain form
2855 56967741 55493815 54004592 52598098 51168479 49820094 48246427 46744018 45272632
2847 45272632 43902778 42667814 41500889 40446112 39155380 38421601 37511304 36741882 36114055
2838 36114055 35431178 34954241 34298262 33505741 33134180 32637750 32082090 31636680 31206594
2829 31206594 30617797 30009962 29296460 28632765 28302108 27430229 27011752 26693010 26330019
2820 26330019 25779758 25311255 24719364 24600517 24427237 24007559 23873777 23531709 22951231
2811 22951231 22415133 22006253 21712223 21402427 21051745 20756735 20115891 19580864 19429112
2802 19429112 19348313 18924705 18769173 18334360 18200104 18180064 18011592 17665175 17502248 17253569
2792 17253569 17041349 16687710 16464772 16352626 16223131 15909630 15563919 15089629 15046220 14749273
2782A4749273j93890k56841l02969j55378k05450k50319r2165j35605j44567k21628
2772A2790461j07582k6455p7295l42014k08582j9792k11546j15361o2499j64961
2762A1454374m08561j05023l9854n1707k73119k25642j35575m1936j61097o5880
2752I945980j24756j85786q2434j21580p1984O612l16028j89335n046R9946k61835
2741H693754j71424j86678q407R6247k76199j45939r3978j29800j61833k54281
2731G361462k08721j5056K03817r311L7989k30311m3302K7006j26151j55557o7777
2720F774088r9969r951j13171q8692k540m0199j35003j80037J35960j56590j07802
2709E976094j8539p3577N0113j97235j8073J9805n6769J79655m3462m33853J83204
$$ plain form
2782 14749273 14555383 14298542 13995573 13840195 13634745 13384426 13292261 13156656 13012089 12790461
2772 12790461 12682879 12656424 12579129 12237115 12028533 12008741 11797195 11681834 11619335 11454374
2762 11454374 11045813 10940790 10900936 10849229 10576110 10350468 10214893 10172957 10011860 9945980
2752 9945980 9821224 9635438 9553004 9431424 9359440 9366052 9050024 8860689 8855643 8955589 8693754
2741 8693754 8522330 8335652 8327245 8423492 8147293 8001354 7907376 7777576 7615743 7361462
2731 7361462 7152741 7137685 7341502 7332191 7370180 7139869 7096567 7123573 6997422 6841865 6774088
2720 6774088 6674119 6664168 6550997 6462305 6459765 6419566 6284563 6104526 6240486 6083896 5976094
2709 5976094 5957555 5883978 5934091 5736856 5718783 5738588 5681819 5861474 5818012 5384159 5567363
2698E567363j5142Q4403O4168j69174m7187j51345n4357K5722J0218o3791m42966
2687D807912j02905J46210k306K0087n1103L9900m4983l488M1059M5598n5520
2676D840461j16309j31429J8765O3687j04959J14146j11726M0346K0140j08099
2666D525023K03275p8640o7173l3045k1515j34208Q9069j2112j38357k7203n5058
2655D250056K29470O755n9417J46148l01415r1755L213m1104J63716o9470k10819
2644D025378P8676N0541P9304j94635p005L31403m7623L7093L6929m8363R092
2633D350790j65885o970R7662R5930M6014J22408J85296k3798k49296M8334n4582
2622D445903n4010m0788K53473J90810k23198j78376n5532j01845p4060m8959
$$ plain form
2698 5567363 5552221 5636624 5700792 5531618 5484431 5333086 5278729 5304451 5314669 5250878 4807912
2687 4807912 4705007 4851217 4848911 4868998 4817895 4857795 4812812 4809324 4850383 4895981 4840461
2676 4840461 4724152 4592723 4611488 4675175 4570216 4684362 4572636 4612982 4633122 4525023
2666 4525023 4728298 4649658 4582485 4549440 4527925 4393717 4482786 4470674 4332317 4305114 4250056
2655 4250056 4479526 4486281 4426864 4573012 4271597 4179842 4183055 4141951 4305667 4236197 4025378
2644 4025378 4104054 4154595 4233899 4039264 4032259 4363662 4316039 4353132 4390061 4341698 4350790
2633 4350790 4184905 4177935 4275597 4371527 4417541 4539949 4725245 4701447 4452151 4500485 4445903
2622 4445903 4391893 4351105 4604578 4795388 4572190 4393814 4338282 4236437 4162377 4113418
2612D113418J11104K3760j46521p1552k2304K1361K73884N2435k51125M8405K19024
2601D371889L4354j91002J81138R8155Q2872J48573j89878l1922j5940N7200k11664
2590D333775j77248n2405j19355p0821Q4567m6215j60427Q750J63351j16565j19759
2579C727648j68273j15030J99625j66439O2568J25189p7403j7950q5934n0752
2569C433249l5972J68266n2170j49889K1215J9556r194j99686K00881r5856J22964
2558C423364K0805j29518K7124j49856p8469l8869j73605k75910k21466J99740
2548B603340R0712j70786J12388r1806L560r0480K9677J20254M1994l3480j48630
2537B466743L9074R4277k924j99201o8124n6218j24340L7222K28860Q6321j29165
$$ plain form
2612 4113418 4224522 4248282 4101761 4030209 4007905 4029266 4303150 4355585 4104460 4152865 4371889
2601 4371889 4406243 4215241 4396379 4494534 4577406 4725979 4536101 4504179 4488239 4545439 4333775
2590 4333775 4156527 4104122 3984767 3913946 3998513 3952298 3791871 3800621 3963972 3847407 3727648
2579 3727648 3559375 3444345 3643970 3477531 3540099 3665288 3587885 3569935 3484001 3433249
2569 3433249 3397277 3565543 3513373 3363484 3384699 3404255 3395061 3195375 3396256 3300400 3423364
2558 3423364 3444169 3314651 3341775 3191919 3113450 3074581 2900976 2625066 2403600 2603340
2548 2603340 2694052 2523266 2635654 2543848 2547408 2456928 2486605 2606859 2648853 2615373 2466743
2537 2466743 2505817 2600094 2597170 2397969 2329845 2273627 2149287 2186509 2415369 2501690 2372525
2526B372525j26635j10565j70819J16194L8927L3788p1715m1298k83682J22130
2516A878850L12452n5117k35178m424l9919j08062j08926N046r890J53848j68402
2505A620278n0166J50451j26413r865k3044j9890J35044j41446j79257J13079
2495A468771Q9917k6120O7151j75279q7399N1099j11761L4319P1075j36961j03751
2484A141061N1621P274k017k6927J21262J1M2483p4283l690l0212K34568p6527
2472A384624j08155j01547q854l1068P9233L6962j7828j23236J36337K3143R9514
2461A369125k2897P3041J7197k26224n9541j53482j65944K2082K11589l3831l2219
2450I98896J49848n3451N2013n0692j07579J38143R6766j06910j85866j3218j17090
$$ plain form
2526 2372525 2245890 2135325 1964506 2080700 2119627 2153415 2081700 2040402 1756720 1878850
2516 1878850 2191302 2136185 1901007 1896583 1856664 1748602 1639676 1644722 1634832 1788680 1620278
2505 1620278 1570112 1720563 1594150 1584285 1561241 1541351 1676395 1534949 1355692 1468771
2495 1468771 1558688 1532568 1599719 1424440 1337041 1388140 1276379 1310698 1381773 1244812 1141061
2484 1141061 1192682 1199956 1197939 1171012 1292274 1292285 1334768 1260485 1256795 1226583 1461151 1384624
2472 1384624 1276469 1174922 1166068 1135000 1214233 1251195 1233367 1110131 1246468 1269611 1369125
2461 1369125 1346228 1419269 1436466 1210242 1150701 997219 831275 853357 1064946 1031115 998896
2450 998896 1148744 1095293 1147306 1096614 989035 1127178 1223944 1117034 931168 917950 800860
2439H00860J03975R3067Q9907J0587l7169Q5701l3220j80419J50793M2555j14008
2428A012629l8809n1415N499J65344j09596l07182J93355n3800j70438J014K11663
2417H58264l0254J4445R6360J38059o0468j75994p6280Q6556J35955L2879j75124
2406H44398j21956J45400l245q657J0219J02312n8861j0622n1280N638k37369
2395F15977J38707O9508R6172L2108P0459n9040j83226J67466J38149P4958j84995
2384I76243p8379M2212q4417J44794N0172R4483L9637m7874R4579M1025o8457
2373A204018k75597o2666K8534O0098r1203q4464k2013J43201j38894J50184m9229
2362H61969j81103J13126l4202n4791M0321J20274j55660l6076J1276N3003K37194
$$ plain form
2439 800860 904835 997902 1087809 1098396 1061227 1146928 1113708 933289 1084082 1126637 1012629
2428 1012629 973820 922405 927904 1093248 983652 676470 869825 816025 645587 646601 858264
2417 858264 828010 842455 938815 1076874 1016406 840412 764132 850688 986643 1019522 844398
2406 844398 722442 867842 864597 855940 866159 968471 909610 898988 847708 853346 615977
2395 615977 754684 824192 920364 952472 1022931 963891 780665 948131 1086280 1161238 976243
2384 976243 897864 940076 855659 1000453 1050625 1145108 1184745 1136871 1231450 1272475 1204018
2373 1204018 928421 865755 894289 954387 863184 778720 756707 899908 761014 911198 861969
2362 861969 680866 793992 759790 704999 745320 865594 709934 673858 685134 738137 975331
2351I75331r1302j54527j8346m0781J71099q2446J4456M9395k2464p8174k75250
2340D46991j4815J55183p4905O1632J03717L5147n2950M0571O3297Q39O9066K23116
2328A056889k01341k9423J12659p8760l5896J3562N0708j27849l5687M8171J77887
2317I50920n6150l9074j75426Q3074Q9245L1027j05117J69524p5276n0191J32006
2306I54562j90097L1743j21568K4368P6824j68559j34199R1645k2060M2496l7700
2295E47455J8767j4542j37973P1021K57475K0322m4326N950J96273p2407p8742
2284G69273m0692r2206K02705k0560J1985Q2544J26849m987j43356j59029l5461
2273F97065r2889J28099J73593J0491M4955j08351o0009N9238K80612m9156k03911
$$ plain form
2351 975331 884029 729502 711156 670375 841474 759028 773484 822879 800415 722241 446991
2340 446991 432176 587359 512454 574086 677803 712950 660000 700571 763868 764707 833773 1056889
2328 1056889 855548 826125 938784 860024 824128 837690 888398 760549 724862 773033 950920
2317 950920 894770 855696 680270 763344 852589 883616 778499 948023 872747 822556 954562
2306 954562 764465 796208 674640 699008 775832 607273 473074 564719 542659 585155 547455
2295 547455 566222 551680 413707 484728 742203 762525 718199 724149 920422 848015 769273
2284 769273 728581 636375 839080 818520 830505 913049 1039898 1034911 891555 732526 697065
2273 697065 604176 732275 905868 916359 961314 852963 792954 852192 1132804 1083648 879737
2262H79737K1636j87803j4689K25415J2386Q6531j87221J06195K000K165P7757
2251A024109j48340j75015O9652j0058K212k0551R9917J95118J9504J10488j39752
2240A027284N1646j15153K048o8561j09668p1835o7178k1121R5j33252L34127
2229H28432M29173N1472k55891K7233j42818k03278q1591L2173J66959K07894
2219A059758J87746N007p9095j22201P0389o9832n9560K09909r1405O3388R0504
2208A264608j24419J3427J06223P0287j39778J01148o6356J33927K05144l10032
2198A254179K01824K65085k39154j8361J48729K08198r6647M3781k6506J4638
2188A755766o4507K0518P7010J60085K44423j18540L827L3008K29887O1009J3346
$$ plain form
2262 879737 901373 713570 698881 924296 936682 1023213 835992 942187 944187 946352 1024109
2251 1024109 875769 700754 770406 760348 762560 742009 841926 1037044 1056548 1167036 1027284
2240 1027284 1078930 963777 965825 897264 787596 715761 648583 627462 627557 494305 828432
2229 828432 1257605 1309077 1053186 1080419 937601 734323 652732 684905 851864 1059758
2219 1059758 1247504 1252511 1173416 1051215 1121604 1051772 992212 1202121 1110716 1174104 1264608
2208 1264608 1140189 1153616 1259839 1330126 1190348 1291496 1225140 1359067 1564211 1254179
2198 1254179 1456003 1721088 1481934 1463573 1612302 1820500 1723853 1767634 1741128 1755766
2188 1755766 1691259 1711777 1788787 1948872 2193295 2074755 2078582 2111590 2341477 2402486 2415832
2177B415832Q4143q5649j80548P5725J7818K34912K0222K61440q6465j67590J78910
2166B768750N9721R9986J72746O3907J46709j8530j24440J08473K13890k3963
2156C467249R1977K04332P5242K00508j40439K78153K45381K7901K90559J09150
2146D850013l7995l7110N7106L87793L38772K07666Q5972J70443K25919N22140
2136F770719L44873J93270K98076N06262L76100L90971N32247O05386N34556R08918
2126A1461378R13820P77505R01941J111982J127326J714920J692299J953651K860742
2117B4515564L551271L786702M991596O537659Q615265J0513428J2923936J2538806
2109H7974227O262734j820826q657651j7042775j6874327j0382526p096568m884102
$$ plain form
2177 2415832 2499975 2414326 2233778 2309503 2327321 2562233 2582455 2843895 2757430 2589840 2768750
2166 2768750 2828471 2928457 3101203 3165110 3311819 3293289 3168849 3277322 3491212 3467249
2156 3467249 3559226 3763558 3838800 4039308 3898869 4177022 4422403 4450304 4740863 4850013
2146 4850013 4812018 4774908 4832014 5219807 5558579 5766245 5852217 6022660 6248579 6770719
2136 6770719 7115592 7308862 7606938 8113200 8489300 8880271 9412518 10017904 10552460 11461378
2126 11461378 12375198 13152703 14054644 15166626 16293952 18008872 19701171 21654822 24515564
2117 24515564 28066835 31853537 36845133 43382792 51998057 62511485 75435421 87974227
2109 87974227 94236961 92416135 83758484 66715709 49841382 39458856 32362288 27478186
2101B7478186l886239k723979k072849j298049r94263o69413p17883p30757q44888
2092A3539866j031708j264710j182728r07125n66592n05973j87066k32490m70440
2083G191034l94073l33571j91175k48305m24874n6106n00160k75869m03154r1879
2073D271868k33448j99802n9267M9276j48294n6892j20559l0948n6451l26435
2063C089048k29778k44145J28377k0334K2954j1346m54180P5881N8701j44127
2053B271051O2834O6667j34315M3294L4219j19029J43775m8496k43536j13098
2043A963366J20456n3940j49465m8092j01375n0136N2526J56742o4176k03502
2033A622404J43796O4507j14059j91995J12301p9192j25404n079k02470R8153
$$ plain form
2101 27478186 23591947 20867968 18795119 17497070 16502807 15833394 15115511 14384754 13539866
2092 13539866 12508158 11243448 10060720 9153595 8587003 8081030 7893964 7661474 7191034
2083 7191034 6796961 6463390 6272215 6023910 5599036 5542930 5042770 4766901 4363747 4271868
2073 4271868 4038420 3838618 3779351 3828627 3680333 3623441 3502882 3471934 3415483 3089048
2063 3089048 2859270 2615125 2743502 2723168 2746122 2734776 2280596 2356477 2415178 2271051
2053 2271051 2333885 2400552 2266237 2309531 2343750 2224721 2368496 2320000 2076464 1963366
2043 1963366 2083822 2029882 1880417 1832325 1730950 1680814 1733340 1890082 1825906 1622404
2033 1622404 1766200 1830707 1716648 1524653 1636954 1557762 1432358 1427279 1224809 1322962
2023A322962p3898K7289J23841j2106o4570k02520Q6453k65108q992O2893O7372
2012A063616K7848j15949j73128P5323J57581L1354m5955R4123L5299j70968l06066
2001F73078p2453K49579O136k1812q4840J76713K4986j02480J48857J8460l1896
1990I84328R814J0523N1087m9564k25280R9682K24401O7464l15874L6687J23679
1979A016947k38698j75859J9292K46415K335N4354j39279M7528k04719L1639J21958
1968G81913j23682j00297j02923k2618j32172L35149j2731j2121m3817J63065
1958G29766n2384r2831N5587j74784N9601o4777M849L28717j98484l53166n9356
1947A82738J09124P1168J41956K0977j0226m4168K3823J3887m0159J0750k42055
$$ plain form
2023 1322962 1249064 1276353 1400194 1388088 1323518 1120998 1207451 942343 933351 996244 1063616
2012 1063616 1091464 975515 802387 877710 1035291 1066645 1020690 1114813 1150112 979144 673078
2001 673078 600625 850204 856340 834528 749688 926401 951387 848907 997764 1016224 984328
1990 984328 994142 1004665 1055752 1006188 780908 880590 1104991 1172455 856581 893268 1016947
1979 1016947 778249 602390 621682 868097 870432 924786 785507 833035 628316 659955 781913
1968 781913 658231 557934 455011 432393 300221 635370 622639 610518 566701 729766
1958 729766 677382 584551 640138 465354 524955 460178 465027 793744 595260 242094 182738
1947 182738 291862 363030 504986 525963 515737 471569 495392 509279 469120 479870 237815
1936B37815J39995p341O0434K5847L5659p9044k33036K69666K02101k16800J2905
1925D48201q8361J37365J94987j54314k34893Q7866J31591j95464o1982K22357
1915D87353k00496M6385m766j41215J7949Q4909J39696j84622n2149J40812J13418
1904D47274o7940J01805J27369o6538R583Q5238r2379j29969j63707K29343j954
1893D78125P4490j48569l4235O5882J7690q2714l5133J29332j02467J4849k1070
1882C56180k17590J53407N5082k1533J04779q253J24465q9914J48048j4405p3714
1871E16552k40674j29712J29113K38183l5115j39096J49338m5643p4975O0136
1861D28107L9708Q7891m2893j13558m8335J40486q2360q6870K54253j32364j28593
$$ plain form
1936 237815 377810 370469 430903 456750 492409 413365 180329 449995 652096 435296 448201
1925 448201 359840 497205 692192 537878 302985 390851 522442 326978 264996 487353
1915 487353 286857 333242 328476 187261 205210 290119 429815 245193 193044 333856 447274
1904 447274 379334 481139 608508 541970 551553 636791 544412 414443 250736 480079 478125
1893 478125 552615 404046 369811 435693 453383 370669 335536 464868 362401 377250 356180
1882 356180 138590 291997 347079 325546 430325 422072 546537 456623 604671 590266 516552
1871 516552 275878 146166 275279 513462 478347 339251 488589 442946 367971 428107
1861 428107 467815 555706 512813 399255 350920 491406 409046 322176 576429 444065 315472
1850C15472J28439R8546P5112L592j23741n975n8384N5577J44453k783J24968
1839G55276Q3251j08924J27581n2339k64441j63289N6975J54641p6308k6540K8889
1828E14772k94891N7014K53507o5226r298q3555J07240J56154j67872k94750J61116
1817C34211k03618r8979K04908K37797j4534j51230P1513J98322j89120l34918
1807E4352m2205J58883J97214N0167L5856n1766k12177J77391q8898p2351M0651
1796B47117j65607k2482K57784K56071j45139j35181j91404R6428r0503K9130
1786A36214J49441J04072M7136K6493j20778j25605M2063r922J72930J11739p2041
1775D61742o8837p2551j51358j17146J07064J31625j13236J70265J88090j94435
$$ plain form
1850 315472 443911 542457 617569 621161 497420 491445 433061 488638 633091 630308 755276
1839 755276 838527 729603 857184 804845 540404 377115 434090 588731 512423 485883 514772
1828 514772 219881 276895 530402 465176 455878 372323 479563 635717 467845 173095 334211
1817 334211 130593 31614 236522 474319 459785 308555 380068 578390 389270 54352
1807 54352 12147 171030 368244 418411 454267 402501 190324 367715 278817 206466 247117
1796 247117 81510 59028 316812 572883 427744 292563 101159 197587 107084 136214
1786 136214 285655 389727 436863 463356 342578 216973 259036 249114 422044 533783 461742
1775 461742 392905 320354 168996 51850 158914 290539 177303 347568 535658 341223
1765C41223l95889j29609J91017q8395J57407o0305O2J32001j08998J08665k02660
1754e5481J39564J98391O0672k07520l09073Q1555R549K03473N4552K55526j51573
1743B79635J02604Q1437l705j8561o0793j13290k8488Q2545L2694j38791r4207
1732A21080P1885m4281J13781L9133J35996o5816j89011j50933K8994K43319n8652
1721B45495r3137q1985n5937q086j18263K57564O4490N0459N229j32978J38525
1710B71376o251p0132P0377l5705J11944K0440l8605J0551Q3049p7979J19952
1699D59017o9376l41696M0569M3705j84494J80418k4479k53724O6067J89087M4106
1688A49200J4558j00936j18002M2504K23291J16806l6859j5817k57124k3995P1844
$$ plain form
1765 341223 -54666 -184275 6742 -81653 75754 15449 15511 147512 38514 147179 -55481
1754 -55481 84083 282474 343146 135626 -173447 -91892 -82343 121130 175682 431208 279635
1743 279635 382239 463676 459971 441410 380617 267327 238839 321384 354078 215287 121080
1732 121080 192965 148684 262465 301598 437594 371778 182767 31834 60828 304147 245495
1721 245495 152358 70373 14436 6350 -111913 145651 210141 260600 265829 132851 271376
1710 271376 265125 194993 265370 229665 341609 362049 323444 333995 417044 339065 459017
1699 459017 389641 47945 88514 132219 -52275 128143 103664 -150060 -83993 105094 149200
1688 149200 163758 62822 -55180 -12676 210615 327421 290562 274745 17621 -6374 65470
1677F5470j4184N6201L7479k41285J02316N3990J99091J63866j30740j39588n229
1666A47387j23542J36731M6880N8605J01899k69377K19234J7922l80206P7656
1656C3189R6971k4580Q9504O7392j40047K38277j27392k25435L2054m2349J71578
1645A69162J2949j7136j01724P9201m4706k0623p1843J56542m3412p5521J59864
1634B02753J9210P9342L3856k18906K47033j13028k41P4856j08396n7733m2787
1623A15959K52413J55700o7571q752j09659k06227k49158o7732J35668J67885
1613A18526J05513o1952k9119p0428j06055n1344K20884N1552K8012J11714j26712
1602A90591J6534J8313j29157J51520J66803o933k43980p9465J57532N4781L8990
$$ plain form
1677 65470 51286 107487 144966 -96319 5997 59987 259078 422944 292204 152616 147387
1666 147387 23845 160576 207456 266061 367960 98583 317817 335739 -44467 33189
1656 33189 130160 105580 195084 262476 122429 360706 233314 7879 39933 -2416 169162
1645 169162 182111 164975 63251 142452 97746 77123 5280 161822 118410 42889 202753
1634 202753 221963 301305 335161 116255 363288 250260 250019 324875 216479 158746 115959
1623 115959 368372 524072 456501 447749 338090 131863 -117295 -185027 -49359 118526
1613 118526 224039 162087 132968 62540 -43515 -94859 126025 177577 205589 317303 190591
1602 190591 207125 225438 96281 247801 414604 407671 163691 84226 241758 296539 335529
1591C35529R8963j54062j55170r9742J30648N3850n5700R5784j05342J35606k41207
1580C9157q0911J21219o046J02867k24710n692n1135O8527J62135K15749M3363
1569C84523j01364j17685p0225r6129R1381n6276n0092P3448k2140J33046R4179
1558B62666j4112l6285n0605J37690L1355n2042j84845K37313J1127k50682q000
1547H3580N9909K01186j27247m0856K03173P2970j93477j10230M5922k67682K04677
1536A31925m80j33663n3588Q3678J0341j10658K93933o6545M6122J17844j00312
1525B18597j30655J22634r6737j8814o4611J78621O9911J6695k90606M5397n1427
1514i95L3141l3031P1433J38068k89102J2935J67066o2935j92869M9633J79975
$$ plain form
1591 335529 434492 280430 125260 25518 156166 210016 154316 250100 144758 280364 39157
1580 39157 -41754 79465 73419 176286 -48424 -54116 -105251 -36724 125411 341160 384523
1569 384523 283159 165474 95249 -880 90501 34225 -15867 57581 35441 168487 262666
1558 262666 248554 212269 161664 299354 330709 278667 93822 331135 342262 91580 83580
1547 83580 143489 344675 217428 176572 379745 452715 259238 149008 194930 -72752 131925
1536 131925 131445 -2218 -55806 27872 38213 -72445 221488 154943 201065 318909 218597
1525 218597 87942 210576 113839 95025 30414 209035 278946 295641 5035 50432 -995
1514 -995 32146 -885 70548 208616 -80486 -67551 99515 36580 -156289 -106656 73319
1503G3319J07066o3235r2634R0480m955o8192L2001J21875l3486O872J14409j22149
1491A61371N9516l60510l5332N0706J04773M2957J43613J47581k61896m137O6748
1480A15390J96741p4911q5293M4627l26828O9305J8843j31545J58028j10919R7062
1469b9500N7420K7862K3841k4195n8279j5537Q3093j43668O1842J23569p5611
1458C0837Q6576M7403j05740k2463q9197j21638L58578R8598k12892O5465j27608
1447G919m9751M2518O1419J0441m9181j5983K8648K5022O7583n6455j9253q814
1435D4113r1736L44298p5753J0398l3937o5251q658k18544R9811k0006P5407L2149
1423I2291n0737R559L3840Q725l2642M2677O5929J45309m6579n5399J4178j47593
$$ plain form
1503 73319 180385 117150 24516 114996 110041 41849 73850 195725 162239 169111 283520 161371
1491 161371 220887 -139623 -174955 -124249 -19476 23481 167094 314675 52779 48642 115390
1480 115390 312131 237220 151927 196554 -130274 -60969 -42126 -173671 -15643 -126562 -29500
1469 -29500 27920 55782 79623 55428 -2851 -18388 64705 -78963 -17121 106448 30837
1458 30837 117413 164816 59076 36613 -52584 -174222 184356 282954 70062 135527 7919
1447 7919 -41832 686 62105 72546 23365 7382 36030 61052 128635 72180 52927 44113
1435 44113 -47623 296675 220922 231320 197383 132132 123474 -95070 4741 -15265 60142 92291
1423 92291 41554 51113 84953 93678 61036 103713 169642 314951 268372 212973 227151 79558
1411G9558J33841r0324J3930l2625O1640j42765P709O1036J38566j89464n5020
1400a3918N0O8204N5146M7580j42080l6831O7857M7813J5243o4562K94600k43461
1388I5641k08525J39325N6554j93980J02843J01327j13335L4318J62735k12115
1378c5212l06800R1829L94258L5969k34122l7229j05334J20105J25862L6646J38028
1367B24000J25004j29365k60626l0470J33158j12386j91749K11133l1759N6037
1357g023o6141Q2335L9033K1820J26150n7567j11168k523j06906J57550J25608
1346B01168j93308j11596J9455J76106J18044Q105K1033j26521J12934j85907
1336C9513J0300M9570j19605o3946j44449K74171J35353K29645k8315j49060N4327
$$ plain form
1411 79558 213399 123075 137005 104380 166020 23255 30964 92000 230566 41102 -13918
1400 -13918 -13868 54336 109482 157062 14982 -21849 46008 93821 109064 44502 339102 95641
1388 95641 -112884 26441 82995 -110985 -8142 93185 -20150 14168 176903 -35212
1378 -35212 -342012 -250183 144075 180044 -54078 -91307 -196641 -76536 49326 85972 224000
1367 224000 349004 219639 -40987 -71457 61701 -50685 -242434 -31301 -63060 -7023
1357 -7023 -73164 9171 48204 70024 196174 138607 27439 24916 -81990 75560 201168
1346 201168 7860 -103736 -84281 91825 209869 217974 239007 112486 225420 39513
1336 39513 49813 99383 -20222 -84168 -228617 45554 180907 410552 382237 233177 287504
1325B87504l42401J68317J69298P6251j24796q2334J29148r8670k01590R3813
1315G4540Q1787N4157K3639k37726q0023J96261L1672q1180L4563q634J06296
1304A95352k38688O9954M8712p1743j05447l3197N8878R5609J0932P0392N4725
1293A55479O4048j19482k45465K17611J83195j61079j55953N0146j90723q2769
1283b84992J99295O584J1845N9103J3505k9898J78797l4345j93534K14281o2990
1272G7651N4632N6110j48677L8014j46097j9134J20853j2739P9426J65394k29389
1261C6044j15770Q6975L6217J0804j55297j41717R1147J94314k9318K6282K10123
1250B49804j03445j39703J25535R3928j13300k05619P1679l3970j71662J29358
$$ plain form
1325 287504 -54897 113420 282718 358969 234173 151839 280987 182317 -19273 74540
1315 74540 156327 210484 234123 -3603 -83626 112635 144307 63127 97690 89056 195352
1304 195352 -43336 26618 75330 3587 -101860 -135057 -76179 19430 30362 100754 155479
1293 155479 219527 100045 -145420 72191 255386 94307 -61646 -11500 -202223 -284992
1283 -284992 -85697 -79113 -67268 -8165 5340 -24558 154239 119894 -73640 140641 77651
1272 77651 132283 188393 39716 77730 -68367 -87501 33352 20613 100039 265433 36044
1261 36044 -79726 7249 43466 54270 -101027 -242744 -151597 42717 13399 39681 249804
1250 249804 146359 6656 132191 226119 112819 -92800 -21121 -55091 -226753 -97395
1240i7395M41O2387q6184l1957J43317j21048N9578m473J15208J8760l6014L3095
1228E5715o7982j25090o1728j1807l1238K52675M3890m6410k40929J57684Q9889
1217A4669p0920o9115J92955r6020k7390R0192q996L7626o3015l4676L6689n0309
1205d8310j2604j7633J06750l4048m3107P4472M4492n4737K5220K249M8479k841
1193H8382j2608J4625j294o4555j84098K13669j43775O9780O5274J16965j50317
1182A2048n2534r6247O189N0748J29486J21961k8766l2339r3221J04457j07191
1171A4591j45234M04592j40203m2212J36621k25137j13080M2397K03831j30928
1161E238K1134J28371J07750j9595r9651l3250M2750j06314N0330R4571r6045
$$ plain form
1240 -97395 -96954 -34567 -120751 -152708 -9391 -130439 -70861 -75334 39874 58634 22620 55715
1228 55715 -12267 -137357 -199085 -210892 -242130 10545 54435 8025 -232904 -75220 14669
1217 14669 -56251 -125366 67589 -28431 -55821 34371 25375 63001 -14 -34690 1999 -48310
1205 -48310 -60914 -78547 28203 -5845 -48952 25520 70012 15275 40495 42744 91223 88382
1193 88382 75774 90399 89105 24550 -159548 54121 -89654 -19874 45400 162365 12048
1182 12048 -40486 -136733 -130544 -79796 49690 171651 142885 110546 17325 121782 14591
1171 14591 -130643 273949 133746 91534 228155 3018 -110062 -67665 136166 5238
1161 5238 26372 154743 262493 242898 143247 109997 152747 46433 96763 191334 95289
1150I5289J75422j84436j68811L7460m588J7066J36617J2383r8004L9010J68392
1139B25800j90611j00076P8330r9496p9223J21153J40411j69881J40755r1114
1129b3952n2838J06809m6456N8715j24109J13378j2919K1753j44717R047j53747
1118b49036L1195L2901K31677J20809p7082j20127j26423K60027l2601j4418p2504
1107a5582J6312j06133j61413Q8817K66229o5463j20438p9503J30293O716r3632
1096a33797M070Q9917n2420J44166q6685k08977J4469Q6370M8300J45643r2240
1085d1184o0621j23508J01361J92790R80N6439j43605j12861K0335M4432k3657
1074h9099N8887K383J35438k16772k0162L9908K5613n491L3693J9601O2984J27279
$$ plain form
1150 95289 270711 86275 -82536 -45076 -49664 -32598 104019 116402 18398 57408 225800
1139 225800 35189 -64887 13443 -86053 -165276 -44123 96288 -73593 67162 -23952
1129 -23952 -76790 30019 -16437 42278 -81831 31547 18628 40381 -104336 -95289 -249036
1118 -249036 -217841 -184940 46737 167546 90464 -29663 -156086 103941 71340 56922 -15582
1107 -15582 730 -105403 -266816 -177999 88230 22767 -97671 -177174 -46881 -40165 -133797
1096 -133797 -129727 -39810 -92230 51936 -34749 -243726 -229257 -142887 -94587 51056 -41184
1085 -41184 -101805 -225313 -123952 68838 69818 126257 -17348 -130209 -109874 -65442 -89099
1074 -89099 -30212 -27829 107609 -109163 -129325 -89417 -63804 -69295 -35602 -16001 46983 174262
1062A74262q5312j01587k7494k48935n926K16607P1058r420N3544n0255K2422
1051H964N5340r9978L2399o9873M8423l3955j5070k37872J16702J18132j9409
1040i6197k43240K75822J74787j67313J7364j86704m7075K33392K51882j63597
1030D9121M2956J14116j70545N0433p9843j8760R2212k44922N4528K4836j8540
1019a04408K1943K10337p8960p496m314L634L0227R698j16752O9038J6971p4268
1007b4350J60238j13973k5334p6280J00401o1256q2646O0468L2987r2676N3233
996f9188j20233R3903L5852j1009K84025M9713l26120j16048R1551J6600j39280
985b10234J27999J5304k17391N1135n797J24630l1572m8263k0034J13868J54213
$$ plain form
1062 174262 88950 -12637 -40131 -289066 -294992 -78385 -7327 -16747 36797 -13458 8964
1051 8964 64304 -35674 -3275 -73148 -24725 -58680 -73750 -311622 -194920 -76788 -96197
1040 -96197 -339437 -63615 111172 -56141 -38777 -225481 -272556 -39164 212718 49121
1030 49121 92077 206193 35648 86081 6238 -12522 79690 -165232 -110704 -85868 -104408
1019 -104408 -82465 127872 48912 41416 37102 40736 70963 80661 -36091 32947 49918 -24350
1007 -24350 135888 21915 -3419 -79699 20702 -40554 -123200 -62732 -29745 -122421 -69188
996 -69188 -189421 -95518 -59666 -70675 213350 263063 -63057 -179105 -87554 -70954 -210234
985 -210234 -82235 -66931 -284322 -233187 -238984 -114354 -145926 -194189 -214223 -100355 53858
974E3858k7109J89426J10842l03389j23010J47938n5480r0375o7412J12732J00975
963D8996Q1396j49971q9249o282M1055k9989J30189m655q9999N7771l0249k15384
951b56371q048L6455K9538R4023l5353P8199j58171N1121N4603K06499q1821r1448
939h0774J07983r8203j70181M5087l7386L5711q635p1902K33739J21303j09999
928c3257M7519K29840L7903n5497j47886j97882O8977p6577J17509o5367M2281
917c2437m5097j51452j85006Q3178j7694J84455Q8707L4025O6000k22093j10415
906c07829J00167J93160k4478j99261L7694J32971k6622r9063m7463J19748P6114
895d4862K3526L0452j13720J05918o6812O0038r3034j09684J28411J17836m7542
$$ plain form
974 53858 26749 216175 327017 23628 -99382 48556 -6924 -97299 -164711 -51979 48996
963 48996 130392 -19579 -108828 -115110 -74055 -104044 26145 21490 -68509 -10738 -40987 -256371
951 -256371 -264419 -227964 -198426 -104403 -139756 -61557 -219728 -168607 -114004 92495 10674 -80774
939 -80774 27209 -70994 -241175 -196088 -233474 -197763 -206398 -278300 -44561 76742 -33257
928 -33257 14262 244102 282005 226508 78622 -119260 -50283 -126860 -9351 -74718 -32437
917 -32437 -77534 -228986 -413992 -330814 -348508 -164053 -75346 -41321 24679 -197414 -307829
906 -307829 -207662 -14502 -38980 -238241 -200547 -67576 -94198 -193261 -240724 -120976 -44862
895 -44862 -21336 9116 -104604 1314 -65498 -5460 -98494 -208178 -79767 38069 -9473
884i473r8959J15611J25481j60718k12928O6271K6966q5546J6189N2538k55054
873d19622J69199K83767J06198m9654m9210J0958r5981j84703Q579O3033N2537
862a04899J18463P1488k12252J83185q5742j63825m3143J10659k7420J38635n7172
851g2023k48814k025L02420j93004O2547R4246P5780p7143j23297q4419n1562
840c17294O6015r051K27662r9609k24258J45208J23462k3106P6161j18474J36864
829a6420N147M6300O2465m5845j24288R971K7812j68593R0370L8522l4204J87885
817G9122j64945j02457K4329J51577Q7999p241L6286p546j99061j06543K0365
806a88115l464K31847l8835k9556k9367M5831j1838j01318q9868L21775J57988
$$ plain form
884 -9473 -108432 7179 132660 -28058 -240986 -174715 -147749 -233295 -217106 -164568 -419622
873 -419622 -250423 33344 139542 89888 40678 51636 -44345 -229048 -220469 -157436 -104899
862 -104899 13564 85052 -127200 55985 -29757 -193582 -236725 -126066 -153486 -14851 -72023
851 -72023 -320837 -322862 -20442 -213446 -150899 -56653 19127 -58016 -181313 -265732 -317294
840 -317294 -251279 -260330 -32668 -132277 -356535 -211327 -87865 -110971 -34810 -153284 -16420
829 -16420 -11273 35027 97492 51647 -72641 -62670 -34858 -203451 -113081 -74559 -108763 79122
817 79122 -85823 -188280 -163951 -12374 75625 68384 104670 97124 -101937 -208480 -188115
806 -188115 -191579 40268 1433 -28123 -57490 -11659 -23497 -124815 -214683 107092 265080
795B65080j45404k32938l0387J89485J43519j49406j52805R0477J33932j39614
785b8061J55212n9156k93270n3999M7263o828J05706K08660k21105K71472o6752
774E9142R725j89868l9576J84777L0173J40328M6179q1594j53875n9037m9769
763a03395j11186K00936j87574m059J41510J90701J79047k55947j29776k7574
753a07317j53456q5614K29449P7294K3824j66266o4392J58416J3728r0810J1171
742a53973R6437j15517K3777o9493P6133J73879j41423j40849J94314k6477J35921
731E2729k51001J20613q6019j7214J8724J54850q6124j77001L04156j37623m7255
720a51165N630K5896r5448M6546L4107q4895j60282K70497L42522M2951k10414
$$ plain form
795 265080 119676 -113262 -143649 45836 189355 39949 -112856 -22379 111553 -28061
785 -28061 127151 67995 -225275 -279274 -232011 -238839 -133133 75527 -145578 125894 59142
774 59142 68867 -121001 -160577 24200 54373 194701 240880 159286 5411 -53626 -103395
763 -103395 -214581 -13645 -201219 -205278 -63768 126933 305980 50033 -79743 -107317
753 -107317 -260773 -346387 -116938 -39644 -15820 -182086 -246478 -88062 -74334 -165144 -153973
742 -153973 -57536 -173053 -149276 -218769 -142636 31243 -110180 -251029 -56715 -83192 52729
731 52729 -198272 -77659 -163678 -180892 -162168 -7318 -93442 -270443 33713 -103910 -151165
720 -151165 -145535 -119639 -215087 -168541 -134434 -219329 -379611 -109114 233408 276359 65945
709F5945j06376j39187M4879R104K4054k6969K05173O0632j56514j69241J04906
698h3594O511P6248j47812r3577O2802O1175p7980m8173L2858K37457J41953j9644
686A48224P8753j93705J77O9545j00010k94100J8434J81511L4829j72411J69010
675e9743j32425P9536L9423J3400O4689k8256m4257k13007n988j35222L60187
664f1663J26523n2406K04533m6775j43019o4314O7907j44086j37853J85925p080
653g2308M9278j0709l4310M4407j21521m09607K46663L89292l5329o5184j5523
642c4851o2313N9550M4755J6173J7234j57993m4901R9898j28579J11056K4462
631e5509l2221J74524Q3820n9174l4371j88939l18148k214Q0575J86820n8010
$$ plain form
709 65945 -40431 -179618 -134739 -125635 -101581 -128550 76623 137255 -19259 -188500 -83594
698 -83594 -77083 -835 -148647 -242224 -179422 -118247 -196227 -244400 -211542 25915 167868 148224
686 148224 226977 33272 33449 102994 2984 -291116 -272682 -91171 -56342 -228753 -59743
675 -59743 -192168 -112632 -73209 -59809 4880 -23376 -67633 -280640 -286628 -421850 -61663
664 -61663 64860 12454 216987 170212 27193 -37121 30786 -113300 -251153 -65228 -72308
653 -72308 -23030 -33739 -68049 -23642 -145163 -554770 -308107 81185 45856 -19328 -34851
642 -34851 -97164 -37614 7141 23314 40548 -117445 -162346 -62448 -191027 -79971 -55509
631 -55509 -87730 86794 170614 111440 77069 -111870 -430018 -432232 -351657 -164837 -222847
620b22847m0624J26546Q5541k6890q2374N2879P1437m5121J87564k7498k1098
609E7515j48522N5106j12094O2304k5087K73535J00652r7056n4955J9760j95777
598f4619k41227J19923K52187p6124j34991m8496j06455Q7168N4688n4217l7520
587b49683K46545J17632r7349j04886L0284J27675p0749j61379M6422k7176R1557
576e1107L2834r3418j45981J6502l7064J28647J71636L036j71883J99613M657
565E7472o3028N4360k928j09053k14571J87551O4169j599l9663N7406n426j51122
553a66432n2578l3469L4232L2286n334Q7060N8048J822j0675o1771k04372k2881
541c44064J68213j5563N1498j95256O3620Q0066M2328j41853J40397J6211l5969
$$ plain form
620 -222847 -263471 -136925 -51384 -78274 -160648 -107769 -36332 -81453 106111 78613 57515
609 57515 -91007 -35901 -147995 -85691 -110778 162757 263409 166353 111398 131158 -64619
598 -64619 -305846 -185923 66264 -9860 -144851 -193347 -299802 -212634 -157946 -212163 -249683
587 -249683 -3138 114494 17145 -87741 -57457 70218 -531 -161910 -115488 -142664 -51107
576 -51107 -18273 -111691 -257672 -241170 -278234 -149587 22049 25085 -146798 52815 57472
565 57472 -5556 48804 45876 -63177 -277748 -90197 -26028 -27627 -67290 -9884 -15310 -166432
553 -166432 -219010 -252479 -218247 -185961 -191295 -104235 -46187 -44365 -55040 -116811 -321183 -344064
541 -344064 -175851 -191414 -139916 -335172 -271552 -191486 -149158 -291011 -150614 -134403 -170372
530a70372j1201n5612q1364m8175J48891p5046o7443Q4297O9619J18493j11981
519a99894k2565J45567p7335J5343j48393J39436j6545j09981m0752j0204K92965
508c2358j33462r513J78884N1336j52050q7976K9213J04791n4265p8790j51447
497c35637j87120R9936L34353J7976O8834J81404k04731k18974N9055J35874Q0978
486C1948m6871k31726K3704r357J68037R7322P4277j33195n9798j13331K16818
475A7828j14745J09392J2456q4517j36216O2924O3131j03976j28268M8468J74509
464g9014K2702n7952j01826J34134M8245r5851J36903J47748j41031l68181j81427
453e35550J99422J03824P6542r9721j39141n1188J04732P0126K53112p0807N1846
$$ plain form
530 -170372 -181573 -237185 -318549 -366724 -217833 -292879 -360322 -276025 -206406 -87913 -199894
519 -199894 -222459 -76892 -154227 -138884 -287277 -147841 -164386 -274367 -315119 -325323 -32358
508 -32358 -165820 -175333 3551 54887 -97163 -185139 -155926 -51135 -105400 -184190 -335637
497 -335637 -522757 -422821 -88468 -70492 -1658 179746 -24985 -243959 -184904 -49030 31948
486 31948 -14923 -246649 -222945 -232302 -64265 33057 107334 -25861 -85659 -198990 17828
475 17828 -96917 12475 24931 -59586 -195802 -132878 -69747 -173723 -301991 -253523 -79014
464 -79014 -56312 -114264 -216090 -81956 -33711 -129562 7341 155089 14058 -354123 -535550
453 -535550 -336128 -232304 -155762 -255483 -394624 -445812 -341080 -270954 -17842 -88649 -36803
442c6803n1883k8235n2028J79374o1211j89460R6764L1221j8020j02764J8596
431b14449k0687l4079j4847K46781j18020q651j24340p8408O3365M9783L5239
420b18313J60378j30248k88170J37222K58992J3471l9733J22k9626J5847j1726
409a31784P9518L0717r8115m5419n8195n5984J27716K5444O4439n5356n4187J65124
397f082j66533o4150j3175M0201p03j33267K92813j18219o9032q618k8911j3611
385b89287j6057R4378J17565j34453j47837M7657r1358R3907p3642J1999O5415
374c21713K46781J4564j92696J19338r7964R9727p7897o0464J9259K74980l1964
363h049q2678n7966J5098j28714M6672K06760j95639J15205o2182Q901Q5119m3976
$$ plain form
442 -36803 -88686 -116921 -168949 10425 -50786 -240246 -143482 -112261 -130281 -233045 -214449
431 -214449 -235136 -269215 -284062 -37281 -155301 -163952 -288292 -366700 -303335 -253552 -218313
420 -218313 -57935 -188183 -476353 -339131 -80139 -66668 -106401 -106279 -135905 -120058 -131784
409 -131784 -52266 -21549 -119664 -165083 -223278 -279262 -151546 -126102 -61663 -117019 -171206 -6082
397 -6082 -172615 -236765 -249940 -209739 -210442 -343709 -50896 -169115 -238147 -246765 -275676 -289287
385 -289287 -305344 -210966 -93401 -227854 -375691 -328034 -419392 -325485 -399127 -387128 -321713
374 -321713 -74932 -60368 -253064 -133726 -231690 -131963 -209860 -270324 -251065 23915 -8049
363 -8049 -90727 -148693 -133595 -262309 -215637 -8877 -204516 -89311 -151493 -142592 -57473 -101449
351a01449O2981j13987q1869P8067j7334J03319J10103j79844p4561k0054K21752
340a2876l01040j65029J18664L7780o2557k17470J85272p7870l0786L05208J12259
329a08445k2550J17074m7491k58420L6226K13260P5386K0514M1673k76576R7261
318a12088J6702p4025J14624k50218J21578K9476J57715q4561m8177J19584q4345
307i3735l37685l1984Q9052K7536o4103j1792K52285O9536j67480j44999J75289
296b38080J8525K8444m5607q4765J69234K3601k7862M2923j53580m6825P6247
285b37745j68133r6586J58267K50701K6644m5975K5323l52708M8569O8948o3010
274c85705K02471J18588r7239q830J0784j61662R8432j40593J16278J04861Q6076
$$ plain form
351 -101449 -38468 -152455 -234324 -156257 -173591 -70272 39831 -140013 -214574 -234628 -12876
340 -12876 -313916 -478945 -360281 -322501 -385058 -602528 -417256 -495126 -525912 -220704 -108445
329 -108445 -130995 -13921 -61412 -319832 -283606 -70346 5040 25554 67227 -209349 -112088
318 -112088 -95386 -169411 -54787 -305005 -183427 -153951 3764 -80797 -128974 -9390 -93735
307 -93735 -431420 -463404 -374352 -346816 -410919 -422711 -170426 -100890 -268370 -413369 -238080
296 -238080 -219555 -191111 -236718 -321483 -152249 -128648 -156510 -113587 -267167 -313992 -237745
285 -237745 -405878 -502464 -344197 -93496 -66852 -112827 -87504 -440212 -391643 -322695 -385705
274 -385705 -183234 -64646 -161885 -170715 -159931 -321593 -223161 -363754 -247476 -142615 -56539
$$ [...]
##END NTUPLES=NMR SPECTRUM
##END=
