##TITLE=1H_TG-2342-4
 CDCl3
 8 sc, 
 18.1.2022
##JCAMPDX= 6.0         $$ Bruker NMR JCAMP-DX V2.0
##DATA TYPE= NMR FID
##DATA CLASS= NTUPLES
##ORIGIN= UXNMR, Bruker Analytische Messtechnik GmbH
##OWNER= root
$$ XWIN-NMR		Version 3.5
$$ Tue Jan 18 11:41:59 2022 Russian Standard Time (UT+4h)  she@DPX200
##.OBSERVE FREQUENCY= 200.131346
##.OBSERVE NUCLEUS= ^1H
##.DELAY= (6, 6)
##.ACQUISITION MODE= SIMULTANEOUS
##.ACQUISITION SCHEME= undefined
##.AVERAGES= 8
##.DIGITISER RES= 18
##SPECTROMETER/DATA SYSTEM= spect
##.PULSE SEQUENCE= zg30
##.SOLVENT NAME= CDCl3
##.SHIFT REFERENCE= (INTERNAL, CDCl3, 0, 15.7039)
##AUDIT TRAIL= $$ (NUMBER, WHEN, WHO, WHERE, WHAT)
$$ ##TITLE= Audit trail, XWIN-NMR		Version 3.5
$$ ##JCAMPDX= 5.01
$$ ##ORIGIN= Bruker BioSpin GmbH
$$ ##OWNER= she
$$ F:/spectra/data/she/nmr/H-F/1/audita.txt
$$ ##AUDIT TRAIL=  $$ (NUMBER, WHEN, WHO, WHERE, WHAT)
(   1,<2022-01-18 11:40:31.60 +0400>,<she>,<DPX200>,
      <created by zg, POWCHK disabled, PULCHK disabled
       configuration hash MD5:
       00 E9 B6 7A A2 85 ED C7 34 08 36 98 17 FE 4E 26
       data hash MD5: 16K
       64 19 29 34 EC B0 47 F5 0F A1 D9 DF 52 23 7B 63>)
$$ ##END=
$$ 
$$ hash MD5
$$ 3B E9 E5 9D AB 4E 91 80 E6 39 FF 07 9D 05 70 5C
##$RELAX= 
##$RELAX= 
##$RELAX= 
##$RELAX= 
##$RELAX= 
##$RELAX= 
$$ Bruker specific parameters
$$ --------------------------
##$DU= <F:/spectra>
##$EXPNO= 1
##$NAME= <H-F>
##$PROCNO= 1
##$TYPE= <nmr>
##$USER= <she>
##$AMP= (0..31)
100 100 100 100 100 100 100 100 100 100 100 100 100 100 100 100 100 100 
100 100 100 100 100 100 100 100 100 100 100 100 100 100 
##$AQSEQ= 0
##$AQ_mod= 1
##$AUNM= <au_zg>
##$AUTOPOS= <>
##$BF1= 200.13
##$BF2= 200.13
##$BF3= 200.13
##$BF4= 200.13
##$BF5= 200.13
##$BF6= 200.13
##$BF7= 200.13
##$BF8= 200.13
##$BYTORDA= 1
##$CFDGTYP= 0
##$CFRGTYP= 5
##$CHEMSTR= <none>
##$CNST= (0..31)
1 1 145 1 1 1 1 1 1 1 1 1 1 1 1 1 1 1 1 1 1 1 1 1 1 1 1 1 1 1 1 1 
##$CPDPRG= <>
##$CPDPRG1= <>
##$CPDPRG2= <>
##$CPDPRG3= <>
##$CPDPRG4= <mlev>
##$CPDPRG5= <mlev>
##$CPDPRG6= <mlev>
##$CPDPRG7= <mlev>
##$CPDPRG8= <mlev>
##$CPDPRGB= <>
##$CPDPRGT= <>
##$D= (0..31)
0 1.2 0 0 0 0 0 0 0 0.06 0 0.03 0 0 0 0 0.0002 0 0 0 0 0 0 0 0 0 0 0 0 
0 0 0 
##$DATE= 1642491630
##$DBL= (0..7)
120 120 120 120 120 120 120 120 
##$DBP= (0..7)
150 150 150 150 150 150 150 150 
##$DBP07= 0
##$DBPNAM0= <>
##$DBPNAM1= <>
##$DBPNAM2= <>
##$DBPNAM3= <>
##$DBPNAM4= <>
##$DBPNAM5= <>
##$DBPNAM6= <>
##$DBPNAM7= <>
##$DBPOAL= (0..7)
0.5 0.5 0.5 0.5 0.5 0.5 0.5 0.5 
##$DBPOFFS= (0..7)
0 0 0 0 0 0 0 0 
##$DE= 6
##$DECBNUC= <off>
##$DECIM= 32
##$DECNUC= <off>
##$DECSTAT= 4
##$DIGMOD= 1
##$DIGTYP= 9
##$DL= (0..7)
0 120 120 120 120 120 120 120 
##$DP= (0..7)
150 150 150 150 150 150 150 150 
##$DP07= 0
##$DPNAME0= <>
##$DPNAME1= <>
##$DPNAME2= <>
##$DPNAME3= <>
##$DPNAME4= <>
##$DPNAME5= <>
##$DPNAME6= <>
##$DPNAME7= <>
##$DPOAL= (0..7)
0.5 0.5 0.5 0.5 0.5 0.5 0.5 0.5 
##$DPOFFS= (0..7)
0 0 0 0 0 0 0 0 
##$DQDMODE= 0
##$DR= 18
##$DS= 0
##$DSLIST= <SSSSSSSSSSSSSSS>
$$ [...]
##$SUBNAM2= <"">
##$SUBNAM3= <"">
##$SUBNAM4= <"">
##$SUBNAM5= <"">
##$SUBNAM6= <"">
##$SUBNAM7= <"">
##$SUBNAM8= <"">
##$SUBNAM9= <"">
##$SW= 18.0517287032376
##$SWIBOX= (0..15)
0 0 2 0 0 0 0 0 0 0 0 0 0 0 0 0 
##$SW_h= 3612.71676300578
##$TD= 16384
##$TD0= 1
##$TE= 0
##$TE2= 300
##$TE3= 300
##$TEG= 300
##$TL= (0..7)
0 120 120 120 120 120 120 120 
##$TP= (0..7)
150 150 150 150 150 150 150 150 
##$TP07= 0
##$TPNAME0= <>
##$TPNAME1= <>
##$TPNAME2= <>
##$TPNAME3= <>
##$TPNAME4= <>
##$TPNAME5= <>
##$TPNAME6= <>
##$TPNAME7= <>
##$TPOAL= (0..7)
0.5 0.5 0.5 0.5 0.5 0.5 0.5 0.5 
##$TPOFFS= (0..7)
0 0 0 0 0 0 0 0 
##$TUNHIN= 0
##$TUNHOUT= 0
##$TUNXOUT= 0
##$USERA1= <user>
##$USERA2= <user>
##$USERA3= <user>
##$USERA4= <user>
##$USERA5= <user>
##$V9= 5
##$VALIST= <valist>
##$VCLIST= <CCCCCCCCCCCCCCC>
##$VD= 0
##$VDLIST= <DDDDDDDDDDDDDDD>
##$VPLIST= <PPPPPPPPPPPPPPP>
##$VTLIST= <TTTTTTTTTTTTTTT>
##$WBST= 1024
##$WBSW= 4
##$XGAIN= (0..3)
0 0 0 0 
##$XL= 0
##$YL= 0
##$YMAX_a= 240867
##$YMIN_a= -431562
##$ZGOPTNS= <>
##$ZL1= 120
##$ZL2= 120
##$ZL3= 120
##$ZL4= 120
##$ABSF1= 10
##$ABSF2= 0
##$ABSG= 5
##$ABSL= 3
##$ALPHA= 0
##$AQORDER= 0
##$ASSFAC= 0
##$ASSFACI= 0
##$ASSFACX= 0
##$ASSWID= 0
##$AUNMP= <proc_1d>
##$AZFE= 0.1
##$AZFW= 0.1
##$BCFW= 1
##$BC_mod= 2
##$BYTORDP= 1
##$COROFFS= 0
##$CY= 11.3945322036743
##$DATMOD= 1
##$DC= 2
##$DFILT= <>
##$DTYPP= 0
##$F1P= 2.36226072786647
##$F2P= -0.459571619588291
##$FCOR= 0.5
##$FTSIZE= 0
##$FT_mod= 4
##$GAMMA= 1
##$GB= 0.15
##$INTBC= 1
##$INTSCL= 1
##$ISEN= 128
##$LB= 0.24
##$LEV0= 0
##$LPBIN= 0
##$MAXI= 10000
##$MC2= 0
##$MEAN= 0
##$ME_mod= 0
##$MI= 1.114404
##$NCOEF= 0
##$NC_proc= 0
##$NLEV= 6
##$NOISF1= 3.799351
##$NOISF2= 2.8
##$NSP= 1
##$NTH_PI= 0
##$NZP= 0
##$OFFSET= 15.70392
##$PC= 1
##$PHC0= -15872.87
##$PHC1= 17.00078
##$PH_mod= 1
##$PKNL= yes
##$PPARMOD= 0
##$PSCAL= 0
##$PSIGN= 0
##$REVERSE= no
##$SF= 200.130013532006
##$SI= 16384
##$SIGF1= 3
##$SIGF2= 2
##$SINO= 400
##$SIOLD= 16384
##$SREGLST= <1H.CDCl3>
##$SSB= 0
##$STSI= 0
##$STSR= 0
##$SW_p= 3612.71676300578
##$SYMM= 0
##$S_DEV= 0
##$TDeff= 0
##$TDoff= 0
##$TI= <>
##$TILT= no
##$TM1= 0
##$TM2= 0
##$TOPLEV= 0
##$USERP1= <user>
##$USERP2= <user>
##$USERP3= <user>
##$USERP4= <user>
##$USERP5= <user>
##$WDW= 1
##$XDIM= 8192
##$YMAX_p= 0
##$YMIN_p= 0
$$ End of Bruker specific parameters
$$ ---------------------------------
##NTUPLES= NMR FID
##VAR_NAME=  TIME,          FID/REAL,        FID/IMAG
##SYMBOL=    X,             R,               I
##VAR_TYPE=  INDEPENDENT,   DEPENDENT,       DEPENDENT
##VAR_FORM=  AFFN,          ASDF,            ASDF
##VAR_DIM=   8192,          8192,            8192
##UNITS=     SECONDS,       ARBITRARY UNITS, ARBITRARY UNITS
##FACTOR=    0.0002768,     1,               1
##FIRST=     0,             0,               0
##LAST=      2.2672688,     0,               0
##MIN=       0,             -431562,         0
##MAX=       2.2672688,     240867,          0
$$ Real data points
##PAGE= N=1
##DATA TABLE= (X++(R..R)), XYDATA
0@%%%%%%%%%%qJ6j6K4l2M0m8N6p2Q8j04J20j44J76k08K40k78L23l73M29m91N60
32B98o36P20q16R21j036J163j300J452j619J801k000K217k454K711k994L305l642
49a909M014m421M868n366N918o534P227q008Q900r934J1141j2575J4315j6474
63h838J9236k2914K8088l5962M9522p9234K60827j58346l22420M44797k1189k81995
75a28428Q5660K32304k05261j43848J37476P2260j04908M433K0674K2286N863
86a489n4065k3574R9554K1747p0579j8608P2934J9077n1613l0064M1259N8812
98F3391j5826j00341L1383J06314p8783q0762J32077L7276j60988j6739J60812
109G7814j40j20118L3668N8680o8804k5994L2484R208K4243k6167p8508K9476
$$ plain form
0 0 0 0 0 0 0 0 0 0 0 0 -8 8 -8 16 -16 24 -24 32 -40 48 -56 64 -80 96 -112 128 -150 173 -200 229 -262 298
32 298 -338 382 -434 487 -549 614 -686 766 -853 948 -1052 1165 -1289 1422 -1572 1733 -1909
49 -1909 2105 -2316 2552 -2814 3104 -3430 3797 -4211 4689 -5245 5896 -6679 7636 -8838
63 -8838 10398 -12516 15572 -20390 29132 -50102 210725 52379 -270041 174756 153567 -128428
75 -128428 -42768 189536 -15725 -159573 -22097 50163 -54745 -50312 -29638 -7352 -1489
86 -1489 -55554 -79128 20426 42173 -28406 -47014 25920 44997 -6616 -36680 4579 63391
98 63391 47565 -52776 -21393 84921 6138 -74624 57453 94729 -66259 -82998 77814
109 77814 77674 -42444 -8776 49904 -18900 -44894 -12410 -3202 21041 -5126 -83634 -54158
121e4158Q4995l3927n0127R1411M4989j19084n778J32047k2466j04185L0870O2145
133E6732m4671o7684K5246M2943m0316k8811M6351K9432l5064k6361M9205L4938
145D1940l9892O724L5977m0309j8720M6141l368m0624J4211K0191m6930j0332
157c4991O9402j1858o5077L2006K7866m7412K210N3067n093m8057P177L8427j3217
170D450j3744K0443L57r707k951j699P645j1564j0356K1515K499j7690M910J5206
184I314l117j1934J9496J7434k7412o176J5668j6627o889J1194m779o462o203
197a6493k498J0459J4860J765j8622Q428L0336k0240j7748L2201j65l5585k409
210a5711K3461k155k6776O209K1615j3470q150J1864N065M528n836n541J2712
$$ plain form
121 -54158 30837 -3090 -53217 38194 83183 -35901 -41679 90368 67902 -36283 -5413 56732
133 56732 12061 -55623 -30377 12566 -27750 -56561 -10210 19222 -15842 -42203 7002 41940
145 41940 2048 8772 44749 4440 -14280 31861 28493 -12131 2080 22271 -24659 -34991
157 -34991 34411 22553 -42524 -10518 17348 -30064 -27854 25213 20120 -27937 -20760 17667 4450
170 4450 -9294 11149 11506 1799 -1152 -2851 4794 -6770 -17126 4389 6888 -10802 -5892 9314
184 9314 6197 -5737 13759 31193 3781 -2395 13273 -3354 -10243 951 -3828 -10290 -16493
197 -16493 -18991 -8532 6328 8093 -10529 -2101 28235 7995 -9753 22448 22283 -13302 -15711
210 -15711 7750 5595 -21181 -14972 6643 -6827 -14977 -3113 1952 6480 644 -4897 7815
223G815L307q012q632J063K0609j988k2214O210J7152o903k2235O985L3873k1151
237E879m1517K8544K8641l3103k0882L4260K3449l7199j8397M3391J1245l1658
249g347l935J9436P447k0372j4471K2500R672j7864p137J2177J6816j1428j9708
262a4214K3036K0397k2201k0643J1857K1645j7786k9612K3635K1395k8350j7822
274b8663K1707K2775j5770k1468K4641J8043k4989j3769J8575K0191j5235k9535
286b3497J9120K8099k1162k1754K0635K7861j9354l4584K5443L0522l2417k4091
298b5179K7314K0689l0671k9227L6181K8563l6852j7219L2440J5619k6231j7908
310b2481K9581J8034l1709j2918K1327R620j5280j5274K1639K1453k5554j7074
$$ plain form
223 7815 11122 3110 -5522 -4459 16150 14162 -8052 -1842 15310 8407 -13828 -6843 27030 5879
237 5879 -35638 -7094 21547 -11556 -32438 1822 25271 -11928 -30325 13066 24311 -7347
249 -7347 -11282 8154 15601 -4771 -19242 3258 12930 -4934 -12071 106 16922 5494 -14214
262 -14214 8822 29219 7018 -13625 -1768 19877 2091 -27521 -3886 17509 -10841 -28663
274 -28663 -6956 15819 49 -21419 3222 21265 -3724 -17493 1082 21273 6038 -23497
286 -23497 -4377 23722 2560 -19194 1441 29302 9948 -24636 807 31329 -1088 -25179
298 -25179 2135 22824 -7847 -37074 -893 27670 -9182 -26401 6039 21658 -4573 -22481
310 -22481 7100 25134 -6575 -19493 1834 11454 -3826 -19100 2539 23992 -1562 -18636
322a8636K3785K0313j7311k5549J9885K4847k9610k3236K4763J9110j9041k4195
334b4875K0057K4718k6703j7924K9677J7104k5569k3154K6239K5897l1910j8672
346b5115L3407J4787k6614j6172K7010K0539k8232j2858K6123L583k3786r360
358a6688K0889J2564k7459j1960K7086P663k0091p306K1497J5101k4649j3229
370a6582K3374N269j7943p225J3319R441k0841q626K5627O360j8483l013J9900
383A0577R428k3790n908K8445j085k4526q49J4095J619j6804k366J7740l298j4623
397a1345J832J1427N373j5801n552K1969k50k1450M340J8498j42j8031K336K1206
411A4410o838j6429R163J0669l534j2469j385J6697m798j7334J0057J5141p645
$$ plain form
322 -18636 5149 25462 8151 -17398 2487 27334 -2276 -25512 -749 18361 -680 -24875
334 -24875 -4818 19900 -6803 -24727 4950 22054 -3515 -26669 -430 25467 -6443 -25115
346 -25115 8292 23079 -3535 -19707 7303 27842 -390 -13248 12875 16458 -7328 -16688
358 -16688 4201 16765 -10694 -22654 4432 12095 -7996 -15302 6195 21296 -3353 -16582
370 -16582 6792 12061 -5882 -13107 212 9653 -11188 -19814 5813 12173 -6310 -9323 10577
383 10577 20005 -3785 -9693 18752 17667 -6859 -7708 6387 8006 -8798 -11164 6576 3278 -11345
397 -11345 -9513 1914 7287 -8514 -14066 7903 7653 -13797 -9457 9041 8899 -9132 -6796 14410
411 14410 7572 -8857 306 10975 7441 -5028 -6413 10284 5486 -11848 -1791 13350 5705
424E705j5046O936J7735j1333j3822J2849K049j2076m742L153R029m938j2605
437a7106P666J3246k137q642O686J7885j0630j3833K0353O668j9757m056J0104
450F447K215j1505n653J0419M89r285j777P090R962j0598j3697J8233Q098j8520
464h082o55J4015r55j3187J568J6350k348j2576J611P099O222o977j1567J4816
478E334O999k1527K53K1956j183k2173J11K2422n157j7348R806O622r247p080
492a0212K16J4237K900k0154j125K1121L845j5360J328K1520p232k1549J5694
505E229J4738j5586j2447J810R048j0j4523j86J3557j799j4920M094K5731n902
519H834k8207J4945K3349j5179j1555J0193N792q262p946R551J0697p092j4786
$$ plain form
424 5705 -9341 -2405 15330 3997 -9825 3024 5073 -7003 -11745 -8592 437 -4501 -17106
437 -17106 -9440 3806 1669 -6973 -287 17598 6968 -6865 13488 20156 399 -3657 6447
450 6447 8662 -2843 -8496 1923 2412 -6873 -8650 -1560 8402 -2196 -15893 2340 10438 -8082
464 -8082 -8737 5278 4323 -8864 -7296 9054 6706 -5870 -4259 2840 9062 2085 -9482 5334
478 5334 12333 -9194 -8941 13015 11832 -10341 -10230 12192 7035 -10313 -507 6115 -3132 -10212
492 -10212 -9996 4241 7141 -13013 -14138 6983 10828 -4532 -3204 18316 11084 -10465 5229
505 5229 19967 4381 -8066 -6256 2792 2782 -11741 -11927 1630 -169 -15089 -10995 14736 8834
519 8834 -19373 -4428 18921 3742 -7813 2380 8172 -90 -8036 1515 12212 5120 -9666
532i666O94K1830P48k5959Q239K1149j9305j4452K0480J2041j7575j3900J3697
545a979J0738q959n816K417Q167j971j8148R787K3240j7674k0909J9029J8052
558A5974j5306j2445J8175O871j8709j99J3357K039p631j5395M924K1562r108
571D109j9421J2448J5337j4887j2306K5339J2613k8773o997K1017L072j0147p522
584f118K145P986r966j0244J4125J3011j6802j7805K1570K0428k2915q821K2414
597I008o89j5023K978J3023K686j4155o774J3367J0712r164j5184J0183J5389
610A6357k0030r668K5204k03k5047k78J7936K691j4465k459J0735K63o514k873
624h351R375J0591j7938j2078K4927P680k1337j506J7756j09j5519N530J7190
$$ plain form
532 -9666 -8972 12858 13606 -12353 -4114 17035 -2270 -16722 3758 15799 -1776 -15676 -1979
545 -1979 8759 -200 -6016 -3599 4568 2597 -15551 -5764 17476 -198 -21107 -2078 15974
558 15974 668 -11777 6398 13269 -5440 -5639 7718 9757 2126 -13269 -8345 13217 4109
571 4109 -15312 -2864 12473 -2414 -14720 10619 23232 -5541 -12538 8479 11551 1404 -6118
584 -6118 -3973 4013 -5953 -16197 -2072 10939 -5863 -23668 -2098 18330 -4585 -13406 9008
597 9008 8319 -6704 -3726 9297 11983 -2172 -8946 4421 15133 5969 -9215 968 16357
610 16357 -3673 -13341 11863 11660 -13387 -13665 4271 6962 -7503 -9962 773 1036 -5478 -8351
624 -8351 1024 11615 -6323 -18401 6526 14206 -7131 -8637 9119 9010 -6509 -979 16211
637A6211p327j2656J570P758N978j1744j2271J4321M216j8060L51J8439j750k1026
651a5990M107K2995n800j3915P265N977j850n023j452J1072L81j5560j22J6362
665H447K853j7172j261J8866o431j5693J1980Q710j0810p964L573J0230k278j0801
679g751J272R304J069j0427k67J6931n836j8006J2088J3078j0842q043O803P341
693F714n794n889Q279M797n437o661J437J2298l729j5914P429J0422j1381o694
707a0123R584O837j0018o656J1697M328p913j258L148M894k976q929Q284P844
721H743j1269n453J0668O440r916o578J3172K741j2051J675P184q48o268m948
735f708Q343M554j0681l187Q797L068q866l894J3572J553j5330K939J1596k457
$$ plain form
637 16211 8884 -3772 -2202 5556 11534 -210 -12481 1840 6056 -12004 -11653 6786 5036 -15990
651 -15990 -11883 11112 5312 -8603 -1338 4639 2789 -2234 -3686 7386 7767 -7793 -7915 8447
665 8447 11300 -5872 -7133 11733 5302 -10391 1589 10299 -511 -8475 -4902 5328 3050 -7751
679 -7751 -6479 2825 3894 -6533 -6800 10131 4295 -13711 -1623 11455 613 -7430 -627 6714
693 6714 920 -4969 3310 8107 2670 -3991 -2554 9744 6015 -9899 -2470 7952 -3429 -10123
707 -10123 -539 6298 -3720 -10376 1321 5649 -2264 -3522 -374 4520 1544 -7385 899 8743
721 8743 -2526 -7979 2689 9129 -787 -7365 5807 8548 -3503 -1828 5356 4508 -1760 -6708
735 -6708 1635 6189 -4492 -7679 1118 4186 -4680 -8574 4998 6551 -8779 -5840 5756 3299
749C299q171n40R469J095j0349J859J0094p53q077j846J1945J048j5077K691J2212
764H899n597j0020K117R735k467j2264M801J0516m456q103J626R917j89j2942
778h427M087J2572o587r640M943J0751l507j2039O970J1298q214p439N794Q015
792H577l851j2207N628J1478q988r227O824Q821n859j1790Q338J1417j0931p863
806i633Q884O921o612r945Q327J1106j0413p696R911P740o673r361R180J0961
820A2697j2051p926J0869N869r027r044R121R297j2711p348J1600N560q820p612
834i526R296R571j2421p616J2807N106j0211o626J0142Q799j2791n999J3880M341
848H752j0236n073J0015Q144j2967o507J3780L484j1752n147J0175O592j3360
$$ plain form
749 3299 -4872 -5412 4057 5152 -5197 -3338 6756 6003 -2074 -3920 8025 9073 -6004 -3313 8899
764 8899 3302 -6718 -4601 5134 2667 -9597 -4796 5720 1264 -6839 -5213 4704 4515 -8427
778 -8427 -4340 8232 1645 -7995 -3052 7699 4192 -7847 -877 10421 2207 -5232 562 8577
792 8577 4726 -7481 -1853 9625 637 -8590 -1766 7055 1196 -10594 -2256 9161 -1770 -9633
806 -9633 -749 6172 -440 -10385 -2058 9048 -1365 -9061 850 8590 1917 -7444 1736 12697
820 12697 646 -7280 3589 9458 431 -8613 508 9805 -2906 -10254 1346 6906 -1914 -9526
834 -9526 -230 9341 -3080 -10696 2111 7217 -2994 -9620 522 9321 -3470 -9469 4411 8752
848 8752 -1484 -6557 3458 11602 -1365 -7872 5908 9392 -2360 -7507 2668 9260 -4100
861d100n735J3900K535j1840l334J0095N722j2683n260J4137K519j1205k069J0601
875C283N264j2011l802J4348J584j2006p55R251L494j1701m337J3239P31j2147
889e565o47R815K948j1342l113J3740l04j2382J220R109Q56r963k033J2272m27
904D184j1038J947R513J248r735j569J3354o51j2580L240R113k057q991k50J0714
919F442k369j0529L185P777j179q135j060J1007j389j1817M569R047m106q189
933f746K380R999l163r652N962O441l472n012R51Q184j764j0657M717Q660m258
948B570p332L282Q095m433q073P582M992p079l455K582M993k196q106L856O317
963C595n378m752M527O871n282p546R179N439q722j027N383J573l449l687N148
$$ plain form
861 -4100 -9835 4065 6600 -5240 -8574 1521 7243 -5440 -10700 3437 5956 -5249 -7318 3283
875 3283 8547 -3464 -7266 7082 8666 -3340 -4095 5156 8650 -3051 -7388 5851 6582 -5565
889 -5565 -6212 3603 6551 -4791 -7904 5836 5532 -6850 -5630 3479 4335 -5628 -7661 4611 4184
904 4184 -6854 -4907 4606 5854 -3881 -5450 7904 7253 -5327 -2087 7026 4969 -4022 -4272 6442
919 6442 4073 -6456 -3271 4506 3327 -4808 -5868 5139 3750 -8067 -3498 5549 1443 -6746
933 -6746 -4366 5633 2470 -7182 -1220 5221 1749 -3263 -2312 5872 4108 -6549 -1832 6828 2570
948 2570 -4762 -1480 6615 2182 -5891 1691 6683 -396 -3851 -1269 3724 1528 -6578 -2722 3595
963 3595 -1783 -6535 -2008 4863 -419 -7965 1214 6653 -2069 -3096 2287 3860 411 -3276 1872
978A872L394n962k735M598M862m698o868Q106M071j0499k13Q181j351o924j197
993e363O730J022o430rM013J340k921l569P567L962j1009m32J0908o06q069O00
1009b266P680j667p524M463N454l900m118j169N444K709r438j534Q698j665p756
1024f589K017R342k819j0799O316R063n789m299L098L537Jn972J270P832l106
1039C103q096K224J0119k005j1957N109R882q613n461P170K969n004o179L717
1053c022O772l517n975J635P156j085r018N327J1072r546p761J0001N574o709
1067I04n377N590N157o142l175M868L909l363q679M035J1166p938r748Q522N385
1082E114q301m690R158M411j0206k678Q681K815l595n433K687Q715n922p547R061
$$ plain form
978 1872 5266 -696 -3431 1167 6029 1331 -5537 2569 6640 -3859 -4072 4109 2758 -4166 -5363
993 -5363 1367 2389 -4041 -4050 -37 1303 -1618 -5187 2380 6342 -4667 -5099 5809 5203 -2866 -2266
1009 -2266 5414 3747 -3777 686 6140 2240 -1878 -3047 2397 5106 -4332 -5866 2832 1167 -6589
1024 -6589 -4572 4770 1951 -8848 -2532 6531 742 -3557 -459 3078 3079 -2893 -1623 6209 3103
1039 3103 -4993 -2769 7350 5345 -6612 -1503 8379 -234 -5695 1475 4444 -560 -6739 -3022
1053 -3022 3750 233 -5742 -4107 3049 1964 -7054 -1727 9345 -201 -7962 2039 7613 904
1067 904 -4473 1117 6274 132 -3043 1825 5734 2371 -6308 -2273 8893 955 -8793 -271 5114
1082 5114 -3187 -7877 1281 5692 -4514 -7192 1489 4304 709 -4724 -2037 6678 756 -6791 2270
1097B270N717r757n807J0450O718j1394l649R949K92o043r68L751L858o515o516
1112g644Q270N551p904o805P951P104j0449l772J2567l60r769Q38O873K429o107
1127a227l782O468L518n357l622O290N731r622n251J3013J459j1517K4P329Mo927
1143c469p12P012m62o510n64N269M486p149n228R967K457j0185J101Q014j036
1158B991p801R69R275j664o891J912M203J076m173k794P301O27r408J026P948
1173D597j287p984m1Q286k174p003M405L859k632l282K00N774L44p480J314O593
1189C489j047n672J167P580k948p259N573N049m789l272J632L799j572n303K493
1204a080L965l013l825J633N947k200p212M896N093n627k313L800K504l205l682
$$ plain form
1097 2270 7987 -1770 -7577 2873 9591 -1803 -5452 4497 4789 -1254 -2222 1529 5387 -1128 -7644
1112 -7644 626 6177 -1727 -8532 -581 6523 -3926 -7698 4869 4509 -5260 -4422 2451 4880 -1227
1127 -1227 -5009 1459 4977 -380 -4002 2288 8019 -1603 -6854 6159 7618 -3899 -3875 3454 3458 -3469
1143 -3469 -4181 2831 2369 -4141 -4705 564 5050 -2099 -7327 2640 5097 -5088 -3987 4027 2991
1158 2991 -4810 -3841 5434 3770 -3121 -1209 2994 4070 -103 -2897 4404 5031 -4377 -3351 4597
1173 4597 3310 -4674 -4715 3571 1397 -5606 -1201 2658 26 -3256 -3056 2718 3062 -4418 -3104 3489
1189 3489 2442 -3230 -2063 5517 2569 -4690 883 5932 1143 -2129 -497 3302 1730 -3573 -1080
1204 -1080 2885 -128 -3953 -2320 3627 1427 -5785 -889 4204 -1423 -3736 64 2568 -637 -4319
1219d319M547L343m015j643K291L583j664n108M665L948o425k081M790J703m433
1234h18l289N193J868n637k08L605Q96k854k956M562L103o299r69N108J094m362
1250a963j702O123J328o618J242N529j056l513j041M342J240o188M7N319j136
1265A953m302o92N486O44p245J573O074k568m626J016M565l21o299J681O184k203
1281I20m236J235N312M1o396K079O608l440m711K286M515j607o115K122O059l877
1297G95m660K595M129j409o092K376O592m507m808L386M374k337n521L478O009
1312D400m432m144M102L971k231n137L322N752m919m533M601L556l230n032L654
1327c00N555n395m053N030L046l792m370L436M785n508l982N467K824l830l684
$$ plain form
1219 -4319 228 3571 -444 -2087 204 3787 2123 -2985 1680 5628 -797 -2878 1912 3615 -818
1234 -818 -4107 1086 2954 -2683 -2891 714 1610 -1244 -4200 362 3465 -2834 -3803 1305 2399 -1963
1250 -1963 -3665 2458 3786 -2832 -1590 3939 2883 -630 -1671 2671 3911 -2277 -2230 3089 1953
1265 1953 -2349 -3041 2445 3089 -4156 -2583 3491 923 -3703 -2687 1878 1557 -4742 -3061 3123 920
1281 920 -3316 -2081 3231 3272 -3124 -1045 5563 2123 -2588 -302 4213 2606 -3509 -1387 4672 795
1297 795 -3865 -1270 2859 1450 -4642 -2266 4326 -181 -4989 -1603 2771 434 -5087 -1609 4400
1312 4400 -32 -4176 -74 3897 1666 -3471 -149 5603 684 -3849 752 4308 1078 -3954 -300
1327 -300 5255 -140 -4193 837 3883 91 -4279 -843 3942 -1566 -5548 -81 2743 -1087 -4771
1342d771M325N030n324l590O310K577m465l021L967M310n775l598O038K155m799
1357f31k924M253M015n628l513O204J691n265k281M182L332n646l188O595J695
1372B891n158j209M184L219n164k707O484J687n622r23M305K240n201k294O384
1387C116Q43n669l74M095J703n140k451N796N54n963q6M074J141m438j561O329
1403A969K87n240Q80M462M53m056j119N561N8n710J069M459m10m340l67N632p57
1420B831n585J802L940j400l891l21M727r27n287J821L833j242l523O51M973j071
1436A331n034K835M004k263k770J251L816j249m396K638L321k303k518J126L563
1451C352j592m917K782L287l338k874K133K968k323l583L464K835l372j373K101
$$ plain form
1342 -4771 -446 4584 -740 -4330 1980 4557 92 -2929 1038 5348 -427 -4025 2013 4168 -631
1357 -631 -3555 698 4713 -915 -4428 1776 3467 -1798 -4079 103 3435 -2211 -5399 1196 2891
1372 2891 -2267 -3476 708 3927 -1237 -3944 2540 4227 -1395 -2318 1987 4227 -974 -3268 3116
1387 3116 3959 -1710 -2084 2011 3714 -1426 -3877 1919 2473 -3490 -3576 498 1639 -2799 -4360 1969
1403 1969 2256 -2984 -2104 2358 2811 -1245 -2364 3197 3255 -2455 -1386 3073 2663 -1677 -2044 3588 2831
1420 2831 -2754 -952 2988 1588 -2303 -2624 2103 1176 -4111 -2290 1543 301 -3222 -2571 2402 1331
1436 1331 -3703 -868 3136 873 -1897 -646 3170 1921 -2475 163 3484 1181 -1337 -211 3352
1451 3352 1760 -3157 -375 2912 -426 -3300 -1167 1801 -522 -4105 -641 2194 -1178 -2551 -450
1466d50K769j531l829L124L210l661j962K930K390k648k952M048K212m248o76
1481a274K716J110k365k589L200J883m245j352L412J179l008k161L968J818m661
1496b369J96L502J38k558j136L463J324m087q5L495M08k766j311M095J109n276
1512a858M58M186j050l216k44L160K79m242N05L709j096k720k8L636O15m861N07
1529b260M724j605l381J054L540p13m075J760M268k112k487R24K914J4m366J009
1545g92M359k709l477J439L295j241m303K150L786k917k459K255J991q54l604
1560c081J657M168k451l210K315L205j385l867K498M327l661k722L241J912k132
1575H14k679J516L289l024k867K831K019k044l356K580L966l911k936L885J790
$$ plain form
1466 -450 2319 788 -3041 83 3293 -368 -2330 600 2990 342 -2610 1438 3650 -598 -1274
1481 -1274 1442 2552 187 -2402 798 2681 -1564 -2916 496 1675 -1333 -3494 474 2292 -2369
1496 -2369 -2173 1329 1467 -1091 -2227 1236 2560 -1527 -1612 1883 2291 -475 -1786 2309 3418 -1858
1512 -1858 -1400 2786 1736 -1480 -1724 1436 1715 -2527 -2022 1687 591 -2129 -2157 1479 2094 -2767 -2260
1529 -2260 2464 859 -2522 -1468 2072 1359 -2716 -956 3312 1200 -1287 -363 2551 2565 -1801 -792
1545 -792 3567 858 -2619 -1180 2115 874 -3429 -1279 2507 -410 -2869 -614 1377 523 -3081
1560 -3081 -1424 2744 293 -2917 -602 2603 1218 -2649 -151 4176 515 -2207 1034 2946 814
1575 814 -1865 -349 2940 -84 -2951 -120 1899 -145 -3501 -921 3045 -866 -3802 83 1873
1590A873k771j990K538K862l363k001L738J878k282k316K495L369l795k380M073
1605A928R85l598j652K922K123l850j645L706P89l030j184K290K356l320k345
1620c525M321J024l557q58L122J755l371j308M430N36l465j91K635J400l184j716
1636a952L946M50l850l00K879J125l945q93M511k92m070P02K561J03k815p56L796
1653A200M6l617N38K995O29l078p48M609k63m203J520K748p75k824p8L509o53
1670A555l611J187K410l85k624k15L493p32l853J240K776j099k407O04L128q95
1686E72l151J911K393j170j781O06K961p25l487J865K627j964j854R44K715j586
1702H76k957K240J990j990j639Q40K083j285k826K161K021k375j421J647J903
$$ plain form
1590 1873 -898 -2888 -350 2512 -851 -2852 886 2764 482 -1834 661 4030 235 -2145 1928
1605 1928 2913 -685 -2337 585 2708 -1142 -2787 919 1708 -1322 -2506 -216 2140 -1180 -3525
1620 -3525 796 1820 -1737 -2595 527 2282 -1089 -2397 2033 2569 -896 -1087 1548 2948 -236 -1952
1636 -1952 1994 2444 -1406 -1706 1173 2298 -1647 -2540 1971 1679 -2391 -1689 872 975 -1840 -2596 1200
1653 1200 1246 -2371 -1833 1162 1791 -1287 -2035 2574 2311 -1892 -372 2376 1601 -1223 -1301 2208 1555
1670 1555 -2056 -869 1541 1156 -1468 -1683 1810 1078 -2775 -1535 1241 142 -2265 -1661 1467 572
1686 572 -2579 -668 1725 555 -1226 -620 2341 1616 -1871 -6 2621 657 -1197 -253 2462 876
1702 876 -2081 159 2149 159 -1480 -640 1443 158 -2668 -507 1514 -861 -2282 -635 1268
1717A268j347k483K848K036k629j024J940J495j542k137K239J893k589r81J741
1732G28J084j565k034K346J575l173p88K191N80j886j658K599J393l004k76K312
1748D24O10j549j211K435J599l055l59K667J36k031q39K403R71l162P2K631n13
1765A229j934n52K143P00l386J83K537o02k042j48K098O36l046N56L122p94k025
1782a325M58K295K35k896N07K916j103k056P14K242l42k997R34K797j625k100
1798a346O91J929n18k755P01K579j506k011J372J699o17k397J334K642j784j724
1814a711J590J680q06k351J309K532j600j901J863J563j156k206J153K404k131
1829B32k076J782J214j510j843J487K003k012j727K402J146j582j179J395K078
$$ plain form
1717 1268 -79 -2562 286 2322 -307 -1331 609 2104 562 -1575 664 2557 -32 -1013 728
1732 728 1812 247 -1787 559 2134 -1039 -1827 364 944 -942 -2600 -1 1392 -1612 -1888 424
1748 424 1034 -515 -1726 709 2308 -747 -1106 1561 1697 -334 -1173 1230 2201 -961 -889 1742 1229
1765 1229 -705 -1257 886 1586 -1800 -1617 920 318 -1724 -1872 226 862 -2184 -1628 1494 700 -1325
1782 -1325 -867 1428 1663 -1233 -726 2190 1087 -969 -255 1987 1645 -1352 -418 2379 754 -1346
1798 -1346 -655 1274 756 -1999 -1298 1281 -225 -2236 -864 835 218 -2179 -845 1797 13 -1711
1814 -1711 -121 1559 753 -1598 -289 2243 643 -1258 605 2168 1012 -1194 -41 2363 232
1829 232 -1844 -62 1152 -358 -2201 -714 1289 -723 -2450 -48 1098 -484 -1663 -268 1810
1844A810k027j673K570R91j628j261J599J907k103j654K791O20j881j147J453
1859C67J659k492j608K815M13k379m64J439J439k479j021K956M11k270j80J868
1875D74J185k273j059K993K47k374q4J961J078k330r23K676K29k548K6J500M74
1892A252k256p45K831k59k619M60J877Q0j948l88K736j46k475N70J947p6j749
1909i08k88K666N7k514Q01J814k63j761k83K433k03k874P54J748n91j727q3K199
1927I77m14k648J186J724q23j422K96J976l19k322J263J610p32j396P40J995o54
1944A037k140J362J656j209j114K30J838q33k250J454J471j655j175O64J632p76
1960A92k114J452J309j545p96Q98J342o95j952J940J291j563n56J156J174j014
$$ plain form
1844 1810 -217 -1890 680 1671 43 -1218 381 2288 185 -1469 1322 1942 61 -1086 367
1859 367 2026 -466 -2074 741 1154 -1225 -1689 -250 1189 -1290 -2311 645 1056 -1214 -1394 474
1875 474 1659 -614 -1673 1320 1567 -807 -891 1070 2148 -182 -1105 1571 1800 -748 -722 778 1252
1892 1252 -1004 -1749 1082 823 -1796 -1336 541 621 -1327 -1715 1021 875 -1600 -1030 917 841 -908
1909 -908 -1196 1470 1527 -987 -186 1628 1365 -396 -679 1754 1551 -1323 -569 1179 588 -1139 -1222 977
1927 977 563 -2085 -899 825 2 -1420 -1124 852 533 -1789 -526 1084 352 -1044 -304 1691 1037
1944 1037 -1103 259 1915 706 -408 -178 1660 827 -1423 31 1502 -153 -1328 -664 968 192
1960 192 -1922 -470 839 -706 -1502 -604 738 43 -1909 31 1322 -241 -797 359 1533 519
1976E19j363J568J280j906n75J107O27j145j395J466J109k250k92J481L37j108
1992e40j189J690Q65k033k47J620J59q62q63J776R41k056Q9J846K30j563l93J444
2010I14Q24k217Q0J654m42j301k88J278N30k150N0J667l38j331n5J451K57k064
2028a481L36K063q18r12K41J181M32j580K79J879r73j142M53J249k06j785M96
2045b88J785j194j116P04J021m21j751N52J797j238j342P24J051m6j521M46J922
2062A085j137j119J128J033l97j382Q14J550j289r60J275O13p98j062M91J711
2078A556j340j459J240O23p11j153Q73J356j783r88J805K35n32r12N16J719j237
2095a92j028J659P09j224n81J193J339j867q49J925N2j030m86O78Q74j345r02
$$ plain form
1976 519 -844 724 2004 98 -477 630 1257 112 -1283 183 1292 -958 -1250 231 568 -540
1992 -540 -1729 -39 826 -1207 -1454 166 325 -537 -1400 376 1317 -739 -650 1196 1426 -137 -530 914
2010 914 1738 -479 -399 1255 813 -488 -776 502 1032 -1118 -1068 599 261 -1070 -1125 326 583 -1481
2028 -1481 -1145 918 100 -812 -571 610 1042 -538 -259 1620 647 -495 -42 1207 1001 -784 -288
2045 -288 1497 303 -813 -109 912 491 -1260 -708 1089 -149 -1491 -767 284 238 -1283 -837 1085
2062 1085 -52 -1171 -43 990 593 -789 25 1575 286 -674 601 1214 416 -646 -155 1556
2078 1556 216 -1243 -3 620 -91 -1244 -371 985 -798 -1786 19 254 -278 -1190 -674 1045 -192
2095 -192 -1220 439 1148 -76 -657 536 1875 8 -841 1084 1136 106 -380 298 1172 -173 -1075
2112a075J462L86j390p41R55J111j582o37J855J92j720M01J316M90j263p82J841
2129H19K86j169j05P46P01j391o15K052L3k069J37J344O5j337k23J254l15j367
2147a154L03P72M42j120q28J813M14j650J40J449j40j139J74J798m99j384N66
2164d3J071j12o90k86J053j57j669M17J511m77j447l22J861m49j759J033P29q76
2182f12k23J17J201j66j599Q29J204l14q66oJ462l54j685J329J180j112o28M46
2200B03R57o16j036M51P34q34n93L54R69n67j661J241J067j247l04O86M58l68
2218a06q18R97P54r13j81L75O71j56j217J008Q32j141n42R91M61p78r90R51N62
2237G60j219l0O82k74j84p25P33Q21j318k52Q54O19p22n97J076O15j263K43R45
$$ plain form
2112 -1075 387 773 -617 -1358 -403 708 -874 -1511 344 536 -1184 -783 533 1023 -240 -1022 819
2129 819 1105 -64 -169 577 1278 -113 -728 1324 1357 -712 -575 769 834 -503 -726 528 213 -1154
2147 -1154 -851 -79 363 -757 -1585 228 642 -1008 -868 581 441 -698 -524 1274 775 -609 -43
2164 -43 1028 916 226 -60 993 836 -833 -416 1095 618 -829 -1151 710 261 -1498 -465 264 -612
2182 -612 -835 -718 483 317 -1282 -453 751 437 -429 -435 1027 673 -1012 317 1497 385 -243 203
2200 203 1160 544 -492 -41 693 -141 -734 -380 589 22 -1639 -398 669 -578 -882 -196 262 -106
2218 -106 -924 73 827 -86 -267 108 779 623 -594 414 1246 105 -437 554 1015 237 -753 198 760
2237 760 -459 -489 193 -81 -265 -990 -257 564 -754 -1006 -152 467 -255 -852 224 839 -424 -181 764
2256G64k39l67k56O13M51r97j54R25l39n37l72P72L33j614K88J047l69p38K40
2275e49P81p7q90L99O44k77m96J26N18N73j272M17J132n57o70K61Q87k34j052
2294c36K60J110q09o56L22M10r1r49J47J124p65p36O29L91p1r28L89J331j036
2313b64n26R21L63j17n95L06J078p61n36O06K56l25o20L31Q86j082n53Q56J65
2332C89m06p65L25R99j079m16R22J03l77m34N36R10q87n50J173J87n02l96P82
2351E14N28r90l70J121k20m99k81M45L58p17o48Q81K25r63j25N39N04r14l01J126
2371B13mj002J51N40K40n08k00J188R3q93K45M33M17r62r7J089j75j123K31N31
2391D07Q9q92j74Q38k55n88P4N55Q5q73o9J089l16o21L25N39m7m30m6R76j36p97
$$ plain form
2256 764 525 158 -98 515 966 -31 -185 740 401 -136 -508 264 597 -1017 -729 318 -51 -789 -549
2275 -549 232 155 -735 -336 308 31 -465 -339 179 752 -520 -103 1029 472 -198 63 950 716 -336
2294 -336 -76 1034 225 -431 -109 301 210 -739 -592 532 -233 -969 -340 51 -20 -948 -559 772 -264
2313 -264 -790 131 494 377 -218 88 1166 405 -131 475 731 406 -214 117 1003 -79 -632 224 389
2332 389 -17 -782 -457 542 -537 -953 -31 72 -305 -739 -203 707 -180 -730 443 630 128 -268 514
2351 514 1042 52 -318 803 583 84 -197 248 606 -111 -759 122 347 -616 -741 -202 302 -612 -913 213
2371 213 209 -793 -642 -102 138 -370 -570 618 711 -182 63 496 913 -49 -146 943 768 -355 -124 407
2391 407 496 -396 -570 268 13 -575 -501 54 139 -734 -803 286 -30 -651 -326 213 166 -264 -310 666 530 -267
2413b67O18K97l02l95r7Q25j70r47M69M59m63l06j19O78k89q73P30K65m08l37
2433f32jQ14k48o41O57M78n60k63O74L41k50n17N35K96k99m34L13L97k59q38M17
2454b0N87r11j06K73K31n4o87M94K09n41J60J07K79j38n06N54O84p07p0M25K55
2475E18l45k66N69K38q58L53K71k25R6n88L31L55q15p5L39K0k40m20N50L66r68
2496g94K18O80m31J33o5M88J06m81J99M17n5j49k48M15K47p79K2P10l65l72l3
2517a37L00m9m33K18J45n24J16j04L40N10j213J42Q21j49l28K26N53k91m87N79
2537B35O15o10j23J36o0K64l97p1N77l71n45M13L36j13r42L19M90p79J09N99k48
2558a66l10N3J71K20n8l26M33K40J29o00K83Q68j038kQ51j91n04QJ38M3k66J41
$$ plain form
2413 -267 351 648 346 -49 -146 679 509 -438 31 490 27 -279 -398 280 -9 -882 -152 113 -295 -632
2433 -632 -633 181 -67 -708 -51 427 -133 -396 278 619 369 -148 387 683 384 -50 263 660 401 -437 -20
2454 -20 567 -344 -450 -177 54 0 -687 -193 16 -525 -365 -258 21 -117 -623 -69 615 -92 -162 263 518
2475 518 173 -93 476 714 -144 209 480 255 351 -237 94 449 -366 -441 -102 -82 -322 -742 -192 174 -794
2496 -794 -576 104 -327 -194 -259 229 335 -146 53 470 415 266 18 433 680 -99 -77 633 268 -104 -137
2517 -137 163 114 -319 -101 44 -480 -364 -468 -128 382 -831 -689 132 -17 -345 -119 434 143 -344 235
2537 235 850 240 117 253 193 457 60 -11 566 195 -350 63 399 286 -656 -337 153 -626 -517 82 -166
2558 -166 -476 -423 -252 -32 -90 -416 17 257 386 -214 69 937 -101 -103 748 557 53 61 199 242 -24 117
2580A17j05k12J22l89R4P06o58o70Q57L5m08K33L79l5k41J56M18m36J93j8k65
2601a27P39j70o19N47J38q30M63N14j39p28J02N37p69j05M35k98O0r4j38N75j90
2622i7l19j91N68L05n93L54O85p46m56J075k35j21J79k84K23P7Jj82n8j14m57
2643c86P0Q25n67q20R00m2n70J66L81j41k56M27J04o9J09j67k60Q75k10m82M42
2664C29K46m68p2N80j88m18p1L60j77k10K42l84O8J89o76M24M10o25l49M72K65
2685e3k67M5N12l85k53Q45j10l95K62k20K62K32n4m18J81K05m44O2O36l22r30
2706f09N02J23l22J61o7rm5j80j7L03L57m49l78Q09J22o56N95L37m76j12K94K56
2728E39l76J22P5j17N8r9k42K47r7n29K58L06m23q3J56J23l43Q7L23j22m62N34
$$ plain form
2580 117 12 -200 -78 -467 -373 333 -325 -995 -138 -103 -511 -278 101 66 -175 -19 399 -37 156 138 -127
2601 -127 612 442 -177 370 508 -322 141 655 516 -212 -110 427 -342 -447 -12 -310 -250 -344 -482 93 -97
2622 -97 -416 -607 -39 266 -327 27 712 -34 -490 585 350 229 408 124 347 424 425 243 185 71 -386
2643 -386 -316 509 -58 -878 22 -20 -590 -424 -43 -184 -440 -13 91 22 131 -36 -296 579 369 -113 329
2664 329 575 107 35 615 427 9 -62 298 121 -89 153 -231 -163 26 -650 -226 184 -441 -790 -318 -53
2685 -53 -320 -275 237 -148 -401 444 334 -61 201 -19 243 475 421 3 184 389 -55 7 643 321 -609
2706 -609 -107 16 -306 -145 -212 -221 -266 -446 -463 -160 197 -252 -630 179 301 -355 240 577 101 -11 283 539
2728 539 163 285 360 243 301 202 -40 207 110 -419 -161 145 -278 -361 -205 -82 -425 -338 -15 -137 -599 -65
2750f5J37j21K01k80J27M68j80l95K94M36l60m20M63J68o78K50J73j14n0k43K1
2771a68J79k38r7J99J56l13k73O18l0m76L76L15l29q3Q2K45J01k02J27q6K82j63
2793B22j57M25rp37L22L73n73j80J70K82j69l86K20J46k91Ql3K42J25l05J55M27
2815B77k54k04J49M41L1n24N44Q3m05j77K12J33m7l91J65K82l85k92J99K68l09
2836b04j85K56M37n39j11L9J68n4k50M94K01j52k20L53P4j13m39N97K0m06m9L97
2858C14J73n12o5J63K37m96q9N08k43k70j39K37K23l15k13O74n6j87k49M84K21
2879D00n57J66M36j14l81L43L8Q9m36j72N87j95l87j6M72r9o34J71L77l42j33
2900c87j13M01J06m24k8N45k36r3L81J50m0k53L8M82k99l71N08N3k29k44n2M99
$$ plain form
2750 -65 72 -49 152 -128 -1 467 287 -108 186 622 262 -158 305 473 -205 45 218 104 54 -189 -168
2771 -168 11 -227 -324 -125 31 -282 -555 63 33 -443 -67 248 -81 -164 -82 163 264 62 189 103 385 222
2793 222 65 490 481 -256 66 439 -134 -314 -144 138 -31 -417 -197 -51 -342 -334 -367 -125 0 -305 -150 277
2815 277 23 -181 -32 409 440 -84 460 543 138 -39 173 306 259 -132 33 315 -70 -362 -163 105 -204
2836 -204 -389 -133 304 -235 -346 -307 -139 -193 -443 51 252 100 -120 233 307 194 -245 352 372 -34 -83 314
2858 314 487 -25 -90 73 310 -186 -275 233 -10 -280 -419 -182 41 -274 -487 187 131 -56 -305 179 400
2879 400 -157 9 445 331 -50 293 331 420 -16 -188 399 204 -183 -199 273 174 -460 -289 88 -254 -387
2900 -387 -500 -99 7 -417 -445 100 -136 -229 152 302 262 9 47 529 230 -141 367 420 191 -53 -105 394
2922C94l55k59J36J57k78j91O2L95k95k50K78K29j89m23N20M59m63l40N49J59
2942B95l21r0J22N49l82k82M57J87m38k86L89K60l23l70L05J84n56m7J91Q3k27
2963c00j89M24K31n99%L92K22m90k9O69o0l20Q7K29K10l23k78N29K00o56n9K55
2985A45K17m31j28M10Q5q61K08O04k66l03j85L40J94l89M7L42K64n47j47Q23n2
3006C70o69L69N54l74k97P9M02j09m60L7K72J20m65k91P34k94o19J18N95k43l16
3027d87L24M11l91l45L99L08j03m02j3N74J88p03K84N36l75m45N15L53o93l16
3047c81P01nl00p1M4J02n6m51J98M38n19k41K6O75l12m65Q30R9o54J42M54K29
3069D83k58j89NL43p1m70K45L92m70m84Q29K53r16N8L98j14m83N4K38M2l95J32
$$ plain form
2922 394 39 -220 -84 73 -205 -396 -334 61 -234 -484 -206 23 -166 -589 -69 390 -73 -413 136 295
2942 295 -26 -116 6 555 173 -109 348 535 97 -189 200 460 137 -233 72 256 -300 -347 -156 -73 -300
2963 -300 -489 -65 166 -433 -433 -41 181 -309 -338 331 271 -49 38 267 477 154 -124 405 605 -51 -110 145
2985 145 362 -69 -197 213 298 -563 -355 249 -17 -320 -505 -165 29 -360 -313 29 293 -254 -401 422 370
3006 370 -299 70 624 250 -47 32 434 325 -135 -98 174 294 -171 -462 272 -22 -641 -523 72 -171 -487
3027 -487 -163 248 -143 -488 -89 219 116 -286 -299 275 463 -240 44 580 205 -240 275 628 -65 -381
3047 -381 320 315 15 -56 -12 90 34 -417 -219 219 -300 -541 -515 160 -152 -617 213 312 -342 -200 254 483
3069 483 225 36 41 384 313 -157 88 480 10 -474 355 608 -308 -250 148 34 -449 -395 -157 -115 -510 -378
3091c78K73K88l00n06O17L94p47J05O18N2p60M28O33m39l85J01L41k33P8m48L44
3112G6M45r33j14P50J74j081P1P86j28o07L67L22n21J07R9K61L68n87k12N57K25
3133D25o43k1R54k95p79M55P07p98k55K64K03j79k46j25L93Q8o63J55P32k17r97
3154h42N36N78l43m61P12R9l92q6M96J26k95j74m6N94Kq30J53Q81o45p17Q19N21
3176F86r79l00O74J21o38Q3J61J9l5l31L31M86k17n24M08Q11q84l40Q98J55p75
3197a90q6Q53j71n04j59L56L50l60n42N81L04o17k91N94L04j173lR90j75n04K06
3218b37L00J28l18j62N52K52m16m60P36L59o94k80J059m25n47Q3P06m63n75L1
3238c71N69k67l1j89K61L04o80k40Q64q2q19L31O63j71m90J57N90k34m80L79L37
$$ plain form
3091 -378 -105 183 -117 -623 -6 388 -359 -254 364 416 -344 84 717 278 -107 -6 335 102 180 -268 76
3112 76 521 -412 -526 224 398 -683 -612 174 46 -561 -194 128 -393 -286 -187 74 442 -145 -357 200 425
3133 425 -218 -239 715 420 -359 96 803 5 -250 14 217 38 -208 -333 60 148 -515 -360 372 155 -842
3154 -842 -306 272 -71 -532 180 279 -113 -199 297 423 128 -46 -92 502 504 -326 -173 708 63 -654 165 686
3176 686 -293 -593 81 202 -436 -353 -192 -173 -208 -539 -208 278 61 -463 -55 756 -128 -468 430 585 -190
3197 -190 -276 577 406 -98 -257 99 449 89 -453 128 432 -185 -476 118 422 -751 -754 236 61 -443 -237
3218 -237 63 191 -127 -289 263 515 99 -361 375 734 40 -240 819 394 -153 -70 636 173 -402 -371
3238 -371 198 -69 -100 -289 -28 276 -404 -644 220 138 -681 -350 313 142 -348 -191 399 165 -315 64 401
3259D01q5l47k60P71Qq99K05N46j22o48L35M99n73n55N96K20k27k99m1P37k30
3280C2o07K32P61l15n79M85O43m53o25Q58J27m47j42K16K99l42m82M58L12k47
3300A84n42K90K94l56o43O80M85r02o5O34J92m76j60L89L15m05k80M00M11l17
3320A28m28O47L80n50n32O77L24p37j28N95L0q21J7N11K00o04k98O02J26n16l41
3341g18Q74M8n84j97Q52k5m93r3O75p1l98J5N74n0n82J9M46P5q27K68O30o8q13
3364d43PQ66m37n80R7Q61l29p44K58P13l4o43R9O04O0p21K67N59j73o21L55O67
3386F88n43m50L54M47m08o23K32P75l38o34J54P10o38k32K99M32k57o66N37P02
3406E41n88m41N11M38m16m88N15N67l51n75K84M85k50o65N50N93o51m64O56K09
$$ plain form
3259 401 316 -31 -291 480 488 -411 -206 340 218 -430 -95 404 -169 -724 -128 92 -135 -434 -475 262 32
3280 32 -575 -343 418 103 -476 9 652 199 -426 432 559 112 -30 186 485 143 -339 119 431 184
3300 184 -358 -68 226 -130 -773 -93 392 -510 -575 59 251 -225 -385 4 319 -86 -366 34 445 128
3320 128 -300 347 727 177 -355 322 646 -91 -219 376 406 -415 -398 113 313 -291 -589 13 139 -377 -718
3341 -718 156 204 -380 -577 275 250 -243 -336 339 268 -130 -115 459 409 -173 -154 292 367 -460 -192 438 370 -443
3364 -443 -436 430 -7 -587 -490 371 42 -702 -444 269 235 -408 -309 295 355 -366 -99 460 287 -334 21 688
3386 688 145 -305 49 496 88 -535 -303 472 134 -500 -346 364 -274 -506 -207 225 -32 -698 -161 541
3406 541 -47 -488 23 461 45 -443 72 639 288 -287 -3 482 232 -433 117 710 59 -405 251 460
3426D60o45l22N57K36m74m53M19M34n02m25O64M32n81l42Q41K67o76l10O05M22
3446F07o24m07Q81J27n55l00O29K11p92o3N78K63r45j32O33K59q31j42O64N3o38
3467e24M1O72L01p30j96O83K00o11j9O75p3o29J11O30l7p20l0P30r9n40j44P63
3489D54j62q28J23N96op66J80P94l02o76J89N82k22j72J4N51R8q96K86Q23k50
3510D10p72M54O39n30o43M99O08o11o52M55O29m65p06M79N28l14p75N29P43n72
3530f7o56P51M34k92m97K82P23o81l58N07M07k27o83M21O91p49o03Q68M23q62
3550a68n04Q52K88p43k90M59M02o84j51K99N43n34m40Q57L65o60n39P04N49o70
3570f5j99P03K16q38R3N34j91m54r5M75L14o34n86R22K66r80JQ66l8q87J27O68
$$ plain form
3426 460 -185 -507 50 286 -188 -641 -222 212 -290 -715 -51 381 -200 -542 299 566 -110 -420 185 607
3446 607 -17 -424 457 584 29 -271 358 569 -223 -286 292 555 -390 -522 111 370 -461 -603 61 114 -524
3467 -524 -483 189 490 -240 -436 247 447 -164 -183 492 419 -210 -99 531 494 -226 -256 474 375 -165 -309 454
3489 454 292 -536 -413 183 177 -589 -409 385 83 -593 -404 178 -44 -216 -202 349 447 -449 -163 660 410
3510 410 -362 92 731 201 -442 57 665 54 -598 -143 486 21 -685 -206 322 8 -767 -238 505 -67
3530 -67 -723 28 462 170 -327 -45 678 -3 -361 146 553 326 -357 64 755 6 -597 271 694 -168
3550 -168 -672 180 468 -275 -565 -106 296 -388 -539 -240 303 -231 -671 186 551 -109 -648 56 605 -65
3570 -65 -264 439 655 -183 -90 444 253 -201 -296 179 493 -141 -727 195 461 -519 -518 348 310 -577 -450 218
3592B18j25l62j04O40L9l78j62O80K03r92K0R34P9j067L43O01l29q01N71O73l90
3613B91n91J7M63Q8p38J69N98p9r31L07R50n21p08N00R41n71o69M26M03j35m24
3634b14L63L75j53q66L00Q44l58p98N80M82o59n76N68N94o97l38L70M28k07o03
3654e65J09O93k62p46O81O23n08o48Q73M07p54o5M50K94m55m29N81K04m22m70
3674d09N85M47q17n64P77M32j019j21J051R6q88o6O41p9k14k64L82M57n33l86
3694d92P16N64j127r7R34K34r39o1Q67j57p61J64L67L7n90n5P44kp72k83R28K44
3716D63r90N9Q12l3p29P5Q23k58m83R1N30R3o72m2Q15r7q42K15P29k10q77K89
3738b39P85o99m26M64M40l02n20K00N32q1n61q7R59j11j069M08P89m80o29N34
$$ plain form
3592 218 93 -269 -373 267 306 -72 -234 446 649 -343 -323 611 690 -377 -34 567 238 -563 8 681 291
3613 291 -300 -283 180 268 -470 -301 297 218 -713 -406 544 23 -685 -185 756 185 -484 -58 345 210 -214
3634 -214 149 524 371 -495 -195 649 291 -507 73 555 -104 -680 -112 482 -215 -553 -183 245 38 -565
3654 -565 -456 237 -25 -771 -90 533 25 -623 250 657 -97 -162 288 582 127 -302 279 483 61 -409
3674 -409 176 623 -194 -758 19 451 -568 -689 362 458 -430 -496 145 66 -148 -412 -30 427 -106 -492
3694 -492 224 788 -339 -436 498 732 -207 -268 599 442 -319 -155 212 249 -341 -396 348 346 -426 -709 219 463
3716 463 -527 -468 344 311 -418 -343 480 222 -261 -170 360 453 -219 -261 554 457 -385 -170 559 349 -528 -239
3738 -239 546 -153 -579 -115 325 23 -497 -297 235 154 -407 -494 465 354 -715 -307 482 2 -627 -93
3758i3Q28n40o24M09O27k97o20M03L28j34q11L93N99m29p84P31M18p86l02O23
3778f1L35n47k07N52K73l40m97M66P74p21l90N14O64q67m38Q79M21r81j62N98
3798B65L60p12l74M82M45o80k87M05O76j018k54P59L06p45k89R47k6o03j32P18
3818B43L16o91j28P09k8m54m10Q30J62o82l18Q39O9r47J21N90J86r42J15P76j26
3839B30n54j66O92no66K9Q90K6j010J16R04m7p04O1P49j18p13M47L66m4q95K06
3861b06O88j66p71l3R73l59p33J98P81l57p44K33R26m26n80L55O70j38r84M63
3881b10P29k99o49M38P91n65n63L88N52n79n53M75N52n74m57N26N32n94p11O95
3901g6O34n46p86O92N77o40m66O00N38o20m94O90O04n09n23N11N71o17o96Q33
$$ plain form
3758 -93 735 195 -429 -20 607 310 -310 93 421 287 -524 -131 468 39 -745 -14 404 -382 -684 -61
3778 -61 274 -273 -480 72 345 5 -492 -26 748 27 -363 151 815 -52 -490 389 810 -171 -333 265
3798 265 625 -87 -461 21 466 -214 -501 -96 580 -438 -692 67 373 -372 -661 286 260 -343 -475 243
3818 243 559 -132 -260 449 421 -33 -443 387 549 -133 -451 388 457 -490 -369 221 407 -535 -420 356 230
3839 230 -324 -490 202 197 -469 -440 450 476 -534 -418 486 439 -265 -204 545 427 -286 161 527 483 -412 -206
3861 -206 482 316 -455 -488 485 126 -607 -409 372 15 -729 -496 430 4 -576 -221 449 311 -673 -210
3881 -210 519 220 -429 9 800 235 -328 60 612 33 -520 -45 507 -67 -524 2 534 -60 -771 -76
3901 -76 558 12 -774 -82 495 -145 -611 -11 527 -93 -587 103 707 198 -325 186 757 140 -556 277
3921B77N64r24l79N96L64n24o89R09L06q98j73O85L81o89l08O63K40o85k62P40
3941A94M93j018n5O15L17p04o9O85J51q51l42J010J29q68j87O92M48r08j01N81
3961B12K16j007m8P66J24q35J62P57k0p54n1Q51O0p46m2R51j90p74J33Q75j96
3982D44p12j2Q55k14p47J63Q77m77o08R7O33j80p07K22Q13n48m46K86P81k48p47
4003d75K90O65l27o35L60P59l11q40N40N90l33p15O21L89l68q36O72L72m99m27
4023e08M49L30l26m93N50L13m22m46M20N30m58o73P69P22p99m82P28L44m16m70
4043c38M93L74n00m56N61N12p75m46N98M85p04n91J042J07o37k04M51N48p75j82
4063d37M31M05n55l45O73L65o87l77J043M2r00p4Q94J43q92j48R86k49n96J1L36
$$ plain form
3921 277 841 -83 -462 134 498 -26 -715 194 500 -398 -571 114 495 -194 -502 161 401 -284 -546 194
3941 194 687 -331 -386 229 546 -158 -227 458 609 -242 -584 426 555 -313 -500 192 640 -268 -369 212
3961 212 428 -579 -627 139 263 -572 -410 347 327 -427 -478 373 433 -313 -355 596 406 -368 -235 640 444
3982 444 -268 -280 575 361 -386 -223 654 177 -431 -334 299 119 -588 -366 447 -101 -547 -261 520 272 -475
4003 -475 -185 480 153 -482 -122 637 326 -514 26 616 283 -432 189 578 210 -626 46 418 -81 -508
4023 -508 -59 271 -55 -548 2 315 -107 -553 -133 397 -61 -734 35 757 -42 -524 204 548 132 -338
4043 -338 155 529 29 -427 134 646 -129 -575 23 508 -196 -787 255 362 -275 -479 -28 520 -255 -437
4063 -437 -6 399 -156 -501 172 537 -150 -527 516 558 -342 -416 478 621 -271 -419 567 318 -278 -267 69
4084F9L00r46p9J150j39p92j83J022j21q49K08Q09k84o88K20P01M1p71J39O85
4104D92Q5p85j10R30j61r15M8J064n99o01O03K30j47p86K69P77l43o02L16N50
4124C15k8r16L80P42m07p24N35Q59m67p17N91M64n08n43M37M80k74o85K50P42
4144E26l49r50P63O46p30o48P15L25n07l50O44J61k85m00L18P36n86o81P35N94
4164F77n81o71P32O99j002m12Q99K08o35l60O35L33n46m66N39N81q16m74P26O06
4184F72j021k57P04J46o51m1O44J95n60j75M90L38o00j74O14L89r25k68J007L6
4204E63q95o9J024l13p97K07M79M2p11P2O66k5n24n04J098J60r29j81J169j94
4224C38q79K80P62j01p68K11Q89k16o28k51Q40n3q48L0R29l30o92J01R36l97p34
$$ plain form
4084 69 369 -577 -656 494 355 -437 -620 402 281 -568 -360 449 165 -523 -303 398 439 -332 -193 492
4104 492 577 -208 -318 612 451 -464 -416 648 49 -552 51 281 134 -652 -383 394 51 -551 -235 315
4124 315 287 -629 -249 493 86 -638 -103 756 289 -428 163 627 119 -424 13 493 219 -466 -216 526
4144 526 177 -773 -10 636 -94 -742 -27 298 -209 -559 85 246 -39 -439 -121 615 29 -652 83 677
4164 677 96 -575 157 856 -146 -558 341 549 -86 -446 189 522 -24 -490 49 630 -186 -660 66 672
4184 672 -349 -606 98 244 -407 -448 196 391 -169 -344 146 484 -116 -290 324 713 -212 -480 527 563
4204 563 -332 -401 623 310 -487 -280 199 241 -470 -398 268 243 -281 -785 313 473 -456 -637 532 338
4224 338 -541 -261 501 400 -368 -157 732 516 -112 -363 477 424 -424 -394 535 205 -487 -386 550 153 -581
4245e81J70Q55m88n55K74O82j47o88L77M04j9r28M18Q56l53q29O37N35n24m66
4265c70M17M08l25n96M54M93n17o10M82N75m41p05N84P44q42m11N45P27o88m53
4285e29O22N13o66m26N85N21n58m10N20O64q76m14N43O20p80l55M72L22o05k21
4305d58P16K1m76k49M12M17n59n23P93L66p23j59P57L52j040q5P71K37n64k43
4325b37N59L07q43k64P90J51p83j02R02j61p84J05P27p1q89KP28K48o50k05Q47
4346C77j88n33k2Q01J00r54K07P15j86o44J34Q74j01j099L84P04l43n84J52O50
4366D44j91o28L3Q47l15p67L39N61j18q75M05Q62m69p51O48M35k93o65N02Q33
4386H37o05p08L11P46m44o94O46N13n02p18N45M99o33l00L23O27m74n44M51M99
$$ plain form
4245 -581 -411 444 -44 -599 -325 357 210 -478 -101 303 284 -644 -226 630 277 -552 85 620 96 -370
4265 -370 47 455 130 -466 -12 481 -36 -646 -164 411 -30 -735 -151 593 -249 -660 -115 612 -76 -529
4285 -529 93 606 -60 -486 99 620 62 -348 172 836 -40 -454 89 709 -71 -426 46 368 -237 -458
4305 -458 258 279 -197 -446 -34 383 -176 -699 94 460 -263 -422 335 687 -353 -438 333 570 6 -237
4325 -237 322 629 -214 -478 312 463 -320 -422 480 319 -465 -360 367 296 -593 -591 137 385 -265 -470 377
4346 377 189 -344 -366 435 535 -419 -212 503 317 -327 -193 681 580 -519 -135 569 226 -358 -206 444
4366 444 253 -375 -342 505 190 -577 -238 323 205 -670 -265 597 128 -623 25 460 167 -498 4 837
4386 837 232 -476 -165 581 137 -557 89 602 100 -618 -73 426 -207 -507 -184 443 -31 -575 -124 375
4406C75n32l23L44O77o59l68M62O37o61j95M56K43m29l90M54O63p81k29M37M29
4426F10p38l24O05K66q05j91O08L63p87k97R16L48r46j92O01L74n48l92R15j8
4446C68n96k39Q62p6m31j88P55J07r29Q0O24M8n22k67M45K39o52K5N47J10p46
4467d36j36P60k3n93L4O89r5m71q7P57p1p57K82O36j40o90K12O16j82p78K85M64
4489B76k7o52O7O14k01n71J50O15k03o24J35Q66k85q50O47P77n52p44N09N34j52
4510C29p62L24O54l21n15K77N57l95p10N44N36n48m89M56N96p07o25P56L40n59
4530b62l84N38N37m68m71M10N86n72m31O36N00p17n20P90N16p69k69N85L70p46
4550a41l81P13K65o46l41N81K34m36m67Q25J96q61o9O65O2n51j41P11J74o14o5
$$ plain form
4406 375 -157 -480 -136 541 -118 -486 -24 613 -48 -243 213 456 27 -363 91 754 -27 -256 181 610
4426 610 -128 -452 153 419 -386 -577 31 394 -393 -690 226 574 -372 -564 37 411 -137 -529 386 368
4446 368 -228 -467 395 319 -112 -300 455 562 -367 -287 337 385 -137 -404 41 280 -372 -347 200 310 -436
4467 -436 -572 188 165 -428 -394 295 200 -271 -358 399 328 -429 -147 489 349 -341 -129 487 305 -473 -188 276
4489 276 249 -403 -336 278 77 -494 -344 271 68 -556 -421 445 160 -690 -43 734 182 -562 -53 481 329
4510 329 -433 -109 545 224 -291 -14 543 148 -562 -18 518 -30 -519 -63 533 -174 -799 -43 297 -262
4530 -262 -646 -108 429 -39 -510 -100 486 -86 -517 119 619 -98 -618 172 688 -81 -350 235 605 -141
4550 -141 -522 191 456 -190 -531 50 284 -152 -619 206 402 -459 -528 137 199 -352 -493 218 392 -222 -287
4571b87O96N6o47j33N60L55p88q3R04k55n86n7N32j39o49J57N28m1n77R2M72K25
4593C35q04nR24j64o38j9P60L2q58K62O04j30o50J98N82N2q13J09P16k75p63M43
4615a02N74l08o04L10M65m86k69R3N79k04m00O7P02k95o19M18O11l63o55M34O63
4636F11o79k00L27L99l69m44L72L93k58p89O19N50n14n29M34N67p37o53Q02M81
4656C83o94j37M11L50k17l22L82J91n28l69P72L05m30o00Q78K85r37k2O05J98
4676E04p40k20N89K96p27j80O13J06l95l57N39K34n38j82O25K63o48k40R76j05
4696D13n61j48O67R2p01r8P00J4o28l6O84P3r14N3P00l5o90J28L29K46o18N5N98
4719C23P9q02m3P61N8o36oO37j22n25J02P70m76m28M0P63j42p75K34M26o6n77
$$ plain form
4571 -287 409 465 -182 -315 245 600 -188 -271 633 378 -208 -265 267 128 -521 -364 164 123 -454 -362 110 335
4593 335 -469 -474 450 286 -352 -371 389 421 -437 -175 429 299 -351 -153 429 481 -332 -223 493 218 -545 -102
4615 -102 472 164 -440 -130 335 -151 -420 -327 252 48 -352 -285 417 122 -497 -79 532 169 -486 -52 611
4636 611 -68 -268 59 458 89 -355 17 410 152 -637 -18 532 18 -511 -77 490 -247 -900 -98 383
4656 383 -311 -448 -37 313 96 -226 156 347 -181 -550 222 527 97 -503 375 660 -277 -299 306 504
4676 504 -236 -456 133 429 -298 -478 135 241 -154 -511 28 262 -276 -458 167 430 -218 -458 518 413
4696 413 -148 -296 371 463 -238 -336 364 378 -250 -286 398 471 -443 -390 310 275 -415 -287 42 288 -330 -275 323
4719 323 402 -400 -443 318 376 -260 -266 371 249 -276 -174 596 120 -308 -268 495 353 -422 -188 238 172 -405
4741d05J7Q63l52p68M44N83l33m36J07N99k14o97O38M55k79l78R5N67k71n70L61
4762B6M79l02n63L49N86m62n74N02M41n90l06M31K88l30m94L46N34m20n93N33
4782a19N44n03k66K86P37p02k50M40Q9l8m95N10K96n50l11L69N71m70m21O13K47
4803E77p75k40N44J21m62k78O86Q4m66k89O33K82o83m2N25K11p48n1P54J68r13
4824c62J24N97J42p06j01N53N1n56o2P44j74o95j15R27j74o26J48N13m6n46J00
4845b64M92j4p21J87N43J09m49P6O69l90n39K09L59q4m86J87O79j57r17L39M43
4866B71j23n32J86N79m92l20K42M33j98n48M27M15k70n84O70L16l23m39K84O78
4886F72o38k79L64L87m85l21K58O18m29n32L31L86m05l61L30M51m95l34L91N78
$$ plain form
4741 -405 -388 475 123 -645 -201 382 49 -387 -280 319 105 -592 46 501 222 -156 -61 506 235 -335 26
4762 26 505 203 -360 -11 575 113 -461 41 482 -108 -414 17 305 -25 -519 -173 361 -59 -652 -119
4782 -119 425 -78 -344 -58 679 -23 -273 167 256 218 -277 233 529 -21 -332 37 608 138 -283 330 577
4803 577 -198 -438 106 227 -235 -513 173 257 -209 -498 135 417 -266 -308 217 428 -320 -371 383 551 -362
4824 -362 -238 359 501 -205 -306 247 298 -258 -320 424 250 -445 -560 367 193 -433 -285 228 182 -364 -264
4845 -264 228 214 -507 -320 223 332 -117 -41 628 238 -301 -92 267 183 -303 -116 563 406 -511 -172 271
4866 271 148 -384 -198 381 -111 -431 -189 244 46 -502 -75 340 70 -514 156 472 149 -290 -6 672
4886 672 34 -245 119 506 21 -300 -42 576 147 -385 -54 332 -73 -434 -104 347 -148 -482 -91 487
4906D87n38m24N05L87m98l07N88J28l92k85M99L49m25l63N75K85n81k86N59J85
4926D48n15m10O25Q0l05m24N16M05p57RM52O5n78j40O33J21n87L3P32k1n49J46
4948b1K67J95o59J31N28q3o66J37N28L2o11o4N94j83m60l0N07J8n50J06O14qp71
4971d49K48N70k05m51L8M85N2o64L17O00k98m77J83M00j70n16J80O70m49n25P
4992d54Q10k31o23K15N66l72l16J88L94j25n32M11M02l16l07L32L70m18l93N04
5012A05L25l36l44K42N24n50l86O00L01n54k86K79M44m51l50L38L76m20l00L92
5032e1L80l20m23M57M09n94k28N24L13m40l27O27J33n92j14M31J33m76j79O19
5052B82l8m91k54O88o2m06q9K85L18m58k12P01M2o19j2O48j1m46kM34Q4n72r0
$$ plain form
4906 487 -51 -475 30 417 -81 -388 200 328 -64 -349 150 499 74 -289 286 571 -10 -296 263 448
4926 448 -67 -477 148 228 -77 -501 15 420 -337 -328 124 189 -389 -529 104 225 -362 -329 403 382 -167 -21
4948 -21 246 441 -218 -87 441 358 -308 -171 357 389 -222 -286 308 125 -335 -365 142 160 -390 -284 330 322 -449
4971 -449 -201 369 164 -287 -249 236 288 -376 -59 541 243 -234 -51 349 179 -337 -157 513 64 -461 -454
4992 -454 356 125 -498 -283 283 -89 -405 -217 177 52 -480 -69 333 17 -290 42 412 -6 -399 105
5012 105 430 94 -250 -8 516 -34 -420 180 481 -73 -359 -80 364 -87 -437 -99 277 -143 -443 -51
5032 -51 329 9 -414 43 452 -142 -370 154 467 27 -300 327 460 -132 -246 185 318 -158 -337 282
5052 282 244 -247 -501 187 125 -281 -370 -85 233 -225 -437 264 306 -313 -325 323 312 -134 -136 298 382 -190 -280
5075b80M07L24p74Q8O61j48n32O7K84J50o16%P13j01m36O2K76J53o57J78L12O5
5097A96l60m5N31j7n08q5O76j19n11J76M75l16l62L01M05k72m59K95K58mp86K38
5119b93P14l63m18K75L70l94k71K18N18l60j55K30M43l74m16K83M03l60l32N17
5139B35L16m37m07K66N93n15l12L38R1k25l23M66L30m24m01L88M62p36j39M05
5159b9N17o43j26M03R2l63j1K83M24o70k54N22K87o43j10M17M17o39l45O43j8
5180A54m27N3M86n4l80k72O20J41n66R0L84O4m83k93O83J52m73r7L78J04k66k42
5202b44O24m5n72k2N32K8o12m9O22p8n79K9M70j0n10J24M39n1n35K43M48j4n23
5225b85j63O81N8o48J52N46n2n83K72N39l20m57J91K74r0m40K82M65m17l77J32
$$ plain form
5075 -280 127 451 -323 -235 426 278 -254 -187 97 247 -369 -369 344 243 -193 -131 145 298 -359 -181 131 196
5097 196 -164 -209 322 305 -203 -288 388 269 -242 -66 409 93 -269 32 437 165 -294 1 259 255 -531 -293
5119 -293 421 58 -360 -85 285 -109 -380 -162 356 -4 -159 71 514 140 -276 7 410 50 -282 235
5139 235 551 114 -293 -27 566 51 -261 77 168 -57 -380 86 416 -8 -409 -21 441 -295 -434 -29
5159 -29 488 -155 -281 122 214 -149 -160 123 547 -123 -377 145 432 -211 -321 96 513 -126 -471 172 154
5180 154 -273 -220 266 212 -168 -440 180 321 -245 -155 229 293 -190 -483 200 352 -121 -218 160 264 -2 -244
5202 -244 380 335 -237 -259 273 301 -311 -360 262 184 -395 -366 104 94 -416 -292 147 96 -439 -196 252 238 -285
5225 -285 -448 233 291 -357 -205 341 289 -294 -22 517 197 -260 -69 205 115 -325 -43 422 5 -372 -240
5246b40O05k21m41J66N18l75m84N02K92l12k76K94L71k46m10N38J00l76k01K57
5266F1M16l71n38M45K28l40j01K00K39m28j88L68L12m00j82K56K63m82j46N21
5286A33K26o53r1N07K60l99l37M80K57o40j2N35J02n63j36M92K05m40k29N31N8
5307B86m98j95O65M7q13L26L46J8m00j61O48j7n54J27N15j15m07rM74L4o10J5
5329b78O16l7n09N8L30R3n59O3N80k36m92K19M63j42l00M3N29m39l76K10M74r8
5351B12p28M83N35j35m80J22L64k15l85m7M75j98m75M07K20j97m34M34L08l84
5371a18l87M56N19m77l13Q9O44l64k99J07N17l40l06M34K49m01k81M60J87l32
5391D4l14K61M41n16k13N34J49n95j26N10K00n92q7L09J76m79Q0K24J63j95m11
$$ plain form
5246 -240 365 144 -297 -131 387 12 -472 30 322 10 -266 28 399 153 -257 281 381 5 -196 61
5266 61 477 106 -432 13 241 -99 -200 0 239 -189 -377 -9 303 -97 -279 -23 240 -242 -388 133
5286 133 359 -294 -385 122 382 -17 -354 126 383 -257 -269 266 368 -195 -331 161 366 -74 -303 228 286
5307 286 -212 -407 258 305 -508 -182 164 182 -218 -379 269 252 -302 -175 340 225 -182 -191 283 317 -293 -278
5329 -278 338 301 -208 -150 180 273 -286 -223 357 121 -371 -152 311 169 -131 -88 441 2 -374 -164 310 212
5351 212 -516 -33 502 367 -113 9 373 158 -227 -274 201 3 -472 -65 155 -42 -476 -42 266 -118
5371 -118 -505 -49 470 -7 -320 -231 413 49 -250 -143 374 34 -272 162 411 10 -271 189 376 44
5391 44 -270 -9 432 -84 -297 237 386 -209 -335 175 375 -217 -304 5 181 -298 -218 6 169 -26 -437
5412d37N22K74m03l76N63K91n72l9M17J03n06r7L76K33o15PO14K4n78k41N48J25
5434B33n31j54N66N0m14r3N05R1m95j00O53j45m33K42L26o1m90K2M81jn96J99
5456a45L85l4m33J2N32r6n21K38M15l13m12N7N74k94m15K05N15j35m76J41O80
5477D80k73n38J8P18q0o56L82J88j57l52K78L38k27k76K7L96j94n19L32L26k99
5498h8l38K81N28n17l02M35L86l82l39L77K78k91l35M07J95k69k70K42L31j72
5518A57n58N73J57l15k97L83J30l59l08L41L96m10j21L19K28p44P3L44L74n06
5538a43K1K67Pk10j19M09J84n15j66M79Pk14j53M47l8o50J73L42J31m96j22N47
5560A88J0m33j88O75j53m11J8O06pn52L1M31n1j92j66N27j21m11L6O17l59l92
$$ plain form
5412 -437 85 359 -44 -420 143 434 -138 -177 240 343 -163 -260 116 349 -266 -259 355 379 -199 -440 108 233
5434 233 -298 -452 114 164 -250 -343 162 253 -242 -342 311 166 -267 -25 301 240 -250 -228 253 252 -344 -145
5456 -145 240 206 -227 -215 317 221 -300 -62 353 40 -372 -315 259 -35 -450 -245 270 135 -341 -200 480
5477 480 207 -331 -313 405 325 -331 51 239 82 -270 8 346 119 -157 -130 266 72 -447 -115 211 -88
5498 -88 -426 -145 383 -134 -436 -1 385 3 -336 41 319 28 -307 100 295 26 -244 -2 329 157
5518 157 -401 172 329 14 -283 100 230 -129 -437 -96 300 -110 -231 88 316 -428 -355 -11 363 -143
5538 -143 -122 145 152 -58 -177 232 416 -99 -265 214 221 7 -146 301 263 -387 -214 128 259 -237 -359 188
5560 188 198 -235 -423 252 99 -312 -294 312 305 -247 -216 215 164 -28 -194 333 212 -199 -163 454 95 -297
5582b97J45K95N1o05M35L36k50l86M8N21o9n09K05K94k29l41K05L13j05l85K03
5603a25M92k95l65L17L99l12m21L16M47l09l55Q9L85j90k60K67K06k37m25K49
5623a27L67l65m10N26L98m26l67L58K18q6l73M43L10m37k87N39R0m16k40M81K48
5644D44m59l38L63M20n85J9J26K83m66j62M97q6l50p8M81J66l63l97P05J11m15
5665h4j12M35M2l60j90P02k04l37k18N67J36n56j5M18n2m73O5M23j7n07J52M77
5687B92j77m82R7M54J30n60R2L68j13l63J21K63P1l92J24L79j62n15R5N74o5n71
5709c40O7O41j82l86J9L65p1l98J50M30j88n26J63N52k28m29M49J67j60l71K80
5730DL20j86m78K19M46l53k86K32L99l73j89J16M22m90k58M49K74j82m68K98M13
$$ plain form
5582 -297 -152 143 194 -411 24 360 110 -276 -228 293 224 -285 -80 214 -15 -356 -151 162 57 -328 -125
5603 -125 367 72 -293 24 423 111 -310 6 453 144 -211 -122 263 73 -187 80 286 49 -376 -127
5623 -127 240 -125 -535 -9 389 -37 -404 -46 172 86 -287 156 466 29 -258 281 371 -45 -285 196 444
5644 444 -15 -353 10 430 -155 -136 -10 273 -193 -355 142 56 -294 -372 109 275 -88 -485 220 331 -84
5665 -84 -196 239 281 -79 -269 433 229 -108 -326 241 377 -179 -194 224 172 -301 -236 187 170 -337 -185 292
5687 292 115 -367 -270 184 314 -246 -154 214 101 -262 -141 122 193 -199 -75 304 142 -373 -278 296 231 -340
5709 -340 -273 368 186 -200 -181 184 113 -285 -135 295 107 -419 -256 296 68 -361 88 255 95 -276 4
5730 4 324 138 -340 -121 325 -28 -314 -82 317 -56 -245 -129 293 -197 -455 -6 268 86 -382 -84 329
5751C29m04l23L75M86m28k96M02M5l31j20L69K89m44j21K17L81n83j42M62k0l29
5772a86qJ65J46k29k95M64K22l05k19L02K9l12k16N59K25n23r7M45J35m83k0L81
5794A80J60m36j0L12o5l15j3L22K10n44j6M15N7n85J34M03k6o48J37N37k8n40
5816c59J27N63Q2p24J33N98k84l80%N96l13k38O8K84j6m45n9Q34l11m71Q8N12
5838B85l05m12K39M46j52n42J72O08l70k61L12L25j96n12K96N16n16k46L12L73
5858C72l59k94K58M88l95m55N00J85k70m26M64J30l03j61K15L92m69k42L29L21
5878B80l80j95L87J74j25m05L62K11k24k24K27J78k91k36L30K84m76jK54K04m31
5899i7j43L63J77n81n5N39k4k17m34O23P7m01LL47J86m68r6M42j9l29l7L60j49
$$ plain form
5751 329 -75 -398 -23 463 35 -261 141 186 -145 -265 104 393 -51 -172 45 426 -157 -299 163 143 -186
5772 -186 -194 -29 117 -112 -407 57 279 -26 -245 57 86 -226 -442 117 342 -181 -278 167 302 -181 -201 180
5794 180 340 -96 -106 206 141 -174 -187 135 345 -199 -215 200 257 -328 -194 209 183 -465 -328 209 181 -359
5816 -359 -232 331 413 -311 -178 420 136 -244 -244 352 39 -199 -131 153 137 -308 -367 467 156 -315 -227 285
5838 285 -20 -432 -193 253 101 -441 -269 339 -31 -292 20 345 149 -363 -67 449 -67 -313 -1 372
5858 372 13 -281 -23 465 70 -385 115 300 30 -396 68 198 -105 -266 -51 341 -128 -370 -41 280
5878 280 -100 -295 92 266 141 -264 98 309 85 -139 88 266 -25 -261 69 353 -123 -124 130 334 -97
5899 -97 -240 123 300 -281 -336 203 179 -38 -472 151 228 -173 -170 177 363 -105 -201 241 222 -107 -144 216 67
5922F7j55j57M90P8n24o5M88j06k31r9M54j31m52K46L71o5l91q8M02K7m82Q8M71
5945B36l6m54M6M00j01l36J85M50l74m20K19M97k29k11O8L13j81j91RK80j35l56
5967c21J80K74k9l79J81M20l50k11J95M56l07n42K98M19k38j12J69K25l03k01
5987a76K15L01l88k32L41J69j64m14L87J23j64k57J33L11k76k82M56K55n52o1
6007b75K36L24m05o6L36K52n75j60N23K26m29k14M09j47o6k37L41K79m40k48N70
6028B34j03k05n5L21O9m24k32P36j28m35j31N61R0l50k05L15N8k96l7K60J69m01
6050a89k0L56L7m26qM49P2m76j04M21J62n70N7L45K4k66j98N02R4n45J41M81j39
6073B00m89K4N72j32m79J29M87k51k73JK71J80n41K35L10m62j40K31M62j49m91
$$ plain form
5922 67 -88 -245 245 323 -201 -266 222 116 -115 -214 240 109 -343 -97 274 209 -182 -270 132 159 -323 -235 236
5945 236 200 -254 -208 192 91 -245 -60 390 16 -404 -185 312 83 -128 -60 253 72 -119 -110 170 35 -321
5967 -321 -141 133 104 -275 -94 326 -24 -235 -40 416 109 -433 -135 284 46 -66 103 328 25 -176
5987 -176 39 340 -48 -280 61 230 66 -348 39 162 -2 -259 -126 185 -91 -373 83 338 -214 -275
6007 -275 -39 285 -120 -186 150 402 -173 -333 190 416 -13 -227 182 35 -31 -268 73 352 -88 -336 234
6028 234 131 -74 -129 192 261 -163 -395 341 213 -222 -353 208 298 -52 -257 58 116 -180 -217 43 212 -189
6050 -189 -209 147 184 -242 -250 199 271 -205 -309 112 274 -296 -239 106 130 -136 -334 168 262 -283 -142 339 200
6073 200 -289 -265 307 175 -304 -175 312 61 -212 -211 60 240 -301 -66 244 -218 -358 -127 335 186 -305
6094c05K61L88k64l53J95M38k01m42J33O01l61m04K16K78n7l99L56L96n98j62
6114b84K69K62l11l33L96K59l28j09M15Q1l75l13K95M64m85k51M55K30k34m54
6134c51M25J75m86L8M55Lk74k84L57L06m66j17L96j3k51p7K52J54l73k74O03P4
6156B72m73j06L86J56n34K26L38l4n19J7M05L8k89j5L89j17l73M3K80J29n06J12
6178a75L78o6k30k27N76j98n12L36L94n7n24K39J70j11l03J38M53j44l52J49L36
6199B70J18o93N4N36j50k13J6K79k30j68J56M75l56m79K93L35k79l18K78M37l11
6220E0m10L48L52m10k45K69L93j84m05M24J42j34m67K99M11n16k07K85M63m37
6240B1m56M20K74l34k09L89N6l56J07PM29n28j18K44L77m73j43M36K79n75j64
$$ plain form
6094 -305 -44 344 80 -273 -78 360 159 -283 -150 451 90 -314 -98 180 123 -276 80 476 -122 -284
6114 -284 -15 247 -64 -397 -1 258 -70 -179 236 317 -58 -371 -76 388 -97 -348 107 337 103 -351
6134 -351 74 249 -237 -199 256 259 -15 -299 58 364 -102 -219 177 164 -87 -164 88 242 -131 -405 198 272
6156 272 -201 -307 79 235 -299 -73 265 231 -288 -271 134 172 -117 -132 257 140 -233 -190 90 219 -287 -175
6178 -175 203 137 -93 -320 256 58 -454 -118 276 219 -305 -66 104 -7 -310 -172 281 137 -215 -66 270
6199 270 388 -305 -251 285 135 -78 -62 217 -13 -181 -25 450 94 -385 -92 243 -36 -354 -76 361 50
6220 50 -360 -12 340 -70 -315 -46 347 163 -242 182 324 190 -277 22 433 -83 -290 -5 458 21
6240 21 -435 -15 259 -75 -284 105 161 -195 -88 -81 348 -180 -298 -54 323 -150 -293 143 422 -153 -317
6261c17N06J00l66j56K23K61j98m43M79K37m28j84M92j51j24j74N30m1n72R1K11
6282b4P3l06K2M23J86n21m3L65p5j73j56M50k6l42p5N74k41l47P2L74Nl76n3L80
6306A66l9l37R8L84k36l52K20K68k4n88K59M28j08m21K55L46l58l30K62L66P4
6327C33n68Q8O01l45k35M5N14k67l79J12M02l40k96K16K54j67k78K25M08n78L9
6348b16K63J66q6m16J85L56k36k69M14l9n3k86J62K78l00k25M80Q2k76k68K53
6369c1K06l18k32N30J66l97j79M24R8m03l25O32M3k65j66K80K29m37k2L04M2j46
6391C3k83M38K1l42j3M81j3n18n8M03R2j91l28N27m1m53n9L17N9m13J31M54j24
6414A20l20J8N07J3p28L64R2J40l18qM52o7o14J80K69Rm42R8L97j10m48K09L26
$$ plain form
6261 -317 189 289 -77 -233 -10 251 53 -390 89 326 -102 -286 206 55 -69 -243 287 246 -326 -235 -24
6282 -24 49 -257 -235 188 374 -147 -190 175 100 -73 -229 221 195 -147 -222 352 111 -236 -164 210 215 -161 -214 166
6306 166 127 -210 -112 272 36 -316 -96 172 148 -440 -181 247 139 -282 -27 319 -39 -369 -107 259 333
6327 333 -235 -147 454 109 -126 -81 433 166 -213 -101 301 -39 -335 -119 135 -32 -310 -85 323 -255 -216
6348 -216 47 213 127 -289 -104 252 16 -253 161 122 69 -217 -55 223 -77 -302 178 260 -16 -284 -31
6369 -31 175 -143 -375 155 321 -76 -255 169 267 -136 -461 171 214 -51 -217 63 292 -145 -167 137 179 33
6391 33 -250 188 209 -133 -146 335 322 -196 -254 149 241 50 -278 249 208 -245 -304 13 72 -341 -210 244 120
6414 120 -200 -182 325 338 -390 -26 66 206 -112 -120 332 265 -349 -169 100 109 -333 -235 162 52 -396 -187 139
6437A39j47n69M69M28j14n01J82M18q9n15K03M49k60m44L73K43o6o37M00K56j03
6458A15l90K55L94l39l70K90L08k85k14Q0N47l25m75L44K21l8k99J31M58m24l02
6479c18M31J82k3o46M14J84l50l85N21K72k75m04M20L43k62n15M75J99k74k26
6499b37L61K03l17l51M11P8k01k86N41J31n87N7L90J11m33rL39J26m26lL53J3
6521B64m30j92P14r1m07j29L43J33m96O8M04M8l03j65N92k68k57n6M72K0l87j0
6543a33L94j70l52q7O04l2k52j13L46R9n70J03L67kl89j7N27k58n54K68L42K1
6565A42l83j5N51j89n24K91L35j84k81P3N39k36o19M42L62l63j39J20K84k51k65
6586c10L87On2k36KM74l58l88L48M00l40l31M35K95j56n95N95K62m81k98K57M96
$$ plain form
6437 139 -8 -577 -108 320 206 -295 -113 305 216 -299 -96 353 93 -351 22 265 199 -438 -38 218 115
6458 115 -275 -20 374 35 -335 -45 263 -22 -236 -156 391 66 -409 -65 156 118 -181 -50 408 -16 -318
6479 -318 113 295 272 -374 40 224 -126 -511 10 282 7 -397 23 366 104 -411 64 263 -11 -237
6499 -237 124 327 10 -341 70 148 -53 -339 202 333 -254 -197 193 304 -129 -138 201 327 -99 -102 251 264
6521 264 -166 -358 356 265 -142 -271 72 205 -291 -223 181 229 -74 -239 353 85 -172 -228 244 264 -123 -133
6543 -133 261 91 -261 -348 256 224 -28 -141 205 304 -266 -163 204 202 -187 -204 323 65 -489 -221 121 142
6565 142 -241 -256 295 106 -418 -127 208 24 -257 -184 355 119 -500 -58 304 -59 -198 -78 206 -45 -310
6586 -310 77 83 31 -205 -203 271 -87 -475 -127 273 -67 -398 37 332 176 -419 176 438 -43 -341 -84 412
6608D12l23m50L28L27n56Q5J75K31j42m33L95K70k82j38K20n4j11k09K53K99m39
6629a42j8J18J91j66k77M27P6l09O0J73P9k32j85K84J49n17L08Q7r5J16m25L28
6651C0K70m91j24N67j27k87q2L70J44n61J75J34K31k75l17N59j2m85O3N61j64
6672A79m35P7L04l0k39l7M37m9m29J52N56k48l89K8M02k44l39J81N10k65l84Q2
6694a80N58j89o13M10J49J45n32J22M53j71l78J24L55k15l11K49L58l65k48Q7
6714a92K95k7m20M09K60m17q0J57K91j89l96J35N93m11m58N06J14j93k35K38L84
6735C64l97m54N90J78k89k97L33K73l36l54M63J13m09j60N73J47m83k64M83N4
6755A28k90j20N04P4l61j52M11J02l72j63L56j4k63mM57r3m36J77K36Ok31k59
$$ plain form
6608 412 89 -361 -33 294 -262 -177 -2 229 87 -346 49 319 37 -101 119 65 -46 -255 -2 297 -142
6629 -142 -160 -42 149 -17 -294 133 209 -100 -40 133 212 -20 -205 79 228 -289 19 106 11 127 -298 30
6651 30 300 -191 -315 252 125 -162 -244 126 270 -291 -116 18 249 -26 -343 216 204 -281 -218 343 179
6672 179 -256 -179 125 95 -144 -181 256 207 -222 -70 486 238 -151 -123 279 35 -304 -123 387 122 -262 -180
6694 -180 378 189 -424 -14 135 280 -252 -130 323 152 -226 -102 253 38 -273 -24 334 -31 -279 -192
6714 -192 103 76 -344 65 325 -92 -172 -15 276 87 -309 -174 419 8 -450 56 170 -23 -258 -20 364
6735 364 -33 -487 103 281 -8 -305 28 301 -35 -389 74 187 -222 -382 191 338 -145 -409 74 128
6755 128 -162 -282 222 296 -65 -217 194 296 -76 -239 117 103 -160 -164 293 200 -236 -59 177 183 -48 -307
6777c07L43K91n43M0L31N3m40N7L13R5l90O9L31o8k78O3L30Rn36J36L11K1k99
6800f8l3M38j18n23K85L27m19j17P4K85M9o10K44M05p9n26K49L87Ln26K85J67
6822A79j63j40Q9L23k94k46J88N76l38n04K75L60j87l81K87J37l86M8J19L70m73
6843a61j38L00L57l50k99L19J88l08j90K25L48m32j38K59K95l12l40L50M01l86
6863a2k31L07j4j13k79K93L98m43j86K58J79k10l73L05L22m03n3L30Q6k34j82
6884b55L37J90l69l12O45N5k32l17L94K88m32r7L38L7l78j37L88Q9l05k63N61
6905B25j13j83l7K11K92o01K6L74r0k46m3L87L3k74r3M35p2l69k0N48j47l73p0
6928b00M13N6m74J98J79Jl14N3L75p0n93J93M01j90l51J25N50l13m49K84N13k37
$$ plain form
6777 -307 36 327 -216 -176 155 208 -232 -175 138 233 -157 -88 243 175 -103 -40 290 299 -237 -101 210 231 -68
6800 -68 -101 337 219 -304 -19 308 -111 -228 -154 131 180 -430 -186 219 140 -386 -137 250 253 -273 12 179
6822 179 16 -124 -35 288 -6 -252 -64 512 174 -330 -55 305 118 -263 24 161 -225 -177 -58 312 -161
6843 -161 -299 1 358 8 -291 28 216 -92 -282 -57 291 -141 -279 -20 275 -37 -377 -27 374 -12
6863 -12 -243 64 50 -63 -342 -49 349 -94 -280 -22 157 -53 -426 -121 201 -202 -255 75 161 -73 -255
6884 -255 82 272 -97 -409 236 291 59 -258 136 424 -8 -105 233 270 -108 -245 143 232 -73 -336 225
6905 225 112 -71 -108 103 395 -206 -180 194 104 -142 -185 202 235 -39 -132 303 231 -138 -158 390 243 -130 -200
6928 -200 213 269 -205 -7 172 173 -141 -88 287 217 -376 -183 218 28 -323 -198 352 39 -410 -126 387 150
6950A50n01L03K93k17k06O3L72p2m89K97K71k46l26K88L38j38l06NL62k79l35
6971c73M63K74m44k62K73L63l32j68L24J26k03m16L56L24k47k89L53N2j56k55
6991b37K02K94m34l49N67K15l27k54K90M31m59j47K31J73k61l68N16Q5l68j19
7011c19O90j23m72J2L05K7k44k70O46J9n29j08M51L46p44JM44J50l97q1K64J57
7033B25m07n5M57qm26m2L99j9k09j28L60q2l88J26M00m9m62K37K88j05l98K64
7055b2J50m5k81o8M12p6l20J69M95l61j93L5M03j12m40L35M7j01k21K48L51j24
7077B81n13K02J90o3l01K11K80q3n70K61K93j83l91L10M77k24m99L81L01k49l63
7098b52K76K17k42k81L49J53k43k22K84L39m77j28J30L57l19j70M00M4k37k13
$$ plain form
6950 150 -351 -48 245 28 -178 -115 257 185 -304 -7 264 18 -308 -20 318 180 -126 -121 241 -38 -373
6971 -373 90 364 -80 -342 -69 294 -38 -206 118 244 41 -375 -19 305 58 -231 122 174 18 -237
6991 -237 -35 259 -175 -524 43 258 -69 -323 -33 398 -61 -208 23 196 -65 -433 83 168 -200 -319
7011 -319 371 248 -224 -212 93 120 -124 -394 252 271 -258 -366 85 431 -313 -312 132 282 -115 -196 68 225
7033 225 -182 -237 220 212 -214 -256 143 124 -85 -213 147 65 -323 -197 203 154 -308 -71 217 112 -286 -22
7055 -22 128 83 -198 -266 146 70 -250 -81 414 53 -140 -105 298 186 -254 81 128 27 -194 54 405 281
7077 281 -232 -30 160 97 -204 7 287 204 -366 -105 188 5 -386 -76 401 177 -322 59 360 111 -252
7098 -252 24 241 -1 -282 67 220 -23 -245 39 378 -99 -227 -97 260 -59 -229 171 215 -22 -235
7118b35K21K89m11k13K54L05j65l11L27R4k67j06K21P3r3k03K69K18l60k34M95
7139A68J67l43j80L45K82p37J04K45K27l34k65N66P2l75r9K80K25n34P1L60n6
7160A89l57o1L19J00k92j07L16N5k47j74N84k47l59J79K24L5m63K42K50q7k80
7181a81m7M25n8k97J72K62r8m27M4K81Q7l20R5L21j90l53K04K68j36k81J98L96
7203C65l82j73J76K54k69o3j63N74k77l40K16K16k58j50J48L88k37l11M66N7j52
7224H5k19K7K94j96l55L37K71l54J77j63L60j91l82L35K41j87l38K97J77j86p7
7245d7O9K73k22l08K11K04j89j91L20J21l06r3K40J17k01k76K73K89m18L8J91
7266I5j37L7j38K72J03l57q6L21P4k69k70N46j06j94j29K68L1j93k06N21O2l46
$$ plain form
7118 -235 -14 275 -136 -349 -95 210 45 -266 61 155 -112 -218 3 76 -17 -220 49 267 -93 -327 168
7139 168 335 -8 -188 157 439 -298 -194 51 278 -56 -321 245 317 -58 -157 123 348 -186 -115 245 189
7160 189 -168 -229 90 190 -102 -209 107 162 -85 -259 325 78 -281 -102 122 157 -306 -64 186 99 -181
7181 -181 -228 197 139 -158 14 276 178 -249 -205 76 163 -157 -62 259 69 -284 -80 188 52 -229 -31 365
7203 365 -17 -190 -14 240 -29 -92 -255 319 42 -298 -82 134 -124 -274 -126 262 25 -286 180 237 85
7224 85 -134 -107 187 -9 -364 -27 244 -110 67 -96 264 73 -309 26 267 80 -258 39 216 30 -47
7245 -47 22 295 73 -235 -24 180 -9 -200 120 241 -65 -158 82 199 -2 -278 -5 284 -134 -96 95
7266 95 -42 -5 -143 129 232 -125 -211 110 184 -85 -355 191 85 -109 -238 30 61 -132 -338 183 245 -101
7288a01oJ08J19l22QM09m9k13j38J99R6k33k05O03j98k99K29J91j28r0j45L56
7310A91K0m09n2L08K10m90J70L36k08l41J78L29qn10K32K02j43k86J63L99k39
7331E2k13P1J99n7l50L58J04j34l00K50K48k57r7J34J62r5n05M12K31k05k81K72
7353aL25l73j62K95J90k68j50J81K18j07l63K55J69l47o2L49k6j01p4J22L1k82
7375a81J59J10K01l60j18K51J46k25j35K61J6j60m9L35q0k55n3K70K13n39k9K57
7397C5J36k47j9J73J28l80r1L90l0j25r7K96N0m15L6K15J88m36l1K32J65l68j33
7420c28N90o2m56J58K65n1l48P2L11j05k27R1K21l8k55o1M04r6m26L53ON3m31
7443c60K67M61l99k25J95J57J12l76j0L81m8m16J68M51l63j72J70J39m8k34J26
$$ plain form
7288 -101 -107 1 120 -202 -194 215 166 -47 -185 14 110 -123 -328 275 77 -222 7 198 70 -20 -165 191
7310 191 211 -198 -250 58 268 -222 -52 284 76 -265 -87 242 234 -276 -44 158 15 -271 -108 291 52
7331 52 -161 -90 109 52 -298 60 164 30 -270 -20 228 -29 -126 8 170 75 -430 -18 213 8 -273 -1
7353 -1 324 -49 -211 84 274 6 -144 37 255 148 -215 40 209 -138 -200 149 123 22 -52 70 101 -181
7375 -181 -22 88 289 -71 -189 62 208 -17 -152 109 125 -35 -84 251 171 -84 -137 133 346 -193 -222 35
7397 35 171 -76 -95 78 206 -174 -265 125 95 -30 -127 169 219 -196 -160 55 243 -193 -224 8 173 -195 -328
7420 -328 262 200 -256 -98 167 116 -232 -160 151 46 -181 -90 131 93 -162 -223 181 85 -341 12 18 71 -360
7443 -360 -93 368 -31 -256 -61 96 208 -168 -178 203 155 -261 -93 358 -5 -177 -7 132 84 -150 -24
7464b4K02j75j79J45K90j59k71R5L30k69j49K34J08k76j87L03R1k23q6K30K31
7485B61l49r5L54M2j76j73J09K78l64l8L07mk65l0J00J81j59k50J78K18k47N5
7507f7P0J01j63j63L72R6n38J39J32K61l49j60L62R8k49k43L81p0l3j88L55k0
7529A24k82%K05j02j02%L77k41j02J9L12n9l18q4M07J88o04Q7L71j46J21l06K90
7552A55M1m68K18J15M1l38O9J84K33m64N5L32o9l47J51L05k58k81J39K77q6j92
7574a88J27J57J9l06LL88j33j16o3K49q1k02Q5K94k61r3K21J04l24j0%J96N6k39
7598a17J9P3J92l00R4J12p6p2L7J99o6j49J32J00k83r8J21K34J28l25O6M8j45
7621g6m8J13J39l3j41J1J74k81o5J68J64q9k56K26K06k38j39J52J32r0k26J78
$$ plain form
7464 -24 178 3 -176 -31 259 100 -171 -76 254 -15 -164 70 178 -98 -285 18 109 -114 -200 30 261
7485 261 -88 -183 171 213 37 -136 -27 251 -113 -151 156 152 -113 -143 -43 138 -21 -271 -93 125 -122 -67
7507 -67 3 104 -59 -222 150 246 -292 -153 -21 240 -109 -269 93 191 -58 -301 80 10 -23 -211 144 124
7529 124 -158 -158 47 -55 -157 -157 220 -21 -123 -104 208 149 -169 -253 154 342 -262 -175 196 50 171 -135 155
7552 155 196 -272 -54 61 102 -236 -167 17 250 -214 -159 173 104 -243 -92 213 -45 -326 -187 90 4 -188
7574 -188 -61 96 115 -191 -188 200 67 -49 -112 137 56 -146 -61 233 -28 -121 100 204 -120 -130 -130 66 122 -117
7598 -117 -98 -25 167 -133 -39 73 -3 -75 -38 161 95 -54 78 178 -105 -203 -82 152 280 -45 21 69 -76
7621 -76 -124 -11 128 95 -46 -35 139 -142 -207 -39 125 36 -220 6 212 -26 -165 -13 119 29 -197 -19
7643a9J63k38j43M14p7m1k73L19K52m82n2K82p1n6k01L34J48m69n2M20q1l00L7
7666a86K67L3k45MK57n4j59l8J50K25m35N0M15k18l20K28K02J11m54J29J15k9
7688D8k57Q8K57K1l03R1K79j60k50J4N19k90j12j43N95l38j37M5J70j20j35J30
7710A2K52j31l25K2L71q0m86K93K39r6l42M34p1j8m05K78J01oj86J97J84j14k22
7733i9Q5J58k84m0K34K37l45M3M3K50j92m76L27J22r4j86K94J02r1k43K05J14
7755A64k23l3K22J33k57k02K48K52l53j02N8K11q4j49J23J41j65o5J97jk14o8
7777a67J61J20j71j35L15O5k95j44M66j26l26K45n1P2j33J0K38r3k81L0M15k2
7799A93l15P8J26n4m1q6K08p3j81J65K82j39k63O5L45k41o1j83K95k9k69JL23
$$ plain form
7643 -19 144 -94 -237 177 100 59 -214 105 357 -125 -177 105 34 -22 -223 111 259 -210 -262 158 77 -223 -186
7666 -186 81 114 -131 -127 130 76 -83 -121 29 254 -181 -131 284 66 -254 -26 176 287 -167 -38 77 48
7688 48 -209 -121 136 157 -146 -55 224 64 -186 -172 347 57 -55 -198 397 59 -78 -33 137 17 -118 12
7710 12 264 133 -192 -170 201 121 -365 -72 167 71 -271 163 92 74 -331 -53 48 42 -144 53 237 123 -99
7733 -99 -14 144 -140 -180 54 291 -54 -11 32 282 90 -386 -59 63 -31 -217 77 179 88 -155 50 164
7755 164 -59 -92 130 263 6 -196 52 304 -49 -151 -93 118 34 -115 8 149 -16 -81 116 115 -99 -167
7777 -167 -6 114 -57 -192 123 188 -107 -251 215 89 -237 8 -43 29 -104 -94 144 51 -230 -200 215 193
7799 193 -122 -44 82 28 -13 -99 109 36 -145 20 302 163 -100 -35 310 69 8 -175 120 91 -178 -177 146
7822A46l4l08K66j7J08l99R3L31k30m4lL35k42k44K75M8j11l9r3K78P5l38J26
7845b1J82k3l71K94r1l7p2J60J66k79p1Q6K73k33n2k6K63k17M9J23Q8j81k16L09
7869A03R5l07J89P0o8j21j59L06J80k46k59L56Q9k85j45L45o2l07J36J79J51k10
7891C0PJ03J2m10R3L18o4k18o9K07J23l13m9K79J2j26J6J10Q8k04j82M52j7k78
7915h0N4J5K01k10k29M87p2k24J4K20q6p2J7M8J12k69QR7Pk18L2K24o6j14m5K76
7941A27o6j74J0J75k1k12N7J69J1r7q2M29k01j89j31K42P1k91O3M31j28m03J80
7964c0L37j56j67o1K84j94k12J22K24k62Lm5L45j02j92J56j28ORm8K19l8k48R7
7988h1K65j68m3K68Nk00k22J60J18K2k17KL38j77l53M57r0Lk36J00J59k57l8L39
$$ plain form
7822 146 112 -196 70 53 161 -238 -145 186 -44 -88 -91 244 2 -242 33 81 -30 -69 -162 116 191 -147 -21
7845 -21 161 138 -233 61 -30 -67 -139 21 187 -92 -163 -77 196 -37 -89 -115 148 -69 -20 103 191 10 -206 103
7869 103 198 -109 80 150 82 -39 -198 108 288 42 -217 139 228 -57 -202 143 81 -226 -90 89 240 30
7891 30 37 140 152 -258 -165 153 89 -129 -198 9 132 -181 -230 49 61 -65 -49 61 149 -55 -237 215 198 -80
7915 -80 -26 -11 190 -20 -249 238 166 -58 -44 176 90 18 35 83 195 -74 -66 31 38 -180 -148 76 10 -104 -149 127
7941 127 61 -113 -103 72 51 -161 -104 65 76 -21 -103 326 125 -64 -195 47 118 -173 -110 321 193 -210 -30
7964 -30 307 151 -16 -77 207 13 -199 -77 147 -115 -112 -157 188 86 -106 50 -78 -72 -63 -111 108 70 -178 -81
7988 -81 184 16 -27 241 246 46 -176 -16 102 124 -93 -91 247 70 -283 174 84 87 -149 -49 110 -147 -185 154
8012A54j4j32J28R2j07k38K0J13K28l78l2K21R9n1l02K82j32j52J8K69j7j81J3
8035i9K08l6l05K01J2J35k04j92L64k20P2N5k3J8J84l90L11J36l11r0L20p7j37
8058f8R1J27j62j76J67J88j23j69l9J13J23k01rK81j38q4J0J98k06P1jK7L7j80
8082a23J44J85n9k45J59J23k01k08L69Mj12m0J91p1j64j7m1J42j01p9P8K27j27
8105C4k18J3L52j18p2k11L32j64j4J30R0j76j9J40l2r2r1k2K83k24m1Q2K05k79
8129a12nL44K0l04k59L51J33p2k23J66L6l2o2n3K09k03l7K19j02K4j00P3L8j48
8153i9K8J95j50q0o1J79K21k41k2J25j63M9l4K14j57k00K02m4K51l45L4K02Mk64
8177a56J89j3J28k05q9O7J90l38K22L5l2j06NJ03
$$ plain form
8012 154 140 8 136 228 121 -117 -97 16 244 -134 -166 55 154 103 -199 83 -49 -201 -183 86 69 -112 -99
8035 -99 109 73 -232 -31 -19 116 -88 -280 84 -136 -64 -9 -32 -14 170 -220 91 227 -84 -174 146 69 -68
8058 -68 23 150 -12 -188 -21 167 44 -125 -164 -51 72 -129 -138 143 5 -79 -69 129 -77 -6 -7 20 57 -123
8082 -123 21 206 147 -98 61 184 -17 -225 144 148 36 -4 187 116 -48 -65 -106 36 -65 -144 -66 161 34
8105 34 -184 -171 181 63 -9 -220 112 -52 -66 64 154 -22 -41 99 67 -25 -116 -138 145 -79 -120 -38 167 -112
8129 -112 -117 227 247 -57 -316 35 168 96 -127 39 75 43 -19 -72 137 -66 -103 116 14 38 -62 11 49 -99
8153 -99 -71 124 -26 -106 -167 12 233 -8 -30 95 -68 -19 -53 161 4 -196 6 -38 213 -132 -98 104 108 -156
8177 -156 33 20 148 -57 -146 -79 111 -227 -5 30 -2 -108 -103 0
8191@
$$ Imaginary data points
##PAGE= N=2
##DATA TABLE= (X++(I..I)), XYDATA
0@%%%%%%%%%%%jNj2J6j6J6k4L2l2M0m8N6o9P8q9J04j21J41j63J87k12K38k69L04
35A61l42L84m31M80n35N96o60P31q08Q93r87J087j197J319j453J603j767J947
53A021k149K377k635K928l269L667m137M708n415O318p510R164j1618J5617k3187
68a4120M2198j71916k87724N00240J43273l17219O7917K78218j58904j82556J67984
79F7391J03037j42722l9178M0100j3269k0863m5824k6944Q1307K1963q2265j5927
91g3194P9187K4263n4941j8916N2079M1624k6799q3770J5458J04528n3976r8874
103i3331J08272O0323j45078j8433J72755J6600j38434J9218R2299n5862m0807
114b2478N3404O848j4055k5864o4943K1117Q1883l1801o9508O1052N0846j03282
$$ plain form
0 0 0 0 0 0 0 0 0 0 0 0 0 -1 4 -8 8 -8 8 -16 16 -16 24 -24 32 -37 41 -48 56 -65 76 -87 100 -112 126 -143 161
35 161 -181 203 -228 252 -283 313 -347 384 -424 469 -518 569 -628 691 -762 841 -926 1021
53 1021 -1128 1249 -1386 1542 -1727 1940 -2197 2511 -2904 3414 -4096 5068 -6550 9067 -14120
68 -14120 28078 -143838 -431562 68678 211951 -105268 -37351 240867 81963 -100593 67391
79 67391 170428 27706 -11472 28628 15359 -5504 -51328 -78272 3035 24998 -57267 -73194
91 -73194 5993 30256 -24685 -43601 8478 50102 23303 -60467 -45009 59519 5543 -93331
103 -93331 14941 75264 -69814 -88247 84508 101108 -37326 -18108 74191 18329 -22478
114 -22478 30926 37774 23719 -2145 -67088 -45971 35912 4111 -65397 -4345 46501 -56781
126e6781k0565J38354k061j14030L5308Q5417l6648o2324L3190N3670l6168m1536
138b4174L7055J9567m8417l3752L6775L1259m5825j5375M3421j9620k0907N4776
150A4783J4794l7590J3617L3383k7968j6816N7080m806p8719J6083M2298m5562
162a9423j2982M9897n485m9453Q361M8591o001k3641K1330O039j6962j052l84
175a165K646o068j3138J5788N415k1482K996J7567p54r420J3563J8786k2895j2372
189a0533K4291o379j1814J4835k869j0992k494l51Q366O728n759j7218J231K6533
203A3575j2764k4486K9849J0183l3262K895L1143J779k4060K719K3947j3031j8345
216i858J1795K099o328p066q239R797M213r605j918P136J8616K864k0082O652
$$ plain form
126 -56781 -77346 61008 58947 -55083 -19775 65642 28994 -33330 -140 53530 17362 -24174
138 -24174 12881 32448 -15969 -49721 -12946 18313 -27512 -42887 534 -19086 -39993 14783
150 14783 29577 -8013 5604 38987 11019 -5797 51283 46477 -32242 -16159 26139 -19423
162 -19423 -32405 17492 12007 -37446 -29085 19506 13505 -10136 11194 17233 271 -781 -1165
175 -1165 1481 -4587 -17725 -1937 3478 -18004 -15008 2559 1805 -7615 5948 24734 1839 -10533
189 -10533 13758 7379 -4435 10400 7531 -3461 -5955 -6306 2060 8788 3029 -14189 -12958 13575
203 13575 811 -23675 6174 16357 -16905 -14010 17133 18912 -5148 -2429 21518 8487 -9858
216 -9858 1937 4036 -2292 -9358 -17597 -7800 -3587 -13192 -15110 -7974 10642 13506 -6576 76
230G6K0693o370j8811M299K6011j5348m2258K4270L5292l2713k3453L3505K2206
243B7399l4614k1521M1801J5012l9293o952K3996L631j9563j2401K1659J3070
255A2224k1270o562J5394J2627r091j7801J8083K1426k3605j9585J7061K0677
267A9578j2698k6363K0574K6396k7491j9404K4896J8429j8903k4504J8095J8773
279A7378k7526j5584K1944J5913j4994k4557J7974L1559j9182k2734K2603K4203
291B6997j8670l1911K1518L3734l0474k7540K9740K0719k7988k4806L3584L0325
303C5228l7506k3353L4999J4151k9337j7394K6571J8093l2393j5737K7142J0592
315A1056j6284j1017J7902J9584k4209j9314K6212J8070k0104k2641J7078K6629
$$ plain form
230 76 20769 14399 -4412 -113 25898 10550 -31708 -7438 27854 -4859 -28312 5193 27399
243 27399 -7215 -28736 13065 28077 -11216 -18168 5828 9459 -10104 -22505 -846 12224
255 12224 -9046 -15608 -214 12413 3322 -14479 3604 25030 1425 -18160 -1099 19578
267 19578 6880 -19483 1091 27487 -4 -19408 5488 23917 5014 -19490 -1395 17378
279 17378 -10148 -25732 -3788 12125 -2869 -27426 -9452 22107 2925 -19809 2794 26997
291 26997 8327 -23584 -2066 31668 1194 -26346 3394 24113 -3875 -28681 4903 35228
303 35228 -2278 -25631 9368 23519 -5818 -23212 3359 21452 -10941 -26678 464 11056
315 11056 -5228 -16245 1657 21241 -2968 -22282 3930 22000 1896 -20745 -3667 22962
327B2962k4811k3558K9521K1152k0765k0700J8177K5222k4313k2964K8073J4090
339B2086k9555k1486K3930K4954k9341k2250L4535J7044k8744j3045K7311K0553
351B5992k6350j7298K8001P089k5439n493K0767J0861k4293j3842K8358R240k3526
364e933o075J9993J1453k3345j5236K4833Q868k1340n347J4186Q190j7039j0379
377a7171K4014O777k2890m333J7680O335k1071p837K8005L592k5836K508K0392
390A0165K814j3621k042J7884j229j7881K038J0612o24j4464q407J8014K110k2736
404a7367L646K0761j545j6469J722K1037l727j9312Q929J2446p150j1432p96J4515
418E258j095j7450R120J6994q429j2911Q050J8129p721j6357J2805O978j4223
$$ plain form
327 22962 -1849 -25407 4114 25266 4501 -16199 1978 27200 2887 -20077 7996 22086
339 22086 -7469 -28955 -5025 19929 -9412 -31662 2873 19917 -8827 -21872 5439 25992
351 25992 -358 -17656 10345 17434 -8005 -13498 7269 18130 -6163 -20005 8353 17593 -5933
364 -5933 -12008 7985 19438 -3907 -19143 5690 14558 -6782 -12129 2057 10247 -6792 -17171
377 -17171 6843 13620 -9270 -13603 4077 10412 -10659 -18496 9509 13101 -12735 -10227 10165
390 10165 12979 -642 -2684 15200 13971 -3910 -1872 8740 8116 -6348 -14755 3259 5369 -17367
404 -17367 -13721 7040 5495 -10974 -9252 11785 8058 -11254 -2325 10121 2971 -8461 -9257 5258
418 5258 4163 -13287 -4167 12827 4398 -8513 -463 17666 9945 -6412 6393 13371 -852
431h52l080N457M583n162j3531N257J1818o383j0794L431J3415p076j5884J7831
445i70J2686j9713k398J6975M423q530l691J1328K478j1251j255O057L919r855
459B03j4577J3708J0936j9674l733J6958j94j1664J697J5729j263j5360K559R110
473D435Q61o577j0670J0095J0026j8304k182K3111J91k0440J744K3437j263k0850
487f386P741J0946j2145o854L315Q105P01j9242k930K0831K686j6933j005J9524
501H354k244k0809J3839K0262j6141j1977R356J0215J20j2731j604J2948k594
514F994j4872J353J8248n664k8970R998K7379j5891j6301J4129Q444o893n334
527g380R745J0209r093j2276L728J7420P84k5535K268K4475j4518j7351K1700
$$ plain form
431 -852 -3932 1525 6108 946 -12585 -7328 4490 -1893 -12687 -9256 4159 -2917 -18801 -970
445 -970 11716 -7997 -10395 6580 11003 2473 -1218 10110 12588 1337 82 6139 10058 203
459 203 -14374 -666 10270 -9404 -13137 3821 3627 -8037 -6340 9389 8126 -7234 -4675 4435
473 4435 5296 -1281 -11951 -1856 8170 -10134 -12316 10795 10986 -9454 -7710 15727 14464 -6386
487 -6386 1355 12301 156 -6698 -3383 4722 5423 -13819 -16749 4082 6768 -10165 -11170 8354
501 8354 6110 -14699 -860 19402 3261 -8716 640 10855 10975 -1756 -3360 9588 6994
514 6994 -7878 -6525 11723 6059 -22911 -12913 14466 -1425 -17726 -3597 4847 -2046 -7380
527 -7380 2365 12574 3481 -8795 -5067 12353 13137 -12398 -10130 14345 -173 -17524 4176
540D176J3145j8247j2484J6015J3515j1647q374M582M691j966j4198L953K0988
553A4149j5093k2998J9802J9437j5885j4725J7207J0914j8548k126J7089m73j0461
566a711q815M828J8948p228k1812J0442J7175j3171j3221K0402J3234k7554r307
579a7790K7194N279j4911m386N074Q372n400r619J1690J0031j6648j6946J7369
592f91J9209k3783j6786K3136L273j8683L991J4006Q20j2098l847J5654R869j0530
606C540j2418Q873J5978j4917j3160K3179L892k6228J063K1543J796j6365l284
619f508J2768K58q925j482N623N697j4060j3539K1957J0047k4316l696J9652J592
633E068j5127L693J8193o102j4236O554J0032K714q527j0410J3026Q501j7132
$$ plain form
540 4176 17321 -926 -13410 2605 16120 4473 -3901 681 5372 3406 -10792 -6839 14149
553 14149 -944 -23942 -4140 15297 -588 -15313 1894 12808 -5740 -7866 9223 8750 -1711
566 -1711 -10526 -5698 13250 6022 -15790 -5348 11827 -1344 -14565 5837 19071 -8483 -17790
579 -17790 9404 14683 -228 -4614 460 8832 3432 -6187 5503 15534 -1114 -18060 -691
592 -691 18518 -5265 -22051 1085 4358 -14325 -10334 3672 4492 -7606 -11453 4201 14070 3540
606 3540 -8878 -5 15973 1056 -12104 11075 14967 -11261 -10198 11345 13141 -3224 -6508
619 -6508 6260 6518 -2407 -3889 1734 7431 -6629 -20168 1789 11836 -12480 -16176 3476 5068
633 5068 -10059 -6366 11827 5725 -8511 -1957 8075 10789 2262 -8148 4878 13379 -3753
646c753k100J7360k262k0272J654K1988n720k0133O618R440m681l915o1Q272J937
661D372j3363R43J6933J653j6229k533J8435k384j7997R964J1758j2281p761P162
675a328Q985k071j1091K020R751n95r422j643J2971l049j8981R126J5808j2351
689a870j0011Q747P825m822o384Q018N749o921m517L376R592j953j5107N329J3636
704A0687j0059q350J0330O027r645p502J1092N519j0986k410M908K368k457p536
718h014N450Q986j0394n620J1480N848r267o806J1837N405j3210K2J0076k058
732C735o039j878O832N613j0014l744R870K793q380l876J0291K727j5583L02J3573
747F222m041r593R28Q122J532j0093Q35J1189j516q175k34R955K252j3380Q15
$$ plain form
646 -3753 -5853 11507 9245 -11027 -9373 12615 6895 -13238 -6620 2820 -1861 -5776 -5837 2435 4372
661 4372 -8991 -8048 8885 10538 -5691 -8224 10211 7827 -10170 -206 11552 -729 -8490 -1328
675 -1328 7657 5586 -5505 -3485 6266 5671 -3751 -5394 7577 4528 -14453 -5327 10481 -1870
689 -1870 -11881 -3134 4691 -131 -6515 1503 7252 331 -4186 -810 8782 6829 -8278 -2949 10687
704 10687 628 -7722 2608 8635 -1010 -8512 2580 8099 -2887 -5297 -389 1979 -478 -8014
718 -8014 -2564 6422 -3972 -9592 1888 7736 -1531 -8337 3500 8905 -4305 -4283 5793 3735
732 3735 -2304 -4182 2650 8263 -1751 -5495 4375 7168 -1212 -5088 5203 7930 -7653 -7351 6222
747 6222 2181 -7412 -6484 1638 3170 -6923 -6088 5101 3585 -4590 -4824 5131 7383 -5997 -5182
762e182J4624n065j0455M328R237j586j1454L358J1641n704r410K785P696n74
776D239j2151J467J3084o140j0653O161R780l297j1294N366J2306p567r134P476
790c57P149m214r974M426J2967p734r909Q331Q719n742j0473O614J1819j0299
804A323j0309R987O351q071q760O449J1032r799r620J0834P323p944p847P819
818a232J1026j0570r451J2488O778r667o620Q678R791j1069q684J2874N722j0348
832b84o601Q187Q820j1689r185J3045N537j1681n534R396P962j1161p858J3883
846B837M918j1799m330R479P136j0977p703J4299M800j2228l124J0617O754j1602
860i23o706J4327L610j3387k984R844M385j1657o766J3360L550j3391j705J0463
$$ plain form
762 -5182 9442 4377 -6078 -1750 7487 5901 -5553 -2195 9446 3742 -5668 -2883 4813 4239
776 4239 -7912 -6445 6639 499 -10154 -3993 5787 2490 -8804 -3438 8868 1301 -7833 -357
790 -357 6792 2578 -7396 -2970 9997 2263 -7646 685 9404 3662 -6811 -197 11622 1323
804 1323 -8986 1001 7352 -719 -9479 -3030 8002 -1797 -11417 -583 6740 -1204 -9051 -1232
818 -1232 9794 -776 -10227 2261 9039 -628 -7248 1430 11221 152 -8532 4342 10064 -284
832 -284 -6885 1302 10122 -1567 -10752 2293 7830 -3851 -9385 11 7973 -3188 -11046 2837
846 2837 7755 -4044 -8374 1105 8241 -2736 -10439 3860 8660 -3568 -6692 3925 10679 -923
860 -923 -7629 6698 10308 -3079 -6063 3781 8166 -3491 -10257 3103 6653 -6738 -8443 2020
874B020M139j0757m883J3864K783j3154l25J0526K301r933l923J2916K614j2845
888d657j31J0640J848j0062l767J2653J230j3748J100J0201p31r215k246J1037
902D152J024j2128J453R743n21r271j662J1801P15j3246K970J0911k661q244J311
917c653J0188m98j1052L317Q978k583p549o18R052k48j2292L056J0598n198q346
932f848L155R062k316j0466N001Q021n115n129J745O267p02r877L397R868m871
947A192p262M036P581k651q513O543P062p709l844M892L771k279p127K926P137
962E755n276n435M518N447m795p863P112O529r416l126P150R27l715k399M529
977e8M180n871k450N761L699l901o231O240O426j0013k136R590j061p303N0O560
$$ plain form
874 2020 6159 -4598 -9481 4383 7166 -5988 -6313 4213 6514 -3419 -7342 5574 8188 -4657
888 -4657 -4788 5852 7700 -2362 -6129 6524 7754 -5994 -4894 5307 4576 -4639 -6885 4152
902 4152 5176 -6952 -5499 4244 3723 -5548 -7210 4591 5306 -7940 -4970 5941 3280 -4964 -3653
917 -3653 6535 6037 -5015 -1698 7280 4697 -2852 -3470 5582 5334 -6958 -3902 6696 1498 -6848
932 -6848 -3693 5369 3053 -7413 -2412 5609 494 -4635 -2890 3377 2675 -7202 -3805 6063 1192
947 1192 -6070 -2034 5547 2896 -5617 926 7988 279 -3565 1327 5098 2819 -4308 -1382 5755
962 5755 479 -4956 -438 5009 214 -7649 -537 5992 -3424 -6550 600 1527 -2188 -4587 -58
977 -58 4122 -1749 -4199 1562 5261 1360 -4871 1369 7795 -2218 -4354 5236 4175 -3128 -3078 3482
993C482J445p078n44N036m11l215k789M259L925r537k773J1482l56q733R31P764
1009B888R8p360L589P435m759m241J889M308K539p813k904R035m82q693J786Q211
1025E526k698j0693M504J0317o961o453M407L185p46m434L52P605k232p630L179
1040b772R284j510j0862L064J1842p086p514Q178L436n943m512L873O744m164
1054B058o878K594N860j371q296K485J0461p986r846J0282O649p980n171O149
1068i90N938n314l706O356L073l631n750L023J0542o182j1368Q665P260q798m885
1083e767Q178M282j0019l693R991J996o454l763K302P258m060q509P852O531r393
1098c268n054J0111P020j0891n523J1421K183q251K27M257K553m845n577P726
$$ plain form
993 3482 4927 -2151 -2695 2341 1930 -1285 -4074 185 4110 -5427 -8200 3282 2926 -5807 -4876 2888
1009 2888 2986 -4374 -785 6650 1891 -2350 -461 3847 6386 -1427 -4331 4704 4222 -4471 -2685 5526
1025 5526 2828 -7865 -3361 6956 -5 -6458 -2051 1134 388 -4046 -3694 3911 1679 -5951 -2772
1040 -2772 6512 5002 -5860 -2796 9046 1960 -5554 2624 6060 117 -4395 -522 6222 2058
1054 2058 -4820 -2226 3634 2263 -6033 -3548 6913 -1073 -10919 -637 6012 -1968 -7139 -990
1068 -990 4948 -366 -4072 2284 5357 1726 -4024 -1001 9541 3359 -8009 656 7916 -882 -5767
1083 -5767 2411 6693 -3326 -7019 2972 4968 -1486 -5249 -2947 4311 251 -8258 -406 6125 -3268
1098 -3268 -8322 1789 8809 -2082 -7605 3816 5999 -2252 -2025 2232 4785 -60 -5637 2089
1112B089N943q218o232P327P145r277n944J1443J128j1712J063P907M01o467l317
1127f721O758L972n918k658N535M727p412n497J1661L834j2802k92R387j84o583
1142b193o35P010J42p164M72N564J920n975n769Q656L952j0858o05R043j354q083
1158e877J196Q809j028q304K337N466j69l427k247N806K063q427P15Q620j119
1173D414p822O39Q146j056q271L385N249m306l465J089L854L58p201N01P320j620
1189A214n523J102O803j365p892M790O540n484l697L450L223j127m746K154M955
1204D397l037l825K210M769j738p198L263O330o025l538M619J878l443l300M086
1219e52L628m484k330L416K556j693m233L182N148n737l128O254J799m310k340
$$ plain form
1112 2089 8032 -186 -6418 909 8054 -1223 -7167 4276 5404 -6308 -5245 2662 3063 -3404 -6721
1127 -6721 37 4009 -1909 -4567 968 5695 -1717 -7214 4447 8281 -4521 -4813 4574 4390 -2193
1142 -2193 -2828 4182 4324 -2840 -2368 3196 5116 -859 -6628 2028 5980 -4878 -5483 3560 2206 -5877
1158 -5877 -4681 4128 3100 -5204 -2867 2599 2430 -997 -3244 2562 4625 -3802 -3087 5533 4414
1173 4414 -3408 -2769 5377 4321 -3950 -565 4684 378 -3087 -1998 1856 2214 -4987 -4486 2834 1214
1189 1214 -4309 -3207 3596 2231 -5661 -871 5669 185 -3512 -62 3161 2034 -2712 -558 4397
1204 4397 1360 -2465 -255 4514 2776 -4422 -1159 5171 -854 -4392 227 2105 -1338 -4638 -552
1219 -552 3076 -1408 -3738 -322 2234 541 -3692 -510 4638 -1099 -4227 2027 3826 -484 -2824
1234b824M778K840n607r24M704j98l128k267L144L094o058k153N716Q10m668j266
1250d007M831K202o464J37O496j517m240J20L960J465n253m67N977n21m704M95
1266a490N007Q96o806K78O952k330n413J458L958o21n461M42O311k339n178K068
1282b268M398j80o212J077O913k748n654L211M600j415n103K023O568k953n332
1297c075L545L991j907n524J568O497l898n994L969M223k905m932K494O228m038
1312B42n513M770L694l294m194K491N759l939n303N081M172l723l926L436N927
1327E680m588n007N584L503m566l802L291M752m663n110N539L163m747l066L415
1342f22M502m708m689N983L027n254k588M078M189m650m236O587K884n351j907
$$ plain form
1234 -2824 1954 4794 -813 -1737 2967 2769 -359 -2626 518 3612 -2446 -4599 1117 1927 -2741 -4007
1250 -4007 824 3026 -3438 -3301 3195 1678 -2562 -2442 1518 2983 -2270 -2737 3240 2719 -1985 -1490
1266 -1490 3517 4413 -2393 -2115 4837 2507 -2906 -1448 2510 1889 -3572 -3130 3181 842 -4336 -2268
1282 -2268 2130 1950 -4262 -3185 3728 980 -4674 -1463 3137 1722 -3381 -1358 5210 2257 -3075
1297 -3075 470 4461 2554 -2970 -1402 5095 1197 -4797 -828 3395 490 -4442 -1948 4280 242
1312 242 -5271 -501 3193 -101 -4295 -1804 3955 16 -5287 -206 3966 243 -3683 -247 5680
1327 5680 1092 -3915 1669 5172 606 -3196 95 4847 184 -4926 613 3776 -971 -4037 -622
1342 -622 3880 -828 -5517 466 3493 -1761 -4349 -271 3918 -732 -4968 1619 4503 -848 -2755
1357b755M377L369m695m044O074K259o105j738M466K698n050l410O263K116n988
1372b163j329M629K075m849l204N804K082o315q39N056J787m475k341O397J915
1387D230n946j77M885R76m371k381N626J205o118k83M734K02m334j797N513P14
1403B678o171N35M837n82m107r71N071Q89n748J016N065p36l603j64N111N0n699
1420b529J551M866k029l421L08M297m57n314J458M510j964l500M04M017p70n445
1436d018J959M322k779l212J648L466r44m003K394M156k305k538J767L189r21
1451B181m332K129M208l453l084K592K619k102l503K572L225l718j876K439J775
1466A672j780l298K317L421l542k234L223K045k220k619L411K915m267j074L456
$$ plain form
1357 -2755 1622 4991 296 -3748 2326 4585 -1520 -3258 1208 3906 -1144 -4554 1709 3825 -2163
1372 -2163 -3492 1137 3212 -1637 -4841 963 3045 -3270 -4109 947 2734 -1741 -4082 2315 4230
1387 4230 -1716 -1893 2992 3968 -403 -2784 2842 4047 -2071 -2354 2380 2582 -1752 -3549 1964 2678
1403 2678 -3493 -2958 1879 1297 -2810 -3781 1290 2179 -3569 -2553 2512 1776 -1827 -1991 3120 3170 -2529
1420 -2529 -978 3888 1859 -1562 -1254 3043 2586 -2728 -1270 3240 1276 -2224 -1820 2197 1427 -4018
1436 -4018 -2059 2263 -516 -3728 -2080 1386 442 -3561 -1167 2989 684 -1854 -87 3102 2181
1451 2181 -2151 -22 4186 733 -2351 241 2860 758 -2745 -173 3052 -666 -2542 -103 1672
1466 1672 -108 -3406 -1089 2332 -1210 -3444 -221 1824 -396 -3015 396 3311 -956 -2030 1426
1481A426R12k221j762K522K378l693j710M237O11k940j879L136K182m898j030
1496b729M237m75l010o88K917J445l993m89M103J76k809m93L134J436m398n01
1512b137N056r29l684M50L170L79l874K51L965r57l180M61K800M29m512k18M696
1529B166j404m070J561L210o84l835J117M537k055l005J570K600m5l507M11M614
1545C181j597m098K231L531j324l938J585M098k775l255K513J855j652k805P27
1560a723L959k064l961K670L089j675l531K175M159l114l527L938K255k579k209
1575b138J928L316k279l069K997K489k386k516J695L696l392l876M024K061l782
1590a232j610K222K577l035k503L793J698k883j599K157K926k532l159M305K068
$$ plain form
1481 1426 2338 117 -1645 877 3255 -438 -2148 2089 2700 -240 -2119 1017 3199 -1699 -2729
1496 -2729 1508 1033 -1977 -2665 252 1697 -2296 -2785 1318 1494 -1315 -1808 1326 2762 -1636 -2137
1512 -2137 2919 1990 -1694 -1244 1926 2305 -1569 -1318 2647 1690 -1490 -1029 1771 2200 -2312 -2530 2166
1529 2166 762 -3308 -1747 1463 779 -3056 -1939 2598 543 -2462 -892 1708 1663 -1844 -1433 3181
1545 3181 1584 -2514 -283 3248 1924 -2014 -429 3669 894 -2361 152 2007 355 -2450 -1723
1560 -1723 2236 172 -3789 -1119 1970 295 -3236 -1061 3098 -16 -3543 395 2650 71 -2138
1575 -2138 -210 3106 827 -2242 755 3244 858 -1658 37 3733 341 -3535 489 2550 -1232
1590 -1232 -2842 -620 1957 -1078 -3581 212 1910 -973 -2572 -415 2511 -21 -3180 1125 3193
1605C193m145j036L159K041l246k169M062J163l549q72K358J528l040k618L971
1620H00J454m285q90L513J248l339j565M193Q30m065J30K806Q75k563j732L778
1636A188J451l989k02L357P91l243j186M317L58m386J47L296n71k684o52L316
1652A308L31m029L89L236q0k987n91L756K59m229Q86L535j029k581L10L247K43
1669A974l668J047L162r82k120k5K700N7m177J184L238j779k497Q99K414n99l247
1686b419J430K622j742k204J251K133l24l397J436L265j940j919J462K318q56
1701A116k923K073K753k524j652J502J626j014k563J354K668k560j755J803J605
1716A509j429k422J880K321k847j437K144J047j259j881J995K383k493j036K611
$$ plain form
1605 3193 -952 -1988 1171 3212 -34 -2203 1859 3022 -527 -1399 959 2487 -553 -3171 800
1620 800 2254 -2031 -2921 592 1840 -1499 -3064 1129 1959 -2106 -1976 830 1705 -858 -2590 1188
1636 1188 2639 -1350 -1552 1805 2596 -647 -1833 2484 2842 -1544 -1397 1899 1328 -1356 -2008 1308
1652 1308 1639 -2390 -2001 1235 1155 -1832 -2423 1333 1592 -2637 -1751 1784 755 -1826 -1516 1731 1974
1669 1974 -1694 -647 2515 1533 -587 -612 2088 2145 -2032 -848 2390 611 -1886 -987 1427 828 -2419
1686 -2419 -989 1633 -109 -2313 -1062 1071 747 -2650 -1214 2051 111 -1808 -346 1972 1116
1701 1116 -1807 266 3019 495 -1157 345 1971 957 -1606 -252 2416 -144 -1899 -96 1509
1716 1509 80 -2342 -462 1859 -988 -2425 -281 766 -493 -2374 -379 2004 -489 -1525 1086
1731A086R50j437j671K076J695k743j334K642M63j878j425K052J397k751q73K378
1747F27L39j969j012J912J549k951p59K830K12k081r0J971J185k897k7L089l76
1764A552k190J20J931P60k994j75K975o27k371K72J769J83k724j50L024j043k332
1781b020N85J877r2k324K00L248q88k414J267J917j12k308M19K958j220k368J325
1798E0J817n54k341L58K784j390k187J408J569r77k311P53K626j467k709J834
1814g37J537j161j684R76K449j260k357K358J801j539j396R53K484j818k288K370
1830F88J393j773j319J099K005j683k436K285J328j845j467J309J788k045j997
1845b670K541J326k066r42J699J659j791j773K761J182k423n68J799J222k034
$$ plain form
1731 1086 2036 599 -1072 1004 2699 -44 -1378 1264 1727 -151 -1576 476 1873 -878 -1751 627
1747 627 966 -1003 -2015 -103 1446 -1505 -2264 566 778 -1303 -1393 578 1763 -1134 -1161 1928 1552
1764 1552 -638 -518 1413 2173 -821 -996 1979 1352 -1019 -747 1022 1205 -1519 -1669 1355 312 -2020
1781 -2020 -1435 442 350 -1974 -1774 1474 586 -1828 -561 1356 1244 -1064 -645 2313 1093 -1275 50
1798 50 1867 1313 -1028 -670 2114 724 -1463 -55 1514 537 -1774 -1021 1605 138 -2571 -737
1814 -737 800 -361 -2045 -1069 1380 120 -2237 121 1922 383 -1013 -60 2424 606 -1682 688
1830 688 2081 308 -1011 88 2093 410 -2026 259 1587 -258 -1725 -416 1372 -673 -2670
1845 -2670 -129 1197 -869 -1811 -112 1547 -244 -2017 744 1926 -497 -1065 734 1956 -78
1860g8j368K628R64k486l41J337R43j745j538K435Q58k850m77J780Q73k019j254
1877b338K672Q26k577k0K000O35j761r82K738N87k754K69J968K56j905p89K537
1894A362N62k846J47K069j06j954n08K143J72k779K78K104m31j542l62K404J92
1911I05k716O39K454o01j624N3K089K79k767J114J916q16j502M03J777n5k568
1928a020N71K083j195j551M85J464k93k592R57K215j156j429O54J577n24k045
1944a799J184K056j444j067R94J313m75j740J155J780j411j157J075J120p36j984
1960a136J217J723k215p02J089O78q37j628J195J631j823q96J675N53p41j257
1976a474J304J533j771q35J871O23r69q03J029J593k116o79J737J41j247o96J173
$$ plain form
1860 -78 -1446 1182 2146 -340 -681 656 1599 -146 -1684 751 1609 -1241 -1718 62 935 -1084 -2338
1877 -2338 334 1160 -1417 -1437 563 1198 -563 -1545 1193 1780 -974 -705 1263 1519 -386 -1175 1362
1894 1362 1924 -922 -775 1294 1188 -766 -1274 869 1041 -1738 -1460 644 213 -1329 -1691 713 905
1911 905 -1811 -1172 1282 681 -943 -890 1199 1478 -1289 -175 1741 925 -577 -174 1603 1548 -1020
1928 -1020 -449 1634 439 -1112 -627 837 544 -2048 -1091 1124 -32 -1461 -807 770 246 -1799
1944 -1799 -615 1441 -3 -1070 -76 1237 762 -978 177 1957 546 -611 464 1584 848 -1136
1960 -1136 81 1804 -411 -1113 -24 654 -183 -1811 -616 1015 -808 -1704 -29 524 -217 -1474
1976 -1474 -170 1363 -408 -1243 628 1251 282 -521 508 2101 -15 -694 1043 1184 -63 -759 414
1993D14J042k229n59J717J68j142o98J115R99j870m97K149j45j439k02J384Q86
2010A093j698k66J974k81j065P8J191M95j712l60J838k09j614J7J245Jj815n9
2028a147K073q86j336L69J096J40j332j57K041r40j363J117R99J27j718J80K247
2045A510p79j496J123P28k73j325M59J702j243j477R46R35m22j318J08J634j010
2062a98j472J399Q29q03j146N58J654j027j079J302P92o26q71P63J623j019j637
2079i58J560R11j198q19P52R53j122j111J575L94j337m89M89J114j092j240J493
2096a25P69j489m42J169J053j479r45K066M88j457qR58O69p34j077J587N60j748
2114a85k68R67O92j174j184J723J44j863K72J223K7j058p53J396O28j460J26Q33
$$ plain form
1993 414 1456 -773 -1332 385 553 -589 -1287 -172 827 -1043 -1540 609 464 -975 -1177 207 1093
2010 1093 -605 -871 1103 822 -243 -165 1026 1521 -191 -551 1287 1078 -536 -519 726 727 -1088 -1147
2028 -1147 926 40 -1296 -927 169 309 -1023 -1180 861 -79 -1442 -325 674 801 -917 -737 1510
2045 1510 731 -765 358 1086 813 -512 -53 1649 406 -1071 -125 810 388 -930 -822 812 -198
2062 -198 -1670 -271 558 -245 -1391 -833 821 -206 -1285 17 809 183 -688 75 1698 679 -958
2079 -958 602 1513 315 -504 248 1201 79 -1032 543 937 -400 -889 -400 714 -378 -1618 -125
2096 -125 644 -845 -1287 -118 935 -544 -1489 577 1065 -392 -400 558 1227 493 -584 1003 1563 -185
2114 -185 -453 514 1206 32 -1152 571 715 -1148 -876 347 374 -684 -1437 -41 587 -873 -747 86
2132H6J89p06o32J908N13k272N15J673k13j130k75J456k02j554N35R96k33r10
2150b56q25J425L89j709k1J420l83j092N8J469k22j932J121J187m50n35l2J034
$$ plain form
2132 86 275 -431 -1063 845 1358 -914 -399 1274 1061 -69 -344 1112 910 -644 -109 887 654 -256
2150 -256 -1081 344 733 -976 -997 423 40 -1052 -994 475 253 -1679 -558 629 179 -356 -388 646
$$ [...]
8191A6
##END NTUPLES=NMR FID
##END=
