##TITLE=1H_TG-2342-1
 CDCl3
 8 sc, 
 17.1.2022
##JCAMPDX= 6.0         $$ Bruker NMR JCAMP-DX V2.0
##DATA TYPE= NMR SPECTRUM
##DATA CLASS= NTUPLES
##ORIGIN= UXNMR, Bruker Analytische Messtechnik GmbH
##OWNER= root
$$ XWIN-NMR		Version 3.5
$$ Mon Jan 17 10:44:39 2022 Russian Standard Time (UT+4h)  she@DPX200
##.OBSERVE FREQUENCY= 200.131346
##.OBSERVE NUCLEUS= ^1H
##.ACQUISITION MODE= SIMULTANEOUS
##.ACQUISITION SCHEME= undefined
##.AVERAGES= 8
##.DIGITISER RES= 18
##SPECTROMETER/DATA SYSTEM= spect
##.PULSE SEQUENCE= zg30
##.SOLVENT NAME= DMSO
##.SHIFT REFERENCE= (INTERNAL, DMSO, 0, 15.7072)
##AUDIT TRAIL= $$ (NUMBER, WHEN, WHO, WHERE, WHAT)
$$ ##TITLE= Audit trail, XWIN-NMR		Version 3.5
$$ ##JCAMPDX= 5.01
$$ ##ORIGIN= Bruker BioSpin GmbH
$$ ##OWNER= she
$$ F:/spectra/data/she/nmr/H-F/1/pdata/1/auditp.txt
$$ ##AUDIT TRAIL=  $$ (NUMBER, WHEN, WHO, WHERE, WHAT)
(   1,<2022-01-17 10:43:35.68 +0400>,<she>,<DPX200>,
      <created by zg, POWCHK disabled, PULCHK disabled
       configuration hash MD5:
       00 E9 B6 7A A2 85 ED C7 34 08 36 98 17 FE 4E 26
       data hash MD5: 16K
       31 BA 23 B4 44 8D 8C 52 07 65 78 B1 2D AC B5 9A>)
(   2,<2022-01-17 10:43:37.84 +0400>,<she>,<DPX200>,
      <Start of raw data processing
       efp BC_mod = 2 LB = 0.24 FT_mod = 6 PKNL = 1 PHC0 = -15867.19 PHC1 = 12.00078 SI = 16K 
       data hash MD5: 16K
       E8 C4 74 05 88 5D DE B4 7D 3F 3E 0E 91 39 63 C0>)
(   3,<2022-01-17 10:43:56.60 +0400>,<she>,<DPX200>,
      <pk PHC0 = -7.331585 PHC1 = 8.799999 
       data hash MD5: 16K
       BA 33 BE 07 42 3F A8 7A C6 36 93 F6 D2 EA F5 8F>)
(   4,<2022-01-17 10:43:59.65 +0400>,<she>,<DPX200>,
      <abs ABSG = 5 
       data hash MD5: 16K
       C5 58 83 F6 BC 13 3F A3 47 92 D7 16 4B 7A A4 79>)
$$ ##END=
$$ 
$$ hash MD5
$$ 23 18 9B BF 15 32 CE 92 70 29 AF C3 34 3B 12 79
##$RELAX= 
##$RELAX= 
##$RELAX= 
##$RELAX= 
##$RELAX= 
##$RELAX= 
$$ Bruker specific parameters
$$ --------------------------
##$DU= <F:/spectra>
##$EXPNO= 1
##$NAME= <H-F>
##$PROCNO= 1
##$TYPE= <nmr>
##$USER= <she>
##$AMP= (0..31)
100 100 100 100 100 100 100 100 100 100 100 100 100 100 100 100 100 100 
100 100 100 100 100 100 100 100 100 100 100 100 100 100 
##$AQSEQ= 0
##$AQ_mod= 1
##$AUNM= <au_zg>
##$AUTOPOS= <>
##$BF1= 200.13
##$BF2= 200.13
##$BF3= 200.13
##$BF4= 200.13
##$BF5= 200.13
##$BF6= 200.13
##$BF7= 200.13
##$BF8= 200.13
##$BYTORDA= 1
##$CFDGTYP= 0
##$CFRGTYP= 5
##$CHEMSTR= <none>
##$CNST= (0..31)
1 1 145 1 1 1 1 1 1 1 1 1 1 1 1 1 1 1 1 1 1 1 1 1 1 1 1 1 1 1 1 1 
##$CPDPRG= <>
##$CPDPRG1= <>
##$CPDPRG2= <>
##$CPDPRG3= <>
##$CPDPRG4= <mlev>
##$CPDPRG5= <mlev>
##$CPDPRG6= <mlev>
##$CPDPRG7= <mlev>
##$CPDPRG8= <mlev>
##$CPDPRGB= <>
##$CPDPRGT= <>
##$D= (0..31)
0 1.2 0 0 0 0 0 0 0 0.06 0 0.03 0 0 0 0 0.0002 0 0 0 0 0 0 0 0 0 0 0 0 
0 0 0 
##$DATE= 1642401815
##$DBL= (0..7)
120 120 120 120 120 120 120 120 
##$DBP= (0..7)
150 150 150 150 150 150 150 150 
##$DBP07= 0
##$DBPNAM0= <>
##$DBPNAM1= <>
##$DBPNAM2= <>
##$DBPNAM3= <>
##$DBPNAM4= <>
$$ [...]
##$SUBNAM2= <"">
##$SUBNAM3= <"">
##$SUBNAM4= <"">
##$SUBNAM5= <"">
##$SUBNAM6= <"">
##$SUBNAM7= <"">
##$SUBNAM8= <"">
##$SUBNAM9= <"">
##$SW= 18.0517287032376
##$SWIBOX= (0..15)
0 0 2 0 0 0 0 0 0 0 0 0 0 0 0 0 
##$SW_h= 3612.71676300578
##$TD= 16384
##$TD0= 1
##$TE= 0
##$TE2= 300
##$TE3= 300
##$TEG= 300
##$TL= (0..7)
0 120 120 120 120 120 120 120 
##$TP= (0..7)
150 150 150 150 150 150 150 150 
##$TP07= 0
##$TPNAME0= <>
##$TPNAME1= <>
##$TPNAME2= <>
##$TPNAME3= <>
##$TPNAME4= <>
##$TPNAME5= <>
##$TPNAME6= <>
##$TPNAME7= <>
##$TPOAL= (0..7)
0.5 0.5 0.5 0.5 0.5 0.5 0.5 0.5 
##$TPOFFS= (0..7)
0 0 0 0 0 0 0 0 
##$TUNHIN= 0
##$TUNHOUT= 0
##$TUNXOUT= 0
##$USERA1= <user>
##$USERA2= <user>
##$USERA3= <user>
##$USERA4= <user>
##$USERA5= <user>
##$V9= 5
##$VALIST= <valist>
##$VCLIST= <CCCCCCCCCCCCCCC>
##$VD= 0
##$VDLIST= <DDDDDDDDDDDDDDD>
##$VPLIST= <PPPPPPPPPPPPPPP>
##$VTLIST= <TTTTTTTTTTTTTTT>
##$WBST= 1024
##$WBSW= 4
##$XGAIN= (0..3)
0 0 0 0 
##$XL= 0
##$YL= 0
##$YMAX_a= 267362
##$YMIN_a= -237971
##$ZGOPTNS= <>
##$ZL1= 120
##$ZL2= 120
##$ZL3= 120
##$ZL4= 120
##$ABSF1= 15.71714
##$ABSF2= -2.334709
##$ABSG= 5
##$ABSL= 3
##$ALPHA= 0
##$AQORDER= 0
##$ASSFAC= 0
##$ASSFACI= 0
##$ASSFACX= 0
##$ASSWID= 0
##$AUNMP= <proc_1d>
##$AZFE= 0.1
##$AZFW= 0.1
##$BCFW= 0
##$BC_mod= 2
##$BYTORDP= 0
##$COROFFS= 0
##$CY= -3
##$DATMOD= 1
##$DC= 0
##$DFILT= <>
##$DTYPP= 0
##$F1P= 0
##$F2P= 0
##$FCOR= 1
##$FTSIZE= 16384
##$FT_mod= 6
##$GAMMA= 0
##$GB= 0
##$INTBC= 1
##$INTSCL= 0
##$ISEN= 128
##$LB= 0.24
##$LEV0= 0
##$LPBIN= 0
##$MAXI= 10000
##$MC2= 0
##$MEAN= 0
##$ME_mod= 0
##$MI= 1.114404
##$NCOEF= 0
##$NC_proc= -7
##$NLEV= 6
##$NOISF1= 3.799351
##$NOISF2= 2.8
##$NSP= 0
##$NTH_PI= 0
##$NZP= 0
##$OFFSET= 15.70722
##$PC= 1
##$PHC0= -15874.52
##$PHC1= 20.80078
##$PH_mod= 1
##$PKNL= yes
##$PPARMOD= 0
##$PSCAL= 0
##$PSIGN= 0
##$REVERSE= no
##$SF= 200.13000887214
##$SI= 16384
##$SIGF1= 3
##$SIGF2= 2
##$SINO= 5.538805
##$SIOLD= 16384
##$SREGLST= <1H.CDCl3>
##$SSB= 0
##$STSI= 16384
##$STSR= 0
##$SW_p= 3612.71676300578
##$SYMM= 0
##$S_DEV= 0
##$TDeff= 16384
##$TDoff= 0
##$TI= <>
##$TILT= no
##$TM1= 0
##$TM2= 0
##$TOPLEV= 0
##$USERP1= <user>
##$USERP2= <user>
##$USERP3= <user>
##$USERP4= <user>
##$USERP5= <user>
##$WDW= 1
##$XDIM= 16384
##$YMAX_p= 439046291
##$YMIN_p= -679873
$$ End of Bruker specific parameters
$$ ---------------------------------
##NTUPLES= NMR SPECTRUM
##VAR_NAME=  FREQUENCY,     SPECTRUM/REAL,   SPECTRUM/IMAG
##SYMBOL=    X,             R,               I
##VAR_TYPE=  INDEPENDENT,   DEPENDENT,       DEPENDENT
##VAR_FORM=  AFFN,          ASDF,            ASDF
##VAR_DIM=   16384,         16384,           16384
##UNITS=     HZ,            ARBITRARY UNITS, ARBITRARY UNITS
##FACTOR=    0.220516191357247, 1,           1
##FIRST=     3143.48609346966, 0,            0
##LAST=      -469.230669536118, 0,           0
##MIN=       -469.230669536118, -679873,     0
##MAX=       3143.48609346966, 439046291,    0
$$ Real data points
##PAGE= N=1
##DATA TABLE= (X++(R..R)), XYDATA
$$ [...]
6281a35640K06230P8395J78142j41232k3153Q6605j9538k15774p6804J25784P4087
6270A37102j64048q3712R2684K14063J7816j70078r652J41655n3256J33137o7372
6259A88339j72842o0353K36832j32331J74058o1394j53685O7124J71612R6303
6249C53663j49982j696K14565n8908n9389J5573r924j10769p1820K3320n3021
6238I1612O6478j65718O1023K46966J15977k26554q6444L1809M4115L2978J50688
6227C62930q6706m6690Q110j07033N1121j33860R5327J48563k55837l661Q5518
6216A17782r8786o4491J24880N9274Q2958R4330k54135O1807J81755q9694k38844
6205b3164M7570P8279n527J29483j10720N7289J09542J15088j87319O2386M5143
$$ y = [-135640, 70590, 148985, 327127, 185895, 162742, 249347, 229809, 14035, -62769, 63015, 137102, -26946, -110658, -17974, 196089, 213905, 43827, 34175, 175830, 122574, 255711, 188339, 15497, -44856, 191976, 59645, 233703, 172309, 18624, 85748, 257360, 353663, 203681, 201985, 416550, 357642, 298253, 313826, 303902, 193133, 121313, 144633, 91612, 158090, -7628, 53395, 300361, 416338, 189784, 103340, 135149, 179264, 212242, 362930, 276224, 229534, 237644, 130611, 181732, 47872, 143199, 291762, 35925, 32264, 117782, 18996, -45495, 79385, 138659, 221617, 315947, 61812, 123619, 305374, 215680, -23164, 24406, 102685, 97158, 226641, 115921, 173210, 282752, 397840, 210521, 272907, 318050]
6194C18050j29439j10610J00262k14871O4984N8269k4230K4724L7736R2466P7588
6183B94929R3197L4313j46272o2594p0801l0231P166J17210j87567N5726J35504
6172B40580j34284P7580R3470O603j62454R704j86831J48931Q977j43066o551
6161d7341O4303N6768n0430R0047R2718J42417j7220r5898m5910j89137O4242
6150F4559o8284j17075K4268K80332K9464L043L6466k38428P8470R2416O3164
6139B48395Q9717j26933J20035J21324r0423k70784J34955J35409j46595j84817
6129C0283j41637N0289J09944P2998J14807M7549j38428J47561M0524o3323p9918
6118A90649O7021m0932N2095J43175l3853j9525J279j63929J2868n406P2535L9252
$$ y = [318050, 188611, 78001, 178263, -36608, 28376, 86645, 62415, 87139, 124875, 217341, 294929, 388126, 422439, 276167, 213573, 142772, 112541, 119707, 236917, 49350, 105076, 240580, 106296, 183876, 277346, 283949, 121495, 131199, -55632, 93299, 102276, -40790, -47341, 16962, 73730, 23300, 113347, 206065, 348482, 331262, 235364, 189454, 317, 64559, -3725, -120800, -96532, 183800, 213264, 216307, 252773, 14345, 92815, 185231, 248395, 338112, 211179, 331214, 452538, 362115, 91331, 226286, 361695, 215100, 30283, -111354, -61065, 48879, 121877, 236684, 284233, 145805, 293366, 333890, 270567, 190649, 257670, 216738, 268833, 412008, 378155, 358630, 359909, 195980, 208848, 203442, 275977, 315229]
6106C15229J96483l17597j24320J3782M0297Q828j09558Q5559m4318M4913J69118
6095B78416J18359j20358j98381m6547K09556j8479k05587J67175K07994j29441
6085B62707J10987j53147j19604j87561R7211J48491M1037L3121J95143k7703
6075D00682o3220p8222J45004Q3656O6284j37254r9312J55527k4478j20028l5698
6064B92941J17421k0049p8906p6893M5831j7973N063K26543o5652p8012j13878
6053B36436j05132J36718m8035J69767K12978j7285j52253j56845j25488J04989
6043B55850J2598J79144J1768j72789J85243j47095M5859J41574l1419k68686
6033B12047o260O9956l3798Q1368J0088j3135M869k73463q705J74182N1864J48504
$$ y = [315229, 511712, 194115, 69795, 83577, 123874, 132702, 23144, 108703, 64385, 109298, 278416, 396775, 276417, 78036, 31489, 241045, 222566, 16979, 184154, 392148, 262707, 373694, 220547, 100943, -86618, 10593, 159084, 200121, 233242, 428385, 400682, 337462, 259240, 404244, 487900, 554184, 416930, 317618, 473145, 448667, 328639, 292941, 410362, 390313, 311407, 234514, 280345, 262372, 267435, 493978, 428326, 350314, 236436, 131304, 268022, 219987, 389754, 602732, 585447, 433194, 276349, 150861, 255850, 268448, 447592, 459360, 286571, 471814, 324719, 370578, 512152, 480733, 212047, 205787, 275743, 241945, 323313, 333401, 320266, 325135, 51672, 42967, 217149, 269013, 417517]
6021D17517r9568n0082R7953J8959j08460j16770l7455N3246O3337J45887J18557
6010E03121j08325K05827J42270j55017o8717m8332J72523k68840P2176J6854
6000D63540J51396N7998k40665J07519l7976k64300j34442O9441p7607J08388
5990B03292J27485K5036l5754N9781l5424j09438k7732J33316j7361J2689M4580
5979C80470K5341m5173J2842n9270n0092O3137j06876K28804N1580k77092N0627
5968B74298J89781Q8734m5867m7181j97849o2514O1089Q0309O1607k119l9945
5957C60343j03124P62O382J42202j35562N9237j13801L18274R9202K3950j44206
5946E13659j56719j2327R7082O7581r4894Q7625N1152o2159K7991j43811l5204
$$ y = [417517, 317949, 267867, 365820, 384779, 276319, 159549, 122094, 175340, 238677, 384564, 503121, 394796, 600623, 742893, 587876, 519159, 470827, 643350, 374510, 446686, 463540, 614936, 672934, 432269, 539788, 501812, 237512, 103070, 172511, 94904, 203292, 330777, 355813, 320059, 379840, 344416, 234978, 207246, 340562, 323201, 335890, 380470, 405811, 360638, 373480, 314210, 264118, 327255, 220379, 449183, 500763, 223671, 274298, 464079, 552813, 506946, 459765, 261916, 199402, 260491, 340800, 402407, 400288, 360343, 257219, 257981, 264363, 406565, 271003, 330240, 216439, 534713, 633915, 657865, 513659, 356940, 344613, 441695, 509276, 414382, 502007, 553159, 491000, 518991, 375180, 339976]
5935C39976r9616n5435J60519J39554n6335M0182K07514J66129r310j82273j06112
5924E44793j36011K53366j60292J41629J95753Q0624J12145j75250l07343O6433
5914F15847J54732j39728Q0971J1672k5392k7885j9654J78705j97248j75604Q4503
5903E40919P1098J5458N2090o2654q0045J9253l0728K00754Q4289K4640J9683
5892H54757J49418K1794J56784J94682J30897M3808J42163j04342k99682k08300
5882A081979k65452J53185J0560m8622k12504n3773O0572P6725q1269j9562n5271
5871F46568J8952J63295Q4695L6757M6093K30231J1419o2345k24136J43507L188
5860A098224J60066Q2646Q2467P2187K43517J38275o1189J29478k8548k78690
$$ y = [339976, 240360, 184925, 345444, 484998, 428663, 468845, 676359, 842488, 833178, 650905, 544793, 408782, 662148, 501856, 643485, 839238, 919862, 1032007, 856757, 549414, 615847, 770579, 630851, 711822, 723494, 698102, 670217, 650563, 829268, 632020, 456416, 540919, 612017, 627475, 679565, 616911, 536866, 556119, 525391, 726145, 810434, 835074, 854757, 1004175, 1025969, 1182753, 1377435, 1508332, 1552140, 1694303, 1589961, 1290279, 1081979, 816527, 969712, 980272, 931650, 719146, 665373, 725945, 802670, 721401, 701839, 646568, 665520, 828815, 913510, 950267, 996360, 1226591, 1238010, 1175665, 951529, 1095036, 1098224, 1258290, 1340936, 1423403, 1495590, 1739107, 1877382, 1816193, 1945671, 1917123, 1638433]
5850A638433l54910l8995j69697j04411q8911Q0467K1074j13367J8643Q0977j09308
5839H59995O5654m0154j14438p9253J70852p9107J40395L3401K96716L6035j42648
5828A147448Q5562J28787J04279P201K85960J03237j93021L3087j63721n7452
5818A481367j13920j56206J29960O38j60889O7792O9551j73j16296J503M5064
5807A248391r4744L7486M8506l0541J1259o2072L2347J58675j99237R7435j83806
5796A063699m1624M8992L3059j55062o0338J72932N4215N1425P5438j54392n5367
5785A032977N5347p8452p5583p4913M8780r4837J95433j7695p9434k7624L1423
5774I15422k30695J13264N2346M6195J13369j33826q1950k04309m299R6880L37099
$$ y = [1638433, 1283523, 1244528, 1074831, 970420, 881509, 961976, 983050, 869683, 888326, 969303, 859995, 925649, 885495, 771057, 691804, 862656, 783549, 923944, 957345, 1254061, 1290096, 1147448, 1233010, 1361797, 1466076, 1473277, 1759237, 1862474, 1669453, 1702540, 1538819, 1481367, 1367447, 1211241, 1341201, 1341839, 1180950, 1248742, 1318293, 1318120, 1201824, 1203327, 1248391, 1153647, 1191133, 1239639, 1209098, 1220357, 1158285, 1190632, 1349307, 1150070, 1247505, 1063699, 1022075, 1071067, 1104126, 949064, 888726, 1061658, 1115873, 1167298, 1242736, 1088344, 1032977, 1088324, 1009872, 934289, 859376, 908156, 813319, 1008752, 991057, 911623, 883999, 915422, 684727, 797991, 850337, 896532, 1009901, 876075, 794125, 589816, 585517, 682397, 1019496]
5763A019496j41535J62100j60070j44421p2017m4071J09142p3728o7793N0297
5753F37400K49050L8904N3061j16150k07079N5544N8493K0009K42034Q1940M5165
5742A158371L9577p1063o9777k49476R3029k011j9682j55944J23784p6201p2631
5731F97976M4672K5376J06056J16207N8999J10424k15982R8507L1971j45581m7760
5720H80865J35135M3019J15670J17888j21779n0260j05925J08241o6259J79959
5710A236554K17494l0126J15921m282q1040j76129j08428p5774j00393K86323
5700A280120q0157J30202P6101q8559j38694J54818J68570R7621j4994k04618
5690A380410K3405p8189J27397K2356l09268k43461N5769K4867p2836O7814Q8877
$$ y = [1019496, 877961, 1040061, 879991, 735570, 663553, 619482, 728624, 654896, 587103, 637400, 886450, 925354, 978415, 862265, 655186, 710730, 769223, 789232, 1031266, 1113206, 1158371, 1197948, 1126885, 1057108, 807632, 900661, 898650, 878968, 723024, 846808, 770607, 697976, 742648, 768024, 874080, 990287, 1049286, 1159710, 943728, 1042235, 1074206, 928625, 880865, 1016000, 1059019, 1174689, 1292577, 1170798, 1120538, 1014613, 1122854, 1056595, 1236554, 1454048, 1423922, 1539843, 1535561, 1454521, 1278392, 1169964, 1094190, 993797, 1280120, 1199963, 1330165, 1406266, 1317707, 1179013, 1333831, 1502401, 1600022, 1585028, 1380410, 1403815, 1325626, 1453023, 1475379, 1166111, 922650, 978419, 1003286, 930450, 998264, 1087141]
5679A087141K23279L47730n387l698j85368k6431j27773j26376J27438k15060
5669A095495J36421Q3717n3015l41493o646J70720R1136R8733Q5567J35256J26062
5658A621953k20784j44500k52583j00759k3048Q4316J4306L7823m9277r8405o3180
5647H05862q4915N8289J41755K4441p92N5013j54916j3276N2297J62534p0195
5636I76097J6993J08562k23107J50499p7368j04934p7629L2489J80173Q2375K5917
5625A090067r5537L3570j06735k24309j27818L12866j02310J6671Q0298q8283
5615G88480Q8274n5909r3135J20571o1049L6519r1396n8332K50738r2669r6068
5604G36024Q7311J16370j74901j17028O4165Q1113L00553j93013k48779O2862
$$ y = [1087141, 1310420, 1658150, 1652763, 1649065, 1463697, 1437266, 1309493, 1183117, 1310555, 1095495, 1231916, 1315633, 1262618, 921125, 914479, 1085199, 1176335, 1275068, 1360635, 1495891, 1621953, 1401169, 1256669, 1004086, 903327, 880279, 964595, 978901, 1016724, 967447, 869042, 805862, 720947, 779236, 920991, 945432, 944640, 999653, 844737, 831461, 883758, 1046292, 976097, 993090, 1101652, 878545, 1029044, 951676, 846742, 769113, 801602, 981775, 1064150, 1090067, 994530, 1028100, 921365, 697056, 569238, 882104, 779794, 796465, 876763, 788480, 876754, 820845, 727710, 848281, 787232, 823751, 732355, 674023, 924761, 832092, 736024, 823335, 939705, 764804, 647776, 711941, 793054, 1093607, 900594, 651815, 714677]
5594G14677K83517O3673j2518k8773J28068L0970m8835l5889K770Q0894n2665
5583A125889J29645K3411o7455K13830O3150r6995k10398n7700n4469M9024K74359
5572A392291o9148j4055j36000k1186l8342O1104J34083J06257j01924m572J31656
5561A440164P6642l0549q5611M6516L9975j31555L0442K1509K35077j44602p9595
5550A418413Q2135J5101J8425K59066P4705m877J06624q6338K06627m4852k50988
5539A794041k614k5J20665k1258k05907o584O5958j17297o4717K3460M6714j37821
5527A494615j6108R7598j30853J29625O1655L9863n0413K21901K10823N7916J51779
5516B268401N7208o4986J5718j20495k3774j92173J19740p4733k02848k4467R5182
$$ y = [714677, 998194, 1061867, 1049349, 1020576, 1148644, 1179614, 1130779, 1094890, 1097660, 1178554, 1125889, 1255534, 1278945, 1211490, 1425320, 1488470, 1391475, 1181077, 1123377, 1068908, 1117932, 1392291, 1323143, 1309088, 1173088, 1151902, 1113560, 1174664, 1308747, 1415004, 1313080, 1308508, 1440164, 1516806, 1486257, 1400646, 1447162, 1487137, 1355582, 1386024, 1407533, 1642610, 1498008, 1418413, 1500548, 1515649, 1534074, 1793140, 1867845, 1862968, 1969592, 1883254, 2089881, 2045029, 1794041, 1791427, 1791402, 1912067, 1890809, 1684902, 1678318, 1744276, 1626979, 1562262, 1585722, 1632436, 1494615, 1478507, 1576105, 1445252, 1574877, 1636532, 1676395, 1625982, 1847883, 2058706, 2116622, 2268401, 2325609, 2260623, 2276341, 2155846, 2132072, 1939899, 2059639, 1984906, 1782058, 1757591, 1852773]
5505A852773J44528p0043j69508m0455k3836M8752q7583m5394L9005m4211J6376
5494A620404l911j01588M4479q9836n2033J86172K3946R5953k9160o4142P6567
5483A706851l1399q6646L7466J90556p9167l14772p6707j5629P0043L6794j08482
5472A328908J16329Q2829j15649N1830n6770J9680k13738j35480k02968K5577
5462I00548J46573M6207j10249k1917J49998j66260O7105R4535j6347k03017O7207
5451I54383J62598o3109j1782R5020P7334j28874j51388J85337J83451P666J62791
5440A473427p2200k43302j67294j11146J76599j8563k6701L3161j19878j11726
5430H12377K65598N7191k29778O2873O3536j13016M0489j1235L3937O2613K5297
$$ y = [1852773, 1997301, 1927258, 1757750, 1717295, 1693459, 1742211, 1654628, 1609234, 1648239, 1604028, 1620404, 1616493, 1514905, 1559384, 1469548, 1417515, 1603687, 1627633, 1723586, 1694426, 1630284, 1706851, 1675452, 1588806, 1626272, 1816828, 1737661, 1422889, 1346182, 1330553, 1400596, 1437390, 1328908, 1445237, 1528066, 1412417, 1464247, 1407477, 1427157, 1213419, 1077939, 874971, 900548, 1047121, 1093328, 983079, 961162, 1111160, 944900, 1012005, 1106540, 1090193, 887176, 954383, 1116981, 1053872, 1042090, 1137110, 1214444, 1085570, 934182, 1119519, 1302970, 1310636, 1473427, 1401227, 1157925, 990631, 879485, 1056084, 1037521, 1010820, 1043981, 924103, 812377, 1077975, 1135166, 905388, 968261, 1031797, 918781, 959270, 948035, 981972, 1044585, 1069882]
5419A069882j23945r606R3603l6327j38301M9748K04017q4691J5308r2613j38561
5408H08514K37272o744j33968J14493K24749o7766j41081n5320p5030K05596J75059
5397A285774j44968j69269P0260j54O437r6879j2851K075K8898k33015J60338
5386H96646k4597J11278J9074J15536K01547k60825Q251R3652J51647k56878L085
5375A058416J97023O0164J15871k44297M6561J8422R5930j54624n8496m3319M4407
5364A136058J03068q7288k5109R5887k1504j84464M3626M1855N0023M5320J536
5353A199008l1976o5270J10923J58619J07150M3036j55571n8127l9809K43712
5343A511695J64677j88873m2688j43919K5023Q5000k260R6477N9656k73798r3685
$$ y = [1069882, 945937, 936331, 1029934, 993607, 855306, 905054, 1109071, 1024380, 1039688, 947075, 808514, 1045786, 1039042, 905074, 1019567, 1244316, 1176550, 1035469, 980149, 905119, 1110715, 1285774, 1140806, 971537, 1041797, 1041643, 1048080, 951201, 938350, 940425, 969323, 736308, 896646, 872049, 983327, 1002401, 1117937, 1319484, 1058659, 1066910, 1160562, 1312209, 1055331, 1058416, 1255439, 1315603, 1431474, 1187177, 1233738, 1252160, 1348090, 1193466, 1134970, 1091651, 1136058, 1239126, 1151838, 1126729, 1222616, 1201112, 1016648, 1060274, 1102129, 1152152, 1197472, 1199008, 1167032, 1101762, 1212685, 1371304, 1478454, 1521490, 1365919, 1307792, 1267983, 1511695, 1676372, 1487499, 1444811, 1300892, 1325915, 1410915, 1408655, 1505132, 1564788, 1290990, 1197305]
5332A197305J81552K0834p5754P0570J56721o1599J02165J5238k25017J90571
5322A572586k13567q2332j3529q654L48976j03219l5019J11581k3978k48047Q7490
5311A392288j9098N0290K655J7785m3707p8867L1797j02150L8672M4866k03082
5300A131449P1604R8070O0847J18K81851N0316R2960K5558p1963k1183k67554
5289A452073j03594J65509P9787k959J067o1290J9421l3878j14016k3413l2568
5278A346139J48350K01679j78256m1828q7120k2778q7572K15841l5946o1251O1628
5267A458886k8228j37210N8813J36744N2299J22047j66514l1694J6030K22596
5257A703769j0401q7079p5851k5520N431L0426R1075J0649J94047n0459j61170
$$ y = [1197305, 1378857, 1399691, 1323937, 1394507, 1551228, 1489629, 1591794, 1607032, 1382015, 1572586, 1359019, 1276687, 1263158, 1254504, 1603480, 1500261, 1465242, 1576823, 1552845, 1304798, 1392288, 1373190, 1423480, 1426135, 1443920, 1400213, 1321346, 1353143, 1250993, 1289665, 1334531, 1131449, 1203053, 1301123, 1361970, 1362088, 1643939, 1694255, 1787215, 1812773, 1740810, 1719627, 1452073, 1348479, 1513988, 1593775, 1590816, 1591883, 1530593, 1550014, 1516136, 1402120, 1378707, 1346139, 1494489, 1696168, 1517912, 1476084, 1388964, 1366186, 1278614, 1494455, 1458509, 1397258, 1458886, 1430658, 1293448, 1352261, 1489005, 1541304, 1663351, 1496837, 1465143, 1481173, 1703769, 1693368, 1606289, 1530438, 1504918, 1510349, 1540775, 1631850, 1642499, 1836546, 1786087, 1624917]
5246A624917r729N3682K01839q2776O0287l0329K63824K7343j1048K24935J32702
5235B455647J72968J96623J92401K83049J0419l67265j31717r8542k70891k60144
5225B182548K2964j33079j09183J3157k9268K62985j59816M3448J36717j340J6014
5214B245147J00842j13084J72966j3911R0918K26999j23122K51754M42403L93865
5204C674777J88646M02990N13351O70818L42584M54043k35753q64350q17444n68654
5194C761008l72592l40149o2732j9051k55214k99785N9271L5389l41871l408J06917
5183B267783L01043O3570j46292J15615n0995K5460L60900P4066K54863J57204
5173C423217K50016L78426J54453M29865O00508M56874L84632M6072q01227r84310
$$ y = [1624917, 1615188, 1668870, 1870709, 1787933, 1848220, 1817891, 2081715, 2109058, 2098010, 2322945, 2455647, 2628615, 2825238, 3017639, 3300688, 3311107, 2943842, 2812125, 2713583, 2442692, 2182548, 2205512, 2072433, 1963250, 1976407, 1947139, 2210124, 2050308, 2093756, 2230473, 2229133, 2245147, 2345989, 2232905, 2405871, 2391960, 2482878, 2709877, 2586755, 2838509, 3280912, 3674777, 3863423, 4266413, 4779764, 5450582, 5793166, 6247209, 6011456, 5147106, 4329662, 3761008, 3388416, 3048267, 2985535, 2966484, 2711270, 2411485, 2470756, 2506145, 2164274, 2160866, 2267783, 2568826, 2632396, 2486104, 2601719, 2550724, 2576184, 2937084, 3011150, 3266013, 3423217, 3673233, 4051659, 4206112, 4635977, 5236485, 5693359, 6077991, 6124063, 5322836, 4338526]
5163D338526o28096l76901m33677k07758j82061k46612Q1854r427j50150j55325
5153B030373Q9862o9317p0921J46469l1233j50855p3648q3948r831J38214J95471
5142B110636j71957K0389J30983L980J97591L58227J26340J97610j22668k33708
5132B617423k24852k86866J9477r1937j24167k35750j72051m3199k56418J18592
5122A320252L51537q1789j53049R6266k43206p7445Q3542L3462k8376k04968J4244
5111A110470O7472l5436j8932J21824n409n7845K11741j81400N3586k6286l5228
5100A204557J35471m5586m5453P7347P0920j66630j16650Q9919p1858l0135K00144
5089A302046K8242q5940j02882J10274q2422J12815j65047j59313r7976J55598
$$ y = [4338526, 3710430, 3333529, 2899852, 2692094, 2510033, 2263421, 2345275, 2335848, 2185698, 2030373, 2120235, 2050918, 1979997, 2126466, 2095233, 1944378, 1870730, 1786782, 1776951, 1915165, 2110636, 1938679, 1959068, 2090051, 2094031, 2291622, 2649849, 2776189, 2973799, 2851131, 2617423, 2392571, 2105705, 2125182, 2033245, 1909078, 1673328, 1501277, 1458078, 1201660, 1320252, 1671789, 1590000, 1436951, 1533217, 1290011, 1212566, 1296108, 1329570, 1301194, 1096226, 1110470, 1177942, 1142506, 1123574, 1245398, 1239989, 1182144, 1393885, 1212485, 1266071, 1239785, 1204557, 1340028, 1294442, 1248989, 1326336, 1397256, 1230626, 1113976, 1203895, 1132037, 1101902, 1302046, 1330288, 1244348, 1141466, 1251740, 1169318, 1282133, 1117086, 957773, 859797, 1015395]
5079A015395j30897P4630N6711k1806N1942j4349n1350K9607O8402j9074q7056
5068I72155P163p0979J10636J03152J848q8242M6370j63607l0828O6167J54384
5057A108219R1882q6169l5993Q4524P0443j60624j26359J9887N5266P2741N0138
5046A143955j1060j7838J64826l31949j66061J38006J91802j40742j2055J9328
5036I78212n3423J34601k09010q9237J13696o1949J05841K3358R7568r0660j74170
5025G74827J85136P7884P0014r4521m4617n6574N9954j22088R4352j49094k3031
5014G72242R7402J58882n3970p3586J42784J69542k3207P4648J46508j29177j23408
5003A158660j0404n3367j11082R7096r8870k05554J25827J05550j15669j69330
$$ y = [1015395, 884498, 959128, 1015839, 994033, 1045975, 1031626, 980276, 1009883, 1078285, 1059211, 972155, 979318, 908339, 1018975, 1122127, 1123975, 1035733, 1082103, 918496, 887668, 953835, 1108219, 1200101, 1113932, 1077939, 1162463, 1232906, 1072282, 945923, 965810, 1021076, 1093817, 1143955, 1132895, 1115057, 1279883, 947934, 781873, 919879, 1111681, 970939, 958884, 978212, 924789, 1059390, 850380, 761143, 874839, 812890, 918731, 942089, 1039657, 948997, 774827, 959963, 1037847, 1107861, 1013340, 968723, 912149, 972103, 850015, 944367, 795273, 772242, 869644, 1028526, 974556, 900970, 1043754, 1213296, 1190089, 1264737, 1411245, 1282068, 1158660, 1148256, 1094889, 983807, 1080903, 982033, 776479, 902306, 1007856, 892187, 722857]
4993G22857q8298L34739K93763l02865N4643K72162j69050j0158n5942l69755
4983F82096J26579L90713q1138r5629J83842l2904J5176Q447L511J2692j5742
4972A197643m7650Q1762r4793m3633l8695J44571J4785r7366l2033n4100o3306
4961I67185K4605J79580n3166L5135R0819p0857K03234p9390k74310Q0489K57297
4950A360621r4109j49350j41854p3324J45999J39948q9256k09914L8592K41823
4940A169176O8512J4376j54646l093L4564R3833J27142o521j18241j7220R1319
4929A299201K18j26584P8023J16659J01881N7860j21800O479j0027j12088p7490
4918A212332o1057q824J39272j5188l4211P1779P6318J95463o731M1043p2103
$$ y = [722857, 634559, 969298, 1263061, 960196, 1014839, 1287001, 1117951, 1107793, 1051851, 682096, 808675, 1199388, 1118250, 1022621, 1206463, 1173559, 1188735, 1197182, 1200693, 1213385, 1197643, 1149993, 1231755, 1136962, 1093329, 1054634, 1199205, 1213990, 1116624, 1084591, 1030491, 967185, 991790, 1171370, 1118204, 1153339, 1244158, 1173301, 1376535, 1297145, 1022835, 1103324, 1360621, 1266512, 1117162, 975308, 901984, 1047983, 1187931, 1098675, 888761, 927353, 1169176, 1237688, 1252064, 1097418, 1094325, 1128889, 1222722, 1349864, 1343343, 1225102, 1207882, 1299201, 1299419, 1172835, 1250858, 1367517, 1469398, 1527258, 1405458, 1411937, 1401910, 1289822, 1212332, 1151275, 1142451, 1281723, 1266535, 1232324, 1304103, 1380421, 1575884, 1569153, 1610196, 1538093]
4907A538093N637L8969j47063k6468j30298J67154j07685q7340J03743j411k922
4896A350409J67389j08552M1216n8344K04769Q556R1282J67351p4550K3057O5830
4885A878413L6056J0289J16831n9285o8252P2720O6948R1545P4406p2725n9807
4874B087139K23439K52112k6169k27031J449L4498r3550k45079K7748J99001L0332
4863B263889J13617n4779o5354k2787k51020J9976m3354P0428O0253K32000K7833
4852B350702N4522J25601L1882k57510J34469J56616j12249k38683j32775j22585
4842A989990J09221J4947n8201Q4685m6385J13395j52628J11038J19982n0117
4832B235927j10775r7039K7980l6517p9034R6440n180M5442K3511l22646k84572
$$ y = [1538093, 1543730, 1582699, 1435636, 1409168, 1278870, 1446024, 1338339, 1250999, 1354742, 1353331, 1350409, 1517798, 1409246, 1450462, 1392118, 1596887, 1605443, 1696725, 1864076, 1789526, 1812583, 1878413, 1914469, 1924758, 2041589, 1982304, 1914052, 1986772, 2053720, 2145265, 2219671, 2146946, 2087139, 2310578, 2562690, 2536521, 2309490, 2310939, 2345437, 2251887, 2006808, 2034556, 2233557, 2263889, 2377506, 2322727, 2257373, 2234586, 1983566, 2003542, 1960188, 2030616, 2090869, 2322869, 2350702, 2405224, 2530825, 2562707, 2305197, 2439666, 2596282, 2484033, 2245350, 2112575, 1989990, 2099211, 2114158, 2055957, 2140642, 2094257, 2207652, 2055024, 2166062, 2286044, 2235927, 2125152, 2028113, 2056093, 2019576, 1940542, 2036982, 2031802, 2077244, 2100755, 1778109, 1493537]
4821A493537L1423k695J35765L5673J01005R208l5534N2601R7170K8166K6858
4810A973177j52367J76101k25769r0271k54220J01779K22536J36580r9476n1481
4800A736589N4318o3662j9239L5423j21522l7097R5373O6143j33894K4126n3170
4789A583388j13794N8868n7506J40776M0076j52347M6288n4413l30903J04795
4779A265228J5417j1772J50186P5307l6351P7871j7969j39373j21265K84630l0512
4768A511397J29612k23305m411J94281M7650J5260p4603m2995P0243P2131j11204
4757A584056o1938N8896p5257M9711l3703r3563L0974o2311r0781N5042M6632
4746A407758o0007K26414J36911j4182n1191q4053M0244J11767J32067j34746
$$ y = [1493537, 1524960, 1522265, 1658030, 1693703, 1794708, 1803916, 1768382, 1820983, 1918153, 1946319, 1973177, 1820810, 1996911, 1771142, 1680871, 1426651, 1528430, 1750966, 1887546, 1788070, 1736589, 1790907, 1727245, 1708006, 1743429, 1621907, 1584810, 1680183, 1746326, 1612432, 1636558, 1583388, 1469594, 1528462, 1470956, 1611732, 1651808, 1499461, 1545749, 1491336, 1160433, 1265228, 1280645, 1268873, 1419059, 1494366, 1458015, 1535886, 1517917, 1378544, 1257279, 1541909, 1511397, 1641009, 1417704, 1413293, 1607574, 1655224, 1670484, 1595881, 1552886, 1623129, 1695260, 1584056, 1522118, 1581014, 1505757, 1555468, 1521765, 1428202, 1459176, 1396865, 1306084, 1361126, 1407758, 1347751, 1574165, 1711076, 1696894, 1645703, 1561650, 1601894, 1713661, 1845728, 1710982]
4736A710982j79390K9129J18590J38088j16396N2565N9212j37241N9817L7635
4726A772991q5726p3939k4034q030N7641L8884j10798j58030j6166K2540o271
4715A409062J49309Q0117M5170m1663j15279j7447l3495k5838n1134J02402P7263
4704A578467J33847m0691l1078m409r6187L28043J68093j8796m4888j12637k62582
4693A597182J16172L6210q7538p5781j13484J2671K99133l6111K1530k9405j745
4682A738834K4560o0235p0872j21042O5657R6514k0353O5952K5745N7308N435
4671A807503k02443l4064O5892J39338L0090j02718J68828j54221q7449K5386
4661A656142q2914O505Q6872P0458O3599J76658k9574J76128j3003q4334J74527
$$ y = [1710982, 1531592, 1560721, 1679311, 1817399, 1701003, 1753568, 1812780, 1675539, 1735356, 1772991, 1687265, 1613326, 1589292, 1581262, 1638903, 1677787, 1566989, 1408959, 1392793, 1415333, 1409062, 1558371, 1638488, 1683658, 1641995, 1526716, 1509269, 1475774, 1449936, 1398802, 1501204, 1578467, 1712314, 1671623, 1640545, 1636136, 1539949, 1867992, 2036085, 2017289, 1972401, 1859764, 1597182, 1713354, 1749564, 1662026, 1586245, 1472761, 1485432, 1784565, 1748454, 1769984, 1740579, 1738834, 1763394, 1703159, 1632287, 1511245, 1576902, 1673416, 1653063, 1719015, 1744760, 1802068, 1807503, 1605060, 1570996, 1636888, 1776226, 1806316, 1703598, 1872426, 1718205, 1630756, 1656142, 1573228, 1579733, 1666605, 1737063, 1800662, 1977320, 1947746, 2123874, 2110871, 2026537, 2201064]
4650B201064N8467Q5637l6130k2476k37233L1100J57124Q2812Q3650k69031j41812
4639A993172m3402K33857O299m6715K06270L4322j66471O4476k4801Q2182L7834
4628B377023R9850k46051M0082J4258j19846K6796J35813J01003o4227L7977j35985
4617B266693k21714K19794p8200k09931O624K0629R9747q4395j5508O6508K6936
4606B097183J7784O2753J48881o7131J2146j64734j09871O6097o513O6102j5180
4595B107517o299l4268p494n7915L8026j02214J68955m7837k104j89765J74514
4584B041116J51471J80225J31870K1802n9162j98757j3145K71005Q3325q0403
4574B529347Q2899k14196J16024J30140O3463j07350L09089j26285j2113l7042
$$ y = [2201064, 2259531, 2345168, 2309038, 2286562, 2049329, 2080429, 2237553, 2320365, 2404015, 2134984, 1993172, 1949770, 2183627, 2189926, 2143211, 2349481, 2383803, 2217332, 2281808, 2257007, 2339189, 2377023, 2476873, 2230822, 2270904, 2285162, 2165316, 2192112, 2327925, 2428928, 2364701, 2402678, 2266693, 2044979, 2264773, 2186573, 1976642, 1983266, 2003895, 2103642, 2019247, 2003739, 2070247, 2097183, 2114967, 2177720, 2326601, 2259470, 2271616, 2106882, 1997011, 2063108, 2056595, 2122697, 2107517, 2101218, 2066950, 2059456, 2001541, 2039567, 1937353, 2106308, 2058471, 2056367, 1866602, 2041116, 2192587, 2372812, 2504682, 2526484, 2467322, 2268565, 2255420, 2526425, 2609750, 2529347, 2612246, 2398050, 2514074, 2644214, 2707677, 2600327, 2909416, 2783131, 2771018, 2733976]
4564B733976J6924K09178K53271q4387k58143J52379K02698r2666k31757p185
4554B894288k0146k5893N9842K5044J15672m5394m0308O0330j9550j09334N2382
4543B946933j032P1064J46756M1188O0179j95203J60259J82545j5284j13755m0057
4532C243593K32400J16805J93711M3801P258q800k08778k0786K19072K48125m3152
4521D023249p0404K1984J700M8996K1492J45946O05j36299j8961r2051n5734p20
4509C889803P9007p4535j17621j81674O5914j24676O4605k8527k7015K596K41493
4498C789370J74468j44653J1303m437J38457K10625k31429j73162J17999J91921
4488D080462k9928J01269J7487o7880k39007J08336J27429L673k319L16839q7546
$$ y = [2733976, 2750900, 2960078, 3213349, 3128962, 2870819, 3023198, 3225896, 3133230, 2901473, 2894288, 2874142, 2848249, 2908091, 2933135, 3048807, 3003413, 2963105, 3023435, 3003885, 2894551, 2946933, 2945901, 3016965, 3163721, 3204909, 3265088, 3069885, 3230144, 3412689, 3397405, 3283650, 3243593, 3475993, 3592798, 3786509, 3830310, 3837568, 3828768, 3619990, 3599204, 3818276, 4066401, 4023249, 3952845, 3974829, 3976529, 4025525, 4047017, 4192963, 4193568, 4057269, 4038308, 3946257, 3890523, 3889803, 3968810, 3894275, 3776654, 3594980, 3660894, 3536218, 3600823, 3572296, 3545281, 3547877, 3789370, 3963838, 3819185, 3830488, 3826051, 3964508, 4175133, 3943704, 3770542, 3888541, 4080462, 4050534, 4151803, 4169290, 4101410, 3862403, 3970739, 4098168, 4101841, 4099522, 4416361, 4328815]
4477D328815j74439J37537J53007l36907L6759K22469R921J1202j83210k301n079
4466D197774q3512r8744K4089L8081J55147M1873j82021k16144M9645r495o4957
4455C851736K28060J04379q4889O7476j58411L07433l6031j26959N7953p5796
4445D134951K20427O2858j89562j42173L3925o11r4622N4191m489m1208k7032
4434D006655J74371j86461j07369R5180n6429N2803K6015j43307n3886J53365
4424C960937k7345j39714Q5677j62233J11962O5198K9022j71146m5304O7938J64377
4413C939369k6041r8520o2794o7381j95368K40200J694j07492J85399n0443q3113
4402C675510J85726k76573q7979K32208J08961K0617J79097J37803j79831p3218
$$ y = [4328815, 4154376, 4291913, 4444920, 4108013, 4144772, 4367241, 4377162, 4388364, 4205154, 4202853, 4197774, 4114262, 4015518, 4039607, 4077688, 4232835, 4274708, 4092687, 3876543, 3926188, 3916693, 3851736, 4079796, 4184175, 4099286, 4166762, 4008351, 4315784, 4279753, 4152794, 4210747, 4134951, 4355378, 4418236, 4228674, 4086501, 4120426, 4119815, 4025193, 4079384, 4074895, 4033687, 4006655, 4181026, 3994565, 3887196, 3982376, 3925947, 3978750, 4004765, 3861458, 3807572, 3960937, 3933592, 3793878, 3879555, 3717322, 3829284, 3894482, 3923504, 3752358, 3707054, 3774992, 3939369, 3913328, 3814808, 3752014, 3684633, 3489265, 3729465, 3731159, 3623667, 3809066, 3758623, 3675510, 3861236, 3584663, 3496684, 3728892, 3837853, 3858470, 4037567, 4175370, 3995539, 3922321]
4392C922321J9581K3227K34908j31247l9892l2966j82984J37442r4367R1744j38819
4381C808948J18844n1224o9317P3456J52437K7905n8268m9161J18509N576k4000
4370D053705j1126M3542K258l09546q1324j40214j76725Q3440L5050j14853j1962
4359C372245K93010n4644k96085j54545J12038n5812j5333j03128J3261l5194
4349C075813k0664J29727L2027J5900q8312j44304l0801l9295J67539L2103j48509
4338B981224p9531j70679O8744P6736k5819J50691k4081p9848n4650j11257r5058
4327B636472N6687J7120n3990m9095J41575J59427j94719j43130J21216K10482
4317B902045j86052j39160p8824K01322J31998p4569k25875K4991L8256j54368
$$ y = [3922321, 3941902, 3965129, 4200037, 4068790, 4028898, 3995932, 3812948, 3950390, 3856023, 3947767, 3808948, 3927792, 3876568, 3807251, 3880707, 4033144, 4061049, 4002781, 3953620, 4072129, 4077705, 4053705, 4042579, 4086121, 4088379, 3778833, 3697509, 3557295, 3380570, 3464010, 3499060, 3384207, 3372245, 3665255, 3610611, 3314526, 3159981, 3272019, 3216207, 3200874, 3097746, 3111007, 3075813, 3055149, 3184876, 3216903, 3232803, 3144491, 3000187, 2969386, 2930091, 3097630, 3129733, 2981224, 2901693, 2731014, 2799758, 2876494, 2850675, 3001366, 2977285, 2897437, 2842787, 2731530, 2636472, 2693159, 2710279, 2656289, 2607194, 2748769, 2908196, 2713477, 2570347, 2691563, 2902045, 2715993, 2576833, 2498009, 2699331, 2831329, 2756760, 2530885, 2555876, 2594132, 2439764]
4307B439764J49649q4818J19235J1569J11732J75317k74641k778L45722J08108
4297C098859N1099j00595p5562J95842r5082k13526q4163o4105O4774J03572m6347
4286B834766o7135n6169l9956n259j68635j32200j5303L2300J69439J3050Q9032
4275B653930j70947N5171L16124m4995l3878q6793j19443K32952O0374r5644N7708
4264B824559j6304m6602L459j41236J55038N6708L2480J96106N5510o596J12684
4253C225806Q8338J35988Q7849j38340J07601K13706p4846j53303L96636L13565
4243D203000J74292J10133O0987L8145K08007J42842J08178R8460M4574j49019
4233E039599j08216Q6513P3980j11855J89853L22600p9887l26717M468L746J76697
$$ y = [2439764, 2589413, 2504595, 2623830, 2635399, 2747131, 2922448, 2647807, 2645029, 2990751, 3098859, 3149958, 3049363, 2973801, 3169643, 3074561, 2861035, 2776872, 2712767, 2777541, 2881113, 2834766, 2767631, 2711462, 2671506, 2666247, 2497612, 2365412, 2350109, 2382409, 2551848, 2564898, 2653930, 2482983, 2538154, 2854278, 2809283, 2775405, 2688612, 2569169, 2802121, 2862495, 2766851, 2824559, 2808255, 2761653, 2765112, 2623876, 2778914, 2835622, 2868102, 3064208, 3119718, 3113122, 3225806, 3314144, 3450132, 3537981, 3399641, 3507242, 3720948, 3646102, 3492799, 3889435, 4203000, 4377292, 4487425, 4548412, 4586557, 4794564, 4937406, 5045584, 5144044, 5188618, 5039599, 4931383, 5017896, 5091876, 4980021, 5169874, 5492474, 5412587, 5085870, 5090338, 5094084, 5270781]
4222E270781J17080j55364J05014J77329J13923K87357P4679M0983K27179k9617
4212F229344J50130K15553k049J06259R4208J3188L01235L41640K50454j33427
4202G566535j04042M4835q1520M7578N5902m667P913l8013n794J70765J11547
4191G771039P5782N03870M54938N41072Q83010J270849J308305Q34142L37240
4182A3980247p62002j736876j430329j091789o56421n40201m25546l56535j10212
4173F870336L2827K6833j81643l5548M2607L5001j43269m71722l30140n414K49491
4162F089359j14836l34408j68870l07681J68677O8948k64076j80814k15192l3906
4152D707201m701k23932j1384J21211o065p5839n5811j06750l41594J69554Q7617
$$ y = [5270781, 5387861, 5232497, 5337511, 5514840, 5628763, 5916120, 5990799, 6031782, 6258961, 6229344, 6379474, 6595027, 6592978, 6699237, 6793445, 6806633, 7107868, 7449508, 7699962, 7566535, 7462493, 7507328, 7425808, 7473386, 7529288, 7524621, 7532534, 7494521, 7488727, 7659492, 7771039, 7846821, 8350691, 8805629, 9346701, 10229711, 11500560, 12808865, 13643007, 13980247, 13218245, 11481369, 10051040, 8959251, 8302830, 7762629, 7337083, 6980548, 6870336, 6903163, 6929996, 6748353, 6712805, 6755412, 6790413, 6647144, 6175422, 5845282, 5839868, 6089359, 5974523, 5640115, 5471245, 5163564, 5332241, 5401189, 5137113, 4956299, 4741107, 4707201, 4702500, 4478568, 4467184, 4588395, 4582330, 4506491, 4450680, 4343930, 4002336, 4171890, 4259507]
4141D259507j04071M1734r1536j63940J22224j7379N1587j101k04969j42604p3796
4130C675656m6483J68411j716j39428j81071P090R7076j05327N9881m0782O1482
4119C554789J25143j38601k99170Q1120O7141k22844r0047K20302J5752j15644
4109C197941l5298j11826p2954j86183N2396J58358O9790K51458O2175r5807k43677
4098C046373j82826J17754N9314j16030r5973j59292j70137J36941P4275J16662
4088B827061M1479O8590q990j67083k6320k18361O3557R8217N1395j97199j44857
4077B387489J42928K163K6983l8401l7773J14450N0703j24346j46998Q5370l3558
4066B429010j90009K44424j99512l9238m4624k3321N9893R4139j15734q8625K03664
$$ y = [4259507, 4155436, 4197170, 4105634, 3941694, 4063918, 4046539, 4098126, 4097025, 3892056, 3749452, 3675656, 3629173, 3797584, 3795868, 3656440, 3475369, 3482459, 3579535, 3474208, 3534089, 3493307, 3554789, 3679932, 3541331, 3242161, 3323281, 3390422, 3167578, 3077531, 3297833, 3313585, 3197941, 3162643, 3050817, 2977863, 2791680, 2844076, 3002434, 3072224, 3323682, 3385857, 3290050, 3046373, 2863547, 2981301, 3040615, 2924585, 2828612, 2669320, 2499183, 2636124, 2710399, 2827061, 2868540, 2937130, 2928140, 2761057, 2734737, 2516376, 2579933, 2678150, 2729545, 2532346, 2387489, 2530417, 2532580, 2559563, 2521162, 2483389, 2597839, 2648542, 2524196, 2377198, 2462568, 2429010, 2239001, 2483425, 2283913, 2244675, 2200051, 2176730, 2236623, 2330762, 2215028, 2126403, 2330067]
4055B330067p6204R74J0826P1310K7542J04898k0701J4914p0133p7533n3481j37280
4043B125199n148J76777J27038j17802R2549j225R5358J03880R2530l7240j51061
4032B500855q1647J17303j07872P2647j4393J15204J22109J30779j90321Q7141
4022B751805N9957R8066l9298q8508J46925M3885J93793j03511J39337P0871k00101
4011C073221o0117l1705J77097m8717j44717Q0023j5676q378J18674K03406K8554
4000C371665J66209l093m5667K7735Q2697r685Q4308k3316K00792N3441j4134
3989C890952J04700J10788J33705q0106k24893N8434O0506m6333j6284K82469
3979D273938j04375j72984J62845j03369o8267q417N9513J36186j39902J17463
$$ y = [2330067, 2253863, 2254837, 2265663, 2336973, 2364515, 2469413, 2448712, 2463626, 2393493, 2315960, 2262479, 2125199, 2120051, 2296828, 2423866, 2306064, 2398613, 2397388, 2492746, 2596626, 2689156, 2651916, 2500855, 2419208, 2536511, 2428639, 2501286, 2486893, 2602097, 2724206, 2854985, 2664664, 2751805, 2811762, 2909828, 2870530, 2782022, 2928947, 2972832, 3166625, 3063114, 3202451, 3273322, 3073221, 3013104, 2981399, 3158496, 3109779, 2965062, 3045085, 3029409, 3021031, 3139705, 3343111, 3371665, 3537874, 3534781, 3489114, 3516849, 3599546, 3589861, 3674169, 3650853, 3851645, 3905086, 3890952, 3995652, 4106440, 4240145, 4160039, 3935146, 3993580, 4054086, 4007753, 3991469, 4273938, 4169563, 3996579, 4159424, 4056055, 3987788, 3979371, 4038884, 4175070, 4035168, 4152631]
3969D152631J69975K5022j37334r3621M6122J06512N7422J99113L4518L4677l2943
3958D562094N0092k11726j51998R0631j23753J28655j4656M0893R4362k0082K48198
3947D692710O9183N0462r0653q7200J00801J02864o7991j32542j1222l8389Q2386
3936D670409P0763k0741P3574l1659R3145j02420O3689K05117m72k31449p4414
3925D715542J41015J39548k48868O6455L77300j18616j74470o1421K1466M8800
3915D906751J15162N9615J25184j95386L7388M9268Q8058l7475J38398k0207N741
3904E272497N1828j64099M5089n8899j64349J21629l6282Q2804j0591Q1793k18216
3893E003204n0712J82620K28396o9590K280o7504m4577O3581J20205Q5203O5582
$$ y = [4152631, 4322606, 4347628, 4210294, 4116673, 4162795, 4269307, 4326729, 4525842, 4560360, 4595037, 4562094, 4612186, 4400460, 4248462, 4339093, 4215340, 4343995, 4329339, 4370232, 4464594, 4444512, 4692710, 4761893, 4812355, 4721702, 4634502, 4735303, 4838167, 4770176, 4637634, 4626412, 4588023, 4670409, 4741172, 4720431, 4794005, 4762346, 4855491, 4753071, 4816760, 5021877, 5021405, 4789956, 4715542, 4856557, 4996105, 4747237, 4813692, 5190992, 5072376, 4897906, 4836485, 4857951, 4906751, 5021913, 5081528, 5206712, 5011326, 5048714, 5097982, 5186040, 5148565, 5286963, 5266756, 5272497, 5324325, 5160226, 5205315, 5146416, 4982067, 5103696, 5067414, 5150218, 5139627, 5221420, 5003204, 4952492, 5135112, 5363508, 5293918, 5296198, 5228694, 5184117, 5247698, 5367903, 5453106, 5518688]
3882E518688q0245l5157o198j00147R2878k9236L1545o7208J07148o0044Q0891
3871E452915l8697k017J9131j49743p9857j4053R0427M9279J93504R4848r6108
3860E519629N6397l2977o6583q4669m0801K45987Q7550k82927r301L16688o5503
3849E643490l4627J2978J12435K9402o8557p3152J30869M0180k46773L4970K43663
3838E824878K645k10553K92306L22297j55398j29966J11397J05065K8587J9560
3828F210818R9482p6493j15067j20332n220M5723J72488J64196o6151k473J54359
3817F461330J89717K7689L4936L1467K26650K0692j66692Q6865P9019o4414N8957
3806F986216J10613R434l9385j39102J50874k1869N3429J40095j3667l5537J92329
$$ y = [5518688, 5438443, 5403286, 5397088, 5296941, 5389819, 5360583, 5392128, 5324920, 5432068, 5372024, 5452915, 5414218, 5412201, 5431332, 5281589, 5201732, 5187679, 5278106, 5327385, 5520889, 5615737, 5519629, 5576026, 5543049, 5476466, 5391797, 5350996, 5596983, 5684533, 5401606, 5392305, 5708993, 5643490, 5608863, 5621841, 5734276, 5763678, 5695121, 5621969, 5752838, 5793018, 5546245, 5581215, 5824878, 5827523, 5616970, 5909276, 6231573, 6076175, 5946209, 6057606, 6162671, 6191258, 6210818, 6310300, 6233807, 6118740, 5998408, 5993188, 6038911, 6211399, 6375595, 6309444, 6306971, 6461330, 6651047, 6678736, 6713672, 6745139, 6971789, 6992481, 6825789, 6912654, 6991673, 6927259, 6986216, 7096829, 7106263, 7066878, 6927776, 7078650, 7056781, 7110210, 7250305, 7236638, 7201101, 7393430]
3795G393430j12419P513K41332L9819o0359o7579P3929K61977K58182J80714r6258
3784H120281J04774J43592J7696O802N9420R3449j8044P6712J16981M11344N0836
3773I183843j3097j048O8146Q9670Q6996j22479J84111M23325J35750J34601l7733
3762A0132085L41429n8875j45245j7676j5403J13452K7606k16376p4137M0587
3752A0127447P1680J75705J37940k6273k9451j4648j9705K95232j77841n6448
3742A0483638J08611Q6287J96390j3082k8881J38241K35311l5296K10215K720
3732A1384154m0837J14265O5103L64K9708K18270j44607n411K17752J03435O5599
3721A2007795Q399K35984O9979r9329K0370J89236J10247Q0872J85425J10102
$$ y = [7393430, 7281011, 7288524, 7529856, 7569675, 7509316, 7441737, 7515666, 7777643, 8035825, 8216539, 8120281, 8225055, 8368647, 8386343, 8393145, 8452565, 8546014, 8527970, 8604682, 8721663, 9133007, 9183843, 9170746, 9169698, 9237844, 9327514, 9414510, 9292031, 9476142, 9899467, 10035217, 10169818, 10132085, 10473514, 10414639, 10269394, 10251718, 10236315, 10349767, 10377373, 10160997, 10086860, 10127447, 10199127, 10374832, 10512772, 10486499, 10457048, 10442400, 10422695, 10717927, 10540086, 10483638, 10592249, 10678536, 10874926, 10861844, 10832963, 10971204, 11206515, 11171219, 11381434, 11384154, 11343317, 11457582, 11522685, 11523049, 11552757, 11771027, 11626420, 11621009, 11838761, 11942196, 12007795, 12016194, 12252178, 12322157, 12222828, 12243198, 12432434, 12542681, 12623553, 12808978, 12919080]
3711A2919080J08389J40369K14316J10527r052J06696J49153J31523O1735r2958
3701A3839778J41329J49450K86549j17796O7283K00987K84460J22896r1787L3343
3691A4916492J27338l5923J97494j7137Q6888J15983J42545N5120r1626L5029
3681A5532203N2060J01615q0099J70922j08098J34152M5881N4004M473o6517M9516
3670A5890112J08056M7318K8816j53932J03194o0261j77584K71420J66275M4935
3660A6268349l8745R0481J8245K04724q1905j8435R1360L02407k3227L525K5486
3649A6842265q9835K82909J42928Q0593K85975K4753l4622J7149k57208k4820
3639A7270087J44422J30453M1721L2557J73209j8970j08456K38519l6869p2522
$$ y = [12919080, 13027469, 13167838, 13382154, 13492681, 13483629, 13590325, 13739478, 13871001, 13932736, 13839778, 13981107, 14130557, 14417106, 14299310, 14366593, 14567580, 14852040, 14974936, 14883149, 14916492, 15043830, 15007907, 15205401, 15188264, 15275152, 15391135, 15533680, 15588800, 15497174, 15532203, 15584263, 15685878, 15605779, 15776701, 15668603, 15802755, 15848636, 15902640, 15907113, 15840596, 15890112, 15998168, 16045486, 16074302, 15920370, 16023564, 15963303, 15785719, 16057139, 16223414, 16268349, 16229604, 16320085, 16338330, 16543054, 16461149, 16442714, 16534074, 16836481, 16813254, 16816779, 16842265, 16752430, 17035339, 17178267, 17258860, 17544835, 17569588, 17534966, 17552115, 17294907, 17270087, 17414509, 17544962, 17586683, 17619240, 17792449, 17773479, 17665023, 17903542, 17866673, 17794151]
3629A7794151j34751k28559J19207K59188j00478M8758j43074N1984J2738J02219
3619A7781383j55391R5708J88769n7843j72134q9938J49631j1008p0566P8069
3609A7736680K2834r2067J49273J52480J10711Q870j10123k56866K96720J78815
3599A8197327N3410p7640N8441J64558j59633J20419J97128k0485K1891P3947
3589A8629363J04389p961j54823J35151J42565J50908L7000j08055n906J64538
3579A9087169O1462J35471R6648Q6924J14174O4009J71667j0522J72100J39500
3569B0118602J90019M4740K73919J33778o7148L76429N05125q3442K3539K04194
3559B1719755K63496L03269n7923q6005K52500J46230Q0229K52079N00395K79098
$$ y = [17794151, 17659400, 17430841, 17550048, 17809236, 17708758, 17757516, 17614442, 17666426, 17679164, 17781383, 17625992, 17721700, 17910469, 17852626, 17680492, 17590554, 17740185, 17729177, 17658611, 17736680, 17759514, 17667447, 17816720, 17969200, 18079911, 18088781, 17978658, 17721792, 18018512, 18197327, 18250737, 18173097, 18231538, 18396096, 18236463, 18356882, 18554010, 18533525, 18555416, 18629363, 18733752, 18725791, 18570968, 18706119, 18848684, 18999592, 19036592, 18928537, 18922631, 19087169, 19148631, 19284102, 19380750, 19467674, 19581848, 19645857, 19817524, 19807002, 19979102, 20118602, 20308621, 20353361, 20627280, 20761058, 20693910, 21070339, 21575464, 21492022, 21515561, 21719755, 21983251, 22286520, 22228597, 22142592, 22395092, 22541322, 22621551, 22873630, 23374025, 23653123]
3549B3653123J97440N66658O16942O39289O11413J088394R13698J410195J741798
3540C1438950J964764K553415L007727L481942K989918J285755k164966m694199
3532C9863306m035750k827048j941586j269714j166399r07970p55316n71664m03756
3523B5984103j44420l15012m29078j23639l5729j40404o3016m3095M5531j20273
3513B4614968m010J14133j51829j03053j65918J15157K9519O2971K9044M4308
3503B4585290j01695j31714J63011M8103m3265j38260J08409J51520K3875j64072
3493B4501202K0861O5607K73440L37475k04535J1151J87892P9722K08319K57868
3483B5739002K17230M7268J05440K28284K23904J41920N9841J06510J19686J77904
$$ y = [23653123, 23850563, 24417221, 25034163, 25673452, 26284865, 27373259, 28286957, 29697152, 31438950, 33403714, 35957129, 38964856, 42446798, 45436716, 46722471, 44557505, 39863306, 35827556, 33000508, 31058922, 29789208, 28622809, 27714839, 26959523, 26387859, 25984103, 25839683, 25524671, 25095593, 24971954, 24936225, 24795821, 24732805, 24689710, 24735241, 24614968, 24610958, 24725091, 24573262, 24470209, 24304291, 24419448, 24448967, 24511938, 24540982, 24585290, 24483595, 24351881, 24514892, 24562995, 24519730, 24381470, 24489879, 24641399, 24665274, 24501202, 24522063, 24587670, 24861110, 25198585, 24994050, 25005201, 25193093, 25272815, 25481134, 25739002, 25956232, 26003500, 26108940, 26337224, 26561128, 26703048, 26762889, 26869399, 26989085, 27166989]
3473B7166989K58270J70264K00182M57347J53119L9338O7722n6412n2131p6720
3463B8327968l8972l2439J47702J46563K10541L69313K36026L23672L35866K55160
3453C0281400K95191P87812L63129M34606N70499J048622O50784N10130O25178
3444C5567351M79435J15358M9921k10777k80944M06407J66673J49387p9565M55406
3434C6818652M52786L82294R52176Q59139Q04979J128407J421358J745755K211250
3425D6776796K646638K463646J985425Q34647j166959k203261j463305l24609
3417D9549018K48711P17481J394322J622992J589583O00943j524478k539045k012565
3408D9646962j258688n93424n70257l86091l27985k53406l10330k51505k4007
$$ y = [27166989, 27425259, 27595523, 27795705, 28253052, 28406171, 28445509, 28513231, 28456819, 28404688, 28327968, 28288996, 28256557, 28404259, 28550822, 28761363, 29130676, 29366702, 29690374, 30026240, 30281400, 30576591, 31364403, 31727532, 32162138, 32732637, 33781259, 34432043, 34942173, 35567351, 36046786, 36162144, 36212065, 36001288, 35720344, 36126751, 36293424, 36442811, 36363246, 36818652, 37271438, 37653732, 38605908, 39465047, 40270026, 41398433, 42819791, 44565546, 46776796, 49423434, 51887080, 53872505, 54707152, 53540193, 51336932, 49873627, 49549018, 49797729, 50515210, 51909532, 53532524, 55122107, 55723050, 54198572, 51659527, 49646962, 48388274, 47794850, 47224593, 46838502, 46510517, 46257111, 45946781, 45695276, 45671269]
3399D5671269j2018o3680l6660q6016J32102J02416J58729J54371J65386J87744
3389D6373643N35747M47068J61925L68891M73926M80646L39952O49118O54479
3380E0485395L96549L08765O94036R53362O79027P51756P13472O77158O83233
3371E6342753N06365M28369L31558N40126P70220R59509P74802Q61737R81501
3362F2496940O64857R63569Q08567O74050R78820J261582Q89017R37518J221240
3353G0896160J129944J241952J184931R17992R02404R99372O87046R04543J277417
3344H0141761J538116J059118J390100J395628J467066J536349J417785J653718
3336I1599641J162253J590440J972873K207944K352002K351281K068757J371449
$$ y = [45671269, 45659251, 45595571, 45558911, 45472895, 45604997, 45707413, 45866142, 46020513, 46185899, 46373643, 46909390, 47356458, 47518383, 47887274, 48361200, 48841846, 49181798, 49830916, 50485395, 50881944, 51190709, 51884745, 52838107, 53517134, 54268890, 54982362, 55659520, 56342753, 56849118, 57277487, 57609045, 58149171, 58919391, 59878900, 60653702, 61515439, 62496940, 63161797, 64125366, 64933933, 65607983, 66586803, 67848385, 68737402, 69674920, 70896160, 72026104, 73268056, 74452987, 75370979, 76273383, 77272755, 77959801, 78864344, 80141761, 81679877, 82738995, 84129095, 85524723, 86991789, 88528138, 89945923, 91599641, 92761894, 94352334, 96325207, 98533151, 100885153, 103236434, 105305191, 106676640]
3328A06676640J461519J423836J509922J593767J800302J995103J866679K163962
3320A20491730K002921K115068K155109K284569J940250K115124K109767K076411
3312A37290949K675482K924841L551717L415777L934202M713309N187477N677884
3304A69371638O198995O558445N398744L179094K662055L597508M230100L446711
3296B04643290K691113L164068M091529N408575N789642O630420Q069764R191755
3288B49680156J0196822J0787584J1608556J1956167J2228587J2543644J2551047
3281C31552563J2448971J2099833J1053424R858969Q224064P385203P008390O530086
3273D06161503O370700O682997P024372O499979M774609J532131k736631q926248
$$ y = [106676640, 108138159, 109561995, 111071917, 112665684, 114465986, 116461089, 118327768, 120491730, 122494651, 124609719, 126764828, 129049397, 130989647, 133104771, 135214538, 137290949, 139966431, 142891272, 146442989, 149858766, 153792968, 158506277, 163693754, 169371638, 175570633, 182129078, 187527822, 190706916, 193368971, 196966479, 201196579, 204643290, 207334403, 210498471, 214590000, 219998575, 225788217, 232418637, 240488401, 249680156, 259876978, 270664562, 282273118, 294229285, 306457872, 319001516, 331552563, 344001534, 356101367, 367154791, 377013760, 385237824, 392623027, 399631417, 406161503, 412532203, 419215200, 426239572, 432739551, 437514160, 439046291, 436309660, 427383412]
3265D27383412j5907176k1757730k4813195k4459789k2296979j9888386j7650365
3258B80609792j5368772j3606504j2296731j1116428j0290318r321584q606623
3251B00002832p772187p389235o477502n699554n361582m547657m343459m121577
3243A54290079l339228l261044l370608l324243l202474k668791k733429k597540
3235A29792722k605104k577902k693611k788393k867889k457463k372894k414983
3227A09014483k362342k406576k096469k100565k183850j944673j841954j798421
3219I2279633j903341j645837j450141j508208j436340j373924j264115j086487
3211H0611240j146407j095958j121445j070912j187821j203022j030733q00382
$$ y = [427383412, 411476236, 389718506, 364905311, 340445522, 318148543, 298260157, 280609792, 265241020, 251634516, 239337785, 228221357, 217931039, 208609455, 200002832, 192230645, 184841410, 178363908, 172664354, 167302772, 162755115, 158411656, 154290079, 150950851, 147689807, 144319199, 140994956, 137792482, 135123691, 132390262, 129792722, 127187618, 124609716, 121916105, 119127712, 116259823, 113802360, 111429466, 109014483, 106652141, 104245565, 102149096, 100048531, 97864681, 95920008, 94078054, 92279633, 90376292, 88730455, 87280314, 85772106, 84335766, 82961842, 81697727, 80611240, 79464833, 78368875, 77247430, 76176518, 74988697, 73785675, 72754942, 71954560]
3203G1954560j005208j097567q76467p09722p71577q83333j033934q03754o45299
3194F4127699r49618n97190p19106o95301o08827o77665r95448o32812o35843
3185E7615889o64369n56781o10624p06716n56087p29110m14979m81038m88077
3176E2408108n83740m39045l17267k51438l33649n69487n08177m04936l40278
3167D8660091l65487l78689m60725m84322o86787m51680k16359n34912k38688
3158D4842442l54519m95779l47794j47282n20293k48025k54910l84533l25125
3149D1764182l07464l24637l69557o7768j25643l15660m01042j64455n36583j67527
3139C8983846M472n8124j74132k47691j82956j45798k31513j57642m39493j63708
$$ y = [71954560, 70949352, 69851785, 68975318, 68265596, 67494019, 66610686, 65576752, 64772998, 64127699, 63178081, 62580891, 61861785, 61166484, 60557657, 59879992, 58884544, 58251732, 57615889, 56951520, 56394739, 55784115, 55077399, 54521312, 53792202, 53377223, 52896185, 52408108, 51824368, 51385323, 51068056, 50816618, 50482969, 49913482, 49405305, 49000369, 48660091, 48294604, 47915915, 47455190, 46970868, 46284081, 45832401, 45616042, 45081130, 44842442, 44487923, 43992144, 43644350, 43497068, 42976775, 42728750, 42473840, 42089307, 41764182, 41456718, 41132081, 40762524, 40694756, 40569113, 40253453, 39852411, 39687956, 39151373, 38983846, 38988318, 38930194, 38756062, 38508371, 38325415, 38179617, 37948104, 37790462, 37350969, 37187261]
3129C7187261j61197l78695k77078r6356j63634k51105k6927k32157l67926j69495
3119C5062691j32673M846o0325k18472k74703m2785k9569k28899k46027L4372
3109C3868456R5508Q0546k74932k36537N073n9576j86825N3274n4577l54796K09858
3098C3145472j59831k13577p9352o4525j32480k07767j26137k72070j27162j6553
3088C1746018q8380k61716K3038j72848j31963o8045j38530q5876o0310m9226
3078C0712162k39349L0144o6615j12447m8604k67171j39974M0324J05672j81200
3068B9832942k09141L5203K5972j4328k20021m0140j81730L5598K8453J13898
3058B9406706r992q3617n4348j15238P6906K73416J39471j85486R5264J07927
$$ y = [37187261, 37026064, 36647369, 36370291, 36273935, 36110301, 35859196, 35832269, 35600112, 35232186, 35062691, 34930018, 34934864, 34874539, 34656067, 34381364, 34338579, 34309010, 34080111, 33834084, 33868456, 33963964, 34044510, 33769578, 33533041, 33538114, 33478538, 33291713, 33344987, 33290410, 32935614, 33145472, 32985641, 32772064, 32692712, 32628187, 32495707, 32287940, 32161803, 31889733, 31762571, 31746018, 31657638, 31395922, 31418960, 31246112, 31114149, 31046104, 30907574, 30821698, 30761388, 30712162, 30472813, 30502957, 30436342, 30323895, 30275291, 30008120, 29868146, 29908470, 30014142, 29832942, 29623801, 29659004, 29684976, 29670648, 29450627, 29410487, 29228757, 29264355, 29292808, 29406706, 29396714, 29313097, 29258749, 29143511, 29220417, 29493833, 29633304, 29447818, 29543082, 29651009]
3048B9651009N1664J19194m2458R4732K17104K21807n4708J04831L05745J53101
3038C0822021K99998M6786J64619L08865M63056J50371M31691K89737M39386L90968
3028C3807498M24650M43872M47375M45656M61410M58188O84121N66036M94992
3019C8233798M32393R0967N2537L14811M17943J39154L01398Q6488M12113M21910
3009D0903512N08864M08387O06047P59462M77924P04766N88576L40550O37141
3000D5935229N32503L87802O91815O47301P08513R39698Q34955J159819P94621
2991E2632256R30439Q47919J033327R95522P97783R39235M80263M70210Q13597
2982E9940551R81231Q85912J069871J206840J153042J232423J353288J309563
$$ y = [29651009, 29702673, 29821867, 29779409, 29874141, 30091245, 30313052, 30258344, 30363175, 30668920, 30822021, 31122019, 31168805, 31333424, 31642289, 32105345, 32255716, 32687407, 32977144, 33416530, 33807498, 34232148, 34676020, 35123395, 35569051, 36030461, 36488649, 37172770, 37738806, 38233798, 38666191, 38757158, 38809695, 39124506, 39542449, 39681603, 39983001, 40069489, 40481602, 40903512, 41412376, 41820763, 42426810, 43186272, 43664196, 44368962, 44957538, 45298088, 45935229, 46467732, 46855534, 47547349, 48194650, 48903163, 49842861, 50677816, 51837635, 52632256, 53562695, 54410614, 55443941, 56439463, 57237246, 58176481, 58656744, 59126954, 59940551, 60921782, 61807694, 62877565, 64084405, 65237447, 66469870, 67823158, 69132721]
2974F9132721J568935K042098K035746K087445K366342K577385K882867L387059
2966H8080598L677809L968281L924962M280263M251441M207292L991103L343831
2958A19725580K834164J850111J312545Q03718O79252O69808P23126O29956O64102
2949A29892362O91460M86956O19028O91662J343022J680394J954974K662683K810174
2940A42832715L241676M022089M750049N523526O794766Q380829J0189218J1864102
2932A97598970J2849303J2771929J0604004L047599o798720j1565730j2164690
2925B06342665j1890470j0808282r640019q293255o735293n216075l827436l089967
2917A46841868k477784k084702j227510p15502j63820P85748J103072J549285
$$ y = [69132721, 70701656, 72743754, 74779500, 76866945, 79233287, 81810672, 84693539, 88080598, 91758407, 95726688, 99651650, 103931913, 108183354, 112390646, 116381749, 119725580, 122559744, 124409855, 125722400, 126526118, 127205370, 127875178, 128598304, 129228260, 129892362, 130583822, 131070778, 131689806, 132381468, 133724490, 135404884, 137359858, 140022541, 142832715, 146074391, 150096480, 154846529, 160370055, 167164821, 175545650, 185734868, 197598970, 210448273, 223220202, 233824206, 236871805, 230073085, 218507355, 206342665, 194452195, 183643913, 174003894, 165710639, 158975346, 153759271, 149931835, 146841868, 144364084, 142279382, 141051872, 140336370, 140172550, 140958298, 142061370, 143610655]
2909A43610655K117716J955503K162603K454330K475707K410483K311738K160520
2901A61659255J631512O11068j016079k689002m607421n802684o119212o576633
2893A37090804o496739n970937n206342m660697m289586l209897k764412k125567
2885A02366627j947134j961055j418056j153490q42589j172721j197079j344700
2877I1329803j462803j783701j892086k214884k282604k354792k363470k240789
2869G4734674k468773k427534k550441k155649j922285j902719j939712j653090
2861E7714471j330484j359149j324205j079182j185401r31079r84651r77166q75263
2852D7667891n58478q20953p93842j017733p77452q10376r98271q77791q14531
$$ y = [143610655, 145728371, 147683874, 149846477, 152300807, 154776514, 157186997, 159498735, 161659255, 163290767, 163901835, 162885756, 160196754, 155589333, 149786649, 143667437, 137090804, 130594065, 124623128, 119416786, 114756089, 110466503, 107256606, 104492194, 102366627, 100419493, 98458438, 97040382, 95886892, 95044303, 93871582, 92674503, 91329803, 89867000, 88083299, 86191213, 83976329, 81693725, 79338933, 76975463, 74734674, 72265901, 69838367, 67287926, 65132277, 63209992, 61307273, 59367561, 57714471, 56383987, 55024838, 53700633, 52621451, 51436050, 50504971, 49520320, 48543154, 47667891, 47109413, 46288460, 45494618, 44476885, 43699433, 42889057, 41890786, 41012995, 40198464]
2843D0198464p89532r45376o83016n98656o86577q00855n48552p00352n57860
2834C3887688m00620m75401n54558n65095n40648o03527o60628o40293m32796
2825B9014122m67506o41933k79585l51174o53547n58080m18513k32622m05946
2816B5005216l94702k34128k86944k80646l41839l90978l54978l03153k35690
2807B2182158n75418l80578j04519m85440l36592j44391l25462m67755j63087
2798A9198916l24371k94939k46590n24377m49356l16431J11470k64417j44598
2789A6745307k25653m52647k60788k72518p7097j81800o3347k34606j22944k32998
2779A4620909j08884k27431n67419j87271j80010j89155r1827r4026q7458k81543
$$ y = [40198464, 39408932, 38463556, 37780540, 37181884, 36495307, 35694452, 35145900, 34445548, 33887688, 33487068, 33011667, 32457109, 31892014, 31351366, 30747839, 30087211, 29446918, 29014122, 28546616, 27904683, 27625098, 27273924, 26620377, 26062297, 25643784, 25411162, 25005216, 24610514, 24376386, 24089442, 23808796, 23466957, 23075979, 22721001, 22417848, 22182158, 21606740, 21226162, 21121643, 20636203, 20299611, 20155220, 19829758, 19362003, 19198916, 18874545, 18579606, 18333016, 17808639, 17359283, 17042852, 17154322, 16889905, 16745307, 16519654, 16067007, 15806219, 15533701, 15456604, 15274804, 15211457, 14976851, 14853907, 14620909, 14512025, 14284594, 13717175, 13529904, 13349894, 13160739, 13068912, 12974886, 12887428, 12605885]
2769A2605885k58479J68342k69083n38443j08531l9315k17964k04650K5398l21448
2759A0841712k09659N0828n8975j86145j09823l22860j24183j22769J7066j13179
2749I662013j96637k9384j00218j73616o0631k68532j50858j22927k34453M6120
2739H370877k0126k72212P3230M1424j81227k58331j88950K5565j32561l1796
2729G425893k1274q6670r3733K9596j98128J62297o4246k29756q621l3760k55651
2718F625947n1611j7716j0454J16744j30280q8586k6844l21009K23991L9927k26320
2707F133789l3330l4278P5776l5831j54503k07610L4890J87321j0716k40222j38082
2696E577204j79057L1411J24120O1818p3641l8917k17228R9075N5207j54432N7332
$$ y = [12605885, 12347406, 12515748, 12246665, 11708222, 11599691, 11560376, 11342412, 11137762, 11163160, 10841712, 10632053, 10682881, 10623906, 10437761, 10327938, 10005078, 9880895, 9758126, 9775192, 9662013, 9465376, 9435992, 9335774, 9162158, 9101527, 8832995, 8682137, 8559210, 8324757, 8370877, 8350751, 8078539, 8151769, 8193193, 8011966, 7753635, 7564685, 7590250, 7457689, 7425893, 7404619, 7317949, 7224216, 7253812, 7055684, 7217981, 7153735, 6923979, 6915358, 6881598, 6625947, 6574336, 6556620, 6546166, 6662910, 6532630, 6444044, 6417200, 6096191, 6320182, 6360109, 6133789, 6100459, 6066181, 6141957, 6106126, 5951623, 5744013, 5778903, 5966224, 5955508, 5715286, 5577204, 5398147, 5429558, 5553678, 5615496, 5541855, 5502938, 5285710, 5384785, 5439992, 5285560, 5342892]
2685E342892k53648N0899L05153j55030j3288J09570J2619k6355J9202q8025j42248
2674E161741j8458o8884Q2615J85373L507m1589J01234n2550O9791P6943k56600
2663E243123o8707m1668l2078j2652j21437L9169K35809J40391k25785j01830
2653E054335L59653q6177N9019J78397N4950K5370J01497M2136j84914K1947J9226
2642E645439m2774Q6757J04058k10003P2718j44660q0622q2225j30316J1600o0187
2631E169785j21174O8155J4712Q1222L3176O701j48236k8333j4449j8151J95829
2620E239237j45813o3231q5422J60532M49422l5197o8257q814j53296J59913K06299
2609E655373K1209j89186k19573j15429k16478k0624k78476q3509M4568J78529
$$ y = [5342892, 5089244, 5140143, 5445296, 5290266, 5276978, 5386548, 5399167, 5372812, 5392014, 5303989, 5161741, 5143283, 5074399, 5157014, 5342387, 5345894, 5304305, 5405539, 5352989, 5422780, 5499723, 5243123, 5174416, 5132748, 5100670, 5088018, 4966581, 5005750, 5241559, 5381950, 5156165, 5054335, 5413988, 5327811, 5386830, 5565227, 5620177, 5645547, 5747044, 5789180, 5604266, 5626213, 5645439, 5602665, 5689422, 5793480, 5583477, 5656195, 5511535, 5430913, 5348688, 5218372, 5229972, 5169785, 5048611, 5116766, 5131478, 5212700, 5245876, 5252577, 5104341, 5076008, 5061559, 5043408, 5239237, 5093424, 5030193, 4944771, 5105303, 5554725, 5519528, 5451271, 5442457, 5289161, 5449074, 5655373, 5676582, 5487396, 5267823, 5152394, 4935916, 4915292, 4636816, 4553307, 4597875, 4776404]
2599D776404n444l275k19335j07955n8444j09632J5763j07691J40402P6170l16018
2588D080945R5359L1800j21617q5260j9525k25044o5950m6643M3118M52024j83350
2577C955857q496q6326J31364O7968K34316k08168j02327k29186j41065j17264
2567C496673j37588k1907K37L243k25245o0376j81845P5122Q6396r5039J06054
2556C045725K1685m4247j2018j09333n4205j37251j9312N4724k00920L0466k6292
2545B549022l793p9140m143J55200n0025M7245l7506j38126j69484o3901P1792
2534B277141j1182j44100j80215J61177J60171m4801l7975j26694j30075o4514
2524A858933q7142J5036Q0180J32398j28211M2907j09535k82838r906J51700J91577
$$ y = [4776404, 4770960, 4767685, 4548350, 4440395, 4381951, 4272319, 4288082, 4180391, 4320793, 4396963, 4080945, 4176304, 4208104, 4086487, 4001227, 3981702, 3756658, 3690708, 3644065, 3687183, 4139207, 3955857, 3947361, 3861035, 3992399, 4060367, 4294683, 4086515, 3984188, 3755002, 3613937, 3496673, 3359085, 3337178, 3337415, 3340658, 3115413, 3055037, 2873192, 2948314, 3034710, 2939671, 3045725, 3067410, 3023163, 3011145, 2901812, 2847607, 2710356, 2691044, 2745768, 2544848, 2575314, 2549022, 2545229, 2466089, 2461946, 2617146, 2567121, 2614366, 2576860, 2438734, 2269250, 2205349, 2277141, 2265959, 2121859, 1941644, 2102821, 2262992, 2218191, 2180216, 2053522, 1923447, 1858933, 1771791, 1786827, 1867007, 1999405, 1871194, 1914101, 1804566, 1521728, 1511822, 1663522, 1855099]
2513A855099j96489Q9397k2603k34755L5464J7989j2273M0395j02841J8030j37599
2502A349814M633K32713o9042j26938j95388K09326j03626r8503j34296J2028
2492A080721O8021j09828j6593j6910L59934L9127j02585j68329j42636J6510
2482A007432j20233J60700J29553j04828Q8337M7377k06890K14061R9890j60864
2472A154535Q5755j83409r3082P7980L0976n7847n5097r6558P8239L9648K55208
2461A236348j94088l75909J20163J72736K897K20121L7869k07704k93691j37566
2451E81176K06211J11533k6521L8273O8538j32370O3685n7131L2355J2687k1534
2440H76902j28456N6799n3658P9864J7791O4959l5129k86842M3428J3663j26624
$$ y = [1855099, 1658610, 1748007, 1725404, 1490649, 1526113, 1544102, 1531829, 1572224, 1469383, 1487413, 1349814, 1354447, 1587160, 1518118, 1391180, 1195792, 1405118, 1301492, 1202989, 1068693, 1080721, 1148742, 1038914, 1022321, 1005411, 1365345, 1404472, 1301887, 1133558, 990922, 1007432, 887199, 1047899, 1177452, 1072624, 1160961, 1208338, 1001448, 1215509, 1315399, 1154535, 1240290, 1056881, 963799, 1041779, 1072755, 1014908, 959811, 863253, 941492, 981140, 1236348, 1042260, 666351, 786514, 959250, 962147, 1182268, 1220137, 1012433, 718742, 581176, 787387, 898920, 872399, 910672, 979210, 846840, 910525, 853394, 885749, 898436, 876902, 748446, 805245, 751587, 831451, 849242, 914201, 879072, 592230, 635658, 649321, 522697]
2429E22697J29739J86708j20081R2850o4983J5805k04159j4433R1076J04181N858
2418G45258Q1330K6304j03958j2105J46448n3617j9282m5951O3661j58623j82757
2407D86708L06554P7145j15418J8160m4762q0935J94511K15533N9022M0047j75520
2396I81045K37749l4354j63649j21270n2996P93k3778r862k32495N3724O2867
2385F97774P7060j30990j08955l0526K61622k3206O9809M3175J4262k6101j46610
2374F97314j77053p4148L1550Q2933m6637J67775J36998k28120J32440K75693
2364I98745r4627m7461j14059k7330P8108m2918N755j63505K3516M999j3982m2557
2352E64684J66854m8469j83562P0928M6653p8533p1434Q5347k03537J01388L6099
$$ y = [522697, 652436, 839144, 719063, 811913, 746930, 762735, 558576, 544143, 635219, 739400, 745258, 826588, 852892, 748934, 736829, 883277, 829660, 810378, 764427, 828088, 669465, 486708, 793262, 870407, 754989, 773149, 728387, 647452, 841963, 1057496, 1116518, 1156565, 981045, 1218794, 1184440, 1020791, 899521, 846525, 847318, 823540, 813678, 581183, 634907, 697774, 774834, 643844, 534889, 504363, 765985, 742779, 812588, 855763, 870025, 843924, 697314, 520261, 446113, 477663, 560596, 513959, 681734, 818732, 590612, 723052, 998745, 904118, 856657, 742598, 715268, 793376, 750458, 756213, 592708, 616224, 621223, 607241, 564684, 731538, 683069, 499507, 570435, 617088, 538555, 467121, 552468, 348931, 450319, 486418]
2341D86418M6785Q6408j36074R2954R8780j30550o1915J29940j09620L1852L550
2330E38528p547j4756j93443P8894J59048P5318J03895m5772j07928N2132R9809
2319G38178j2087R5751q3095k5122K32580r8719r4859j05495j1986k65453j00979
2308B68714J58746J20879n7359j83256K24159R6502o3239J74733M4411k94992
2298D89298J9423K05863j26490r6571R3567J7977R002K423k01078J01827K28422
2287G43663L040j01152L3221p6546P710o5829j5503K55286j76982k297Q1234J23107
2275H08952j4204l11230J47328m6760N6800P7310j12539J2739P5251Q5685k9416
2264G49916k0736J13891m1217K7633q8498j1679l6539r3457J84659J59556j15132
$$ y = [486418, 533203, 619611, 483537, 576491, 675271, 544721, 482806, 612746, 503126, 534978, 538528, 530981, 516225, 322782, 401676, 560724, 636042, 739937, 694165, 586237, 638369, 738178, 726091, 821842, 738747, 713625, 946205, 847486, 752627, 647132, 635146, 369693, 268714, 427460, 548339, 490980, 307724, 531883, 628385, 565146, 739879, 784290, 489298, 508721, 714584, 588094, 491523, 585090, 603067, 612069, 614492, 413414, 515241, 743663, 746703, 645551, 678772, 602226, 609936, 544107, 528604, 783890, 606908, 604611, 685845, 808952, 794748, 483518, 630846, 584086, 640886, 718196, 605657, 618396, 693647, 779332, 749916, 729180, 843071, 801854, 829487, 740989, 729310, 692771, 599314, 783973, 943529, 828397]
2253H28397n501n1381N0924q239k3139l9809k61218J53100K02450o8290j0005
2242G67289J58417n7104l2259p6747J80605r6573L9713j5653O744P9349M0256
2231I94037n0760j75508n9004J72856j2468l5106M5174J29320j0788L3417J10657
2220A141827O9773l7708J48344j31149q1287J19556J96568J40783J6105K48435
2210A831247j49439l5662K6888p4835O1538K3356K05415Q9185j45691J43597p1170
2199A904429j12004L88624L5292J34298q0440k47869K94841j08991O0285J11273
2189B379738J72570k75617j09772J43743O2385K44093J49661J37766M4255q9162
2179B859660M5906J5486K52716N7497k09114P2918K12806N8931r4600P4612K60300
$$ y = [828397, 822896, 771515, 822439, 814200, 791061, 751252, 490034, 643134, 845584, 777294, 767289, 925706, 868602, 836343, 759596, 940201, 843628, 883341, 867688, 874432, 953781, 994037, 943277, 767769, 708765, 881621, 869153, 834047, 879221, 1008541, 997753, 1031170, 1141827, 1211600, 1173892, 1322236, 1191087, 1109800, 1229356, 1425924, 1566707, 1582812, 1831247, 1681808, 1646146, 1673034, 1598199, 1659737, 1683093, 1888508, 1977693, 1832002, 1975599, 1904429, 1792425, 2181049, 2216341, 2350639, 2270199, 2022330, 2317171, 2208180, 2268465, 2379738, 2552308, 2276691, 2166919, 2310662, 2373047, 2617140, 2766801, 2904567, 2948822, 2859660, 2905566, 2921052, 3173768, 3231265, 3022151, 3095069, 3307875, 3366806, 3272206, 3346818, 3607118]
2168C607118J16447J97168K76838K63881J70583J08531J59415N11125K31821k3787
2158E619140K10049M05555M24677L83804N82096J32492L98018N50258N20169M56613
2148I682871N47248O74153R78599P24723J329768J312387J356698Q28978J518041
2139A8953466K011756K137881K519225L545087M359531N709388O906278R867377
2131E6009989J2510196J4583131J4633538J3373171l187470k3479801k0516926
2124F3925828j3164842q554852o659346n156144l719751k718905k399555j701658
2116A9850775j667750j155695o60702n85961r30533j115513j445774r24755q37584
2107A0526508l76952o83967m91661n05844k40672m75318l11994l36233n10630
$$ y = [3607118, 3723565, 3920733, 4197571, 4461452, 4632035, 4740566, 4899981, 5411106, 5642927, 5619140, 5829189, 6234744, 6659421, 7043225, 7625321, 7757813, 8155831, 8706089, 9226258, 9682871, 10230119, 10904272, 11882871, 12607594, 13937362, 15249749, 16606447, 17435425, 18953466, 20965222, 23103103, 25622328, 29167415, 33526946, 39236334, 46142612, 56009989, 68520185, 83103316, 97736854, 111110025, 107922555, 84442754, 63925828, 50760986, 42206134, 35546788, 30390644, 26670893, 23951988, 21552433, 19850775, 18183025, 17027330, 16366628, 15780667, 14850134, 13734621, 12288847, 11364092, 10526508, 10149556, 9465589, 8973928, 8468084, 8227412, 7752094, 7440100, 7103867, 6593237]
2098F593237j15983o6049k14880l28830J1943k60688k70400j78915m1887l01815
2088D825733k88943o4676k41823n3782o7511k14329o5025l11550j25830j767r4344
2077C296153p986q2678k26944J45321j89766n3409j6443j88711m6008m3199j19222
2066B467108J14245K7218M6441j03545P7075m5204j73976l63111K13010n6120
2056B203141O7265M4793j39203J4331k63867l01092J33201J01474p5600o1192
2046A723251l2670O3723j16192J2330j07165R2996K6079k67293N7260N3162m2743
2035A462738j21041N9968j74800p9690n9509J98620j46346p6448J33414J24007
2025A320913j40373j26637K37565j20063N3597j00902M2639j9059k07341J28044
$$ y = [6593237, 6477254, 6411205, 6196325, 5867495, 5879438, 5618750, 5348350, 5169435, 5127548, 4825733, 4536790, 4472114, 4230291, 4176509, 4108998, 3894669, 3829644, 3518094, 3392264, 3390497, 3296153, 3288167, 3205489, 2978545, 3123866, 2934100, 2880691, 2864248, 2675537, 2629529, 2586330, 2467108, 2581353, 2608571, 2655012, 2551467, 2628542, 2583338, 2409362, 2046251, 2259261, 2203141, 2270406, 2315199, 2175996, 2190327, 1926460, 1625368, 1758569, 1860043, 1784443, 1723251, 1690581, 1754304, 1638112, 1650442, 1543277, 1636273, 1662352, 1395059, 1452319, 1505481, 1462738, 1341697, 1401665, 1226865, 1147175, 1087666, 1286286, 1139940, 1063492, 1196906, 1320913, 1180540, 1053903, 1291468, 1171405, 1225002, 1124100, 1166739, 1147680, 940339, 1068383]
2015A068383N6620k43178o6486Q2534J73771K0315j29608q1135l1255K5661p0674
2004H04948Q9415J52954o6030k00214P969l114L4590p2069j90440l2433j16176
1993D09400J53586J04515J13226M5896j7906j66435j3963o8565q6683J79439j07708
1982E44802o7637j02882J41450K16105p3566m6262n2409k7607r5469O9013L7293
1971E42831P6142k4048j32535o0453K26085Q6022q0704j03494j4335M1987m3538
1960E13960k8905K17895m9703M7248O3125q3825n9269K6221j42330N470n6258
1949D53629L0923N829j02515K67693j5402j0217j44367R9466j25900l973Q5358
1938E40524k12626j16672J73432j57855O4821K03042J16153j9693j54163L6381
$$ y = [1068383, 1125003, 881825, 815339, 897873, 1071644, 1091959, 962351, 881216, 849961, 875622, 804948, 894363, 1047317, 981287, 781073, 789042, 785928, 820518, 748449, 558009, 525576, 409400, 562986, 667501, 780727, 826623, 808717, 642282, 628319, 559754, 473071, 652510, 544802, 477165, 374283, 515733, 731838, 658272, 612010, 559601, 531994, 436525, 505538, 542831, 618973, 594925, 462390, 401937, 628022, 714044, 633340, 529846, 515511, 557498, 513960, 485055, 702950, 653247, 700495, 763620, 679795, 620526, 646747, 504417, 509887, 453629, 484552, 490381, 387866, 655559, 640157, 629940, 485573, 585039, 459139, 455166, 540524, 327898, 211226, 384658, 226803, 291624, 494666, 610819, 591126, 436963, 473344]
1928D73344O4522J75331j68988p7078k07094J79917n6864p9733J29165r7146l7715
1917B97661M571m6558J770o4173J12961M796J08376M0650p357l0010Q404J06272
1905E37363q4606o4839k62067P2530J29505O0029J67467J36721o2191k99963J3856
1894C43805R6734P6282N6651k21834j98440P7548P3556k8016P072j01651J62260
1883C43967j92183l1770J77859K65280j60955J46151j7593j58758n3046R133J43677
1872D71762o2126J11403o9682j10097N392k9128m9293K36849j5766J9570Q1632
1861E90516m0619R6015O3795J59862j47737j89972j30607j02491K34660j49998
1851C83424J57290K01068l57869j18568R7322N149M2273p9730k7981R7854J13741
$$ y = [473344, 537866, 713197, 544209, 467131, 260037, 439954, 383090, 303357, 432522, 335376, 297661, 302232, 255674, 257444, 193271, 306232, 311028, 419404, 460054, 452697, 422687, 431091, 537363, 452757, 387918, 125851, 198381, 327886, 387915, 555382, 692103, 629912, 329949, 343805, 440539, 516821, 573472, 351638, 153198, 230746, 304302, 276286, 283358, 181707, 343967, 151784, 120014, 297873, 563153, 402198, 548349, 530756, 371998, 318952, 328085, 471762, 409636, 521039, 451357, 341260, 346652, 317524, 268231, 505080, 489314, 508884, 590516, 549897, 645912, 709707, 869569, 721832, 531860, 401253, 298762, 533422, 383424, 540714, 741782, 383913, 265345, 362667, 367816, 410089, 330359, 302378, 400232, 513973]
1840E13973j43496k15957J18636J42316j76444n3098J99668J1842J2824M9209
1830D59473N5351l52298n949J90774R385J04385j39099J10903K0534k71769n4309
1819A27381J06003K947Q7620n7854k64033J39680n4349l3369J85221P2493l7568
1808B74172n4359J8124p5113r2848l9884P6186k04454j1146K25362Q7179M8990
1797B52209O2386J45566j48978j7552k4786l14110O8907J35678k9963p5363L22758
1786C76752q5023j23444O8951r8966J95840M3498j06748k1285l6710j22583J65487
1775B55769j16925M1840L9503R0713J31420r6182n1325J42831j79385p0629N0671
1764B38301k0431L2194r7551K57258r7581j96461R3148Q7760n377r9322j81271
$$ y = [513973, 370477, 154520, 273156, 415472, 239028, 185930, 385598, 397440, 410264, 459473, 514824, 162526, 156577, 347351, 356736, 461121, 322022, 432925, 453459, 181690, 127381, 233384, 236331, 323951, 266097, 2064, 141744, 87395, 54026, 239247, 311740, 274172, 219813, 237937, 162824, 69976, 30092, 106278, -98176, -109322, 116040, 203219, 252209, 314595, 460161, 311183, 293631, 268845, -45265, 23642, 159320, 129357, 53994, 376752, 291729, 168285, 237236, 138270, 334110, 377608, 270860, 249575, 212865, 90282, 255769, 138844, 180684, 220187, 310900, 442320, 346138, 294813, 437644, 258259, 187630, 238301, 217870, 250064, 152513, 409771, 312190, 115729, 208877, 296637, 291260, 191938, 10667]
1753A0667J70630J73939q8084o4690M6732O7584j03380L2562j35381L7531O3341
1742B11451j7195J37430j52444j77713K2612J86395j85197K2817Q9077K4889o2179
1731I9943J59650p8973r6323m232j10484J0834p3594J13969J04193J47098N4377
1720C26458j15966j10607k3002O7578K67869m3538r5646P5587j82557R6880o798
1709B56258O1296j71059O2678k4755N6852Q1101J5022L9961l08550L1888K0770
1698A21462n9637j20711N0547n8138K28281Q5739J25956p68N638n5144r0139M6984
1686B80070r2436J08766q8935j68209K8018k5663j86299K37310J00796j9334k63610
1675h9526R0231J54033M6433J36756j20570j1759q7325O6071q5941J94984j21589
$$ y = [10667, 181297, 355236, 267152, 202462, 249194, 316778, 213398, 245960, 110579, 148110, 211451, 194256, 331686, 179242, 1529, 24141, 210536, 25339, 48156, 137233, 162122, 99943, 259593, 180620, 84297, 80065, -30419, -19585, -93179, 20790, 124983, 272081, 326458, 210492, 99885, 76883, 144461, 412330, 368792, 273146, 348733, 166176, 263056, 256258, 317554, 146495, 209173, 184418, 241270, 322371, 337393, 377354, 68804, 100692, 121462, 61825, -58886, -8339, -66477, 161804, 247543, 373499, 372731, 378369, 323225, 233086, 280070, 187634, 296400, 207465, 39256, 67274, 41611, -144688, 92622, 193418, 174084, -89526, 705, 154738, 201171, 337927, 217357, 205598, 118273, 184344, 98403, 293387, 171798]
1664A71798j30981J28333N1144J38570j3646k11239L5281J66314Q4704k77919
1654A42359j30273J81758J04662q6740N4182J5911j44390r0295m9514j27394L22867
1643A93133J25565j4726r5983J35204J36912j85660j41013K11103K56256j98048
1633D22743O171p9303k40816j27555r239j0906p404P1382J45232l3770n8222K33060
1621C11373K09161j30249n8706k32418J22990J34223r2242m7602m3840j40991
1611C1699J25125m7M7565K2344k0218L0537p6395k1580p3815l3744p8668J01552
1599E4355R785N0034J19406M9558j30781J05065q6101J30320J35362l01177m2325
1588I3501l4939J67437j88319l6249J9024J13763p6521J23074J02741k25131j72588
$$ y = [171798, 40817, 169150, 220294, 358864, 345218, 133979, 169260, 335574, 420278, 142359, 12086, 193844, 298506, 211766, 265948, 281859, 137469, 47174, -2340, -129734, 193133, 318698, 303972, 207989, 343193, 480105, 294445, 153432, 364535, 620791, 422743, 428914, 349611, 108795, -18760, -27999, -38905, -46309, 25073, 170305, 136535, 78313, 311373, 520534, 390285, 331579, 99161, 222151, 356374, 264132, 216530, 172690, 31699, 156824, 156777, 204342, 226686, 206468, 237005, 160610, 139030, 65215, 31471, -47197, 54355, 64140, 114174, 233580, 283138, 152357, 257422, 171321, 301641, 437003, 135826, 93501, 58562, 225999, 37680, 1431, 20455, 134218, 57697, 180771, 283512, 58381, -114207]
1577a14207Q7522J7570r8965K2734J36230k10785K4985K27933J39113k36629K7239
1566B2740M5713P7614J21767l51247M4207Q4834N716N9062J07036j10964j16498
1555a0020J7016O9377j7142j13166R5727j6412J5347K08952k68222o0187M8041
1544c0689N3414N221J72587m9054k8707O4228j04938J94009J82836k14957J37997
1533C81947j52514L301p1280o5686j12494N2703J96705j57319K6191J9493l8059
1522H2988J57380o1102p6574K7672n6130R6288J06566l9628r4317K5384J24955
1511B93482k5569j35032j29051q0078J67222J0589j16803M394P0252n81J08445
1500A67270j62780o8520K16193r1198M0300N2304j42043R1516J25586M6431k9928
$$ y = [-114207, -26685, -9115, -108080, -85346, 50884, -159901, -134916, 93017, 232130, -4499, 22740, 68453, 146067, 267834, -83413, -39206, 45628, 51344, 110406, 217442, 106478, -10020, 6996, 76373, 59231, -53935, 41792, 25380, 40727, 249679, -18543, -78730, -30689, 22725, 27946, 200533, 151479, 122772, 187000, 82062, 276071, 458907, 243950, 381947, 229433, 232734, 161454, 95768, -16726, 35977, 232682, 75363, 101554, 121047, 82988, 240368, 179266, 102692, 130364, 74234, 170522, 277088, 237460, 143143, 168527, 293482, 267913, 132881, 3830, -76248, 90974, 101563, -15240, -10846, 59406, 58825, 167270, 4490, -64030, 152163, 60965, 101265, 153569, 11526, 103042, 228628, 275059, 245131]
1489B45131l09679l7419L987Q9850L8432r0808K39748j95774p7081J36947K45426
1478B88760k20864o304N9423j6421J56112j71359j46412J33817J2269r2410j64690
1467a68079J10432R9976j2260q9818J0086J92054k76422j1061K73629n6195K0729
1456I3071n2058j94912J64492O8200o8596k8057p929m4534R7877N3647O0816J5041
1444A57058m0188o6104q8978J94908J07724o343l7845N344j96327O87K38755O2747
1432C31438j36715o6190l3408r8386l3385M1412k15328O4794R8436k34608J23734
1421a58206J71157l1298k1385J7255K8262J48471k5176k26209K74007J61649k08729
1410A29798l9594Q8406j09088j35702J46046M6917L8714r1766J771l8573J70608
$$ y = [245131, -64548, -101967, -97980, -8130, 30302, -60506, 179242, -16532, -93613, 43334, 288760, 67896, 61592, 121015, 104594, 260706, 89347, -57065, 76752, 89021, -3389, -168079, -57647, 42329, 30069, -59749, -49663, 142391, -134031, -145092, 128537, 72342, 93071, 41013, -153899, 10593, 78793, 10197, -17860, -25789, -70323, 27554, 81201, 142017, 157058, 116870, 50766, -38212, 156696, 264420, 258077, 220232, 225576, 29249, 29936, 268691, 331438, 194723, 128533, 95125, -3261, -36646, 4766, -210562, -145768, -47332, -281940, -158206, 12951, -18347, -39732, -22477, 5785, 154256, 129080, -97129, 176878, 338527, 129798, 90204, 178610, 69522, -66180, 79866, 126783, 165497, 73731, 75502, 36929, 207537]
1399B07537m0747J10883q1450J63613j29136n0384r5959k68136l8170J76147k31261
1388b77063k3963J76250J57677J12678l2240p4855j68016K19107j00873K5896
1378A4598J64868j63122j04193J40087J91549L7791j65555l5994K6848J0761k2324
1367I5314J40926q7788k0178j15678j09220n7277K3116J73291l6480l37954K19072
1356a12856J93741J07975j07322J05635Q6628j51195k29200j20907J28186J02279
1346B964J74825j86790J28373O7487k60402J27409J18359J25083J7910k80061
1336C5157n2344Q4085n6898L5851J79322m067j04067n0667l0155K7552J00240
1325A64009J1072r9417j75303J18545k9963l4864J89990K7192k18387l9376K8144
$$ y = [207537, 166790, 277673, 196223, 359836, 230700, 180316, 84357, -183779, -221949, -45802, -277063, -301026, -124776, 32901, 145579, 113339, 38484, -129532, 89575, -11298, 14598, 179466, 16344, -87849, 52238, 243787, 281578, 116023, 80029, 106877, 117638, 95314, 236240, 148452, 128274, 12596, -96624, -153901, -130785, 42506, 6026, -331928, -112856, 80885, 188860, 81538, 187173, 273801, 122606, -106594, -227501, -99315, 2964, 177789, -9001, 119372, 186859, -73543, 53866, 172225, 297308, 315218, 35157, -17187, 66898, 10000, 45851, 225173, 221106, 117039, 66372, 36217, 63769, 164009, 175081, 75664, -99639, 18906, -11057, -45921, 144069, 171261, -47126, -86502, -58358]
1314e8358P6216J70784k10258j5610R9826J01086j07604J71834k49450l4091K03374
1303A47749J47645j51980n5955o2681K17515J71916k15894p5705k37758Q2480
1293c2668Q1083M2009j67825k2513l2379K15970K8941o7160k02828j39556J60527
1282a36399K03208j37987L3400K04593j36303j47142k9833M1485n191l3167O305
1271a37031Q2265j2507o9331K81190L83740k76018j64671q4301J04999P84m7891
1260F1228j01981J67858j5642k55792O3609q053J5726r3761j6563J34519m5513
1249i4365k44611L18715J26934k0670m058j09009n6567K54351k32973K9715j1995
1238d4533L2136O09K4414l2532k8650N9348P426l725j17336J61227J36335j75028
$$ y = [-58358, 17858, 188642, -21616, -37226, 62600, 163686, 56082, 227916, -21534, -55625, 147749, 295394, 143414, 87459, 24778, 242293, 414209, 198315, 122610, -115148, -32668, 48415, 90424, -77401, -99914, -132293, 83677, 112618, 45458, -157370, -296926, -136399, 66809, -71178, -37778, 166815, 30512, -116630, -146463, -104978, -110169, -143336, -137031, -54766, -67273, -136604, 144586, 528326, 252308, 87637, 3336, 108335, 109119, 61228, -40753, 127105, 111463, -144329, -80720, -88773, -73047, -166808, -183371, -48852, -94365, -338976, -20261, 106673, 86003, 81945, -27064, -83631, 170720, -62253, -32538, -44533, -12397, -11788, 12626, -19906, -48556, 10792, 18218, 14493, -102843, 58384, 194719, 19691]
1226A9691M5306l1611q986n0348r968p37n6102J82563J49482r9106n733l1258
1214A03193k14923K52646N2942j96283j31744M8074k9614J77228M9064r4450j33060
1203a16927N3259L6914O1589m9161K7545j17198K06532q0929l3519L4608p4317
1192e1604n3521L9474j51894m9421L0498R8879K62399K9585j47776n1959N8863
1181A3523J7311m5778j95883L26937l4631J2314K4922p3469o1062J39635J03195
1170B27014m8884l10657j16666K746K18377L5462j64376n5468J53076J14690R3463
1159A48777j20626o1068J6878K15L8911j27283P0447J96918O6127j3617q7366
1148A28313p4203O1852K4329K1325j80379l8516J03514J77985j34103Q0175j27678
$$ y = [19691, 64997, 33386, 24400, -25948, -35916, -36653, -92755, 89808, 239290, 140184, 134451, 103193, -111730, 140916, 193858, -2425, -134169, -86095, -115709, 61519, 110583, 16133, -116927, -63668, -26754, 34835, -14326, 13219, -103979, 102553, 21624, -11895, 22713, -51604, -105125, -65651, -217545, -266966, -236468, -137589, 124810, 154395, 6619, -45340, 13523, 30834, -14944, -210827, 116110, 81479, 93793, 118715, 45246, -15816, 123819, 227014, 178130, -132527, -249193, -246447, -28070, 7392, -156984, -212452, -59376, 55314, 148777, 28151, -32917, -16039, -15824, 23087, -104196, -33749, 163169, 229296, 215679, 128313, 54110, 115962, 140291, 161616, -18763, -57279, 46235, 224220, 90117, 170292, 42614]
1137D2614m5814J67989j18901j05780L5236q7504j27798J50053J3658n875J64076
1126H1954r8562M3390K58218M9952J6905o0159q9478p4416j24659J48072K9939
1115A81156q2106k10059O7318p8001K9413J52502j07380J05628L2181M3932j16165
1104A8419r6422r4072J53407O6411j04339m9507J15696l6010K3815J32513j05088
1093B4823J62633k41381r6585J75281O3161k61810P8768K16995j14606k0107M5267
1082C2439p3082L094J41509K9785j60161J57893l3147M0160m5633j27256j51896
1071a86295J16733l7500M9662J20261j39475o3222J26067L8604j52435J81236
1061E3636M6585n7757K6823m0239j64349N8133Q6543p6495m6500j3837J17743
$$ y = [42614, -3200, 164789, 45888, -59892, -24656, -112160, -239958, -89905, -76247, -82122, 81954, -16608, 26782, 285000, 334952, 351857, 291698, 202220, 127804, 3145, 151217, 181156, 99050, -111009, -43691, -121692, -92279, 60223, -47157, 58471, 90652, 134584, 18419, -78003, -172075, -18668, 47743, -56596, -106103, 9593, -26417, -2602, 129911, 24823, 187456, -53925, -150510, 24771, 87932, -173878, -95110, 121885, 7279, -12828, 32439, -40643, -37549, 103960, 133745, -26416, 131477, 98330, 138490, 92857, -34399, -186295, -69562, -107062, -57400, 62861, -76614, -139836, -13769, 24835, -127600, 53636, 100221, 42464, 69287, 29048, -135301, -77168, 9375, -67120, -113620, -127457, -9714]
1050i714K66933j06308k07254L3814K20535k78041M892Q1146J07307o7619m8075
1039b384n9011K160j17361M5100J468L0219k3327Q4692N6424j48828p7082P4404
1027a33526K5216J54201o2172L592M0257O2772j8516P185j01419n4908M468K40411
1015A67561j40393M7975j3908P903L042j75748j47423q8224J8883L6554J68053
1004a15725O6791N2523k8266R3881M6302N3822l15277K13856l3123O7697m0106
993F2375j54923P8794p7823o2040p9934L7819J824J10527J54836O493K9995R2375
981B00318j19812k00154K35698J5153j71057M5398J13421j58052n2185L8381J43539
970I0648k25143M5192N7803R6391L9602k44788k9875J53956J73511O3865r0760
$$ y = [-9714, 257219, 150911, -56343, -22529, 198006, -80035, -75143, 6003, 113310, 45691, -2384, -61395, -59235, -176596, -131496, -130028, -99809, -123136, -38444, 17980, -130848, -207930, -133526, -108310, 45891, -16281, -12689, 27568, 90340, 71824, 79009, -22410, -77318, -72850, 167561, 27168, 75143, 61235, 69138, 72180, -103568, -250991, -339215, -320332, -283778, -115725, -48934, 3589, -24677, 69204, 115506, 169328, -145949, 67907, 34784, 102481, 62375, -92548, -13754, -91577, -153617, -233551, -195732, -193908, -83381, 71455, 77948, 107943, 200318, 80506, -119648, 116050, 131203, -39854, 5544, 118965, -39087, -91272, -52891, 90648, -134495, -89303, -31500, 64891, 104493, -140295, -170170, -16214, 157297, 221162, 130402]
959A30402j057k1846j79817k15045K87681j33598L0073M0646j69568Q4517M9002
948i8610J23418O6158m7444M0774J10691j06949k69143K9307N6035J14306L5466
937E4009j59583N6984J03538J29186m968j57255j38262L02973j50623l63286J09772
926b17515J66844m4675K0206m7537J66032j43149J47703k4691j63827Q0993p6046
915a35662M8426k1738N3462j2262R2308M3971J36088j36501k9052J07297q8368
904E7969J2190P2321r446r0978j23988o2982P6356r4525K04499R9824M1173r7545
892H4868j56234j91559j25770J81998K38639K4979O0921L6707j16463j30323q4498
881a76735K881J28100K06564j35132n5818Q4566l3727J54500k4298r8774J27823
$$ y = [130402, 129345, 107499, -72318, -287363, 318, -133280, -103207, -62561, -232129, -147612, -98610, 24808, 90966, 43522, 84296, 194987, 88038, -181105, -151798, -95763, 18543, 54009, -105574, -48590, 54948, 184134, 179166, 21911, -116351, 186622, 35999, -327287, -217515, -50671, -95346, -75140, -122677, 43355, -99794, 47909, 23218, -140609, -59616, -135662, -87236, -108974, -55512, -67774, 24534, 68505, 204593, 68092, 39040, 146337, 57969, 70159, 142480, 133034, 42056, -81932, -144914, -68558, -163083, 41416, 141240, 182413, 84868, -71366, -262925, -388695, -206697, 31942, 56921, 117842, 154549, 38086, -92237, -176735, -173854, -45754, 160810, 25678, -30140, 54426, 20699, 175199, 150901, 52127, 179950]
870A79950j08170k06233j75527J64049J06683o7687j13417K16342N7140j37990
860h4860j17372N8663j2314j28600K33891M2002j37285J9389o7464Q342N7887
849a27721J00338J0132m2887J38464j93106J22220L4014j11250j04099n386R8554
838h0727P4609p9357R4515N8209n3425m7384p4705J00764J03017q4741O884P1572
826H9231p2804r3418j9098k3419L5025J09355k9231j5346r2058J78645j20786
815e3904k38159J05376J15074j17042J04368K0731O767j1514K1757N8821p1403
804e9128J50063j01572j13006k2831R6038J94155m8820r5079Q4517O3677n0674
793I7340k22836P8168j4936n6253J24524j8195j86357L41884L6230j53510r3945
$$ y = [179950, 71780, -134453, -309980, -145931, -39248, -106935, -220352, -4010, 53130, -84860, -202232, -143569, -155883, -284483, -50592, -8590, -145875, -126486, -193950, -185608, -127721, -27383, -17251, -60138, 78326, -114780, 7440, 41454, -69796, -173895, -179281, -80727, -6118, -85475, 9040, 67249, 13824, -33560, -108265, -7501, 95516, 10775, 17659, 89231, 16427, -76991, -96089, -119508, -84483, 24872, -4359, -19705, -111763, 66882, -53904, -292063, -186687, -71613, -188655, -84287, -63556, -56789, -68303, -46546, 12275, -59128, 90935, -10637, -123643, -146474, -50436, 143719, 94899, -180, 84337, 148014, 97340, -125496, -47328, -62264, -118517, 6007, -12188, -198545, 143339, 179569, 26059, -67886]
782f7886K90192j11690j96677P6656K163M8588j03190p9384J0785M478J31098
771E133K22717j76034j33026J80571r9847M8013P3096L4936o9331j69788L39545
760B55985k20745j63316P2542J03816j38561K11895k0528J7182P3895N9271j00626
749A50810k25660p962M6887K6906r777m2810o8386o8440Q1245L2560j49027L7336
737a96318J07351J04497k2566j29371J28556P2987j58628P2436p0270j22055J37338
726g6043M5158j59916M3384q1522J21294R8352l78866N9895K45704j16299J15592
715h3267K00786m7125N0010k19736p7095Q7286r213M635j8624L5924o1681j55263
703b93363K93553p7164j51736J39498K0583P2344k3262L8691n7766n6795K49098
$$ y = [-67886, 222306, 110616, -86061, -9405, -7242, 41346, -61844, -141228, -130443, -125965, 5133, 227850, 51816, -81210, 99361, -486, 47527, 120623, 155559, 86228, -83560, 255985, 35240, -128076, -55534, 48282, -90279, 121616, 101088, 118270, 192165, 251436, 150810, -74850, -82812, -35925, -9019, -18796, -61606, -129992, -198432, -117187, -84627, -233654, -196318, -88967, 15530, -7036, -136407, -7851, 65136, -93492, -21056, -91326, -213381, -76043, -30885, -190801, -147417, -228939, -107645, -9293, -388159, -328264, -82560, -198859, -83267, 117519, 70394, 120404, -99332, -176427, -89141, -98354, -93719, -112343, -76419, -138100, -293363, 190, -76974, -228710, -89212, -68629, 3715, -19547, 19144, -38622, -95417, 153681]
692A53681N4418j57100k32437K09754O2097j20147K7210j21892p5823j28255K19711
681a08783K63321o8326j28656J86622j0057j51185m1304o7798M9857l989J0698
670f9600m6974o1827j1692M3501J30556m0092j11247J19039k09630O3893J5005
659a79068K4529K0344m6811N946O7664J32028P7757m139k33575P3295J33911J44326
647B16207o2650K3371R7728m7187j41799j44810Q9000o2949j68359J19604N7531
636b4313K1723r9082J28942k89291J6625K5680M1257J02737m5837O6204L2883
625b2472p8415M8629j46151M1122J71654L7681k59881L9628O961N3916J36993
614B9665M5063J6289m7832l9253J35426q1304P237j7707n2571J8404K681J04319
$$ y = [153681, 208099, 50999, -181438, 28316, 90413, -29734, -2524, -124416, -200239, -328494, -108783, 154538, 86212, -42444, 144178, 134121, -17064, -58368, -126166, -76309, -80298, -69600, -116574, -178401, -190093, -146592, -16036, -56128, -167375, -48336, -257966, -194073, -179068, -154539, -134195, -181006, -175060, -107396, 24632, 102389, 98250, -135325, -62030, 71881, 216207, 153557, 176928, 274656, 227469, 85670, -59140, 29860, -33089, -201448, -81844, -24313, -2590, -101672, 27270, -262021, -245396, -219716, -178459, -75722, -121559, -55355, -22472, -100887, -52258, -198409, -157287, 14367, 52048, -207833, -168205, -161244, -107328, 29665, 74728, 91017, 43185, 3932, 139358, 58054, 65291, 47584, -4987, 13417, 16098, 120417]
602A20417j88573p9073L2305K46201L935k51052p2197K69541Q6669k17103j44591
591a93521r3248K13484Q2495j29844J45497m7632l640P3725m7723k4855k0009
580d5271o1615o5345n5847J19994Q7261j4659j64614J21251q4444j7135J84840
569D416j22956j44181K5348Q2721J49353p2873M9761j29897K813l3650k5531J78084
557c6592J54287o1941J56459l6008k57529O3399j9727j72519J01488K55516N662
546A52495k68684P8271Q0294j05176j37471j2151N5965l4509J28369P4743n8470
535d6324n8682n8298O123Q4354M5785l10266J36398K96145j7412j52293J38126
524F3656L4256p407p4218k36602K94171m2750j47122P704n2938q090J40729k7151
$$ y = [120417, -68156, -147229, -114924, 131277, 135212, -115840, -188037, 81504, 168173, -48930, -193521, -286769, -73285, 9210, -120634, 24863, -22769, -26409, 47316, -407, -25262, -45271, -106886, -172231, -228078, -108084, -20823, -35482, -200096, -78845, -163289, -180424, 4416, -118540, -262721, -237373, -154652, -5299, -78172, -28411, -158308, -155495, -189145, -214676, -36592, 117695, 55754, 212213, 176205, -81324, -17925, -37652, -210171, -108683, 146833, 152495, -116189, -37918, 42376, -62800, -200271, -212422, -156457, -190966, -62597, 12146, -46324, -105006, -163304, -157181, -72827, -27042, -337308, -200910, 95235, 77823, -74470, 63656, 97912, 90505, 16287, -220315, 73856, 31106, -116016, -108312, -161250, -169340, -28611, -55762]
512e5762j67060J99955n2439r8486J83098L1191p7749K5667q5621O9328J62035
501A34157j69898J379j87549R8576q4445K1334P7127Q0563K9858n918m0091j59711
489b04618l6833K1097n0161J64382L1457j77946o4126K52680j3348o4192J1174
478a30434K132N0155k9252J03010K3732r8570k3827k3041l3710k9024N3131R3488
466d2210l5765J02953R5959j2736j42937J68921j6217K4566P5443k14463k2757
455a9243o4472J90446l7484j16742j16581J72221J36055l6324k3456p7995L4677
444D1102R0847J424j88538J8716O8774K6840L7765K8803J53583j69424k74936
433a65044O1134O0659J40830j38628K0835J10535p2601j24884K5469J11112P230
$$ y = [-55762, -222822, -22867, -75306, -173792, 9306, 40497, -37252, -11585, -97206, -27878, 134157, -35741, -34362, -221911, -123335, -207780, -186446, -109319, -28756, 1102, -4816, -44907, -204618, -241451, -220354, -270515, -106133, -74676, -252622, -316748, -64068, -77416, -141608, -130434, -128302, -78147, -107399, -4389, 19343, -79227, -103054, -126095, -159805, -188829, -135698, -42210, -77975, 24978, 120937, 108201, -34736, 134185, 117968, 142534, 217977, 3514, -19243, -83715, 106731, 69247, -47495, -164076, 8145, 144200, 107876, 84420, 6425, 41102, 131949, 133373, -55165, -36449, 32325, 59165, 96930, 125733, 279316, 109892, -165044, -103910, -43251, 97579, -41049, -20214, 90321, 17720, -107164, -81695, 29417, 36647]
422C6647n6934R4983M0153r4252m2781J17558K3825n9083j25353j79646M1094
411b03789k2251L7269Q0323K32714M866l5260n3080J26761l4361k11228N8206
400a9830q7754j13591N2360J2349O3123L26262J39405j69496r6633q1610j366
389B3219K05677j23065p7504l3542r2003P7273l0344N5435l0869l9760j60973
378b26456R15J83080K8702P9660p8298r5475N2069j143j00377J27595j4231J1257
366c2702p0218K1138K3156N2811R5931j46945k7739J88331j62850O9135l9817
355b9769J52885o0302k88815J69749K57097r9608l9865M869j65382j54880J21564
344a32457O2008R9964m3124J71008Q8715j46824j86164O9767K13607o4534p6364
$$ y = [36647, -20287, 74696, 114849, 20597, -22184, 95374, 119199, 60116, -65237, -244883, -203789, -226040, -188771, -108448, 124266, 129132, 93872, 40792, 167553, 133192, -78036, -19830, -107584, -221175, -168815, -156466, -93343, 232919, 372324, 202828, 106195, 24585, 23219, 228896, 105831, 28327, -5215, -97218, -19945, -50289, 5146, -25723, -65483, -226456, -225541, -42461, -13759, 65901, -12397, -107872, -55803, -56946, -157323, -29728, -43959, -32702, -102920, -81782, -58626, -5815, 90116, -56829, -84568, 103763, -59087, 10048, -29769, 123116, 62814, -226001, -56252, 200845, 101237, 61372, 66241, -99141, -254021, -132457, -70449, 29515, -13609, 157399, 246114, 99290, -86874, -17107, 196500, 131966, 55602]
333E5602k49413J79613R2373o6485n5037K2917P2149m6086r7929j06327q4053
322b82676K8913R4168K06842O6402k26498k03415K77954j2032k0295R0019J05811
311A25193k02515r9885K83196o1598r4354K57161M8776Q276k04863J9557o4393
300A4551j05747o7352J66227J06528j67373k7724Q0318O0738J46419p058j51179
289D8348J16103K590O4280J3125r2309q5693o5447o0927N4847p3418j51012j6198
277b45711K71140K233J8713J01355k5422k3200j08202K4975O1181o7236q4537
266g4711J0194q8936J45609K17998n0881j23320l4807q0752N6952L4253J30257
255A41856j22899o7950J5614L1511J00474m2139K8544k4960p7506o7619J0296
$$ y = [55602, -193811, -14198, 78175, 11690, -43347, -20430, 51719, 5633, -92296, -198623, -282676, -253763, -159595, 47247, 113649, -112849, -316264, -38310, -50342, -70637, 19382, 125193, -77322, -177207, 105989, 44391, -49963, 207198, 255974, 264250, 59387, 78944, 14551, -91196, -158548, 7679, 114207, -53166, -80890, -572, 60166, 206585, 199527, 48348, 164451, 167041, 231321, 244446, 152137, 66444, 997, -59930, -5083, -78501, -229513, -245711, 25429, 27662, 46375, 147730, 122308, 99108, -9094, 15881, 77062, 9826, -74711, -64517, -153453, -7844, 210154, 159273, 35953, 1146, -79606, -22654, 11599, 141856, 18957, -48993, -33379, -1868, 98606, 56467, 85011, 60051, -17455, -85074, -74778]
244g4778J01855O4561l9031k93753J22589J53677q7085m0125j2126K05241n9374
$$ y = [-74778, 27077, 91638, 52607, -241146, -118557, 35120, -51965, -92090, -104216, 101025, 41651]
$$ [...]
##END NTUPLES=NMR SPECTRUM
##END=
