##TITLE=1H_TG-2341x2
 DMSO
 8 sc, 
 24.3.2023
##JCAMPDX= 6.0         $$ Bruker NMR JCAMP-DX V2.0
##DATA TYPE= NMR SPECTRUM
##DATA CLASS= NTUPLES
##ORIGIN= UXNMR, Bruker Analytische Messtechnik GmbH
##OWNER= root
$$ XWIN-NMR		Version 3.5
$$ Fri Mar 24 15:27:34 2023 Russian Standard Time (UT+4h)  she@DPX200
##.OBSERVE FREQUENCY= 200.13135
##.OBSERVE NUCLEUS= ^1H
##.ACQUISITION MODE= SIMULTANEOUS
##.ACQUISITION SCHEME= undefined
##.AVERAGES= 8
##.DIGITISER RES= 18
##SPECTROMETER/DATA SYSTEM= spect
##.PULSE SEQUENCE= zg30
##.SOLVENT NAME= D2O
##.SHIFT REFERENCE= (INTERNAL, D2O, 0, 15.8185)
##AUDIT TRAIL= $$ (NUMBER, WHEN, WHO, WHERE, WHAT)
$$ ##TITLE= Audit trail, XWIN-NMR		Version 3.5
$$ ##JCAMPDX= 5.01
$$ ##ORIGIN= Bruker BioSpin GmbH
$$ ##OWNER= she
$$ F:/spectra/data/she/nmr/H-F/1/pdata/1/auditp.txt
$$ ##AUDIT TRAIL=  $$ (NUMBER, WHEN, WHO, WHERE, WHAT)
(   1,<2023-03-24 15:24:44.15 +0400>,<she>,<DPX200>,
      <created by zg, POWCHK disabled, PULCHK disabled
       configuration hash MD5:
       00 E9 B6 7A A2 85 ED C7 34 08 36 98 17 FE 4E 26
       data hash MD5: 16K
       C9 32 71 DB D9 9D EB 6A 21 2D 93 EC C7 62 CC B7>)
(   2,<2023-03-24 15:24:46.81 +0400>,<she>,<DPX200>,
      <Start of raw data processing
       efp BC_mod = 2 LB = 0.24 FT_mod = 6 PKNL = 1 PHC0 = -19015.31 PHC1 = 8.800793 SI = 16K 
       data hash MD5: 16K
       29 32 DF 65 9A 6C 38 FE 52 41 B1 4C 6B F9 A8 41>)
(   3,<2023-03-24 15:25:06.82 +0400>,<she>,<DPX200>,
      <pk PHC0 = -95.38481 PHC1 = 6.799999 
       data hash MD5: 16K
       CF EC 6B 2F 59 91 37 B3 71 83 E3 C4 F6 50 25 97>)
(   4,<2023-03-24 15:25:10.04 +0400>,<she>,<DPX200>,
      <abs ABSG = 5 
       data hash MD5: 16K
       90 63 9C 0C D3 37 CC 6C C8 DF E8 31 4C A4 57 4A>)
$$ ##END=
$$ 
$$ hash MD5
$$ 6C 78 78 56 CE B0 3B E6 F7 6F 4C FA 10 51 C7 0B
##$RELAX= 
##$RELAX= 
##$RELAX= 
##$RELAX= 
##$RELAX= 
##$RELAX= 
$$ Bruker specific parameters
$$ --------------------------
##$DU= <F:/spectra>
##$EXPNO= 1
##$NAME= <H-F>
##$PROCNO= 1
##$TYPE= <nmr>
##$USER= <she>
##$AMP= (0..31)
100 100 100 100 100 100 100 100 100 100 100 100 100 100 100 100 100 100 
100 100 100 100 100 100 100 100 100 100 100 100 100 100 
##$AQSEQ= 0
##$AQ_mod= 1
##$AUNM= <au_zg>
##$AUTOPOS= <>
##$BF1= 200.13
##$BF2= 200.13
##$BF3= 200.13
##$BF4= 200.13
##$BF5= 200.13
##$BF6= 200.13
##$BF7= 200.13
##$BF8= 200.13
##$BYTORDA= 1
##$CFDGTYP= 0
##$CFRGTYP= 5
##$CHEMSTR= <none>
##$CNST= (0..31)
1 1 145 1 1 1 1 1 1 1 1 1 1 1 1 1 1 1 1 1 1 1 1 1 1 1 1 1 1 1 1 1 
##$CPDPRG= <>
##$CPDPRG1= <>
##$CPDPRG2= <>
##$CPDPRG3= <>
##$CPDPRG4= <mlev>
##$CPDPRG5= <mlev>
##$CPDPRG6= <mlev>
##$CPDPRG7= <mlev>
##$CPDPRG8= <mlev>
##$CPDPRGB= <>
##$CPDPRGT= <>
##$D= (0..31)
0 1.2 0 0 0 0 0 0 0 0.06 0 0.03 0 0 0 0 0.0002 0 0 0 0 0 0 0 0 0 0 0 0 
0 0 0 
##$DATE= 1679657083
##$DBL= (0..7)
120 120 120 120 120 120 120 120 
##$DBP= (0..7)
150 150 150 150 150 150 150 150 
##$DBP07= 0
##$DBPNAM0= <>
##$DBPNAM1= <>
##$DBPNAM2= <>
##$DBPNAM3= <>
##$DBPNAM4= <>
$$ [...]
##$SUBNAM3= <"">
##$SUBNAM4= <"">
##$SUBNAM5= <"">
##$SUBNAM6= <"">
##$SUBNAM7= <"">
##$SUBNAM8= <"">
##$SUBNAM9= <"">
##$SW= 18.05172834244
##$SWIBOX= (0..15)
0 0 2 0 0 0 0 0 0 0 0 0 0 0 0 0 
##$SW_h= 3612.71676300578
##$TD= 16384
##$TD0= 1
##$TE= 0
##$TE2= 300
##$TE3= 300
##$TEG= 300
##$TL= (0..7)
0 120 120 120 120 120 120 120 
##$TP= (0..7)
150 150 150 150 150 150 150 150 
##$TP07= 0
##$TPNAME0= <>
##$TPNAME1= <>
##$TPNAME2= <>
##$TPNAME3= <>
##$TPNAME4= <>
##$TPNAME5= <>
##$TPNAME6= <>
##$TPNAME7= <>
##$TPOAL= (0..7)
0.5 0.5 0.5 0.5 0.5 0.5 0.5 0.5 
##$TPOFFS= (0..7)
0 0 0 0 0 0 0 0 
##$TUNHIN= 0
##$TUNHOUT= 0
##$TUNXOUT= 0
##$USERA1= <user>
##$USERA2= <user>
##$USERA3= <user>
##$USERA4= <user>
##$USERA5= <user>
##$V9= 5
##$VALIST= <valist>
##$VCLIST= <CCCCCCCCCCCCCCC>
##$VD= 0
##$VDLIST= <DDDDDDDDDDDDDDD>
##$VPLIST= <PPPPPPPPPPPPPPP>
##$VTLIST= <TTTTTTTTTTTTTTT>
##$WBST= 1024
##$WBSW= 4
##$XGAIN= (0..3)
0 0 0 0 
##$XL= 0
##$YL= 0
##$YMAX_a= 390449
##$YMIN_a= -479525
##$ZGOPTNS= <>
##$ZL1= 120
##$ZL2= 120
##$ZL3= 120
##$ZL4= 120
##$ABSF1= 15.81851
##$ABSF2= -2.233341
##$ABSG= 5
##$ABSL= 3
##$ALPHA= 0
##$AQORDER= 0
##$ASSFAC= 0
##$ASSFACI= 0
##$ASSFACX= 0
##$ASSWID= 0
##$AUNMP= <proc_1d>
##$AZFE= 0.1
##$AZFW= 0.1
##$BCFW= 0
##$BC_mod= 2
##$BYTORDP= 0
##$COROFFS= 0
##$CY= -3
##$DATMOD= 1
##$DC= 0
##$DFILT= <>
##$DTYPP= 0
##$F1P= 0
##$F2P= 0
##$FCOR= 1
##$FTSIZE= 16384
##$FT_mod= 6
##$GAMMA= 0
##$GB= 0
##$INTBC= 1
##$INTSCL= 3.70164e-10
##$ISEN= 128
##$LB= 0.24
##$LEV0= 0
##$LPBIN= 0
##$MAXI= 10000
##$MC2= 0
##$MEAN= 0
##$ME_mod= 0
##$MI= 1.114404
##$NCOEF= 0
##$NC_proc= -6
##$NLEV= 6
##$NOISF1= 3.799351
##$NOISF2= 2.8
##$NSP= 0
##$NTH_PI= 0
##$NZP= 0
##$OFFSET= 15.81851
##$PC= 1
##$PHC0= -19110.7
##$PHC1= 15.60079
##$PH_mod= 1
##$PKNL= yes
##$PPARMOD= 0
##$PSCAL= 0
##$PSIGN= 0
##$REVERSE= no
##$SF= 200.12999060058
##$SI= 16384
##$SIGF1= 3
##$SIGF2= 2
##$SINO= 5.538805
##$SIOLD= 16384
##$SREGLST= <1H.CDCl3>
##$SSB= 0
##$STSI= 16384
##$STSR= 0
##$SW_p= 3612.71676300578
##$SYMM= 0
##$S_DEV= 0
##$TDeff= 16384
##$TDoff= 0
##$TI= <>
##$TILT= no
##$TM1= 0
##$TM2= 0
##$TOPLEV= 0
##$USERP1= <user>
##$USERP2= <user>
##$USERP3= <user>
##$USERP4= <user>
##$USERP5= <user>
##$WDW= 1
##$XDIM= 16384
##$YMAX_p= 376600647
##$YMIN_p= -540125
$$ End of Bruker specific parameters
$$ ---------------------------------
##NTUPLES= NMR SPECTRUM
##VAR_NAME=  FREQUENCY,     SPECTRUM/REAL,   SPECTRUM/IMAG
##SYMBOL=    X,             R,               I
##VAR_TYPE=  INDEPENDENT,   DEPENDENT,       DEPENDENT
##VAR_FORM=  AFFN,          ASDF,            ASDF
##VAR_DIM=   16384,         16384,           16384
##UNITS=     HZ,            ARBITRARY UNITS, ARBITRARY UNITS
##FACTOR=    0.220516191357247, 1,           1
##FIRST=     3165.7582687308, 0,             0
##LAST=      -446.958494274981, 0,           0
##MIN=       -446.958494274981, -540125,     0
##MAX=       3165.7582687308, 376600647,     0
$$ Real data points
##PAGE= N=1
##DATA TABLE= (X++(R..R)), XYDATA
$$ [...]
11807 -31623 -138722 -128667 -68540 11801 76058 7823 42854 99474 -30056 -49155 13137
11796 13137 30959 -22655 -94309 -79287 -15009 30215 -1865 -89790 -41428 -62360 -6000 14720
11784 14720 15913 -13886 -177145 -146044 -68574 -80450 -12311 103309 112467 58821 30414 -50984
11772 -50984 -89478 -113421 -181648 -28005 12424 67655 -21738 -128971 -63257 -62090 -117510
11761 -117510 -166930 -114506 43112 54126 -6777 -55593 -83850 -81887 -29618 -67680 -87377
11750 -87377 -47863 -64730 -97694 18739 110950 97802 121204 -52435 -60240 -40507 -85381
11739 -85381 -101064 -118856 -130965 -82785 -75261 12570 -22840 -29605 32457 9770 -56494 -104927
11727 -104927 -114196 -81642 -56031 -96531 -85519 -87699 -75745 -59962 -101834 -116356 -48369 6122
11715 6122 42274 -32939 -124208 -85029 49112 -5175 -67246 -55126 -173786 -207658 -187468
11704 -187468 -11579 40356 -22922 -61335 -30762 -92232 -70332 -92244 -13287 -11262 59701
11693 59701 139774 48948 -141716 -168778 -200560 -145317 -128602 -164366 -203271 -185663 -161594
11682 -161594 -194547 -235782 -238384 -181442 -80128 32590 -80182 -122174 -26934 -22230 -190314
11671 -190314 -167986 -97681 -135301 -195254 -25572 25938 69459 -79061 -171164 -163838 -152530
11660 -152530 -217713 -138512 -59267 -16080 -109250 -146903 -119439 -72586 -24946 -90427 -105700
11649 -105700 -103265 -13489 24296 -27032 -85954 -160229 -145837 -63172 -100283 -40001 -42585 -53419
11637 -53419 -87949 -133581 -55650 -171480 -219076 -108248 -55801 -215326 -82415 -74594 -43774
11626 -43774 -34047 -126222 -10596 -79269 -57356 32836 -20003 -65262 -17245 18667 -40894 -108833
11614 -108833 -84314 -122884 -37912 -30477 -109756 -81400 -115444 -154814 -82985 -92166 -42240 43440
11602 43440 89140 93449 37955 -12311 -91333 -95069 -129415 -68764 -103873 -88807 -77251 -25706
11590 -25706 -88258 -146199 -181961 -115558 -53009 -143042 -47320 -69303 -105834 -179500 -164050 -224839
11578 -224839 -244858 -204668 -239362 -190047 -104698 -97408 -93457 62505 -3532 -128611 -99103
11567 -99103 -36649 -17181 -96871 -81378 -109726 26351 83741 -52348 -37671 96767 153161
11556 153161 75842 -62079 -49720 -19321 -24767 8080 -147113 -109347 -52571 -20891 8257
11545 8257 -16452 -14871 -1818 63398 -20056 -73182 3566 73052 -56225 -100701 -93551 -24126
11533 -24126 2716 -19056 76887 22513 -22188 -61621 -93680 -97040 -125960 -152954 -126907 -67765
11521 -67765 -35544 -78622 -129833 -130041 -35694 -67977 -70501 -52257 -83473 20045 -79834 -72380
11509 -72380 -65664 -40799 -59668 -24092 535 -42434 -166953 -28116 -8927 12869 -46654
11498 -46654 -165967 -128907 -73577 -115375 -117543 -50029 -68203 -54365 -80101 -72111 -20095 -4303
11486 -4303 -62213 -19137 61440 -26264 -2862 530 -18593 -3655 -4150 74865 -2168 33847
11474 33847 55106 6659 -29314 8965 18669 27028 -66279 -88956 -46182 -35767 -21054 -54470
11462 -54470 25388 35520 -48048 -74168 -68314 -44477 -36782 -26764 31675 24967 -40641 -130704
11450 -130704 -180446 -164691 -37760 -19449 -101466 -191342 -179963 -118141 -67575 -78547 -114122
11439 -114122 -30085 -43895 -51001 -112297 -72268 -94605 -92563 -134363 -58634 -64200 881 95442
11427 95442 34887 -13077 -17590 -23943 31891 -7368 -47691 -220391 -251060 -119320 -105837 -44525
11415 -44525 63417 64299 -28843 -8532 -48893 3603 35180 -51618 -33001 -96684 -68666 -46003
11403 -46003 -84892 -75878 -13933 10603 81459 43534 21143 -118727 -94870 7128 -596 -72351
11391 -72351 -190524 -90470 -50525 -69624 -85743 -121799 -155552 -129834 -108020 -85991 41678
11380 41678 -6740 -37982 -70518 -89314 -58519 15797 78825 -378 5129 -90536 -69916 -151511
11368 -151511 -124676 -124077 -23515 -38978 -39022 4938 -34836 -65379 -113012 283 158731 115410
11356 115410 15995 -98998 -213892 -155279 -96914 -133076 -57687 33149 77987 -5700 41363
11345 41363 13003 7487 94719 43757 3984 -66868 -168306 -154432 -111369 -66460 -34528 -63753
11333 -63753 -35411 5111 -14682 -13047 -45078 -122480 -134458 -168671 -120202 -25088 -36228 -75119
11321 -75119 -196133 -230355 -103228 -16789 -3899 -144081 -102273 -68209 -79572 -109214 -141413
11310 -141413 -109251 -97906 -131843 -102567 -35949 72621 15911 -153891 -92685 -55175 -22514
11299 -22514 -45355 -19922 -16653 -23433 -72766 -116237 -130938 -147724 -207721 -167205 -147391 -82281
11287 -82281 -50251 -9659 -43133 -120169 -45799 -60306 4147 28554 -69512 14997 -15831 -73187
11275 -73187 -43197 13781 -6051 -104041 -41129 -58679 -84476 -182970 -246096 -249409 -134115 -84051
11263 -84051 -181208 -244904 -243554 -187216 -139214 -160770 -58580 -58530 -34688 -17758 822 47805
11251 47805 769 20255 -55412 26664 84738 55566 -4984 5633 15205 -33195 -10852 -92540
11239 -92540 -73000 4311 -3787 11849 44614 -36839 -21522 -81332 -129679 -68987 -31481 -44819
11227 -44819 -109641 -40980 -26154 -68457 366 23097 -70096 4437 -52478 -116264 -133399 -104713
11215 -104713 -58190 -50902 -29867 -100349 -55480 -155598 -170530 -48014 -13037 -11713 -33781
11204 -33781 -71878 43662 8507 -90185 -52767 -46968 70644 84238 7702 -59153 -41159
11193 -41159 96223 3590 -59248 10724 62674 40788 48023 -18323 -32044 -55268 -119403 -119397
11181 -119397 -71412 -2154 -38208 -40219 -26556 -60961 6770 -86229 -12078 4779 -50053 -143578
11169 -143578 -105311 -59452 -58479 -69654 -29969 -23345 -3574 -36818 -44750 -77245 -140299 -34319
11157 -34319 4779 54837 -63109 -19570 19375 28593 21026 -3016 -33542 -54519 -67681 -55711
11145 -55711 -61947 -75955 -141624 -68971 -31329 -35724 -18705 52909 49456 41438 6447 -49172
11133 -49172 -50386 -105713 -118440 -12845 -20121 -56950 -196396 -189901 -85408 10101 16073 -25912
11121 -25912 44523 60911 -57575 -72218 3066 -22824 -132050 -93021 -14103 -84961 -64691
11110 -64691 9585 -39369 36742 4633 -23358 -67800 -91498 -99695 -62198 19771 14747 -41594
11098 -41594 12004 58054 -51827 -26803 -90831 -49921 -104800 -82984 16289 5635 63914
11087 63914 28464 -34419 37441 66540 19144 -17180 -13291 -11459 33855 -1295 -26898 -60742
11075 -60742 -69551 -118761 -67991 100021 6927 -80178 -36495 -24918 -110953 -30088 18961 -38475
11063 -38475 100457 107342 37278 -36078 -62403 -108374 -77380 -2124 12036 -6472 -3947 77825
11051 77825 -75157 -31943 -14539 -44107 -13846 -110965 -73087 35527 60589 49800 16369
11040 16369 103761 96199 19934 31894 75764 108054 83262 138855 69553 53659 28152 1496
11028 1496 31239 39908 21580 -11698 -21990 19781 1191 9130 48174 142613 128003 161160
11016 161160 158047 199415 107917 146697 230980 137178 162403 114971 59185 83016 23926 -3546
11004 -3546 -58842 -98280 -36052 2510 55185 25964 100071 81876 107762 111777 65208 27480
10992 27480 17553 -2287 -78691 -67632 29966 53721 141253 181778 158791 146954 126378 100858
10980 100858 21444 9932 83295 108822 96616 38823 -3026 87922 119115 121685 68751 10646
10968 10646 75914 20326 -48012 64297 104126 108677 182390 148728 72049 102761 71074 183572
10956 183572 165696 86237 99518 89010 84393 93496 157083 164058 75467 108668 50182 -9143
10944 -9143 17658 14322 121113 69617 57036 92551 155441 80830 56733 90692 51610 125694
10932 125694 65681 153258 155694 83413 106808 86752 53740 73924 198095 195516 132395 100061
10920 100061 161338 146170 149146 174901 93811 52102 155696 199556 140107 147689 173628 123976
10908 123976 159099 163631 93289 129328 115228 85989 86524 72018 145644 200024 210874 141873
10896 141873 151018 169337 165537 156657 288674 209765 128727 127068 134529 259476 198245 212945
10884 212945 108063 73369 198385 251536 226600 192190 227105 224785 167133 104195 236517
10873 236517 449915 358752 353033 491201 305561 172743 186546 246862 286040 300136 203752
10862 203752 281325 273606 286631 408828 409459 474799 384401 427856 588721 491519 430894 420833
10850 420833 385676 386188 403991 476220 479943 404607 304561 486710 424794 419458 411503 382166
10838 382166 358469 420373 508661 438110 515511 488041 600707 669911 656106 611091 511386
10827 511386 512217 525016 455837 442427 489339 530331 580888 532863 407101 408055 476182 408636
10815 408636 427869 495572 527265 425871 393302 458487 479327 389816 403177 399035 464128
10804 464128 530070 482909 462470 478640 551174 477640 382134 417293 368731 412859 413626 448017
10792 448017 555528 514121 427596 367195 339962 459006 548483 453420 289595 324003 380824
10781 380824 415124 406539 299436 346663 347470 494036 424483 374132 438769 271335 183069
10770 183069 168335 188491 273753 284149 363468 441723 418558 408599 332441 250007 345741 288348
10758 288348 428296 356422 358515 425027 348660 275451 393346 381612 274593 308982 298546
10747 298546 288928 276301 326695 358301 388045 385618 392491 264424 233616 182037 223658 195950
10735 195950 136878 198831 240574 265015 258079 237558 295264 385188 375798 298895 250699 269331
10723 269331 338634 373664 413242 349079 333759 289819 319563 372398 468350 484107 361785
10712 361785 394933 403447 438616 462292 492254 390005 311592 380105 426574 354117 297743
10701 297743 339859 457981 484743 430425 448449 409595 499921 497126 483746 443992 495958
10690 495958 437712 331524 395363 512507 544665 531253 553696 547932 551114 493363 447182
10679 447182 428174 539215 422370 338151 353444 435313 470578 460801 547627 558248 610393
10668 610393 534974 499662 522670 477537 482120 559993 592945 440365 461625 449290 519210
10657 519210 665859 694401 612760 566235 563512 618869 581814 541853 593224 683852 773857
10646 773857 756327 739186 713655 718125 654252 676423 674373 773815 803987 760967 689105 834553
10634 834553 762172 776920 829339 788521 919441 873194 859900 966287 995010 964827 929670
10623 929670 969997 991358 910724 1023235 985997 1001248 1119856 1132224 1054283 1113233 1134843
10612 1134843 1085061 1173655 1151294 1158261 1182269 1192459 1299579 1198361 1262809 1300045 1297590
10601 1297590 1269820 1280418 1289071 1214424 1315882 1341758 1311525 1399037 1429656 1410537 1490477
10590 1490477 1473860 1524210 1596799 1659511 1701992 1640688 1712236 1717231 1642054 1732615 1831748
10579 1831748 1935642 1960452 1926825 2009582 2026106 2094248 2069925 2146430 2354659 2301440 2349557
10568 2349557 2269482 2346076 2407421 2440861 2526677 2676682 2755071 2781995 2814267 2826981 2936539
10557 2936539 3040368 3104501 3167690 3283866 3320466 3426427 3519455 3560002 3660544 3718721
10547 3718721 3775705 3899858 3961483 3977034 4057131 4035282 4079142 4259376 4262581 4315151 4429569
10536 4429569 4508749 4520753 4649474 4691851 4795524 4756400 4841154 4858174 4921328 5095912 5165282
10525 5165282 5169932 5188201 5240728 5096450 5206043 5327703 5370880 5411534 5449335 5487335 5455871
10514 5455871 5593602 5673083 5578639 5550301 5677863 5738497 5825148 5955905 6003423 6125062
10504 6125062 6249600 6195753 6190639 6301306 6373532 6437199 6484148 6652928 6646336 6679989 6756514
10493 6756514 6921070 6817507 6842299 6916191 6845993 6853043 6905756 6847730 6900019 6874746 6779239
10482 6779239 6858679 6812891 6766433 6781323 6760999 6699226 6689670 6555677 6460864 6370557 6336659
10471 6336659 6322159 6278686 6242622 6204575 6172880 6076528 5902336 5879632 5863114 5809610 5771142
10460 5771142 5729512 5767680 5705078 5562828 5496987 5417590 5472363 5381379 5308560 5257356 5232367
10449 5232367 5320860 5223906 5204739 5063997 4961372 5070937 5037065 4897314 4722093 4739464
10439 4739464 4862028 4728315 4643282 4556336 4451425 4435806 4305065 4221248 4108807 3991997
10429 3991997 3920061 4009497 3827942 3617691 3607061 3494176 3475433 3345748 3275039 3167839
10419 3167839 3095108 2950587 2851189 2746068 2732567 2822350 2606896 2462742 2470053 2359246
10409 2359246 2247743 2147613 2078669 2029422 1917024 1895624 2008720 1876616 1671293 1707775
10399 1707775 1782259 1696140 1643534 1649486 1564865 1492154 1440219 1426672 1484870 1412394 1283265
10388 1283265 1179685 1261637 1296640 1166566 1115958 1133592 1095569 1119252 1070646 982287 1017959
10377 1017959 880287 948510 982520 946482 981218 1046515 969784 924561 952905 944939 935862
10366 935862 911697 914241 857006 838869 816741 775765 782597 634508 712387 713016 640929 734836
10354 734836 703365 731619 740326 744199 732522 674285 606950 599992 659948 646797 566479 579528
10342 579528 575255 586014 583821 677743 729328 696382 674173 633268 563721 576227 646703 569394
10330 569394 569437 493707 631503 600530 498226 527915 479140 420329 454913 563463 514740
10319 514740 586296 583295 555694 607525 535453 501949 558459 654545 647599 618905 588670 462340
10307 462340 410727 543227 498751 442649 400411 425651 501894 461958 450776 453981 487640
10296 487640 491588 345693 317796 480412 331354 265398 394519 431410 449406 421582 443110
10285 443110 428309 455535 447063 294469 345430 399171 498290 465349 375755 398989 413633
10274 413633 377872 359642 466473 506028 505558 493549 482233 427440 389386 390807 414219 518103
10262 518103 496885 386429 373455 452955 506061 506667 548191 414682 361120 499047 542349
10251 542349 488158 427050 480231 510679 570160 572187 507276 558417 561537 448634 404334 467052
10239 467052 465773 406004 497815 549941 570285 531557 524115 523113 502124 553235 553445 507627
10227 507627 452059 491519 474754 450566 582932 500153 553059 575467 589667 574508 593152
10216 593152 462368 563587 702036 540235 488948 484939 437412 468454 482966 503357 538235
10205 538235 554731 662703 648895 667831 677107 783924 710760 680309 730212 742212 650135
10194 650135 572810 528154 641937 636260 665402 742214 646853 735138 676154 732844 756365
10183 756365 743437 749546 713574 695630 739184 772340 694097 755589 724309 796455 827721 811276
10171 811276 857316 887087 854328 773911 875885 943000 924831 956053 1028210 1081433 1035958
10160 1035958 1005043 1056442 1079456 1061048 981640 956067 1040042 954775 1001824 1003371 969441
10149 969441 1026891 1027462 1111135 1197241 1178646 1165611 1212945 1189022 1138263 1116906 1212012 1225417
10137 1225417 1255706 1243097 1339901 1418878 1366103 1351563 1369050 1493474 1431681 1419742 1415881
10126 1415881 1451205 1518819 1545818 1578908 1547634 1563744 1603234 1561454 1554097 1589717 1647135
10115 1647135 1699480 1700542 1801448 1864323 1842473 1950476 1974632 1988130 2009331 2138692 2039013
10104 2039013 2063405 2098559 2164960 2288338 2381551 2399631 2466972 2484497 2549986 2521172 2569727
10093 2569727 2714137 2711233 2703450 2798327 2973861 3051162 3114630 3187509 3279886 3313942 3321293
10082 3321293 3356074 3408726 3481335 3639036 3750030 3878332 4046133 4080194 4075671 4218686
10072 4218686 4293067 4354034 4467329 4551191 4664525 4823996 4915780 5022358 5096509 5170532
10062 5170532 5166832 5379979 5428147 5502409 5679379 5870211 5885596 5978037 5916374 5854703 5993765
10051 5993765 6127686 6170337 6317185 6480378 6413437 6431686 6312897 6329481 6515308 6448627
10041 6448627 6525316 6551619 6544904 6497227 6504573 6612235 6745837 6758921 6823616 6914259 6826857
10030 6826857 6923751 7124297 7070511 7109652 7054464 6994731 7136281 7035358 7002353 7141726
10020 7141726 7181362 7194654 7292918 7349337 7442254 7471857 7525998 7485307 7463472 7511467 7499626
10009 7499626 7461035 7356258 7375040 7380634 7349507 7423299 7343111 7206721 7174496 7140550 7089966
9998 7089966 7025824 6923808 6908656 6921488 6857793 6748508 6569870 6528791 6488266 6322027 6199201
9987 6199201 6093304 6019353 5977287 5954851 5834302 5756753 5699391 5509111 5546945 5483763 5312255
9976 5312255 5291855 5165277 5099784 4999164 4913459 4836882 4789583 4804051 4720841 4672264 4619876
9965 4619876 4607700 4642014 4586566 4536150 4622262 4530529 4520755 4431501 4295767 4275660 4115477
9954 4115477 4000281 3891828 3849015 3859835 3876372 3727327 3656564 3484576 3436276 3482354 3455283
9943 3455283 3362077 3210244 3146860 3044895 2975177 2954663 2755444 2693204 2607033 2576600 2432727
9932 2432727 2367963 2331170 2300551 2230733 2115946 2078162 2043145 2030281 1914039 1913445 1926559
9921 1926559 1910913 1926819 1638958 1701367 1717870 1762598 1648430 1541462 1504142 1509231 1433046
9910 1433046 1391876 1321121 1224728 1281614 1263717 1416413 1236995 1283885 1232779 1256474 1269316
9899 1269316 1250784 1173028 1102665 1162145 1166395 1040735 975513 968902 960091 1090963 1043331 1026001
9887 1026001 900421 907001 960927 888684 889453 839851 868858 855006 839711 923674 950032 879427
9875 879427 830704 873578 871691 793009 800880 847768 797013 714086 768207 684300 623432 626369
9863 626369 679827 635818 590833 540277 701080 653687 625571 633964 655605 717382 678177 559509
9851 559509 497455 503823 526229 635197 629959 632186 648277 632980 492964 464263 678187 662850
9839 662850 575741 556852 566337 655759 556682 574295 471185 456191 455955 339396 443593 488375
9827 488375 505236 452048 430323 473875 446569 446798 467200 442557 449438 471810 501182 478548
9815 478548 488550 468623 456073 467934 445228 400627 394110 511066 476599 364367 449006
9804 449006 415104 440456 461384 421625 436216 350027 409980 427845 453952 481997 470765 497768
9792 497768 435635 366132 330201 426559 522237 512103 488059 457677 469258 464347 455001 405636
9780 405636 400635 474828 482917 367450 329967 404751 324826 400408 407651 349339 378412 414252
9768 414252 461027 496477 497435 534484 522128 387485 395419 444592 425024 479607 523800 538022
9756 538022 539049 623937 571975 526776 523076 468101 449781 458771 515381 458033 536103 487415
9744 487415 473685 509871 579035 695520 703303 510430 686380 736637 650439 652246 696426
9733 696426 660223 563326 579838 650653 798832 775670 701874 648966 583648 590567 502111 509875
9721 509875 533236 573426 662045 689487 775076 680352 646345 650723 680201 736875 676235 717055
9709 717055 677849 729127 740161 705621 668872 646406 702197 831766 742333 679101 633902
9698 633902 632096 708281 708064 650221 645207 654037 699272 700025 686898 715998 571434 576756 567555
9685 567555 588263 642319 695373 632824 489769 516975 550245 546458 672590 698890 620600
9674 620600 614414 556541 581190 566709 594551 525625 484972 485660 426066 368392 345300 384564
9662 384564 445186 471290 302791 337325 370918 378386 326765 419660 343564 240173 332738
9651 332738 401805 234418 199773 224345 240702 258201 325265 311444 313324 317483 296928 291237
9639 291237 224755 206485 156545 171957 222747 273246 327102 326820 328515 303760 303906 359818 375877
9626 375877 287141 182706 173200 230707 271030 312189 270820 316407 270273 143791 238136
9615 238136 271800 243901 268332 235809 316014 384972 347631 262727 236894 264321 225496 190429
9603 190429 145749 180974 180409 127600 114859 156620 129643 173315 276867 343423 328667 206651
9591 206651 214633 135029 17824 80254 143845 240982 218993 252404 211081 106246 175099
9580 175099 205949 198227 243308 214160 232986 227371 238133 264831 259265 244087 223091 277638
9568 277638 253700 235517 253573 209801 190334 148755 146884 288885 338087 343379 359533 348641
9556 348641 333701 300993 272344 288409 281918 275487 252379 130728 180369 264891 207574 157508
9544 157508 119942 117716 156604 181476 263889 216133 283707 266964 274668 321929 188896 133841
9532 133841 273270 362525 175755 227916 192060 205584 283506 234433 294478 309482 250817
9521 250817 354285 385750 350020 309308 202658 175057 161253 180427 248341 244817 217168
9510 217168 303140 306749 257474 159340 131396 237672 330754 453083 414718 259483 342577
9499 342577 326598 270686 277627 284464 328669 291874 339225 287443 248653 325545 477336 479219
9487 479219 420323 482608 439801 409760 307006 344173 365916 313901 338517 254718 279660
9476 279660 384565 367263 332521 296965 390149 454437 458511 378391 442266 355523 377698 374605
9464 374605 388148 431196 293087 247546 298477 327116 320443 264295 323839 322332 344265 376950
9452 376950 399344 330195 214409 276473 406086 434327 356779 368387 403412 448592 447313
9441 447313 474525 429598 419861 339380 369566 373248 399741 398108 403066 456941 523668 416200
9429 416200 403567 427698 439335 508516 413305 404558 436135 460237 431724 432918 408429 447666
9417 447666 463908 331088 348879 467848 484032 479908 444677 436993 404375 380820 365221 391415
9405 391415 350974 248092 381588 451533 384151 415105 466884 375977 256444 287730 336772
9394 336772 269846 439815 399050 347136 471087 497147 412986 406289 439407 430723 387031 454718
9382 454718 474143 466853 466546 538203 460767 493844 509329 445986 420553 455101 444326 397744
9370 397744 422900 299010 319678 421579 318771 418691 436276 492282 471820 392511 319416
9359 319416 399863 462122 493942 499057 462258 526184 542075 528095 463509 521088 507789 575536
9347 575536 620635 646514 556908 494416 472021 496159 615422 587301 535069 567070 574643 687727
9335 687727 654399 761844 699875 629088 584387 599243 576621 597414 601426 542328 602165 661919
9323 661919 597446 624716 602978 623678 579990 660636 734292 701972 758277 721897 758401 745882
9311 745882 701004 756437 728044 707691 693536 725372 780848 788052 820522 763803 725726 748828
9299 748828 817235 748736 774747 810610 854431 860804 864553 891667 818605 797968 732602 780308
9287 780308 852946 876617 832788 864957 892328 865699 949557 880865 864806 874529 946577 1099638
9275 1099638 1011828 868614 916969 1014919 1079890 1134929 1041691 972593 1088011 1167735 1159512
9264 1159512 1188298 1175695 1187225 1254120 1246829 1248088 1260896 1219101 1271044 1384902 1386525 1375378
9252 1375378 1302131 1321720 1302773 1311796 1297685 1291723 1383088 1420399 1487569 1548229 1620242 1568936
9240 1568936 1580467 1588160 1618858 1655420 1616814 1558404 1655247 1625560 1589808 1551725 1619230 1716970
9228 1716970 1785363 1877251 1850699 1859753 1830276 1802458 1877884 1900582 1901656 1949266 1983174 1953994
9216 1953994 2061538 2128680 2161557 2079895 2014571 2076273 2100617 2211061 2235990 2322485 2317416
9205 2317416 2395307 2446066 2465169 2487833 2482962 2434743 2455686 2455300 2430576 2521255 2557600 2616543
9193 2616543 2817242 2818558 2823788 2763345 2829010 2818489 2915161 2922966 2944024 2948685 2972231 3087284
9181 3087284 3085362 3189555 3202366 3219928 3276880 3305137 3321303 3370341 3505846 3576276 3545308
9170 3545308 3652112 3771878 3765634 3780175 3896787 3943641 3999064 4126212 4181238 4222953 4277426
9159 4277426 4371546 4380030 4340007 4408598 4514150 4539053 4702932 4847479 4922219 5039756 5188986
9148 5188986 5140670 5174567 5316100 5426628 5630787 5718908 5862017 6050724 6126238 6295497
9138 6295497 6394645 6466643 6642153 6727362 6835543 7010263 7222644 7356612 7571706 7736965
9128 7736965 7864738 8077674 8269231 8398293 8648476 8813501 9025086 9309168 9633652 9928490
9118 9928490 10217793 10593913 10865858 11201966 11523402 11841823 12310149 12669450 13181001 13704205
9108 13704205 14185860 14782969 15429210 15978922 16569726 17338809 18061353 18869827 19741339
9099 19741339 20584419 21458482 22469835 23418920 24486647 25589291 26512696 27443453 28428742
9090 28428742 29327394 29877638 30461096 30886420 31116354 31291078 31217377 31085879 30881263 30662145
9080 30662145 30308418 29915388 29648286 29357129 29136327 28942867 28757971 28611675 28524888 28516267
9070 28516267 28665739 28724105 28882142 29037869 29283098 29610459 30021006 30446807 31090900 31671334
9060 31671334 32213407 32857774 33560220 34276481 34962376 35602260 36268632 36667447 36846348
9051 36846348 36892352 36733596 36332149 35730999 34919412 33889269 32660712 31386955 30156847
9042 30156847 28881776 27620140 26456085 25462685 24401337 23410867 22410927 21527318 20574354
9033 20574354 19715652 18809496 17900698 17074793 16326501 15498534 14723286 13978006 13399829
9024 13399829 13011208 12424911 11802894 11305089 10847120 10404609 10015226 9654597 9206419
9015 9206419 9091453 8863041 8434242 8222295 8022598 7851730 7587910 7351682 7277641 7099920
9005 7099920 6960769 6876629 6654579 6493834 6379256 6219683 6040719 5940375 5828667 5706632
8995 5706632 5613636 5454059 5352486 5287418 5250160 5190207 5204122 5106213 5060181 4966296 4947741
8984 4947741 5004447 4852167 4670328 4725775 4705934 4596068 4497649 4520081 4607091 4601119 4649489
8973 4649489 4562404 4471525 4356212 4344050 4399028 4376176 4487907 4508594 4428714 4379847 4410213
8962 4410213 4454721 4463269 4491012 4486132 4531390 4507193 4494699 4515177 4501370 4509953 4419984 4413632
8950 4413632 4574290 4676276 4705274 4704223 4702012 4761530 4912264 4888682 4901591 4873084 4908964
8939 4908964 4997565 5027613 5007731 5119624 5235462 5361317 5358293 5394173 5507803 5544257 5552470
8928 5552470 5610799 5724402 5851861 5980375 6003669 6062609 6216322 6199279 6180600 6293521
8918 6293521 6451318 6588686 6705208 6734286 6770256 6901232 7113527 7235501 7427420 7594319
8908 7594319 7661678 7911974 8118099 8369950 8511117 8702135 8739021 9029991 9336638 9458589
8898 9458589 9651468 9968468 10292120 10587699 10915085 11239578 11546049 11959512 12410707 12889514
8888 12889514 13469778 14183725 14768808 15376290 15903380 16501684 17112640 17657572 18274021
8879 18274021 18859925 19342603 19837485 20225713 20467141 20640050 20868627 20856403 20667987 20561724
8869 20561724 20501486 20525174 20420046 20484716 20507832 20701893 20898743 20915635 21206945 21580824
8859 21580824 21974425 22466464 22856978 23363616 24075681 24867175 25590577 26449725 27334573
8850 27334573 28215697 29122016 29983737 30841545 31666883 32344945 32949690 33311225 33564989
8841 33564989 33468521 33279415 32959388 32372516 31624648 30823302 30035051 29366791 28615718 27977609
8831 27977609 27219566 26494051 25948745 25501066 25121090 24789002 24464880 24301085 24170281
8822 24170281 24170558 24275231 24362783 24497230 24617328 24870675 25158275 25493609 25752903 26020568
8812 26020568 26160245 26295915 26346895 26357933 26270621 26066666 25668275 25129570 24506115 23723933
8802 23723933 22945193 22061639 21103553 20227783 19412263 18687005 18009185 17296558 16700779
8793 16700779 16113836 15708436 15387774 14863766 14529889 14104226 13763141 13576351 13361019
8784 13361019 13232441 13035497 12828034 12677525 12459040 12232584 12185934 11985632 11673648 11369079
8774 11369079 11093773 10846423 10507332 10250001 10163058 9896232 9500777 9313132 9127626 8912178
8764 8912178 8689315 8616603 8575161 8405188 8148059 8146062 8078866 8048095 8025285 7887960 7859181
8753 7859181 7873546 7860757 7886290 7895934 7990720 8035860 8075405 8094277 8215009 8368644 8553457
8742 8553457 8665376 8753547 9061797 9195700 9344488 9753209 10000834 10321598 10682552 11020958
8732 11020958 11470616 11827169 12162930 12654601 13017375 13312220 13579120 13926278 14077107
8723 14077107 14182932 14401934 14373229 14328699 14286353 14198400 14004341 13781404 13565089 13464617
8713 13464617 13304570 13051853 12981236 12919250 12989442 13033983 13158966 13353483 13547092 13685982
8703 13685982 13960471 14258780 14611361 14930083 15219156 15560049 15921209 16275339 16473097
8694 16473097 16672010 16828464 16925391 16975671 16936624 16779708 16488564 16206952 15892036 15317503
8684 15317503 14800326 14378849 13975604 13480289 13199621 12826783 12653237 12372595 12191616
8675 12191616 12004199 11880757 11694014 11696239 11614170 11610939 11512492 11447600 11499382 11466769 11384274
8664 11384274 11276903 11239363 11175220 10966429 10796176 10658989 10546134 10292647 9932256 9743328
8654 9743328 9442527 9164345 8922434 8608048 8182229 7911707 7633830 7329745 7034262 6841364
8644 6841364 6774265 6576358 6425886 6205042 6011819 5842348 5675076 5674671 5573261 5436175
8634 5436175 5383489 5325053 5092330 4962979 4703318 4545132 4342737 4326333 4130846 4046566
8624 4046566 4004690 3785752 3671709 3427826 3263841 3190430 3095423 3043282 2970926 2943417 2824815
8613 2824815 2609228 2605188 2588571 2501497 2422890 2296713 2289440 2288600 2307858 2265818 2140692 2090010
8601 2090010 2023498 2031500 1957660 1873242 1822498 1756654 1683112 1784682 1741214 1743260 1735372 1667541
8589 1667541 1623956 1574963 1557408 1434294 1300859 1174854 1233356 1269332 1157331 1216124 1213271
8578 1213271 1131210 1167613 1087639 1090833 1125398 1035445 1041435 991801 968952 960713 921283 914230
8566 914230 906430 883384 744232 800387 831244 895876 903105 810970 762392 757143 690746 764603
8554 764603 706580 714054 721304 713810 729172 613644 642275 634232 579087 658932 542140 486840
8542 486840 610442 643839 608273 562056 590853 454716 545762 660072 721373 699934 648850
8531 648850 616749 480303 493185 546462 573343 484053 443998 514991 539251 605024 525145
8520 525145 496404 597303 556033 526296 550712 417382 395600 437055 458606 435630 442222
8509 442222 457658 406030 415409 406843 401145 462428 480558 453672 474744 507204 401909 362526
8497 362526 297743 270862 329977 440059 487082 382797 358379 341651 353888 414912 371904
8486 371904 354028 318580 261994 382655 393163 403107 409855 390246 364278 298593 314690 324340
8474 324340 352271 362830 326807 352324 268046 238148 342031 330231 368319 359160 285825 325390
8462 325390 386090 347601 236900 281229 236898 224007 236838 232583 244589 348234 362752
8451 362752 337000 282854 280239 250479 263033 361850 309088 285994 305908 242677 168556 232777
8439 232777 188272 194404 154483 159581 190355 198663 59731 64870 160764 121431 128269 57328
8427 57328 39710 129926 57862 128238 131042 169841 214863 120909 228249 165188 198986 196691
8415 196691 155849 162538 137293 103156 121128 243070 219639 229236 139543 73998 61659 -7230
8403 -7230 -14477 22142 -41953 5580 87874 63590 76074 84524 52779 45198 96631 204411
8391 204411 78795 62659 68469 95624 83000 -21566 -59111 -39593 37072 41967 91140 87705
8379 87705 96640 128135 110898 97988 29539 27558 224044 130745 85466 81919 25242 -1414
8367 -1414 22632 23032 54022 137043 59367 9602 4309 1876 67561 85665 36483 17833 14700
8354 14700 -77461 20163 77403 -3270 -38099 -10623 -1065 72913 14396 -17099 17784 66469
8342 66469 28735 74773 46654 7700 53961 124921 202566 25195 -119518 -33967 62302
8331 62302 59169 115062 118862 100592 -14275 42818 118902 31695 19359 138903 170857 84947
8319 84947 89898 67493 29438 50832 -439 54790 103066 123603 83116 101670 117199 -2625
8307 -2625 -44794 2932 50684 -7014 -49833 10849 -12683 -36971 -80548 -84310 -55554 -54505
8295 -54505 71866 181189 134772 33589 1784 72747 24337 -28809 55500 19831 -23316
8284 -23316 35351 7203 12212 73534 52122 40203 -22697 75183 62084 -43314 -14203 -103281
8272 -103281 -98777 -142692 -150412 -57354 -31891 -87946 -109483 -78000 -48837 13429 42807 63288
8260 63288 25140 8630 34537 54999 74565 68300 55357 -15753 -111306 -61531 -13 52584
8248 52584 35441 99413 -27237 18511 121418 27293 18959 -31786 35482 -14151 -117039
8237 -117039 -114026 -83468 -115954 -168134 -174287 -134143 -137725 -191720 -187469 -111793 -97847 -76557
8225 -76557 -66598 -165293 -141534 -125189 -138840 29200 -19355 -122302 -83921 -50160 -70970 -144811
8213 -144811 -91853 -174085 -143862 -150472 -139277 11381 -30759 -70941 -130637 -218091 -164902 -37786
8201 -37786 -139866 -153784 -214935 -163025 -204650 -136779 -204710 -156318 -540125 -144915 400481
8190 400481 147700 113262 4043 -19679 -164746 7750 -62972 -75019 2302 61089 114367
8179 114367 139231 100446 -81939 -82130 73811 1753 164 74 19735 -60329 -26031 -82789
8167 -82789 -116279 -73509 101972 22206 16242 15070 -45977 -73612 -119071 -30272 -38021 -55502
8155 -55502 -105689 24844 116465 -63600 -124420 -148634 -262558 -173151 -139023 -114201 -186362
8144 -186362 -154610 -156347 -172142 -224296 -156459 -131736 -145284 -152920 -207686 -195774 -96322 -149278
8132 -149278 -188589 -95450 -107383 -46294 -45434 -86928 -32857 -31978 -80184 -141607 -45558 -104748
8120 -104748 -179517 -93356 893 -92352 -158957 -114705 -138778 -35022 21605 -34002 -121269
8109 -121269 -92151 -45348 -10008 -13516 27418 78638 32555 -11226 -93121 -189705 -215652 -98266
8097 -98266 -95010 -94552 1327 -71285 -176820 -70686 -46003 -119291 -86608 -22311 -70882 -117631
8085 -117631 -111698 -158804 -134877 -5495 -26018 -87725 -46877 -101027 -117511 -54519 -63152 -43772
8073 -43772 -100528 -170611 -45427 -114164 -43959 -10353 -49913 -82060 -95362 -63380 -99396 -54985
8061 -54985 18268 120200 101167 -9291 -39535 -73760 -14259 -56579 -137414 -83986 -174710
8050 -174710 -75866 -52725 -52237 -43710 -159162 -143181 -165079 -153938 -91017 -44903 -168404 -59631
8038 -59631 107943 65626 -79419 -94853 -76977 -105862 -99881 -67341 47591 121687 34990
8027 34990 72935 94678 -5780 -44915 -63630 -85077 -104861 -17105 -74795 -82997 -57170 -70057
8015 -70057 -12195 -25248 -67038 -80927 -91594 -114595 -96213 7963 -44783 -60188 -69222 -40362
8003 -40362 -84071 -113246 -95644 54795 -2620 -39387 -18996 54840 62464 -9079 -57030 -32808
7991 -32808 -11237 -54939 -65490 -90289 18262 -73761 -23369 -26582 32611 -34461 -63433 -88452
7979 -88452 -172878 -93739 -41058 -116779 -53065 -32988 -11841 32736 90397 101756 131674 77700
7967 77700 119145 165943 26416 -71351 -21232 -86740 -80999 -38364 -5417 75975 -32689 -63183
7955 -63183 -68677 -40231 43716 103262 88648 68307 -29260 -129712 -109112 -117841 -183948 -154904
7943 -154904 -156146 -37356 -50294 30419 -5744 1335 -15778 -8319 -18547 -62456 -56413 29207
7931 29207 55118 50211 -13395 -29303 -71753 -66398 -38695 -185482 -86582 -37173 -55378 -70664
7919 -70664 -160675 -207317 -7266 64662 -22656 -37192 46168 42543 -38527 -68347 19041 26533
7907 26533 56364 -49898 45946 83079 27583 5993 -94662 -33797 -129564 -83459 -90233 -7454
7895 -7454 -63564 -3049 9476 -74436 -15457 -2268 -79549 -119542 -77124 2063 -59017 11541
7883 11541 38527 16889 30965 49970 73154 -28346 -56310 -106208 -93356 -67488 39174
7872 39174 87866 99473 114835 97429 122030 48819 106093 18708 -26624 70213 42353 -54966
7860 -54966 -102284 -48512 8458 12716 -131403 9597 42499 71102 24368 34515 -28580 -138777
7848 -138777 -218916 -170277 -98240 10172 1412 -68361 33483 70266 49786 -57928 -22416
7837 -22416 -60683 26584 93150 -34574 -11475 10670 127754 101243 75652 -43279 -23177
7826 -23177 89275 115657 48679 41197 3907 885 45969 63236 59962 -17512 -119199 -22821
7814 -22821 20841 -32171 2074 58403 113091 172305 147911 48278 107084 115234 71324 17737
7802 17737 1432 43619 120237 3354 67118 131226 96904 28508 6733 2949 58662 169632
7790 169632 102600 62105 176300 204013 196461 170975 93583 159598 114925 49755 103584 154453
7778 154453 185105 138018 108741 138763 139488 84948 163270 144231 78291 198656 210354 181177
7766 181177 234756 151208 130018 33946 229686 252277 211919 123879 -20826 86890 90905
7755 90905 126922 91863 130665 141512 128925 121415 153634 97277 49680 55563 51016 83214
7743 83214 52190 124472 148795 61220 94326 103540 69838 109602 88643 87136 57219 109747
7731 109747 95179 107660 124631 67904 32688 62426 113329 138515 133929 182403 188645 145288
7719 145288 152765 158208 202611 196247 215033 266916 213820 137069 157910 149519 100036 117611
7707 117611 37046 70291 52045 94247 164022 122521 94175 110976 201284 68980 82257
7696 82257 132624 192360 195632 142109 133963 69438 208535 227369 190722 198577 139027 245451
7684 245451 287495 213101 277462 226924 139264 285326 288801 125375 36068 125534 30289
7673 30289 88990 201438 253653 203206 230831 295810 249315 240009 153641 119876 168411 344951
7661 344951 321345 246782 264158 270946 259735 298359 233028 218602 229729 203631 188696 264477
7649 264477 244369 196259 194425 221219 335848 375764 296686 188155 168864 258715 381084
7638 381084 308939 340076 290396 176395 168286 251601 238205 375296 329021 313429 276014
7627 276014 220692 197025 168614 157338 226046 216204 272749 313385 254305 250367 279773 262743
7615 262743 369808 367425 172253 150876 293648 326384 265972 318031 258917 244114 239337
7604 239337 239698 282880 314462 324535 343213 385244 464228 482030 395960 353338 407256 393409
7592 393409 300304 363309 357060 391576 428060 331527 340592 378308 414604 431212 407567 356362
7580 356362 410484 435724 499069 543422 531387 502792 592248 583483 462120 431718 507766 463797
7568 463797 465333 506332 412190 337465 341610 433002 565693 529765 546789 483500 523418 597326
7556 597326 627863 644871 620301 621632 583610 534597 727175 733662 670505 544831 583626 700503
7544 700503 761720 630327 557617 608418 621935 685909 665180 637806 697625 782206 782444 707574
7532 707574 721214 711663 673500 671894 768266 799965 739499 744898 739961 863286 894387 872214
7520 872214 813966 836386 980719 900066 761146 851133 912507 843603 926335 940225 877450
7509 877450 843336 838688 965716 997999 949744 949853 1048985 999504 1139106 1162650 1107322 1148112
7497 1148112 1138416 1065965 1189861 1139209 1163822 1065974 1094579 1185009 1213528 1245384 1185945
7486 1185945 1133763 1093704 1173128 1235643 1248648 1278569 1407481 1333660 1360124 1365050 1439013
7475 1439013 1540906 1510158 1477736 1514343 1618715 1666336 1696710 1715068 1725617 1781613 1882807
7464 1882807 1788674 1629862 1788223 1884229 1868355 1917777 1913782 1923721 1991388 2060157 2131435
7453 2131435 2201234 2173368 2276494 2273543 2366389 2419061 2345530 2316553 2469745 2534863 2568884
7442 2568884 2606555 2648106 2586956 2634621 2733599 2885646 2963292 2960597 2947795 3010257 3111124
7431 3111124 3119723 3316284 3261449 3371572 3533268 3523125 3572561 3592881 3784672 4003050 4137965
7420 4137965 4238110 4214410 4329123 4440361 4588155 4786563 4854943 4838813 4905156 4981965
7410 4981965 5090718 5296970 5556857 5768877 5941278 6072227 6358079 6517796 6657299 6812052
7400 6812052 6997516 7185195 7471808 7836704 8128479 8480666 8678341 8945325 9390313 9918284
7390 9918284 10429623 10875895 11319407 11817240 12552946 13107287 13814193 14578093 15428643 16360348
7380 16360348 17154936 17979677 18981818 20036033 21043681 22122691 23365985 24764560
7372 24764560 25945750 27286770 28366813 29344889 30028225 30388758 30350105 29958813 29384582
7363 29384582 28087054 26656021 25234582 23642604 22178751 20761927 19506715 18295487
7355 18295487 17222461 16168425 15034658 14010160 13034453 12220340 11503545 10833056 10159487
7346 10159487 9623883 9030698 8523701 8057004 7619992 7309582 7032090 6661149 6308881
7337 6308881 6049615 5812062 5640833 5474664 5169700 5022000 4867803 4643384 4483766 4261120
7327 4261120 4124009 3987851 3824708 3731396 3635366 3591491 3373933 3391889 3359773 3158796
7317 3158796 3000307 2908304 2966635 2956193 2736484 2677446 2729904 2643414 2549013 2524038 2514671
7306 2514671 2462953 2523072 2451844 2483668 2390450 2251942 2241068 2161410 2053959 2024853 1935962
7295 1935962 1949886 1998388 1896777 1867756 1809681 1643478 1612828 1683444 1661203 1590561 1582088
7284 1582088 1555636 1559919 1412215 1376217 1443233 1389598 1281221 1228397 1267980 1244348 1212568
7273 1212568 1319877 1304713 1197433 1139793 1164846 1121111 1093507 1157134 1113436 1128779 1027765
7262 1027765 1001741 950416 1003448 1066555 916331 998013 1064032 1088876 1040038 951336 921772
7251 921772 945968 871708 894684 900945 900316 911609 967468 991800 974728 988538 1012339 1046149
7239 1046149 1003010 954132 897887 753754 659393 698114 688410 781908 805345 759276 769909
7228 769909 779346 794373 826440 811990 816551 722550 780331 723287 659038 642336 655320 685362
7216 685362 775298 762548 699556 750439 652756 677320 625577 682227 813456 756560 700141
7205 700141 641722 643318 691461 587730 535643 528982 585691 641712 567689 642653 728043 685649
7193 685649 877300 849984 662324 575505 589230 610355 669224 662466 608355 640421 661364
7182 661364 682168 699927 673781 600901 580136 589033 620946 605856 589834 583610 567502 618401
7170 618401 488843 365376 568787 542024 524007 439297 548561 639767 547351 541352 583004
7159 583004 527090 446320 447348 529795 604154 672244 724980 686193 556047 461303 529891 654652
7147 654652 658096 674330 593324 502365 610023 477462 458245 526102 648672 645948 593403
7136 593403 600770 627832 520938 493252 577041 609904 601085 598085 554055 558461 508189 525653
7124 525653 651247 650776 644635 584142 541205 440213 470933 502837 632047 605351 560441 634917
7112 634917 644618 568881 612959 602819 678443 588294 588548 730252 583003 649824 555767 531655
7100 531655 568232 603276 661957 658985 650785 558980 568406 593650 583775 558840 589557 522354
7088 522354 587217 579567 653235 613877 590539 589323 629764 792898 715942 587908 582704 663629
7076 663629 620267 612207 574338 545314 576045 664910 660052 655292 667819 616083 612408 662284
7064 662284 571611 632712 705014 734947 660919 613861 603130 682085 650061 661915 678686 707745
7052 707745 664778 605804 619883 622853 751035 799025 788802 724232 666869 632013 623899 633417
7040 633417 669364 554173 571543 653081 688077 759667 763894 693836 794621 878922 818594
7029 818594 734818 796438 889593 834377 778120 770176 776867 749975 707277 743939 739665 690677
7017 690677 698636 711474 652521 648528 693765 680831 740136 692028 683885 759917 753345 738657
7005 738657 685887 687209 693808 779154 781247 898084 905554 894897 931601 820192 779065 850326
6993 850326 918517 763736 838483 835773 780951 844934 836343 819319 804997 727143 784536 797144
6981 797144 921221 976307 928307 956463 976578 894257 1044283 905719 957956 935321 934483
6970 934483 944851 944550 1040841 974215 921968 892322 866211 934522 1010095 944707 1097233 1167786
6958 1167786 1181678 1159505 1128318 1023039 983238 1019950 1034692 1045742 1048667 1075044 1026130
6947 1026130 969666 979485 962378 1000635 941044 999119 1080023 1096950 1008273 1034909 998045 939091
6935 939091 919637 931084 899106 979466 908805 965078 930494 1007635 1068565 1026818 1017452 1024081
6923 1024081 1031020 1045509 1040514 1003490 1054870 1057531 1019693 892178 963644 1051663 1014195 973653
6911 973653 1022502 1005348 1060598 1087605 1070351 1026489 937354 963820 977727 1050859 1102272 1099996
6899 1099996 1097507 1171433 1248435 1282083 1160828 1237259 1142947 1196983 1183022 1073874 1116119
6888 1116119 1166409 1213718 1067970 1016648 1011611 1082014 1221616 1275153 1210698 1206071 1192705
6877 1192705 1210955 1265280 1332030 1239098 1183352 1224104 1189338 1325722 1334682 1332894 1300553 1281301
6865 1281301 1364932 1395636 1388722 1273168 1169694 1279534 1317535 1268543 1425319 1310005 1308228
6854 1308228 1308280 1395930 1290023 1259820 1379500 1405782 1343541 1443630 1432919 1398516 1356898
6843 1356898 1262229 1253439 1355685 1349829 1364674 1429578 1412358 1392781 1349902 1424109 1486325 1533799
6831 1533799 1452617 1451919 1575261 1557431 1541838 1482632 1491587 1509023 1507416 1455667 1537115 1601411
6819 1601411 1609184 1604148 1659086 1539486 1474110 1534233 1575565 1617399 1613590 1650846 1630393 1623791
6807 1623791 1628954 1584901 1668417 1762305 1746118 1784440 1733520 1751849 1899465 1821182 1663226
6796 1663226 1687057 1619219 1621995 1633416 1792070 1867465 1855533 1844532 1827817 1808004 1809827 1858175
6784 1858175 1799810 1815014 1863330 1837773 1917072 1882825 1899455 1909753 1928809 1945977 1956305
6773 1956305 2005132 2027116 2038793 2031413 2086596 2111874 2021520 2030601 2004181 2054150 2064343 2128709
6761 2128709 2126308 2049448 2018590 2054567 2125256 2196401 2220379 2168624 2090857 2211082 2193491
6750 2193491 2193969 2254601 2252627 2260793 2259282 2268915 2191842 2259064 2332106 2391746 2300813 2237424 2237716
6737 2237716 2292687 2474921 2474538 2428289 2453367 2481354 2478837 2469958 2560998 2600626 2504616 2529293
6725 2529293 2576277 2573010 2580633 2523441 2554150 2589870 2710077 2747223 2764326 2854300 2727808
6714 2727808 2704706 2927204 2822817 2912715 2926980 2900120 2978511 2981694 2929732 2891042 2873572
6703 2873572 3000164 2991742 2978498 3086798 3160652 3157951 3125063 3126082 3125546 3243763 3189395 3198612
6691 3198612 3204183 3159052 3206820 3368220 3428821 3452298 3488064 3494925 3595444 3570028 3546255
6680 3546255 3619517 3580141 3620715 3599678 3707674 3745774 3727732 3730645 3752627 3723306 3724600 3797406
6668 3797406 3903753 3967100 4033843 4070323 4061080 4038291 4143595 4176457 4194921 4271811 4292667
6657 4292667 4296760 4300138 4360715 4389866 4369021 4348658 4346481 4371160 4543844 4547417 4741207 4715441
6645 4715441 4645060 4692998 4665771 4725653 4797528 4809932 4813786 4897199 5051612 5086642 5151405
6634 5151405 5229369 5136614 5224235 5407801 5475570 5459360 5460312 5518910 5531007 5499107 5538462 5544275
6622 5544275 5609113 5669091 5742991 5858600 5882769 5930741 5989102 6086562 6122485 6103106 6133308
6611 6133308 6183759 6287442 6419253 6385890 6345572 6419480 6537028 6617989 6639909 6722994 6730013
6600 6730013 6854807 6947424 6894592 6992189 7029799 7099062 7199025 7226724 7263354 7353315 7482799
6589 7482799 7591283 7653708 7703228 7786978 7833772 7895881 7934213 7976716 8159672 8158535 8329345
6578 8329345 8372953 8452345 8561859 8556384 8757471 8911194 9010956 8996276 9052907 9192796 9337086
6567 9337086 9487293 9501821 9530085 9649546 9810174 9918156 10055998 10189582 10351538 10436123
6557 10436123 10510529 10712442 10766919 10861681 11084164 11207449 11246340 11345935 11404477 11544566
6547 11544566 11748523 11985183 12165199 12217433 12355324 12496764 12665096 12825351 12869228 13006481
6537 13006481 13157646 13394988 13616957 13743477 13895426 14052400 14106670 14294228 14532813 14633868
6527 14633868 14812671 14973203 15048317 15257045 15438618 15593559 15824884 15998339 16169759 16383287
6517 16383287 16655474 16746906 16797569 17033760 17284911 17484544 17644543 17817432 18048621 18390482
6507 18390482 18512510 18751723 18884848 19108007 19316659 19616774 19913599 20135988 20424898
6498 20424898 20626814 20818725 21104417 21294037 21500123 21903678 22213648 22414300 22578288
6489 22578288 22928066 23284565 23570279 24005024 24251746 24592667 24855546 25192535 25587748
6480 25587748 25859223 26296075 26787891 27099416 27507309 27976933 28337318 28880034 29217669
6471 29217669 29646825 30051075 30570088 31017597 31363565 31904632 32445945 32945498 33567375
6462 33567375 34115511 34638170 35228250 35936890 36540911 37137779 37757349 38484413 39004467
6453 39004467 39562506 40297475 41112035 41779085 42521150 43421974 44129109 44907668 45667637
6444 45667637 46518209 47374814 48166897 49139702 50023244 50987206 52043734 52907705 53800337
6435 53800337 54845835 55876159 57038575 58146810 59419177 60655410 61867707 63036375
6427 63036375 64276539 65698765 67038474 68398766 69926705 71516095 73015190 74564588
6419 74564588 76176479 77918199 79541864 81263644 83135671 85091359 87020040 88978799
6411 88978799 91093995 93233748 95410403 97674925 99989899 102549397 105108286 107763645
6403 107763645 110482480 113330422 116290308 119539255 122756560 126092807 129605951 133254105
6395 133254105 137084259 141121989 145421026 149790082 154284682 159227156 164464776 169768768
6387 169768768 175548582 181369802 187533342 194092366 200888682 208083318 215687622 223540922
6379 223540922 231697675 240395757 249493433 258909925 268521071 278347218 288430046 298647721
6371 298647721 308976246 319212214 329173164 338661934 347630397 355637907 362655600 368508020
6363 368508020 372851320 375603274 376600647 375941301 373429393 369212394 363231675 355935143
6355 355935143 347369667 337860008 327338714 316148716 304751258 293196712 281676605
6348 281676605 270217883 258927774 247896546 237273362 227089977 217248114 207885415
6341 207885415 199049050 190616918 182672853 175049559 167829836 161020722 154677090 148620824
6333 148620824 142729152 137341923 132150967 127182093 122598073 118330914 114046561 110060485
6325 110060485 106290753 102571352 99225970 96009678 92863534 89869748 87083036 84399388
6317 84399388 81901278 79498281 77227578 74907818 72831410 70786687 68853304 66949513
6309 66949513 65125963 63399335 61734044 60056107 58571219 57036257 55598943 54213549
6301 54213549 52847570 51557191 50359837 49179764 47960574 46912886 45675279 44614383
6293 44614383 43691537 42736272 41784288 40913849 40059293 39190606 38346675 37560488 36777846
6284 36777846 36043347 35343710 34679930 33938471 33351895 32803802 32152605 31476707 30932356
6275 30932356 30289701 29667085 29199862 28691262 28185715 27682106 27256217 26770141 26254639
6266 26254639 25882774 25471987 24994911 24660841 24242476 23873158 23544017 23270496 22782249
6257 22782249 22399110 22156845 21733498 21330783 21094286 20906417 20625246 20332655 20090279
6248 20090279 19790804 19519149 19226489 18925457 18681529 18594496 18479719 18089953 17830834 17555944
6238 17555944 17366491 17084321 16892760 16789748 16626073 16365283 16214918 15995145 15845562
6229 15845562 15647334 15442652 15255345 15045450 14929371 14829582 14727133 14518035 14390238 14235711
6219 14235711 14163984 14010852 13885496 13809114 13618192 13403211 13380724 13191295 12989208 12993275
6209 12993275 12909462 12797369 12757734 12671934 12480890 12345486 12342643 12196514 12109060 12043948 12089400
6198 12089400 12022505 11828977 11838815 11718438 11609648 11544965 11531665 11479021 11538617 11435779 11376688
6187 11376688 11279424 11307591 11191979 11084183 11114808 11028307 11009233 11018145 10966751 10893752 10917882
6176 10917882 10922057 10853859 10744828 10725859 10702986 10737715 10748860 10673033 10753214 10740100 10739648 10738997
6164 10738997 10567896 10532904 10560005 10530985 10433813 10506032 10569157 10539754 10333421 10398103 10442165
6153 10442165 10361174 10267811 10279152 10249118 10270617 10292276 10184730 10221804 10054789 9983560 10066023
6142 10066023 10098801 10056448 9945244 10031534 10016365 10008715 9936409 9769233 9732268 9646154 9583977
6131 9583977 9619982 9584682 9564037 9556340 9379861 9319322 9322270 9199164 9180784 9091532 9063225
6120 9063225 9077280 9117974 9039810 8939804 8919060 8836783 8907595 8745087 8612377 8603537 8551825
6109 8551825 8548775 8430703 8409353 8426189 8289458 8307283 8304128 8257118 8104961 8070812 8085935
6098 8085935 8048511 8037313 7970182 7820856 7862466 7827563 7790173 7798904 7834664 7780571 7604599
6087 7604599 7512435 7558106 7506054 7470317 7442726 7440778 7460676 7362151 7315526 7389345 7471589 7304547
6075 7304547 7256408 7179725 7201717 7198585 7178500 7168086 7246328 7180515 7089771 7050479 7095730 7136402
6063 7136402 7093964 7032242 7084483 7133993 7118285 7223131 7173096 7198462 7199065 7172454 7203933 7182497
6051 7182497 7102285 7154385 7133791 7173180 7209828 7286759 7377191 7370084 7384844 7421081 7534077
6040 7534077 7583082 7573250 7628581 7729423 7823358 7898499 8037054 8117239 8234741 8288684 8373981
6029 8373981 8474688 8495769 8647082 8796136 9051589 9130846 9217162 9289984 9444606 9606368
6019 9606368 9690120 9718712 9810741 10032118 10211110 10269836 10552810 10723052 10781709 10860215 11136391
6008 11136391 11328523 11477653 11749865 11825483 12004432 12278299 12400767 12501755 12687393 12815525
5998 12815525 12983370 13204019 13459476 13647327 13892643 14021508 14104540 14242185 14388759 14461891
5988 14461891 14708628 14975937 15167661 15219975 15345576 15487680 15579188 15677837 15696870 15735375
5978 15735375 16001357 16166067 16232672 16370796 16536040 16690854 16885213 16985635 17050780 17116465
5968 17116465 17226374 17295998 17456743 17616728 17708226 17914128 18084328 18118311 18158635 18378321
5958 18378321 18353250 18421554 18632655 18684444 18753941 18792272 18917477 19049787 19067939 19102645 19204385
5947 19204385 19256875 19304222 19465051 19642893 19646705 19691121 19844022 19895449 20057600 20051932 20140087
5936 20140087 20350509 20496814 20552917 20571484 20663618 20781000 20899376 20982823 21262155 21510077
5926 21510077 21618433 21850988 22241599 22638023 22893293 23275461 23653823 24128844 24577362
5917 24577362 24991196 25578976 26199948 26846758 27532855 28285407 28998349 29772008 30754622
5908 30754622 31472396 32252288 33246957 34136537 34977151 35754481 36425558 37007012 37377639
5899 37377639 37596346 37796230 37871055 37662467 37346636 36989993 36450177 35968524 35507603 35046510
5889 35046510 34448088 33933447 33544156 33023292 32541700 32148308 31656270 31221214 30804552
5880 30804552 30326380 29820983 29179516 28549135 27898145 27144819 26425540 25698182 24875129
5871 24875129 23942099 23222347 22416492 21508822 20731704 19894455 19139621 18420890 17752411
5862 17752411 17099118 16614230 15995392 15469693 15024822 14495286 14060730 13645954 13220310
5853 13220310 12826215 12493708 12037311 11669455 11284538 11103709 10904796 10621068 10358243
5844 10358243 10134015 9900012 9572783 9431893 9192075 8992455 8864133 8673377 8496552
5835 8496552 8418895 8171009 7943743 7735818 7482508 7434763 7265051 7049290 6984552 6868486
5825 6868486 6728742 6634045 6550459 6377334 6217997 6174935 6098462 5979426 5825271 5622709
5815 5622709 5587776 5492466 5336498 5301938 5203930 5060423 5068612 5050864 4970119 4844323 4795093
5804 4795093 4678960 4679222 4573386 4450606 4426723 4363775 4318120 4363616 4310138 4129612 4216213
5793 4216213 4134397 3969418 3871188 3872380 4031371 4016600 3850728 3814077 3702252 3714942 3641404
5782 3641404 3533829 3476174 3402195 3389909 3344595 3284486 3313803 3268277 3197336 3072213 3008859
5771 3008859 2999799 3040832 3062065 3056358 2912867 2915182 2741330 2712360 2745325 2662424 2669831 2654544
5759 2654544 2696068 2678511 2545692 2540457 2529496 2509005 2427265 2487801 2428637 2324874 2373376
5748 2373376 2406078 2436734 2413169 2307425 2366482 2295284 2269617 2287318 2315831 2334112 2302167
5737 2302167 2272219 2282435 2342005 2220203 2169219 2127306 2114705 2003461 2025304 2029760 1968042
5726 1968042 1939309 1958683 1881607 1915013 1863366 1937257 1906210 2027677 1941357 1891781 1882435
5715 1882435 1918580 1877617 1807031 1786072 1835163 1960903 1973686 1917070 1873104 1783549 1776462
5704 1776462 1735142 1834003 1850383 1802828 1827924 1739746 1682326 1666229 1779479 1776388 1737950
5693 1737950 1733137 1732207 1724030 1666856 1580664 1632808 1622887 1703562 1632976 1593323 1596803 1648404 1618757
5680 1618757 1568455 1590823 1563325 1538217 1493504 1611971 1618062 1697683 1670039 1628657 1586082
5669 1586082 1543563 1569829 1622637 1590426 1564129 1557667 1472639 1527448 1578226 1568228 1578650 1591200
5657 1591200 1550123 1610284 1659308 1628160 1581385 1609657 1609770 1656282 1628954 1731512 1759091 1665585
5645 1665585 1584929 1707209 1778895 1726900 1676016 1704486 1682720 1612461 1698521 1647449 1665505
5634 1665505 1689009 1674489 1609510 1727762 1749570 1754774 1793667 1805705 1885808 1815589 1732922
5623 1732922 1728443 1759367 1862986 1977420 1954861 1982873 1996454 2001612 1968245 1970540 1997164 1987150
5611 1987150 1996721 1946026 1894695 1985828 1959274 1979074 2002635 1971382 1931624 1841817 1884104 1873575
5599 1873575 1866082 1956263 1888121 1892058 1785830 1899585 1979260 1876239 1935749 1898474 1892681
5588 1892681 1893838 1837308 1818603 1901172 1891335 1807971 1616845 1740914 1892645 1988827 1987818
5577 1987818 1919382 1955325 1959091 1849272 1887909 1973539 2060339 2100259 2056960 2000390 2035593
5566 2035593 1976156 1970305 2063864 2080945 2081231 2033486 2150132 2203395 2218475 2197581 2125083 2112642
5554 2112642 2067670 2170197 2217974 2157871 2270275 2151479 2186532 2176921 2161626 2111989 2119252
5543 2119252 2079319 2078994 2093570 2006263 2010885 1998669 1979891 1996874 2070273 2061788 2050486 2062063
5531 2062063 1971893 1875329 1914127 1899119 1810309 1892430 1916512 1894008 1847448 1795674 1791620 1871043
5519 1871043 1802182 1796654 1875470 1848715 1833835 1868147 1928112 1911461 1780345 1768538 1773966 1814626
5507 1814626 1843720 1807738 1793104 1780218 1786258 1755330 1827380 1836091 1889614 1796567 1708275 1685316
5495 1685316 1786196 1845695 1903123 1734795 1661401 1805548 1814687 1763774 1775305 1768233 1836061
5484 1836061 1829714 1701905 1684902 1580517 1664027 1784734 1691434 1631507 1697405 1672117 1588365
5473 1588365 1607361 1674385 1697183 1646393 1584405 1584431 1800756 1774884 1752709 1697426 1681346 1703793
5461 1703793 1716318 1701807 1771644 1810739 1794382 1814963 1774316 1798918 1913046 1890733 1878436
5450 1878436 1829772 1845431 1807842 1776391 1835999 1977011 1959653 1859617 1913359 1997177 2028877
5439 2028877 1941832 2072143 2074408 1995379 2023937 1946828 1913802 2001198 1936560 1915594 1862652
5428 1862652 1903441 1881254 1718833 1694024 1701055 1723482 1724691 1673336 1713657 1685859 1672277 1659491
5416 1659491 1696872 1705300 1612953 1564245 1445293 1436053 1477723 1424021 1483885 1463065 1500737 1402965
5404 1402965 1385288 1511804 1482406 1549120 1485403 1400538 1424108 1354345 1360827 1401633 1572255
5393 1572255 1544332 1389486 1320981 1242628 1258163 1320802 1312956 1335643 1358524 1350081 1341880 1403124
5381 1403124 1455224 1478261 1449274 1362089 1388126 1537270 1538938 1444600 1464639 1517230 1514187 1458948
5369 1458948 1498700 1498272 1392849 1375900 1340639 1571303 1543489 1589420 1556757 1535970 1590572
5358 1590572 1566841 1677479 1743302 1750283 1721818 1696844 1665445 1605507 1616748 1665714 1765050
5347 1765050 1755862 1615129 1718048 1743674 1720240 1690538 1713633 1719692 1711049 1681091 1699264 1715844
5335 1715844 1744137 1714114 1738881 1845312 1966941 1893821 1729011 1714734 1875592 1919606 1835971
5324 1835971 1755663 1812728 1797818 1889313 1919749 1901431 1935675 1973987 2053178 2048582 2066311 2104928
5312 2104928 2078507 2090038 2063999 2050202 2131222 2181589 2121952 2196136 2146639 2106326 2162447
5301 2162447 2220092 2276378 2349844 2209635 2197429 2266226 2227915 2256803 2239063 2256862 2344893
5290 2344893 2437044 2382629 2372377 2375462 2422086 2394184 2380743 2352225 2350967 2379293 2396820 2303677
5278 2303677 2276340 2369565 2251509 2239200 2212319 2138214 2151283 2160806 2142647 2185817 2120613
5267 2120613 2153238 2202498 2243124 2262120 2207173 2165048 2203723 2223920 2177835 2174896 2108508 2096961
5255 2096961 2089416 2028641 2026083 2177950 2153159 2151460 2093061 2146405 2100451 2138896 2153746 2193070
5243 2193070 2231223 2258769 2250434 2172042 2147565 2135480 2140181 2078753 2121833 2134136 2094444 2135285
5231 2135285 2053121 1970150 1996926 2050948 2087094 2035946 2043410 2011126 2005731 2005127 2004811 2097217 2068332
5218 2068332 2077500 1954474 1994688 2003396 1946229 1874423 1942447 1985360 1937626 1936704 1962459 1991751
5206 1991751 1948153 1954900 1933438 1995458 1942660 1891557 1846869 1864580 1987781 2037767 2022593
5195 2022593 1954404 2013248 2030904 2018901 2033570 1928754 2002031 1957961 2058547 2144033 2104899
5184 2104899 2043024 2079082 2111883 2026051 1959289 1977571 2037236 2013057 1974575 1998062 2008476
5173 2008476 1985316 2100863 2076741 2023603 2032661 2035975 1970879 1984518 2006483 2038901 2100002 2053888
5161 2053888 1999035 1995328 1957524 1881742 1991323 2001382 2059761 1927578 2007508 1995286 2028912
5150 2028912 2051444 1973019 1994768 2005031 1957555 2041722 2076999 2052171 1979230 1994142 2001826 2041833
5138 2041833 1953502 1929148 2043809 2022859 2048016 2061088 2101815 2024033 2086794 2109816 2092894
5127 2092894 1979871 1971624 1939281 1885453 1974637 2011780 2045405 2140437 2028847 2063096 2032108
5116 2032108 2108043 2136456 2063303 2051493 2116565 2054478 2172327 2089212 1974233 2138757 2338474
5105 2338474 2386007 2256232 2222595 2184659 2227133 2233697 2255105 2241758 2144991 2197778 2284594
5094 2284594 2363304 2349978 2349675 2395922 2339407 2435118 2548340 2500718 2427670 2522977 2622422 2639785
5082 2639785 2533374 2595978 2713350 2605386 2675183 2645498 2549375 2592712 2542879 2503676 2608149
5071 2608149 2667280 2661340 2686960 2730675 2848918 2929655 2885681 2910036 2899782 2804173 2797023 2843932
5059 2843932 2901347 2848142 2879869 2948938 2916281 2848696 2863843 2905764 2982679 3040118 3011410
5048 3011410 2984288 2922350 3001905 3063505 3101001 3102213 3015604 2970318 2989781 3075823 3116856 3122581
5036 3122581 3107259 3256964 3286141 3266112 3219721 3278928 3248311 3315161 3297406 3254608 3240380
5025 3240380 3375419 3401606 3396483 3323259 3384088 3292383 3171174 3325292 3356468 3511755 3552821
5014 3552821 3586744 3694653 3651143 3613423 3761557 3710008 3769620 3850238 3781586 3806000 3875650
5003 3875650 3890786 3953586 3994906 4090429 4121476 4240442 4288858 4244496 4352554 4419119 4408487
4992 4408487 4481998 4562765 4724612 4828425 4871097 4884037 4966099 5033824 4993320 4935635 5130942
4981 5130942 5307318 5342692 5486804 5551969 5699777 5727776 5748522 5781035 5857584 6019934 6092845
4970 6092845 6134135 6166646 6152595 6158675 6200690 6173275 6197538 6131504 6197097 6334770 6271416
4959 6271416 6287261 6319625 6266680 6332819 6413062 6281862 6327066 6501984 6449038 6447254 6573046
4948 6573046 6674853 6674368 6828394 6915451 6952210 7020203 7085608 7173716 7300727 7387366 7516070
4937 7516070 7560497 7637493 7684788 7700730 7801359 7898119 8028013 8111093 8092289 8214674 8293153
4926 8293153 8273317 8332336 8368812 8566736 8648495 8642922 8614992 8653806 8723708 8655747 8685646
4915 8685646 8678697 8584434 8647694 8651328 8561832 8449808 8470605 8429537 8324636 8380374 8391100
4904 8391100 8237124 8212124 8113532 8075985 8008871 7932392 7916449 7882780 7750705 7711493 7675389
4893 7675389 7629531 7559825 7606883 7626400 7628344 7694191 7598520 7576148 7647338 7638492 7491727 7415394
4881 7415394 7373171 7353892 7271256 7352713 7428937 7391956 7171401 7128903 7095368 7129978 6966611
4870 6966611 6950141 6886887 6730990 6781734 6642274 6511527 6332031 6233325 6139764 6072607 5962163
4859 5962163 5803782 5739755 5673221 5614888 5577389 5360012 5267227 5137895 5000502 4845381
4849 4845381 4884656 4770730 4640058 4586334 4489280 4437336 4390166 4325108 4215643 4190868 4146593
4838 4146593 4051128 3890963 3894359 3965967 3841492 3713513 3657247 3596819 3598508 3581197 3461879
4827 3461879 3532984 3506770 3486748 3397702 3314320 3403786 3449794 3345597 3375108 3428412 3461765
4816 3461765 3407436 3447804 3443562 3422095 3437388 3353663 3436067 3398976 3411504 3443127 3421376 3376296
4804 3376296 3364489 3478664 3505141 3521227 3660769 3656113 3603385 3560492 3646891 3603428 3758706
4793 3758706 3732029 3819363 3911167 3996853 3965829 3992561 4059392 4105688 4153900 4237391 4295775
4782 4295775 4449385 4545325 4516660 4582893 4642774 4692030 4682482 4772562 4847018 4996736 5028339
4771 5028339 5121537 5170974 5183411 5272653 5232972 5260030 5449332 5577938 5497178 5509856 5585172
4760 5585172 5588974 5616042 5668186 5717211 5731025 5761271 5826533 5874696 5926282 5934865 5957174 5964187
4748 5964187 6152411 6260953 6346627 6316643 6313458 6446119 6580963 6710501 6663502 6744179 6870912
4737 6870912 6867458 6938044 7001068 7186806 7230520 7194249 7293324 7277962 7431272 7459723 7495164
4726 7495164 7525819 7577666 7703798 7730586 7777292 7798424 7760305 7780586 7585211 7544052 7665368
4715 7665368 7715984 7614346 7430575 7347049 7459694 7434945 7300182 7280817 7307795 7221907 7155696
4704 7155696 7060520 7041193 6971305 6880439 6906315 6958341 6988606 7086000 7086841 7027838 6889044 6912464
4692 6912464 6933854 6867508 6798295 6825381 6862335 6843721 6819096 6852780 6742541 6716041 6755249
4681 6755249 6786807 6772143 6696385 6580840 6556712 6506586 6358654 6333844 6258479 6239714 6246750
4670 6246750 6212048 6093334 5958777 5911394 5839644 5668112 5548281 5437693 5330064 5223104
4660 5223104 5091638 5013701 4875048 4830249 4813355 4693656 4633216 4485486 4413021 4308228
4650 4308228 4272713 4185964 3996269 4024726 4057675 3978256 3950988 3963907 3913290 3872639 3788198
4639 3788198 3672224 3612922 3600852 3619625 3526721 3541595 3506356 3562330 3465342 3438353 3276117
4628 3276117 3190431 3089447 3122335 3050561 3015327 3006542 2911733 2883935 2780414 2745154 2690657
4617 2690657 2619883 2583690 2491504 2465382 2512324 2522738 2406723 2322056 2209542 2090753 2072612
4606 2072612 2049302 2121393 2113131 2199137 2097824 1966868 1939178 1889000 1868323 1866804 1836423
4595 1836423 1820472 1834005 1728843 1757539 1691568 1613594 1708539 1635109 1525518 1590306 1513745
4584 1513745 1534700 1616199 1611740 1631962 1571600 1553530 1478674 1466199 1470689 1429875 1449410 1435657
4572 1435657 1451439 1512614 1475104 1468689 1483484 1558320 1586242 1587738 1541023 1463708 1472728 1478138
4560 1478138 1464040 1426903 1421971 1436002 1455594 1428891 1452482 1492550 1467646 1553076 1429209
4549 1429209 1355244 1486351 1499872 1351625 1232035 1321715 1376188 1385065 1409415 1594593 1593346
4538 1593346 1522766 1490226 1509196 1447611 1370703 1408498 1410622 1371658 1467331 1469699 1360505 1331820
4526 1331820 1456532 1600709 1565809 1623116 1524938 1514129 1461915 1461446 1463632 1540346 1485134 1535793
4514 1535793 1638778 1640436 1525856 1564342 1616143 1616606 1485016 1494102 1524866 1574314 1558794 1546780
4502 1546780 1647171 1629799 1731875 1762443 1724924 1697466 1666573 1774291 1839566 1757465 1697825
4491 1697825 1669188 1683557 1650025 1692690 1783260 1841432 1928781 1864806 1711275 1697623 1770824
4480 1770824 1910916 1859770 1848910 1930060 1974842 1985424 1893991 1849765 1866747 1847547 1851867
4469 1851867 1992686 1973682 1922781 1999180 2158184 2206662 2267603 2161735 2150265 2136766 2223253
4458 2223253 2335716 2245138 2271344 2284472 2398687 2450117 2517606 2483065 2420457 2542476 2593404
4447 2593404 2584614 2678192 2800021 2839870 2807680 2874474 2875839 2952871 2976858 3027030 3015762 3091484
4435 3091484 3105905 3134263 3245125 3244979 3357825 3503244 3506616 3598533 3668558 3729377 3735973 3789859
4423 3789859 3910898 4025856 4051887 4132208 4209025 4320370 4506478 4568849 4562553 4735217 4809994
4412 4809994 4903250 5090691 5201566 5351674 5415056 5432191 5595928 5757866 5899121 6095496
4402 6095496 6228293 6366818 6602186 6831005 7055399 7236305 7422265 7778700 8179798 8500741
4392 8500741 8814571 9241039 9774565 10174878 10676837 11169252 11699713 12415337 13120082 13702816
4382 13702816 14393724 15185140 15985166 16793213 17407897 18165083 18828335 19506735 20314182
4373 20314182 20956425 21522940 22103524 22584433 22940049 23272768 23609505 23978093 24115046
4364 24115046 24130270 24086622 23810106 23563669 23180162 22650188 22066390 21517655 20995891 20393207
4354 20393207 19758462 19053705 18259641 17563211 16817442 15986126 15202285 14429506 13852803
4345 13852803 13161178 12465794 11793859 11066017 10523011 9857621 9364143 8911991 8521919
4336 8521919 8028680 7603031 7279117 6965888 6757634 6493341 6325152 6270537 6122328 5904803
4326 5904803 5730000 5586435 5460062 5349490 5193378 5085354 4959573 4871135 4807114 4679779
4316 4679779 4481574 4388060 4383432 4253124 4211941 4202403 4203771 4109022 4017662 3931075 3859897 3829647
4304 3829647 3829812 3947773 3889736 3824505 3682342 3702705 3851524 3808412 3697994 3654750 3514248
4293 3514248 3492926 3457637 3433488 3523583 3514722 3330289 3371739 3433711 3472475 3512535 3343700
4282 3343700 3303955 3330645 3326653 3364357 3364561 3304535 3340956 3326997 3318008 3336605 3295518 3238280
4270 3238280 3362743 3253220 3299235 3301833 3312915 3357323 3418842 3473322 3417557 3451928 3422422
4259 3422422 3409549 3425081 3588242 3583065 3559886 3478846 3511073 3478086 3453838 3530027 3480524
4248 3480524 3493820 3545683 3604165 3651562 3661834 3586693 3640129 3684589 3632025 3706758 3728954
4237 3728954 3640636 3675363 3810999 3849164 3906788 3879877 3919967 3949544 4099989 4095129 3904598
4226 3904598 3978930 4055796 3982186 3931783 4020758 4062136 4191308 4208803 4264780 4205001 4275425
4215 4275425 4310034 4280563 4351197 4452891 4502725 4563529 4501289 4525993 4604904 4670942 4674453
4204 4674453 4663459 4665118 4725232 4845977 4925795 5002875 5013340 5099525 5176199 5185568 5151611 5211894
4192 5211894 5128732 5201790 5345867 5428439 5471580 5632872 5606342 5693519 5769199 5777573 5886405
4181 5886405 5898289 5964859 6027597 6229140 6284311 6278098 6251565 6357726 6428121 6542996 6731480
4170 6731480 6843570 6903210 7038474 7049921 7181854 7212248 7148398 7297367 7533853 7656360
4160 7656360 7783565 7936462 7971038 8046639 8216664 8348159 8393060 8561869 8765443 8874769
4150 8874769 9043047 9100329 9166984 9314446 9468988 9548700 9749163 9855603 9962778 10185839
4140 10185839 10366451 10535642 10672253 10871762 11118166 11314341 11422755 11608469 11838557
4131 11838557 12055559 12285653 12548438 12829170 13072252 13316503 13497464 13730197 14117717
4122 14117717 14413498 14604912 14844688 15263202 15628739 16000503 16214595 16583974 16919945
4113 16919945 17177822 17597053 17938344 18254413 18614217 19007513 19546661 20024726 20475064
4104 20475064 20909466 21355262 21932729 22411142 22972612 23495890 24103842 24972421 25694562
4095 25694562 26245245 26911636 27693623 28546477 29469817 30409794 31485689 32554726 33733328
4086 33733328 34937563 36260570 37639702 39116434 40716199 42571484 44492159 46638689
4078 46638689 48950660 51522713 54244113 57281019 60487102 64077335 67960792 72049643
4070 72049643 76527512 81322789 86192840 91155574 95716818 99761378 103246147 105613990
4062 105613990 106924953 106985379 105621439 102905328 99050508 94540934 89682891 84949624
4054 84949624 80270269 75826739 71791447 68047909 64800489 61773724 59025943 56568783
4046 56568783 54326848 52289753 50527569 48876183 47293079 45882435 44743005 43785024
4038 43785024 42836855 42036060 41427246 40795099 40166239 39650891 39191913 38743791 38329193
4029 38329193 38118651 37933907 37667243 37570551 37509165 37490765 37583233 37641919 37651977 37770437
4019 37770437 37922157 38106196 38349158 38625829 38813987 39182167 39666741 40049776 40371839
4010 40371839 40799254 41218959 41787891 42184728 42768681 43344486 43902602 44427151 45080495
4001 45080495 45674789 46404252 47030983 47432385 48130116 48901430 49426274 49964886 50474359
3992 50474359 50999141 51496572 51932978 52423195 52917882 53331326 53906490 54280669 54581969
3983 54581969 54844348 55186023 55506347 55780482 55987138 56280788 56500132 56740795 57003077
3974 57003077 57279119 57515158 57606735 57467090 56875435 56244386 55612143 54372921 52536162
3965 52536162 50715745 48996936 47570148 46160864 44881737 43525503 42408137 41363596
3957 41363596 40297569 39320835 38384427 37371542 36450540 35385703 34494806 33841825 33158525
3948 33158525 32344571 31612659 30968168 30348641 29761381 29240776 28632304 28143291 27726801
3939 27726801 27181646 26774920 26420845 26142510 25824957 25458106 25107320 24897978 24789743
3930 24789743 24623813 24416353 24104357 24001349 23937707 23687524 23523764 23444836 23359547 23280300
3920 23280300 23194157 23211881 23208030 23098852 23113440 23194569 23178640 23220533 23147343 23292575 23390156
3909 23390156 23351803 23346084 23431489 23547039 23557973 23524165 23684464 23718914 23717348 23772631 23881651
3898 23881651 24081441 24226770 24267375 24343798 24462025 24530441 24608163 24778881 24808908 24757195
3888 24757195 24991915 25012429 25079700 25195583 25192166 25258394 25391862 25438595 25473340 25546326 25678083
3877 25678083 25774002 25763407 25828822 25814412 25924671 26112358 26215156 26228061 26341215 26437739
3867 26437739 26575330 26708709 26774174 26976454 27060998 27251506 27440824 27437860 27485139 27657424
3857 27657424 27831444 27978919 28122403 28183896 28321306 28500900 28717625 28843585 28995870 29282227
3847 29282227 29528840 29690842 29795672 30021060 30295578 30521805 30751445 31070327 31426599
3838 31426599 31774647 32074531 32564782 32998294 33489710 34083663 34608878 35105750 35707675
3829 35707675 36390566 37123783 37881125 38660864 39614429 40650056 41596058 42709368 43857284
3820 43857284 45120009 46400452 47648780 49041794 50586145 52153528 53729197 55305367
3812 55305367 57080995 58903793 60666135 62346815 64132980 65885778 67649119 69328581
3804 69328581 70945515 72547642 73936739 75173726 76243943 77215799 78049897 78634256 79061697
3795 79061697 79399057 79433980 79233027 78923701 78512870 77728400 76751534 75763078 74533993
3786 74533993 73264060 71852297 70381467 68628696 66881568 65164911 63343310 61473670
3778 61473670 59493495 57660039 55774380 54013126 52148810 50186980 48457820 46789905
3770 46789905 45070836 43399879 41837923 40350785 38985572 37634183 36411677 35227100
3762 35227100 34101332 33051103 32084890 31232579 30386895 29626471 28898689 28071429 27342200
3753 27342200 26837647 26287763 25688718 25163730 24829252 24293565 23833377 23363484 22996280
3744 22996280 22559968 22115344 21782848 21455092 21112544 20817920 20559894 20311782 20032571
3735 20032571 19712896 19482590 19208163 18909013 18611667 18283492 18064977 17816756 17565382
3726 17565382 17205651 17022452 16771947 16411575 16177167 16018759 15770723 15575900 15323633
3717 15323633 15089590 14807490 14509118 14272636 14119702 13926752 13630471 13425806 13285029
3708 13285029 13074850 13024196 13009685 12834618 12662941 12575832 12480046 12298952 12165304 11985784
3698 11985784 11924363 11748352 11655476 11656942 11578903 11550439 11480170 11447331 11422346 11447059 11415740
3687 11415740 11290180 11285666 11203314 11312776 11336242 11184217 11140141 11074571 11013616 11058711 11034340
3676 11034340 10961640 10931194 11063893 11117682 11081804 11139795 11211257 11212142 11270282 11150945 11243611
3665 11243611 11253386 11266067 11260767 11252620 11267867 11417592 11545592 11655805 11632790 11708076 11793246
3654 11793246 11834828 11952621 12066718 12115048 12146235 12283837 12413143 12566651 12637286 12814984
3644 12814984 12895409 12990431 13130801 13202725 13397636 13634845 13914704 14131518 14278019 14475586
3634 14475586 14710897 15059680 15252303 15487904 15775647 16137682 16428753 16728097 17033867
3625 17033867 17317815 17637116 18016478 18275361 18591287 19037554 19500141 19774136 20161616
3616 20161616 20437068 20713858 21029200 21388976 21808540 22062344 22398721 22687239 22938282
3607 22938282 23115544 23435480 23707936 24017155 24251430 24348901 24443815 24685833 24871424 25084070
3597 25084070 25332382 25579753 25647594 25608657 26048549 26250685 26437694 26690679 27020731 27309175
3587 27309175 27622548 27985883 28373383 28860745 29324709 29688351 30133039 30665360 31294168
3578 31294168 31927512 32535405 33231279 34028848 34822293 35669261 36534526 37477686 38440829
3569 38440829 39356413 40383071 41491387 42561272 43700127 44803536 45922501 47028704
3561 47028704 48108835 49279321 50210175 51189938 52205640 53294666 54237450 55112846 56000113
3552 56000113 56777018 57504550 58318496 58897019 59576545 60123365 60696052 61235829 61540912
3543 61540912 61934879 62254659 62593731 62876167 63028716 63182180 63408809 63511952 63589915 63638641
3533 63638641 63663124 63670061 63625590 63517833 63494198 63274135 63102137 62952701 62658356 62287679
3523 62287679 61854298 61463738 61078945 60550720 59988594 59402973 58719916 58049367 57331733
3514 57331733 56518765 55630496 54781053 53842497 52874767 51838211 50909774 49862325 48668695
3505 48668695 47531303 46251342 45187599 44039344 42966923 41771502 40761241 39796793
3497 39796793 38526685 37639541 36692320 35874425 35059296 34237133 33329009 32617751 31857164
3488 31857164 31171427 30450942 29839667 29409520 28888118 28332293 27973130 27644475 27290590
3479 27290590 26941162 26616972 26362651 26016354 25783731 25617662 25262272 25014122 24743255
3470 24743255 24585161 24388298 23993695 23694049 23419389 23212716 22933075 22678633 22390733
3461 22390733 22141735 21871249 21526444 21156170 20734199 20370543 20026012 19538157 19212993
3452 19212993 18788647 18411464 18030316 17559174 17078868 16727671 16257427 15879208 15436812
3443 15436812 15019732 14555348 14224471 13878162 13434403 13004333 12724175 12475488 12049246
3434 12049246 11779566 11405032 11146868 10918194 10764440 10536274 10233759 9994304 9701518
3425 9701518 9551014 9413958 9214429 9008300 8842304 8717168 8502338 8259876 8050208 7940695
3415 7940695 7833546 7772354 7723569 7613469 7367414 7186108 7064769 7053592 7056816 6997400 6819935
3404 6819935 6727689 6728822 6610052 6534079 6387702 6256449 6138811 6008254 5951258 5885334 5690737
3393 5690737 5670204 5658879 5625642 5464447 5344802 5324520 5244131 5198624 5132763 5125415 4994219
3382 4994219 4877255 4789299 4799880 4675773 4645803 4636688 4481337 4497283 4516202 4431838 4292788
3371 4292788 4232056 4106643 4050782 4088037 4144632 4043752 3997762 4056667 3949718 3875651 3880703
3360 3880703 3826304 3740262 3711573 3681836 3724903 3727368 3638006 3562622 3510178 3526289 3562089 3529733
3348 3529733 3550023 3498367 3512261 3439427 3193124 3231020 3179393 3220491 3187077 3117794 3081751
3337 3081751 3140696 3172027 3152728 3101214 3053873 3045591 3079726 2969237 2974155 3056274 2938664
3326 2938664 2860846 2813286 2845683 2844880 2796962 2797594 2791679 2700665 2698981 2651669 2701040 2637254 2652385
3313 2652385 2642002 2590214 2562923 2611694 2568185 2622352 2614541 2546532 2495511 2420374 2419444 2531639
3301 2531639 2477771 2354087 2384850 2412367 2350787 2316710 2359695 2276375 2366857 2309218 2291287
3290 2291287 2388016 2405153 2343769 2362356 2343465 2268921 2260503 2276725 2257474 2145966 2150828 2173557
3278 2173557 2189553 2249502 2257173 2193004 2205371 2210662 2161385 2209684 2152219 2244968 2348123 2253823
3266 2253823 2186351 2225719 2267686 2159096 2134522 2173209 2156302 2204831 2156162 2166102 2111053
3255 2111053 2075033 2145520 2146680 2168920 2197934 2209094 2135434 2113624 2083946 2079092 2036837 2145095
3243 2145095 2221912 2133440 2059627 2030313 1986945 1973667 2026342 2120222 2050066 2063282 1988864
3232 1988864 1853407 1883561 1960836 1940808 1954192 1978009 1936372 1920453 2054224 2020725 2024923
3221 2024923 1988905 1887219 1843704 1840906 1839234 1808334 1888550 2016001 1937014 1784611 1723155
3210 1723155 1751620 1757306 1783673 1888769 1852102 1829730 1813035 1755810 1737482 1678330 1662196
3199 1662196 1791180 1742091 1807330 1825754 1731815 1797688 1803576 1744961 1703815 1696991 1731392 1737587
3187 1737587 1711737 1685953 1720786 1642912 1683167 1708480 1731856 1710751 1673918 1693463 1809287
3176 1809287 1722199 1682392 1668334 1635666 1605020 1589602 1486589 1563324 1550880 1481773 1446930
3165 1446930 1461713 1489229 1487709 1390523 1362700 1375575 1345231 1257667 1342518 1409027 1274681
3154 1274681 1290707 1360089 1364947 1316227 1317088 1278771 1303657 1314169 1245552 1200312 1215429 1203842
3142 1203842 1199266 1254578 1226251 1283390 1328300 1337276 1331614 1344468 1385483 1312769 1255093 1271367
3130 1271367 1323263 1291766 1270138 1328198 1425795 1403829 1410732 1393979 1442810 1449060 1390872 1444645
3118 1444645 1536668 1524352 1597181 1639291 1719308 1660843 1679415 1706370 1602418 1615350 1616389
3107 1616389 1504536 1558972 1478533 1184360 1200346 1233448 1307792 1293282 1242991 1276088 1192360
3096 1192360 1175888 1164958 1028533 994786 915252 911734 1122746 1213005 1230957 1154582 1018653
3085 1018653 1016772 1036593 1018982 1074906 1008188 984302 999177 1039695 979706 1009298 1024814 974328
3073 974328 884167 851593 909236 920600 908374 911942 943772 920841 874939 931639 900139 947272
3061 947272 913009 865138 948144 955501 898911 945205 980055 834347 724880 742914 678557
3050 678557 727763 794295 803477 721886 831290 843053 838720 847248 763573 780283 911085 887893
3038 887893 807608 777287 713514 754387 823304 897976 693016 691549 817688 852379 794140
3027 794140 791631 892407 822968 897713 978899 863605 808473 763831 875117 762502 749740
3016 749740 819293 788902 813484 820439 871838 880963 801725 731728 776470 892865 736148 757530
3004 757530 757978 733812 714076 690931 695411 750691 762319 673151 679927 684154 650587 741534 646646
2991 646646 522359 485993 463818 578086 733572 577370 655763 695588 526638 499705 557886
2980 557886 622132 669814 666476 628157 623427 609619 624564 514234 477944 549585 588990 633184
2968 633184 540259 598542 596058 562915 596806 534570 557925 553811 587236 471522 448025 506166
2956 506166 527218 502396 515184 527280 473803 558514 641265 551446 505551 524165 586498 487178
2944 487178 502704 580132 611425 527660 517099 509583 601400 538604 484021 578662 548189 582438
2932 582438 513061 367937 387810 476354 494479 599679 528339 443971 513781 533063 498920
2921 498920 481056 521422 529959 506726 433913 468777 563780 489140 437633 513493 361275 376955
2909 376955 444280 432325 465160 503323 572159 450467 482188 458508 536000 534356 525348 522526
2897 522526 624952 603942 558998 476145 462470 560578 503083 519703 364654 403607 510336
2886 510336 477335 398702 446041 502903 560922 492470 546984 553290 476248 451668 448418 450021
2874 450021 421307 417494 529644 511420 463227 510107 458973 506004 565526 613232 676928 604329
2862 604329 492881 478878 608240 597639 505624 558247 592542 583508 557660 558441 552201 522149
2850 522149 480049 371722 459044 611580 572591 500009 439535 444545 447572 490613 432697 571495
2838 571495 554512 449742 439682 554928 518358 471286 516866 486116 544341 495540 443044
2827 443044 334288 316233 427878 369168 331860 411747 386732 351258 442941 392824 369358
2816 369358 418518 405489 377416 323624 238584 234275 390859 424042 453720 321255 427800
2805 427800 521610 501162 507421 402350 374625 421764 373812 274337 278792 272640 291515 353361
2793 353361 387223 425640 414379 453101 515313 501140 366865 385486 357129 240471 281270
2782 281270 304220 271127 255733 234242 329366 251665 184766 275056 296273 325092 292503 297782
2770 297782 310435 328690 334644 347239 370198 318156 264944 364110 322906 218070 213976 282460
2758 282460 261640 232633 226018 214253 216784 252368 291144 241068 269673 356851 295952 282195
2746 282195 240009 237342 273173 248055 221470 182664 252773 274377 146854 190150 204628 152284
2734 152284 184501 217911 189112 162196 152762 182789 169704 167717 245366 331620 298672 299332
2722 299332 303805 234980 277847 186851 218328 286100 277705 321324 283271 297605 236794 229675
2710 229675 230623 185084 165040 192852 175822 292166 245356 197448 286509 296064 194898 138027
2698 138027 149350 204979 297062 310582 397396 345576 207639 163762 179116 180433 218347 334893
2686 334893 305526 198354 262677 320593 287204 176833 220027 147961 162366 189109 117623
2675 117623 226390 327152 289136 224072 264679 295994 297778 265974 271023 236427 229877 201928
2663 201928 111867 118162 124898 159588 240564 267016 214370 302737 180976 154731 218131 185876
2651 185876 201515 94129 111966 131392 99548 208480 253907 169161 176770 198780 184445
2640 184445 148330 103724 118693 106809 138210 159283 163210 177683 117984 134628 67598 187634
2628 187634 206718 107474 165791 141253 162169 141435 111363 226758 296722 168372 111850
2617 111850 -5564 70443 107576 74106 111 121369 100752 157599 60400 96815 92921
2606 92921 117755 141318 140242 171120 192061 200859 66892 62304 74925 202035 160124 83408
2594 83408 114397 145308 178277 192200 165489 237554 202578 271983 181080 176568 192240 199281
2582 199281 145057 104528 141901 121486 112168 11477 -6584 59300 84296 62393 94507 173181
2570 173181 178028 126380 167444 109347 91891 207737 114012 85617 201853 136134 124118
2559 124118 117571 39212 40877 48560 170251 141823 243031 204234 271914 120464 88660 59744
2547 59744 74217 135148 154277 107449 -17594 -4818 16331 -36635 60286 171963 233711
2536 233711 131640 142658 166016 37823 78034 117925 217092 190133 347475 392824 285367
2525 285367 172403 156494 137895 84008 154562 105521 143501 236921 126146 77339 -4084
2514 -4084 -9547 50467 163554 125471 151254 78997 61872 217737 200038 180058 163253 135169
2502 135169 102606 36348 104914 183611 240242 140319 107901 70906 37119 80145 -12724 8470
2490 8470 104332 85090 122757 121489 104491 149960 100538 125173 118221 25291 18814 38638 -41322
2477 -41322 -29092 119359 128347 87186 27970 -62368 22835 131666 75362 68094 55557 38102
2465 38102 55372 54984 -14131 63796 121437 159241 103588 69673 92362 56457 18778 36738
2453 36738 144774 107555 86657 29139 32328 67330 100688 84277 91948 93622 69207 16017
2441 16017 41968 115213 155365 230346 119692 65812 108312 43149 87993 57930 60768 23505
2429 23505 57155 -8908 85642 93743 70177 18603 65845 59987 104763 90653 -35771 -8873
2417 -8873 -26020 14248 -44016 -61561 -124929 -18783 -21987 -28583 50014 30504 -526 -7058
2405 -7058 -16555 -44739 -63741 45586 102978 118494 138079 83769 -11506 28027 74084 111423
2393 111423 -938 63816 57123 43393 87115 99216 69016 125784 117341 143585 143558 96676
2381 96676 142323 76180 69488 73567 41504 -5981 -16850 50937 29865 -6050 13128 35433
2369 35433 122671 160459 139092 63436 57604 10697 9987 20343 43854 102449 5753 81396
2357 81396 110639 142385 192008 171652 73808 60820 87360 153424 193156 150337 126953 123877
2345 123877 230118 122993 222661 134068 -16160 -12034 70098 71542 13142 -15423 23081
2334 23081 135838 74564 50370 -53062 -19609 25373 97715 51271 -93991 11614 63205
2323 63205 51545 47724 72156 83903 72192 76453 234765 118678 143498 84281 21438 80871
2311 80871 30460 98854 228232 171968 103592 37272 225 -64046 -60194 20773 20065 22026
2299 22026 31928 -67133 -26994 61539 30466 41339 3158 -39690 35771 41364 23663 53318
2287 53318 158528 147218 45128 61122 124822 137270 150062 149561 40452 7912 -12684 -23220
2275 -23220 -82250 45026 110496 77578 44891 96198 188061 95819 44846 78327 31503 6205
2263 6205 52076 63508 -16778 -66499 -2078 82947 50293 71669 111322 96243 175580 94553
2251 94553 -68748 -20025 11066 50760 23697 93782 34872 4170 137840 141654 184281 132385
2239 132385 -9771 36377 52656 -32243 4281 36625 -20316 -47855 -155954 -107593 15303
2228 15303 48458 -5946 68652 -64060 -45782 -33675 41538 71683 15161 12626 1133 31913
2216 31913 35455 17135 -77106 49169 8246 -71323 64927 118122 47637 72393 55239 32669
2204 32669 10019 57365 80790 18420 -67978 -42534 -8956 -95527 -125926 -80054 -46449 14430
2192 14430 -44050 -70985 7236 38117 60726 150849 155646 81494 81405 88747 96069 58645 -23030
2179 -23030 79197 151314 130778 100777 95209 3888 -39425 13146 99701 151393 190469 188484
2167 188484 20448 -61164 -10525 -23195 25028 187681 136696 41590 -45196 -23308 -77080
2156 -77080 -131946 -40855 -35014 99527 114359 -20282 -44836 20499 -8677 -42437 -76216 65317
2144 65317 47157 4005 12637 4643 -8352 -2178 27248 96723 117923 221590 225218 82993
2132 82993 83207 -29523 -145119 -39008 25688 56354 25940 -12628 81063 35112 58631 36972
2120 36972 104479 99226 54604 87050 37370 -734 5106 25439 -63699 -158317 -33890 45434
2108 45434 -35064 -26885 37231 73173 39138 78086 128492 163673 219770 106472 91894 90355
2096 90355 113654 76583 26005 18215 6232 -31908 14634 59535 59095 202515 226367 140712
2084 140712 151302 84949 92480 130000 151375 87464 78707 18298 19459 120507 264636 233886
2072 233886 201139 241662 273184 238684 248163 201453 165222 139492 100428 -1547 -33674 -14488
2060 -14488 113345 69706 -50493 71989 61116 164724 160578 126103 4760 100003 19242
2049 19242 1826 -58947 -77038 14319 33722 109531 87422 34121 144843 69801 31781 136491
2037 136491 29890 17875 31436 -26402 -967 2613 -60375 15217 -23808 -23216 -102964 -122729
2025 -122729 -115205 1917 125846 46570 93259 77802 100742 85121 -68780 -125567 20124
2014 20124 71932 93903 -22045 34981 72532 107302 -11778 -87187 -838 90322 180409
2003 180409 102820 169619 118862 8921 26032 -315 36590 105617 187967 108908 -29008
1992 -29008 -79908 9399 53735 -42622 19636 70751 40260 -60859 -97017 8178 -13773
1981 -13773 -2724 -3943 -68150 31419 131365 -47092 -139196 -48129 -28297 -83572 -87695 39179
1969 39179 53403 -18608 3054 143667 153604 67438 70118 24528 -53496 14314 127877 33596
1957 33596 -40320 9163 -34296 20310 34556 103061 95279 57978 64628 8573 -64506 -4115
1945 -4115 -42816 -7133 -23852 -46496 21490 23593 17685 44980 116883 146750 72319 73344 97596
1932 97596 54653 12286 10953 -57246 -66086 -76314 -18745 139410 21893 -44838 48445 71524
1920 71524 24248 47391 5243 45388 77387 -166 -26686 -18438 -59750 -92477 30807 5614
1908 5614 197 -2193 19028 -65334 -46696 -2540 -12499 -55514 -18097 5735 -66005 -36159 -46175
1895 -46175 -50012 -41619 10210 -7137 -61256 -54997 -17033 83590 55219 15781 -82311 -133269
1883 -133269 -134529 -109624 19305 -3105 1109 42182 8021 -30811 16343 42770 -10225 -4805
1871 -4805 -40006 19795 16189 -8265 -3753 5452 -98307 -176259 -116270 -94489 20337 13968
1859 13968 -61178 10775 -22058 -52219 19027 -100557 -84729 -15697 13259 -145476 -69558
1848 -69558 47182 90440 47649 -21256 -128252 -107314 -83750 62736 -35013 -67299 -50465
1837 -50465 -136799 -36830 -30499 -117364 -125249 -147690 -33258 -129302 6663 120912 68487 14194
1825 14194 75110 96022 32862 152823 82813 43638 -3492 -41661 -38383 -13630 5137 13588
1813 13588 -69201 -73307 -28210 15446 988 26199 -46527 -117422 -96700 -38722 24602 -9144
1801 -9144 -52841 -47906 -81694 -44386 -23024 -46896 6731 75229 99792 -28119 -88472 -36161
1789 -36161 -39505 91348 136843 79261 32530 56519 38364 -37182 48290 5697 96909 109214
1777 109214 8003 61309 -17294 -14407 78284 125282 86667 79011 38618 7754 -98139 -73322
1765 -73322 -138162 -20638 4111 -49013 -34282 -107447 -141401 -103945 -4719 76563 1266 -73014
1753 -73014 -109413 -88705 -147361 -98437 -44800 -44672 27783 -7349 47721 104379 11198 -115727
1741 -115727 -44306 12188 -58956 -48294 -120065 -87840 2575 49231 124497 -40226 -76643
1730 -76643 7846 80261 96915 -28254 -63295 31062 90534 -42628 -68452 -85891 -90600 -15829
1718 -15829 -53722 39705 7766 -66677 -107504 -78500 100837 -24528 -125944 -44481 57410
1707 57410 -23081 -34798 9027 -55420 -102438 -98746 27792 26331 -84115 -30399 -17389 -3712
1695 -3712 -97908 -12378 21574 -61265 -61412 -39420 67263 -54180 -117663 -37494 -34226 -18354
1683 -18354 73982 88362 90777 -83862 -135401 -99444 -63161 -86546 -83909 -35026 -75376 -76554
1671 -76554 -604 -54682 19944 12271 -37718 -67777 -74480 -69163 -79991 -21296 37016 22758
1659 22758 67343 56473 25423 24056 10242 51310 67343 -51542 10798 28540 33700 81962
1647 81962 -18768 -116181 -15437 -48338 -95661 3694 34056 19893 -100078 -23665 15698
1636 15698 -124443 -196975 -141557 29492 -34515 19517 8175 55576 31346 -66081 -27114
1625 -27114 -55616 31202 -51500 -73194 -33859 -28087 -121086 -118467 -68918 -139270 -93731 -80171
1613 -80171 123061 96453 -30021 21759 64384 -4058 35030 74250 -39578 -27879 111557
1602 111557 97229 -35856 -11959 65994 -11476 -62035 -46415 -76057 -18959 -46864 -79767
1591 -79767 -64180 5195 -95275 -50807 -73690 -43342 -55183 56530 56955 2481 -39108 -23694
1579 -23694 24560 -21026 -51307 -113892 -220305 -105770 -36295 -4106 789 -41295 -93407 -21031
1567 -21031 -71308 -53222 -55903 -13095 -26214 -34108 -22396 -107304 -69794 -86928 -110589 -168132
1555 -168132 -78826 -79273 -163994 -13738 -71012 -104093 -55529 -25787 -14457 -51112 -91819 -74063
1543 -74063 2323 -88322 -93391 -32095 -39232 -21314 -63479 -147017 -78826 -46747 -57593 -112471
1531 -112471 -49005 -39470 24613 41162 47179 -2567 -72678 -19021 16988 22581 -25243 -110505
1519 -110505 -53071 4341 -71279 -12497 9607 -58243 -87524 -72802 -66195 -163384 -4157 59651
1507 59651 -32280 -85349 24013 18949 -46846 -131655 -177326 -185384 -85190 -20427 17164 -937
1495 -937 -4308 22952 -56615 -32304 -25378 35055 34266 -52025 -22363 15762 14390 -86314 -67931
1482 -67931 -50587 -68748 -128780 -130155 -151156 -117728 -103605 -82722 -107881 -8256 111668 8429
1470 8429 -15347 -32939 5718 -37638 13780 79141 11565 -89172 -35918 -44733 -89556 11552
1458 11552 -24709 -84864 -56056 -134628 -105418 -36331 -59205 -28029 -12776 -27862 37953 85516
1446 85516 36742 -76809 -122462 -100393 -44188 -14048 -53024 -56429 37204 -42669 -40110 -13970
1434 -13970 -97597 -58511 72741 13840 -38401 -47365 -47867 -77347 -74765 3526 -51543 -14052
1422 -14052 -9958 -82539 -23633 -38928 -92391 -61249 -32242 -103792 -25703 -15879 -78278 -49773
1410 -49773 -11938 -55732 -48799 -57785 -73078 -24439 7643 12451 -59050 -38534 -85252 -61620
1398 -61620 77443 52977 37097 22798 -43195 -111909 -63359 37147 -31378 -94749 -23219
1387 -23219 20512 -53349 -21468 -5553 68802 74466 -18843 -29031 8793 -2124 -54944 -25706
1375 -25706 -65314 -119690 6431 46342 10757 -23088 -49271 65820 -32811 -177501 -43615
1364 -43615 5049 62848 10282 -19782 -101757 -117385 -40672 16308 -13836 -34342 -116141 -40247
1352 -40247 32707 237 30936 -43044 27202 -36369 -135976 -184166 -65495 -29264 -63624 -123412
1340 -123412 -72824 -85139 -151437 -63421 -47866 -116181 -161366 -69686 -21364 -104822 -191842 -231160
1328 -231160 -183087 -94301 -123695 -37926 19407 -82834 -72588 16370 43344 18837 60040
1317 60040 -101350 -14386 92868 62486 -7034 -12462 -60759 -129937 -44393 -1514 33624 55760
1305 55760 -391 23213 54347 -12577 -33826 -8156 49371 -50264 -79989 -86490 33643 58378
1293 58378 17734 -121380 -54365 29214 -31600 -51336 42236 -35926 -47675 -2848 -59933 40712
1281 40712 4411 -112742 -98115 24763 27400 -14329 37251 108370 20931 -19045 -49911 -60891
1269 -60891 -36585 -103228 -155367 -35680 -20508 9193 -20027 -57625 -73000 -167674 -168015 -102600
1257 -102600 -74558 -146717 -197936 -264369 -148404 8109 105264 66894 47079 2616 8356
1246 8356 11595 -21399 -18118 -75577 -109153 -101980 -175245 -145099 35807 63949 70963 64396 51260
1233 51260 -34388 -31784 26297 -3617 110819 81036 31597 -9378 -8432 -27692 -54585 14190
1221 14190 -1363 -44643 -72432 -123742 -88268 -8221 36147 -81898 -114999 -112973 -147462 -62718
1209 -62718 -115428 17505 -34721 -134336 -142756 -28138 -21922 -25488 56680 121899 43034 -2416
1197 -2416 -34330 3501 -10641 -21322 40946 60613 8238 10645 -52698 -239447 -144436 -36662
1185 -36662 -34885 -15993 42380 137463 51033 -83754 -20357 108232 1149 -72673 70791
1174 70791 37944 29782 -3139 -127201 -78165 -33346 -40854 4659 11177 12790 -31996 -73255
1162 -73255 -94601 -66317 -25881 1164 -12483 -19456 18857 33870 16321 21882 25781 33452 7451
1149 7451 -39274 -72950 -48794 1655 -51339 -52924 -24232 -49914 -65717 -104696 -119536 -72393
1137 -72393 35008 -6839 -98593 25425 65174 -115088 -48118 33317 39956 53638 64821
1126 64821 22696 19706 21515 28196 -13806 83867 -16404 -69213 31629 43039 -13874 -58467
1114 -58467 -1532 -124671 -197190 -103017 -98244 -101571 -77894 20376 -22303 -24676 31137 39716
1102 39716 15738 -80916 -31383 -82321 -120616 -99523 18323 81093 16851 -83633 -108164
1091 -108164 -97418 -56653 -22949 -47601 -62083 -16803 -25594 -52692 -173382 -60177 -42240
1080 -42240 31315 -20102 -27395 93830 60639 160187 178739 130432 -20969 -41428 56317 -38032
1068 -38032 -10819 87706 26979 -46667 -19246 47347 -26502 -122536 -41542 4539 -23281 -46678
1056 -46678 -60681 58879 -2646 -7751 -20641 316 -60357 -10829 -17534 -20687 -16475 -76702
1044 -76702 -37832 -3588 -73048 -162625 -89893 -46476 -54177 -27161 9739 -27362 -83501 -89501
$$ [...]
##END NTUPLES=NMR SPECTRUM
##END=
