##TITLE=1H_TG-2341
 CDCl3
 8 sc, 
 15.12.2021
##JCAMPDX= 6.0         $$ Bruker NMR JCAMP-DX V2.0
##DATA TYPE= NMR SPECTRUM
##DATA CLASS= NTUPLES
##ORIGIN= UXNMR, Bruker Analytische Messtechnik GmbH
##OWNER= root
$$ XWIN-NMR		Version 3.5
$$ Wed Dec 15 13:03:27 2021 Russian Standard Time (UT+4h)  she@DPX200
##.OBSERVE FREQUENCY= 200.131346
##.OBSERVE NUCLEUS= ^1H
##.ACQUISITION MODE= SIMULTANEOUS
##.ACQUISITION SCHEME= undefined
##.AVERAGES= 8
##.DIGITISER RES= 18
##SPECTROMETER/DATA SYSTEM= spect
##.PULSE SEQUENCE= zg30
##.SOLVENT NAME= CDCl3
##.SHIFT REFERENCE= (INTERNAL, CDCl3, 0, 15.7138)
##AUDIT TRAIL= $$ (NUMBER, WHEN, WHO, WHERE, WHAT)
$$ ##TITLE= Audit trail, XWIN-NMR		Version 3.5
$$ ##JCAMPDX= 5.01
$$ ##ORIGIN= Bruker BioSpin GmbH
$$ ##OWNER= she
$$ F:/spectra/data/she/nmr/H-F/1/pdata/1/auditp.txt
$$ ##AUDIT TRAIL=  $$ (NUMBER, WHEN, WHO, WHERE, WHAT)
(   1,<2021-12-15 13:00:46.81 +0400>,<she>,<DPX200>,
      <created by zg, POWCHK disabled, PULCHK disabled
       configuration hash MD5:
       00 E9 B6 7A A2 85 ED C7 34 08 36 98 17 FE 4E 26
       data hash MD5: 16K
       98 67 8C F8 B8 9B 6A 05 5F 04 D2 0D EB 36 3A 9D>)
(   2,<2021-12-15 13:00:49.21 +0400>,<she>,<DPX200>,
      <Start of raw data processing
       efp BC_mod = 2 LB = 0.24 FT_mod = 6 PKNL = 1 PHC0 = -15871.44 PHC1 = 11.60079 SI = 16K 
       data hash MD5: 16K
       DA E7 06 83 9D DC BC CF 07 F0 66 22 AE 52 7A AD>)
(   3,<2021-12-15 13:01:07.46 +0400>,<she>,<DPX200>,
      <pk PHC0 = -4.649902 PHC1 = 4.8 
       data hash MD5: 16K
       97 AD 59 1C 0C 9D 07 63 AD 5E 31 75 87 2F 98 F8>)
(   4,<2021-12-15 13:01:10.54 +0400>,<she>,<DPX200>,
      <abs ABSG = 5 
       data hash MD5: 16K
       D3 6D 56 6D 00 B7 B4 BB B8 7B BF 40 C0 3E C1 F5>)
(   5,<2021-12-15 13:03:06.35 +0400>,<she>,<DPX200>,
      <abs ABSG = 5 
       data hash MD5: 16K
       21 D9 7C AD 54 CC F2 00 AF AA AD 6D 49 7A 09 64>)
$$ ##END=
$$ 
$$ hash MD5
$$ 0F 54 0F 41 6F 4B 53 16 E3 F3 9C 1A 43 D1 78 9E
##$RELAX= 
##$RELAX= 
##$RELAX= 
##$RELAX= 
##$RELAX= 
##$RELAX= 
$$ Bruker specific parameters
$$ --------------------------
##$DU= <F:/spectra>
##$EXPNO= 1
##$NAME= <H-F>
##$PROCNO= 1
##$TYPE= <nmr>
##$USER= <she>
##$AMP= (0..31)
100 100 100 100 100 100 100 100 100 100 100 100 100 100 100 100 100 100 
100 100 100 100 100 100 100 100 100 100 100 100 100 100 
##$AQSEQ= 0
##$AQ_mod= 1
##$AUNM= <au_zg>
##$AUTOPOS= <>
##$BF1= 200.13
##$BF2= 200.13
##$BF3= 200.13
##$BF4= 200.13
##$BF5= 200.13
##$BF6= 200.13
##$BF7= 200.13
##$BF8= 200.13
##$BYTORDA= 1
##$CFDGTYP= 0
##$CFRGTYP= 5
##$CHEMSTR= <none>
##$CNST= (0..31)
1 1 145 1 1 1 1 1 1 1 1 1 1 1 1 1 1 1 1 1 1 1 1 1 1 1 1 1 1 1 1 1 
##$CPDPRG= <>
##$CPDPRG1= <>
##$CPDPRG2= <>
##$CPDPRG3= <>
##$CPDPRG4= <mlev>
##$CPDPRG5= <mlev>
##$CPDPRG6= <mlev>
##$CPDPRG7= <mlev>
##$CPDPRG8= <mlev>
##$CPDPRGB= <>
##$CPDPRGT= <>
##$D= (0..31)
0 1.2 0 0 0 0 0 0 0 0.06 0 0.03 0 0 0 0 0.0002 0 0 0 0 0 0 0 0 0 0 0 0 
0 0 0 
##$DATE= 1639558846
##$DBL= (0..7)
$$ [...]
##$SUBNAM2= <"">
##$SUBNAM3= <"">
##$SUBNAM4= <"">
##$SUBNAM5= <"">
##$SUBNAM6= <"">
##$SUBNAM7= <"">
##$SUBNAM8= <"">
##$SUBNAM9= <"">
##$SW= 18.0517287032376
##$SWIBOX= (0..15)
0 0 2 0 0 0 0 0 0 0 0 0 0 0 0 0 
##$SW_h= 3612.71676300578
##$TD= 16384
##$TD0= 1
##$TE= 0
##$TE2= 300
##$TE3= 300
##$TEG= 300
##$TL= (0..7)
0 120 120 120 120 120 120 120 
##$TP= (0..7)
150 150 150 150 150 150 150 150 
##$TP07= 0
##$TPNAME0= <>
##$TPNAME1= <>
##$TPNAME2= <>
##$TPNAME3= <>
##$TPNAME4= <>
##$TPNAME5= <>
##$TPNAME6= <>
##$TPNAME7= <>
##$TPOAL= (0..7)
0.5 0.5 0.5 0.5 0.5 0.5 0.5 0.5 
##$TPOFFS= (0..7)
0 0 0 0 0 0 0 0 
##$TUNHIN= 0
##$TUNHOUT= 0
##$TUNXOUT= 0
##$USERA1= <user>
##$USERA2= <user>
##$USERA3= <user>
##$USERA4= <user>
##$USERA5= <user>
##$V9= 5
##$VALIST= <valist>
##$VCLIST= <CCCCCCCCCCCCCCC>
##$VD= 0
##$VDLIST= <DDDDDDDDDDDDDDD>
##$VPLIST= <PPPPPPPPPPPPPPP>
##$VTLIST= <TTTTTTTTTTTTTTT>
##$WBST= 1024
##$WBSW= 4
##$XGAIN= (0..3)
0 0 0 0 
##$XL= 0
##$YL= 0
##$YMAX_a= 97486
##$YMIN_a= -132213
##$ZGOPTNS= <>
##$ZL1= 120
##$ZL2= 120
##$ZL3= 120
##$ZL4= 120
##$ABSF1= 15.71384
##$ABSF2= -2.33801
##$ABSG= 5
##$ABSL= 3
##$ALPHA= 0
##$AQORDER= 0
##$ASSFAC= 0
##$ASSFACI= 0
##$ASSFACX= 0
##$ASSWID= 0
##$AUNMP= <proc_1d>
##$AZFE= 0.1
##$AZFW= 0.1
##$BCFW= 0
##$BC_mod= 2
##$BYTORDP= 0
##$COROFFS= 0
##$CY= -3
##$DATMOD= 1
##$DC= 0
##$DFILT= <>
##$DTYPP= 0
##$F1P= 0
##$F2P= 0
##$FCOR= 1
##$FTSIZE= 16384
##$FT_mod= 6
##$GAMMA= 0
##$GB= 0
##$INTBC= 1
##$INTSCL= 0
##$ISEN= 128
##$LB= 0.24
##$LEV0= 0
##$LPBIN= 0
##$MAXI= 10000
##$MC2= 0
##$MEAN= 0
##$ME_mod= 0
##$MI= 1.114404
##$NCOEF= 0
##$NC_proc= -9
##$NLEV= 6
##$NOISF1= 3.799351
##$NOISF2= 2.8
##$NSP= 0
##$NTH_PI= 0
##$NZP= 0
##$OFFSET= 15.71384
##$PC= 1
##$PHC0= -15876.09
##$PHC1= 16.40079
##$PH_mod= 1
##$PKNL= yes
##$PPARMOD= 0
##$PSCAL= 0
##$PSIGN= 0
##$REVERSE= no
##$SF= 200.130007548201
##$SI= 16384
##$SIGF1= 3
##$SIGF2= 2
##$SINO= 5.538805
##$SIOLD= 16384
##$SREGLST= <1H.CDCl3>
##$SSB= 0
##$STSI= 16384
##$STSR= 0
##$SW_p= 3612.71676300578
##$SYMM= 0
##$S_DEV= 0
##$TDeff= 16384
##$TDoff= 0
##$TI= <>
##$TILT= no
##$TM1= 0
##$TM2= 0
##$TOPLEV= 0
##$USERP1= <user>
##$USERP2= <user>
##$USERP3= <user>
##$USERP4= <user>
##$USERP5= <user>
##$WDW= 1
##$XDIM= 16384
##$YMAX_p= 428775010
##$YMIN_p= -5983480
$$ End of Bruker specific parameters
$$ ---------------------------------
##NTUPLES= NMR SPECTRUM
##VAR_NAME=  FREQUENCY,     SPECTRUM/REAL,   SPECTRUM/IMAG
##SYMBOL=    X,             R,               I
##VAR_TYPE=  INDEPENDENT,   DEPENDENT,       DEPENDENT
##VAR_FORM=  AFFN,          ASDF,            ASDF
##VAR_DIM=   16384,         16384,           16384
##UNITS=     HZ,            ARBITRARY UNITS, ARBITRARY UNITS
##FACTOR=    0.220516191357247, 1,           1
##FIRST=     3144.81082393921, 0,            0
##LAST=      -467.905939066573, 0,           0
##MIN=       -467.905939066573, -5983480,    0
##MAX=       3144.81082393921, 428775010,    0
$$ Real data points
##PAGE= N=1
##DATA TABLE= (X++(R..R)), XYDATA
$$ [...]
5925B5223577Q71087l20618o09281k55875O32238k5041j691658n08379R64174
5916B4280224m73168j717520m60069o68828j050636p22735Q48411M4904o52350
5907A9428233k99474o10082O75632P16306M14570J29914J228855K328880J008812
5898B5021646R88689J366667J097382K427386K908034P81938k10606l324710k963343
5889B8093083k386685j504882j094446j525659p55427j022193p13177j56630m45317
5880A8488667J43993m00815m55137J175235J88237j281900j026387J063031J335044
5871A9229968N45399O09677J681992J315598J026859R82047J838991J433758K307905
5862C0972194J958132O07177j470018k791480l742245k930833k032141j808837
$$ plain form
5925 25223577 26094664 25774046 25164765 24908890 25541128 25516087 23824429 23316050 24280224
5916 24280224 23807056 22089536 21629467 20960639 19910003 19187268 20035679 20080583 19428233
5907 19428233 19128759 18518677 19194309 19910615 20325185 20455099 21683954 24012834 25021646
5898 25021646 26010335 27377002 28474384 30901770 33809804 34591742 34381136 31056426 28093083
5889 28093083 25706398 24201516 23107070 21581411 20825984 19803791 19090614 18933984 18488667
5880 18488667 18632660 18231845 17776708 18951943 19140180 17858280 16831893 17894924 19229968
5871 19229968 19775367 20385044 22067036 23382634 24409493 25391540 27230531 28664289 30972194
5862 30972194 32930326 33537503 32067485 29276005 25533760 22602927 20570786 18761949
5854A8761949j342352n87780o80086o60147p80059p002l00441k04731n84788k76984
5844A3337579k37822M22458M65886O36289k18477K57171m00028N74337P73700
5835A5611093M78395N93471O40480n55972O20220K29067L2910Q44631j480229
5826A7014066j486907p41889o05939p19812j47633j68866L03067o85012Q49940
5817A3611015P2857J47282j4272J33456J640557O73544k21134j49720P66714Q56178
5807A7516477L38808N48345M94909N56044J339616J149019L43789J170323Q86668
5798B4343998P83683l95180k037485k357359j459042j839313j98076q02105q89175
5789A5149946j31182j188599m69381K40941R37515K22244L66223J22652P88829
$$ plain form
5854 18761949 17419597 16831817 16151731 15491584 14711525 14704523 14404082 14199351 13614563 13337579
5844 13337579 13099757 13522215 13988101 14624390 14405913 14663084 14263056 14837393 15611093
5835 15611093 16089488 16682959 17323439 16767467 17387687 17616754 17649664 18494295 17014066
5826 17014066 15527159 14785270 14179331 13459519 13311886 13143020 13446087 12761075 13611015
5817 13611015 13683872 13831154 13816882 13950338 15590895 16264439 16043305 15893585 16660299 17516477
5807 17516477 17855285 18403630 18898539 19454583 20794199 21943218 22287007 23457330 24343998
5798 24343998 25127681 24732501 22695016 20337657 18878615 17039302 16841226 16039121 15149946
5789 15149946 15018764 13830165 13360784 13601725 14539240 14761484 15127707 15250359 16039188
5780A6039188Q82741J000941J288527J266330J866841Q32871Q30038K186056J307651
5771B7501184j475245k97412k545501k329454j515382j326212n69530r89982o59009
5762A5793457n26808k75692m60366m57838M73930l36474k10399Q37729J150239
5753A5987778N7800K12885M74264R33062J054601J332822Q45277m04517j084598
5744A9409374j616710j098365j89472j188739j998245o53117K07284o18176j64528
5735A2089306m207K6991O0793j18596n906l68219J600494J075355l3644l61696
5725A3960671R58258R98287N68757J596324M77740r58523k54633j354517j246782
5716A4745582j183653j412557r09520J3374l48439j210525j63631J1979n8376
$$ plain form
5780 16039188 16921929 17922870 19211397 20477727 22344568 23177439 24007477 26193533 27501184
5771 27501184 26025939 25728527 23183026 20853572 19338190 18011978 17442448 16452466 15793457
5762 15793457 15266649 14990957 14530591 14072753 14546683 14210209 13999810 14837539 15987778
5753 15987778 16045578 16258463 16732727 17665789 18720390 20053212 20898489 20493972 19409374
5744 19409374 17792664 16694299 16504827 15316088 13317843 12664726 12872010 12253834 12089306
5735 12089306 12085099 12112090 12172883 12054287 12048381 11680162 13280656 14356011 14322367 13960671
5725 13960671 14918929 15917216 16485973 18082297 18560037 17601514 17346881 15992364 14745582
5716 14745582 13561929 12149372 11239852 11253226 10904787 9694262 9530631 9542610 9484234
5707I484234o13196L03709k88931m15493q4827j85424o287R17719Q34035r31639
5697I013900m19036r51976J252614J20586p37926n09373M21019K53107J50996
5688H593911r52886p51040K09348P0813O7458P7443K37644k12880q066L31961
5678G663706l25774J41337K82347k50335n62229Q42081P25609n0734r39902L80454
5668G906560L42012n91823J613712j191498m37710M5976O38367P11975j43932
5659H893639j53865k89419O30386J12072q20036M81800k69264o44153M96228L83112
5649H820500P5275p08892j76815L24447J65715p2940j345116N60105N98199k30065
5639H010413N83280k63072j06943K78987J68246Q44284M43592J50528p83831q71926
$$ plain form
5707 9484234 8871038 9174747 8885816 8470323 8385496 8200072 8193785 9111504 9945539 9013900
5697 9013900 8594864 7642888 8895502 9016088 8278162 7768789 8189808 8442915 8593911
5688 8593911 7641025 6889985 7099333 7170146 7237604 7315047 7552691 7339811 7331745 7663706
5678 7663706 7337932 7479269 7761616 7511281 6949052 7791133 8516742 8466008 7526106 7906560
5668 7906560 8248572 7656749 9270461 8078963 7641253 7687229 8325596 9037571 8893639
5659 8893639 8739774 8450355 9080741 9192813 8372777 8854577 8585313 7941160 8437388 8820500
5649 8820500 8895775 8186883 8010068 8334515 8500230 8427290 7082174 7642279 8240478 8010413
5639 8010413 8593693 8330621 8223678 8502665 8670911 9515195 9958787 10109315 9325484 8453558
5629H453558N1466l33983N28439L73106p60499O66188K56196k4926m81379j10819
5619H617347N32333n6169n26419p2111r4853l7625j80185O033O95709M12599m4268
5608I252391O08073O50821P21111L85326n54836L24179q0131M15926L26760r91273
5598A1058347k70519N93056q13258k14339j39419j05557L76592Q90336M61058
5589A1836297M7192p15336O15208o06032m22702J636789j1148k41007N79041k62853
5579A2455449K56675J64017N5646L77507O86891m59010m90923k54658M64482K61196
5569A3517272j9746J95661Q293O2711l87389R7592P70079K38000j03455L917n60682
5558A3822253n61272m81160o3345j130614O23215Q9596l41205O41191m43424j49051
$$ plain form
5629 8453558 8505024 8171041 8699480 9072586 8312087 8978275 9234471 9209545 8728166 8617347
5619 8617347 9149680 9093511 8567092 8494981 8400128 8362503 8182318 8188351 8884060 9296659 9252391
5608 9252391 9860464 10511285 11232396 11617722 11062886 11387065 11306934 11722860 12049620 11058347
5598 11058347 10787828 11380884 10567626 10353287 10213868 10108311 10484903 11375239 11836297
5589 11836297 11883489 11168153 11783361 11177329 10754627 12391416 12380268 12139261 12718302 12455449
5579 12455449 12712124 12876141 12931787 13309294 13996185 13537175 13046252 12791594 13256076 13517272
5569 13517272 13497526 13693187 13701480 13764191 13376802 13474394 14244473 14482473 14379018 14382935 13822253
5558 13822253 13260981 12779821 12716476 11585862 12209077 12298673 11957468 12598659 12155235 12006184
5548A2006184O5052o25536p24147Q27015N29705j036213j07493K82943j81258
5539A1036252l82284m1403J9523p10170N87161N25770l81811R2023N56474m2197
5529A1259338j93824p962J01105m54167m75741R83887L71684m06426J4572J43510
5519A1335976p12188l69236m86351N02272o68579p80601J77517Q1119o08718N40191
5509I011402O40555l63089L58798l17271r79119Q01693N06926K3511l53126O42981
5499I973261k70428N93321r75364k94144R79502N09049j067801n38026J515112
5490A0424482j47810l53197p5121N66170J067802J44315o89562L48405J088397
5481A2373881N75657j45939N72671j48992P95293K33976P04834J101458L24769
$$ plain form
5548 12006184 12071236 11445700 10721553 11548568 12078273 11042060 10934567 11217510 11036252
5539 11036252 10653968 10612565 10632088 9921918 10509079 11034849 10653038 10745061 11301535 11259338
5529 11259338 11065514 11057552 11158657 10704490 10228749 11212636 11584320 11177894 11192466 11335976
5519 11335976 10623788 10254552 9768201 10270473 9601894 8821293 8998810 9079929 8471211 9011402
5509 9011402 9651957 9288868 9647666 9330395 8351276 9152969 9659895 9683406 9330280 9973261
5499 9973261 9702833 10296154 9320790 9026646 10006148 10515197 9447396 8909370 10424482
5490 10424482 10276672 9923475 9848354 10414524 11482326 11626641 10937079 11285484 12373881
5481 12373881 12949538 12803599 13376270 13227278 14022571 14256547 14961381 16062839 16387608
5472A6387608N48777m55275m39633J23661J6626r5764n45456P70496Q01933M17565
5462A7530538J95265r22537l05554k59726o33979j8770l86855k46841k00384K1266
5452A4772423p04633P98529m93552l69049p77140o60100M67002l52403J18889
5443A2799966J8901j66917P97488O48793k67480m31771j73517m62929q89524j6192
5433A1856818O03311P7566j85783p83940n26812j97318N79986k35324K74842L92074
5423A1855420l88289n81796K75354O88026q12392j64647J003146L08074L26972
5414A2509868o9166m86003J24516J036998M95447o48314J34223o42745j62844
5405A2291980Q27900J215310J67189R5586Q54708L73380r1219j69545l66883J60246
$$ plain form
5472 16387608 16936385 16481110 16041477 16165138 16181764 16086000 15540544 16311040 17112973 17530538
5462 17530538 17725803 16803266 16497712 16237986 15604007 15585237 15198382 14951541 14751157 14772423
5452 14772423 14067790 14866319 14372767 14003718 13226578 12566478 13033480 12681077 12799966
5443 12799966 12818867 12651950 13449438 14098231 13830751 13398980 13225463 12762534 11873010 11856818
5433 11856818 12460129 12537695 12351912 11567972 11041160 10843842 11423828 11188504 11463346 11855420
5423 11855420 11467131 10885335 11160689 11848715 11036323 10871676 11874822 12182896 12509868
5414 12509868 12440702 11954699 12079215 13116213 13611660 12963346 13097569 12454824 12291980
5405 12291980 13119880 14335190 14502379 14597965 15452673 15826053 15734834 15565289 15198406 15358652
5395A5358652J155407P17604L28949K7041p32890k55006j7184j170667l85243
5386A5026663N2533o93318p61046n31844K89874M21125j370546j109246J20859
5377A1445054m0934Q20342N31792l68900l28832l88672k41662J307130k05686
5368A2529632L1118l04740L85010j88386o08375M07278J55712R3676k36825J08930
5358A2373030J094923l05328J061248P14291q46587p90645o46238L42155K56584
5349A3253433l43987p35574J7083K55341p87669N79261M74428L65608K62050q62136
5339A2477838l2842J281620P38438j99654Q3899P43699L16800L79595R43488O94372
5329A7427253P05533J52462k9795j071914n95586n94669j041707l80970p07851
$$ plain form
5395 15358652 16514059 17231663 17560612 17587653 16854763 16599757 16582573 15411906 15026663
5386 15026663 15079196 14385878 13624832 13092988 13382862 13803987 12433441 11324195 11445054
5377 11445054 11404120 12224462 12756254 12387354 12058522 11669850 11428188 12735318 12529632
5368 12529632 12560750 12256010 12641020 12452634 11844259 12251537 12407249 12500925 12264100 12373030
5358 12373030 13467953 13162625 14223873 14938164 14091577 13300932 12654694 12996849 13253433
5349 13253433 12909446 12173872 12190955 12446296 11658627 12237888 12712316 13077924 13339974 12477838
5339 12477838 12444996 13726616 14465054 14265400 14349299 15092998 15409798 15789393 16732881 17427253
5329 17427253 18132786 18285248 18255453 17183539 16587953 15993284 14951577 14570607 13862756
5320A3862756l63964j34230p30367R17979k96016l34707l80635J23943n92849
5311A2071910J074918L87607n10451J16665q4573j6178n36920L99903R9519R52410
5301A3954810k24057l43034p03187p58243K28008L6664k2102M02933J37697j002269
5291A1707220k16254j468041r27900L70209Q86676K6848q20764m45166l95305
5282H717523K39306R8415K61341n0567k44458M3303j70981M96749n98373n3887
5272H738371R16067L69948k96680m81908K85249Q56748L70936J38302K78456p33784
5262A0441705l06682M8065O35098K13840j81713J01372K4239j70205K41070K48780
5252A1295569j24670n71114j23113R9104M05923N93088m5398J174969n89780n36019
$$ plain form
5320 13862756 13498792 13364562 12634195 13552174 13256158 12921451 12540816 12664759 12071910
5311 12071910 13146828 13534435 13023984 13140649 13056076 13039898 12502978 12902881 13002400 13954810
5301 13954810 13730753 13387719 12684532 11926289 12154297 12190961 12168859 12571792 12709489 11707220
5291 11707220 11490966 10022925 9095025 9465234 10351910 10378758 9557994 9112828 8717523
5282 8717523 8956829 9055244 9316585 9266018 9021560 9064863 8893882 9390631 8792258 8738371
5272 8738371 9654438 10024386 9727706 9245798 9531047 10387795 10758731 10897033 11175489 10441705
5262 10441705 10135023 10183088 10818186 11032026 10850313 10951685 10975924 10805719 11046789 11295569
5252 11295569 11170899 10599785 10476672 10575776 10981699 11574787 11529389 12704358 12114578 11578559
5242A1578559l77245j1502J60448l93869L48972J99127M84074j06581K59818Q0587
5232A2222388J197657O9357j63678L19788m58773p63473O158m52403Q45658j15419
5222A2707260K34582O83910N73937J763425J12937K01463O95688R16731J276652
5213A9166585R07688J77586Q53211R76950J102363Q82183J401532J818187Q77453
5204B8163738N18013M90834J72833K28143M66513R0097M33642j32131J96469p469
5194C0620682j95644J97083j02781L16437Q05156J56524m15628O90193o06546
5185C1465476j172800J9747J75562Q72458M13159o27669m32412J79150N87780
5176C1480451J447284P619p10905J14660p62027m20604p13232o3096M73776m32543
$$ plain form
5242 11578559 11201314 11189812 11350260 10956391 11305363 11504490 11988564 11881983 12141801 12222388
5232 12222388 13420045 13489402 13325724 13645512 13186739 12423266 12429424 11977021 12822679 12707260
5222 12707260 12941842 13625752 14199689 15963114 16076051 16277514 16973202 17889933 19166585
5213 19166585 20074273 20251859 21105070 22082020 23184383 24066566 25468098 27286285 28163738
5204 28163738 28681751 29172585 29345418 29573561 30040074 30130171 30563813 30431682 30628151 30620682
5194 30620682 30425038 30622121 30519340 30835777 31640933 31797457 31381829 32072022 31465476
5185 31465476 30292676 30312423 30487985 31360443 31773602 31145933 30713521 30892671 31480451
5176 31480451 32927735 32935354 32224449 32339109 31577082 31156478 30443246 30380150 30853926 30421383
5166C0421383K29363j225845j079928M73106O94529l14133J16193j62680k21114
5157B8930874L36238j097441P2172j303463j333871J8308n47398r13847k20350
5148B3941222k02527K33271q71557j63061J80621K86113q02632k074161j150758
5139A9376531P7507j541619j105976m3240j05094j23994n18346q9373J85039N88153
5129A6699588M06718l1438m22336P9851P46621R20608M88683M67937k32109r34116
5119A8190007k42402q07025l07481o58997q77088m22328o93664l99275j131763
5110A2649984l17962k77652n03179m55305k28463l05981k767m65599p2377K52187
5100A0272886n95722n5955P70179l51284m68557N30941J94591l58006k11091L56397
$$ plain form
5166 30421383 30650746 29424901 28344973 28818079 29512608 29198475 29314668 29151988 28930874
5157 28930874 29267112 28169671 28241843 26938380 25604509 25622817 25075419 24161572 23941222
5148 23941222 23738695 23971966 23100409 22937348 23117969 23404082 22601450 20527289 19376531
5139 19376531 19454038 17912419 16806443 16763203 16658109 16534115 16015769 15926396 16111435 16699588
5129 16699588 17106306 17074868 16652532 16732383 17479004 18399612 18888295 19356232 19124123 18190007
5119 18190007 17947605 17140580 16833099 16174102 15297014 14874686 14181022 13781747 12649984
5110 12649984 12332022 12054370 11551191 11095886 10867423 10561442 10558675 10093076 10020699 10272886
5100 10272886 9677164 9621209 10391388 10040104 9571547 10102488 10297079 9939073 9727982 10084379
5090A0084379L67475L2297M67654m10626j354694k61143n35762K73132J040432
5081I703144r30712l25536j24421L91024j04061L51432j21209J83935j33069p35232
5071H155295J47940j45954L60096L4101p39832L10965L48250K01168k20504j423878
5061G027647N22854q5847k6003q20035o07451R56447l89517j2994J14019r83451
5051E695669j058546k36262P28905K98978M49559P07384k39813Q34312l29900
5042F850286K65520J92334r12907l32253l15465j6811J04056k63758m9637l12219
5032E209146n11456L17948l66648m68344N87289O18271r14950p10273J47672R87830
5022D896485k53925l13068J67309L67353K36780K88433n7518K41291o06893j59413
$$ plain form
5090 10084379 10451854 10484151 10951805 10541179 9186485 8925342 8389580 8662712 9703144
5081 9703144 8772432 8446896 8322475 8713499 8609438 8960870 8839661 9023596 8890527 8155295
5071 8155295 8303235 8157281 8517377 8551478 7811646 8122611 8470861 8672029 8451525 7027647
5061 7027647 7550501 7464654 7438651 6618616 6011165 6967612 6578095 6565101 6679120 5695669
5051 5695669 4637123 4400861 5129766 5428744 5878303 6585687 6345874 7180186 6850286
5042 6850286 7115806 7308140 6395233 6062980 5747515 5730704 5834760 5571002 5521365 5209146
5032 5209146 4697690 5015638 4648990 4180646 4767935 5386206 4471256 3760983 3908655 4896485
5022 4896485 4642560 4329492 4496801 4864154 5100934 5389367 5331849 5573140 4966247 4806834
5012D806834L76289j68515L40394N27773m91233r06134m66700j37175p9957M81545
5002D283121J84293o10209O82642l60848l29045j16859K7155j33133P9374L26437
4992D032928m95190o43559n04884j66127Q95128j73361n96480O08345P29051R9523
4982C785374k44198l27871k2367K04136L62463n62766M31456l33912r43039j81653
4972B167623N47356R64817m87187o06801m0176M6712L67891j07020N66227J43777
4962C563219r73282K98552J00087j86413p15775N27465j79868k5041L15840Q2758
4952B807542M43318n50901l07328J31286L39634L29820K66658O24550r2082j147069
4942B845428k53529N24352j6052P7621M65087J50537k38881j27154j37949M15699
$$ plain form
5012 4806834 5183123 5014608 5355002 5882775 5391542 4485408 4018708 3881533 3801576 4283121
5002 4283121 4467414 3857205 4539847 4178999 3849954 3733095 3760250 3627117 3706491 4032928
4992 4032928 3537738 2894179 2389295 2223168 3118296 2944935 2348455 2956800 3685851 3785374
4982 3785374 3541176 3213305 3190938 3395074 3757537 3194771 3626227 3292315 2349276 2167623
4972 2167623 2714979 3679796 3192609 2585808 2545632 2592344 2960235 2853215 3419442 3563219
4962 3563219 2589937 2888489 2988576 2802163 2086388 2613853 2433985 2408944 2724784 2807542
4952 2807542 3250860 2699959 2392631 2523917 2863551 3193371 3460029 4084579 3992497 2845428
4942 2845428 2591899 3116251 3100199 3177820 3642907 3793444 3554563 3427409 3289460 3705159
4932C705159L01802j40483j26840O88319l06306j99211j87589J15780n47867L01323
4922C604087K99584q39233L19732K39035j0258n74835l27174J00061n53669j16257
4912B141073R23053J5563J04071N01749N80567m02193K02760k69184K83502L05320
4902D386281m53339n08623m76453P715Q7528M23503o7018M03230n60699R6908
4892C339033m41143O07405P03955o59859n32476l64350N94871k66145o0681L8720
4882B959330L84788l38688k15779P23890l75261L78317m05673j05949J95089r19353
4872B280711J27343O37340l0523k31344m81168L1911K37670M16386K65825L8534
4862C292685M54530o26452k41486j22812M06659j4846K71968M36043p9130m47900
$$ plain form
4932 3705159 4006961 3866478 3739638 4427957 4121651 3922440 3734851 3850631 3302764 3604087
4922 3604087 3903671 3064438 3384170 3623205 3612947 3038112 2710938 2810999 2257330 2141073
4912 2141073 3064126 3079689 3183760 3685509 4266076 3863883 4066643 3797459 4080961 4386281
4902 4386281 3932942 3424319 2947866 2955581 3043109 3466612 3399594 3802824 3242125 3339033
4892 3339033 2897890 3505295 4209250 3549391 3016915 2652565 3247436 2981291 2920610 2959330
4882 2959330 3344118 3005430 2789651 3513541 3138280 3516597 3110924 3004975 3200064 2280711
4872 2280711 2408054 3045394 3014871 2783527 2302359 2334270 2571940 2988326 3254151 3292685
4862 3292685 3747215 3120763 2879277 2756465 3163124 3148278 3420246 3856289 3777159 3329259
4852C329259M43333P49919j043091k58430j67927n08820J023439L48397j86399
4843C729680j240816P62700N90478P7824N57872j46979K03512l66605j159866
4834C007800m34457J474497Q13131m21660n46430k78748Q56536J92988k96911
4825D366746J125419J98560q55650k85432P88191R15730K11463M8950l65545o04501
4815E543931K36318j33406K95095o59468R1536L57425p77828J32123K77706p64975
4805D598457j1036M11263p2645R1090q9122j22416J56382P57521k31539M45163
4795E933118j52262N58677O32716N7783M40761q826O131M81886k71698L12602
4785G990888K24179J544383Q33771J38912J209026O09851P73248J404081J862297
$$ plain form
4852 3329259 3772592 4522511 3479420 3220990 3053063 2544243 3567682 3916079 3729680
4843 3729680 2488864 3251564 3842042 3919866 4477738 4330759 4534271 4167666 3007800
4834 3007800 2573343 4047840 4860971 4439311 3892881 3614133 4470669 4663657 4366746
4825 4366746 5492165 5690725 4835075 4549643 5337834 6253564 6465027 6513977 6148432 5543931
4815 5543931 5780249 5646843 5941938 5282470 5374006 5731431 4953603 5085726 5363432 4598457
4805 4598457 4587421 4998684 4926039 5017129 4928007 4805591 4961973 5719494 5487955 5933118
4795 5933118 5780856 6339533 6972249 7030032 7470793 7461967 7468098 7949984 7678286 7990888
4785 7990888 8215067 9759450 10593221 10732133 11941159 12551010 13324258 14728339 16590636
4776A6590636R06977N48317p33908n24589j478174j943825l53244L85207o34140
4767A2763257K93012Q26943O68829M40472R68403M22341J547426J752210K234162
4758B1917055K707572J879637J015220Q30054k22278j411685k049896k823340
4750B1842339k578936k164538j786914l34009p64628l05218M1518L37941J15591
4741A4403146L65505N14490j48265R55170J247815K051797J652254o10165k192416
4732A8239331k265234k212221j160501j557680j82375q82389j353345k04969j22446
4723H298171k8182k74326q05669j45360M1931K71108p75277k50433L03429k94264
4713F341128N64394m56816l49186k79467o14973r4999O40435N39737j59520l11663
$$ plain form
4776 16590636 17497613 18045930 17312022 16787433 15309259 13365434 13012190 13397397 12763257
4767 12763257 13056269 13883212 14552041 14992513 15960916 16383257 17930683 19682893 21917055
4758 21917055 24624627 26504264 27519484 28349538 28127260 26715575 24665679 21842339
4750 21842339 19263403 17098865 15311951 14977942 14213314 13908096 13949614 14287555 14403146
4741 14403146 14768651 15283141 15134876 16090046 17337861 19389658 21041912 20431747 18239331
4732 18239331 15974097 13761876 12601375 11043695 10861320 9978931 8625586 8420617 8298171
4723 8298171 8269989 7995663 7189994 7044634 7086565 7357673 6582396 6331963 6635392 6341128
4713 6341128 6905522 6448706 6099520 5820053 5205080 5110081 5750516 6290253 6130733 5819070
4703E819070r815L90090m08521j65727L78758j95604L48507j46349n51920l39730
4693E118759l52836M01804l0885l46116K79856N70234j27861K43367L3918O17546
4683F407786q80258P33502o15548j5451L83209J20210L90625n39257J16O59790
4673F644724K4504o28633K93747k86002l46390r9128J61710O7808O68255k43105
4663F257490L55956o17042M11116P16017J06824l2865O97138m5279p18621l88716
4653F742018K80641J48628k58571l77131M09979M32225r8424k12098J68430L2401
4643G268098P96191m65343K07987q6155m17800O00289M46110J22656N92311l74529
4633H689815L83728L04704K91945J317505j28675L28884J30770N95869L4664R19845
$$ plain form
4703 5819070 5809255 6199345 5790824 5625097 6003855 5808251 6156758 6010409 5458489 5118759
4693 5118759 4765923 5167727 5136842 4790726 5070582 5640816 5512955 5756322 5790240 6407786
4683 6407786 5527528 6261030 5645482 5630031 6013240 6133450 6524075 5984818 5984934 6644724
4673 6644724 6669228 6040595 6334342 6048340 5701950 5602822 5764532 5832340 6500595 6257490
4663 6257490 6613446 5996404 6407520 7123537 7230361 7197496 7894634 7849355 7130734 6742018
4653 6742018 7022659 7171287 6912716 6535585 6945564 7377789 7279365 7067267 7235697 7268098
4643 7268098 8064289 7598946 7806933 7720778 7302978 7903267 8349377 8472033 9064344 8689815
4633 8689815 9073543 9378247 9670192 10987697 10859022 11187906 11318676 11914545 11949209 12869054
4623A2869054R52330M15871J018724R42386J420396J903239J881857J670504J662131
4614B4736492J445715N58050l05047p96956n54416j283196r0512L5476N40350
4605B4285956J520756J192205R02700J440561l22482j323614k157586j681687
4597B3856809j068707M89588J18108M51104Q59142M96539N74713r16522j326064
4588B3534710j499344k65494k85374N43606N18723q5201O99958R48886o10539
4579B3499931o24228l55760k461238n35439j379982j442304q13446l59077o51012
4570A4877445o62183j89895p05789j01472m6984J91948k72236l73822J50629K26815
4560A3094456j82802k96893k33147M07935p18797l6328M02160k67500p63267L83498
$$ plain form
4623 12869054 13821384 14237255 15255979 16198365 17618761 19522000 21403857 23074361 24736492
4614 24736492 26182207 26740257 26435210 25638254 25083838 23800642 23710130 23745606 24285956
4605 24285956 25806712 26998917 27901617 29342178 29019696 27696082 25538496 23856809
4597 23856809 22788102 23277690 23395798 23846902 24706044 25202583 25777296 24860774 23534710
4588 23534710 22035366 21769872 21484498 22028104 22546827 22461626 23161584 24110470 23499931
4579 23499931 22875703 22519943 20058705 19523266 18143284 16700980 15887534 15528457 14877445
4570 14877445 14215262 14025367 13319578 13218106 13171122 13363070 13090834 12717012 12867641 13094456
4560 13094456 12911654 12614761 12381614 12789549 12070752 12034424 12436584 12169084 11405817 11789315
4550A1789315K54194K41349n31557K25014P4305M27003J59131m01966N19376J23026
4540A2879190o56669k47933O61765n59121j9831j41341M39161L64924k49689J77165
4530A2647621M4801m42189j8677L71361n86218L57527N44957k36506M7021r6364
4520A2633334l23107L48723j00334l53985n79753J060968Q6857o61936k79053
4511A1831714n37864Q4375L24255m48846K50634J246352r04342M81341m85406
4502A1842213k14960N1551J19313j59736N31278K52880K70126M82875p32907j041690
4492A1400943R4938J149375K77520R9723K18606j060526m80943J003644q4740
4483A2618540l40578k3171l28467L12280O17831n98830R13372J81723N00110L24434
$$ plain form
4550 11789315 12043509 12284858 11753301 11978315 12052620 12479623 12638754 12236788 12756164 12879190
4540 12879190 12222521 11974588 12636353 12077232 12057401 11916060 12355221 12720145 12470456 12647621
4530 12647621 12692422 12250233 12231556 12602917 12016699 12374226 12919183 12682677 12729698 12633334
4520 12633334 12310227 12658950 12558616 12204631 11624878 12685846 12772703 12110767 11831714
4511 11831714 11293850 11378225 11702480 11253634 11504268 12750620 11846278 12327619 11842213
4502 11842213 11627253 11678804 11798117 11638381 12169659 12422539 12692665 13175540 12442633 11400943
4492 11400943 11495881 12645256 12922776 13022499 13241105 12180579 11699636 12703280 12618540
4483 12618540 12277962 12254791 11926324 12238604 12856435 12257605 13170977 13352700 13852810 14177244
4473A4177244K37426m67683O8445l8797K00510O43756n27289N28816m06877p5053
4463A4340498p09517j03089L66405K21385o4984r57797n86685L61141o49041p56407
4453A1461909j4293l27595R59622q49868N5607j82222K69365o67966K20011L67756
4443A1292326j26158M15220p2169K47909J30329J80112M92328n40943q70253R23493
4433A2072194J4081N15211n29391k18074N93513j7503p7184n81832j272509O07329
4423A1105835P30346J74774j27644l07161N55903L9817K76127l24693j04883K83938
4413A2302359m30220m36813k80200O31312K726m00547j9064K66821l24438K38330
4403A1550266k74625J60215M02017l37429o45240N70170p62148M43778J81056
$$ plain form
4473 14177244 14414670 13946987 14015432 13976635 14177145 14820901 14293612 14822428 14415551 14340498
4463 14340498 13630981 13527892 13894297 14115682 14050698 13092901 12506216 12867357 12218316 11461909
4453 11461909 11447616 11120021 12079643 11229775 11285382 11103160 11372525 10704559 10924570 11292326
4443 11292326 11166168 11581388 11509219 11757128 11887457 12067569 12559897 12018954 11148701 12072194
4433 12072194 12086275 12601486 12072095 11854021 12447534 12430031 12352847 11771015 10498506 11105835
4423 11105835 11836181 12010955 11883311 11576150 12132053 12171870 12447997 12123304 12018421 12302359
4413 12302359 11872139 11435326 11155126 11786438 11789164 11388617 11369553 11636374 11311936 11550266
4403 11550266 11275641 11435856 11837873 11500444 10855204 11425374 10663226 11107004 11288060
4394A1288060N50769P20416q06053M71005p48482k05556j28169k03481M17417
4385A1355926n36796q23500J011687J79501p52048P87381O54634l87880m07885
4376A1081020p3675m80412m14181j6108P62730m56064l29145M55190N15346k07021
4366A0837680j042436O12701J42275N98082Q3076P16997o58498n965J92438q5161
4356A1391189k292j97178l86995p6056M03887M39058O27567K64014n32004l72291
4346A1558899L0481J29735J93580R62194M04116p16614L0496N19150Q1827J65455
4336A3359319J26493n83126k43440j56224K52592O25132L84187Q55739n15658
4327A4105014n32325O59486P6523J60652N15406J2143L02880R66584N7145N32664
$$ plain form
4394 11288060 11838829 12559245 11753192 12224197 11475715 11270159 11141990 10938509 11355926
4385 11355926 10819130 9995630 11007317 11186818 10434770 11222151 11876785 11488905 11081020
4376 11081020 11007345 10526933 10112752 10096644 10859374 10403310 10074165 10529355 11044701 10837680
4366 10837680 9795244 10407945 10550220 11148302 11231378 11948375 11289877 11283912 11476350 11391189
4356 11391189 11388897 11191719 10804724 10728668 11132555 11571613 12199180 12463194 11931190 11558899
4346 11558899 11589380 11719115 11912695 12874889 13279005 12562391 12592887 13112037 13193864 13359319
4336 13359319 13485812 12902686 12659246 12503022 12755614 13380746 13764933 14620672 14105014
4327 14105014 13572689 14232175 14308698 14469350 14984756 14996899 15299779 16266363 16323508 16856172
4317A6856172O40019K03605n79386M42255m72013k36062l82091P68927m90763
4308A6750663N90264Q51096l51270L84208j51580N62975K63324j02284M42071
4299A9239467J166582J376726N79994k90958J143850J327340J360653Q51700Q13881
4290B7569235K058481J586454K186228L28995j080491k290184j665299j305585
4282B7387834j028347p66015j448690p81510k66164p91538L58376N87304k19608
4273B3031642P19503l31808L44747j77653M26945J01005P96670M07979Q52551
4264B6171581J4032L2862R01756M12425j00020l60041j76432j10611K09546P74499
4254B7769597k65618K39507Q87298N65045J40768N30406N17007K58475K68889
$$ plain form
4317 16856172 17496191 17699796 17120410 17562665 17090652 16854590 16472499 17241426 16750663
4308 16750663 17340927 18192023 17840753 18224961 18073381 18636356 18899680 18797396 19239467
4299 19239467 20406049 21782775 22362769 22071811 23215661 24543001 25903654 26755354 27569235
4290 27569235 29627716 31214170 33400398 33729393 32648902 30358718 28693419 27387834
4282 27387834 26359487 25593472 24144782 23363272 23097108 22305570 22663946 23251250 23031642
4273 23031642 23751145 23419337 23764084 23586431 24013376 24114381 24911051 25319030 26171581
4264 26171581 26185613 26218475 27120231 27532656 27432636 27072595 26896163 26785552 26995098 27769597
4254 27769597 27503979 27743486 28630784 29195829 29336597 29867003 30384010 30642485 30911374
4245C0911374M35835K56546M76843J25962P39834K85496L169J031762O2647R38181
4235C5267649J187981N5193N2812J131670K77330M05479J322069K056917M99497
4226D2256597K65048J161601Q48830J043799J211551J406217J072242J516034
4218E0781919K153212J254933J331351J585094R50656K326466K524531J680046
4210F4588208K580000J948101L442373L148981L591968M063345L974045N933447
4202I3270468M852315O141601O383789P590131R590963J0596223J2144411J2917473
4194A63487374J5215679J8200628K0744322K2860409K7063832L1406043L4746781
4187C33725068L5563323K8534263J4050489j919349j0095150p891286r68499P366968
$$ plain form
4245 30911374 31347209 31603755 32080598 32206560 32946394 33231890 33235059 34266821 34329468 35267649
4235 35267649 36455630 36510823 36563635 37695305 37972635 38378114 39700183 41757100 42256597
4226 42256597 42521645 43683246 44532076 45575875 46787426 48193643 49265885 50781919
4218 50781919 52935131 54190064 55521415 57106509 58057165 60383631 62908162 64588208
4210 64588208 67168208 69116309 72558682 75707663 79299631 83362976 87337021 93270468
4202 93270468 98122783 104264384 110648173 118238304 127829267 138425490 150569901 163487374
4194 163487374 178703053 196903681 217648003 240508412 267572244 298978287 333725068
4187 333725068 369288391 397822654 411873143 409953794 399858644 391967358 390998859 398365827
4179C98365827N370573k307684j0595829j3870460j1422990n040426r872095k4763360
4171C25863556l1441019l3047086k8216673k0037303j5406769r012692o991895
4164A81710119m795319k582183o68215J367119K572426K101893l940178r652647
4156A66113015j2654955j1862385q437886o341238n417201l570902l219660j946877
4148A12661911l690388k433588l926287m288481l943533k864986k150753k126144
4140H7237751k099651k588037j755480j661170j932512k207006j675993r65466
4132G2352436j215195j138393k111254r45959j418847j782692j203756j187999
4124F1348341q60138r37171k84491j818168k688560j124373j536603j464806n96051
$$ plain form
4179 398365827 403736400 401428716 390832887 376962427 365539437 360499011 350626916 325863556
4171 325863556 294422537 261375451 233158778 213121475 197714706 188702014 181710119
4164 181710119 176914800 174332617 173664402 175031521 177603947 179705840 175765662 166113015
4156 166113015 153458060 141595675 133157789 126816551 121399350 117828448 114608788 112661911
4148 112661911 108971523 106537935 102611648 98323167 94379634 91514648 89363895 87237751
4140 87237751 85138100 82550063 80794583 79133413 77200901 74993895 73317902 72352436
4132 72352436 71137241 69998848 67887594 66941635 65522788 63740096 62536340 61348341
4124 61348341 60488203 59551032 59266541 57448373 54759813 53635440 52098837 50634031 50037980
4115E0037980j89245r16691j290169n15033j141072j81999l55314q28227q48840
4106D3771390k2087q3450o02563M9345r63067K98657J478852M63753l27532L40684
4096D4403982R99117J277770J624194o55826n01693k38360k225177j169246J19867
4087D3634628K78729J248953q16222r12718k43228N81536M33362j49178n0461
4078D4005401K37419J65481J445999j48769K68631j28680L10676J78929o87334
4069D5647753K30600J39928k5300L85584N51662K87759J70585l36231j99170j30486
4059D6722684l5907q66719P51018k20593j1077K62936r30896l44512j165523p89847
4049D3371564j212905q42906o6515j026329p77547r10472r71612k14230o68186
$$ plain form
4115 50037980 49848735 48932044 47641875 47126842 45985770 45803771 45448457 44620230 43771390
4106 43771390 43749303 43665853 43063290 43112635 42149568 42448225 43927077 44390830 44063298 44403982
4096 44403982 45403099 46680869 48305063 47649237 47147544 46909184 44684007 43514761 43634628
4087 43634628 43913357 45162310 44346088 43433370 43190142 43771678 44205040 44055862 44005401
4078 44005401 44242820 44408301 45854300 45705531 45974162 45845482 46156158 46335087 45647753
4069 45647753 45878353 46018281 45992981 46378565 46930227 47217986 47388571 47052340 46853170 46722684
4059 46722684 46686777 45820058 46571076 46350483 46339406 46602342 45671446 45326934 44161411 43371564
4049 43371564 42158659 41315753 41249238 40222909 39445362 38534890 37563278 37349048 36680862
4040C6680862m94672k40779j276615p97674o99144J30447M90809k08232l74093
4031C3210909K43632L62788K35750K472J59228K35262L55348P10577J011082R6966
4021C6624014J370990N47382J516857J574177P8169P84469K55638n42669j829305
4012D0379722k033384j408038p08032j045532p49700j009998l41980q94344N8168
4003C2246882L53313l14085p8425r22096k70327K92453L83288k38897m09895M22908
3993C1465119M7786O24211P95778r82437J523721O53065m96276q83726q0961j90978
3983C2475302L9237j52315k85854p36351q2953l30961l19801P33380r36057J12444
3973C0516071K04438J16648O69419J30829l66415k3599J34173R75367J33400K64551
$$ plain form
4040 36680862 36186190 35945411 34668796 33871122 33171978 33302425 33793234 33585002 33210909
4031 33210909 33454541 33817329 34053079 34055551 34214779 34450041 34805389 35515966 36527048 36624014
4021 36624014 37995004 38542386 40059243 41633420 41711589 42496058 42751696 42209027 40379722
4012 40379722 38346338 36938300 36230268 35184736 34435036 33425038 33083058 32188714 32246882
4003 32246882 32600195 32286110 32207685 31285589 31015262 31307715 31691003 31452106 31042211 31465119
3993 31465119 31512905 32137116 32932894 31950457 33474178 34127243 33630967 32747241 32666280 32475302
3983 32475302 32514539 32362224 32076370 31340019 31257066 30926105 30606304 31339684 30403627 30516071
3973 30516071 30720509 30837157 31506576 31637405 31270990 31247391 31381564 32356931 32490331 32754882
3963C2754882R54545R50475O86684J596165J250840L72200K96901Q3863j050722
3954C7895833j592005j660391j114448r58342r76113n27928j489165m44954M3903
3945B9176390j014601n9794j48678k27841m25781M47979m65959l89685K61535
3936B7153565j92678r11137K16508p79275M73545n57347m36574k39789M9806N74292
3926B5350916q6203M84108o27922j2161p3679J59553M56009m72032J5229P02341
3916B5896159o32418j31641K88087J19592o31836O46338j2303J7143k27199L61025
3906B5692947P8625k89819m28379m73077J048026J449988O85718n32614K16123
3897B7447538Q91811J355082J115558P69081J090785L86958J011350N2537K16368
$$ plain form
3963 32754882 33709427 34659902 35346586 36942751 38193591 38565791 38862692 38946555 37895833
3954 37895833 36303828 34643437 33528989 32570647 31594534 31066606 29577441 29132487 29176390
3945 29176390 28161789 28101995 27953317 27725476 27299695 27747674 27281715 26892030 27153565
3936 27153565 26960887 26049750 26266258 25486983 25960528 25403181 24966607 24726818 24776624 25350916
3926 25350916 25264713 25748821 25120899 25108738 25035059 25194612 25650621 25178589 25193818 25896159
3916 25896159 25263741 25132100 25420187 25539779 24907943 25554281 25541978 25559121 25331922 25692947
3906 25692947 25771572 25481753 25053374 24580297 25628323 27078311 27764029 27231415 27447538
3897 27447538 28339349 29694431 30809989 31579070 32669855 33056813 34068163 34120700 34337068
3888C4337068J377995O77319J199006M78505P53166J394589J530507J897548J769381
3879D5415084J558257J072960J384323J624285L155208K365263K024697K005372
3871F0605449K684075L459467K892564K859540L088365L717750L850834L630662
3863H6788706L883593K396368K112240J995046M98604N1352j047640j769824k232896
3854I2675549j190123j148074j315983j72097j475121r29259j120144j528463
3846H3796285k507680l315013m173527l860363l654991m711283m730913l308797
3838E3533718l066145l035955k424013k371568j919531j933734j348051j397380
3830C6037341r56842j003021j229071p63934o07105m13654o34484j070931j493142
$$ plain form
3888 34337068 35715063 36392382 37591388 38069893 38823059 40217648 41748155 43645703 45415084
3879 45415084 46973341 48046301 49430624 51054909 54210117 56575380 58600077 60605449
3871 60605449 63289524 66748991 69641555 72501095 75589460 79307210 83158044 86788706
3863 86788706 90672299 93068667 95180907 97175953 97674557 97725909 96678269 94908445 92675549
3854 92675549 91485426 90337352 89021369 88849272 87374151 86444892 85324748 83796285
3846 83796285 81288605 77973592 73800065 69939702 66284711 61573428 56842515 53533718
3838 53533718 50467573 47431618 45007605 42636037 40716506 38782772 37434721 36037341
3830 36037341 35080499 34077478 32848407 32084473 31477368 31063714 30429230 29358299 27865157
3821B7865157J92137L33312p07907K25973p88730m15729o69513J51574o83023
3812B5503251j089462j15936N16550j2827J73758p12471O69118k76521k79158
3803B4376302m12404o73048K23737p2240J13990O04243n93743p21184O58734L60631
3793B3865018j067959M53586J066566J17458J03701O21173J8402m39281K13778
3784B4952442N0231R58153L34180j33524k53465M1157N91615O00409Q11798j10770
3774B7842226L22065O00581L73941L70177Q07569R04703j96588k41961J70404
3765C0953117J63971Q02211Q09550K22686O24735o61329J88367N26272P10254
3756C4339834k33827l13211j96407L67510J55536P02939M76529r1017j18711M01690
$$ plain form
3821 27865157 28057294 28390606 27682699 27908672 27119942 26704213 26034700 26186274 25503251
3812 25503251 24413789 24297853 24814403 24801576 24975334 24262863 24931981 24655460 24376302
3803 24376302 23963898 23290850 23514587 23442347 23556337 24160580 23566837 22845653 23504387 23865018
3793 23865018 22797059 23250645 24317211 24434669 24538370 25159543 25177945 24738664 24952442
3784 24952442 25002673 25960826 26295006 26161482 25908017 25949174 26540789 27141198 27952996 27842226
3774 27842226 28164291 28764872 29138813 29508990 30316559 31221262 31024674 30782713 30953117
3765 30953117 31117088 31919299 32728849 32951535 33576270 32914941 33103308 33629580 34339834
3756 34339834 34106007 33792796 33596389 33963899 34119435 34822374 35298903 35207886 35089175 35490865
3746C5490865m0164k84790m97961L48657N97832M01769k5738O2173L76657J330111
3736C7759411O49556M94866Q49780P87097N30997J79216O78435J203565K129243
3727D5262166Q55772Q77312J193521J971804J499899J177028J448837N24560J493567
3718E6304466J726518Q55938K063899J471759J277253K585060J871442J291246
3710F9447581R66998Q78579J235784J648963R70847Q91363Q51244J473198J630733
3701G9995290R74682J228698J638386J359970J962565K670554L310982K142285
3693I5283412K571013L152890L037078L236717L496208L911493M516955M226200
3685A23431966M273544M186664K936926L530582J633111N45262O2575L05240r17004
$$ plain form
3746 35490865 35450701 35165911 34667950 35016607 35614439 36016208 35990470 36052643 36429300 37759411
3736 37759411 38408967 38903833 39753613 40540710 41071707 41250923 41929358 43132923 45262166
3727 45262166 46117938 46995250 48188771 50160575 51660474 52837502 54286339 54810899 56304466
3718 56304466 58030984 58886922 60950821 62422580 63699833 66284893 68156335 69447581
3710 69447581 70414579 71293158 72528942 74177905 75148752 76040115 76891359 78364557 79995290
3701 79995290 80969972 82198670 83837056 85197026 87159591 89830145 93141127 95283412
3693 95283412 97854425 101007315 104044393 107281110 110777318 114688811 119205766 123431966
3685 123431966 127705510 131892174 134829100 138359682 139992793 140538055 140600630 140905870 139988866
3676A39988866j084511j402820R6955j15620m58778l03377j58000j324889k208631
3667A33029195k258877k312142l929458l347616l834238n085567m070829m221382
3659A03969086k611621k697797k426521r72498j697434k026144m16547o2721k13543
3650I0844260P2855L16699M34879M37761L38413J474844R62480J608610R85278
3641I7476079J525753K069005J857100J074434K153617K500190J833962R42196
3633A11432336M18547P83489K18883L29034j346724j502776k169467j676728j608893
3624A04877701k354615k103374j421028j821198j499338q97984j207590j175914
3616I2396660r58168o30065j324241q90854J96813o37562j448962n71055p94917
$$ plain form
3676 139988866 138904355 137501535 137598490 137482870 137024092 136720715 136562715 135237826 133029195
3667 133029195 130770318 128458176 124528718 121181102 117346864 112261297 108190468 103969086
3659 103969086 101357465 98659668 96233147 95260649 93563215 91537071 91120524 91057803 90844260
3650 90844260 90917115 91233814 91668693 92106454 92444867 93919711 94882191 96490801 97476079
3641 97476079 99001832 101070837 102927937 104002371 106155988 108656178 110490140 111432336
3633 111432336 111850883 112634372 112853255 113182289 111835565 110332789 108163322 106486594 104877701
3624 104877701 102523086 100419712 98998684 97177486 95678148 94780164 93572574 92396660
3616 92396660 91438492 90808427 89484186 88593332 88790145 88152583 86703621 86132566 85337649
3607H5337649K26591O11933K19350L46314M15422J189909J228323P64957L79998
3598I0720446Q87666N39855P32290k27041N42682M59627N14348J50846M00248
3589I4720967o93059n232J97012L4139r24372q95214m62265m86067k14090r30844
3579I0340975k311541j520530j511667j797646k524402k558918k165782k407071
3571G3543418j518145j793432k325442j971270j391070k317807j701719j692908
3563E8831625j217519k483450m24758l28985j753873k098402j095803j291979
3555D8136856j289113j455527o32865l78578L69721r81583j562895P3915L6799
3546D2316730m41217o45741k31904J76419l00975j25280l1305l19947m97959k18561
$$ plain form
3607 85337649 85564240 86176173 86395523 86741837 87157259 88347168 89575491 90340448 90720446
3598 90720446 91608112 92147967 92880257 92653216 93195898 93655525 94169873 94320719 94720967
3589 94720967 94027908 94022676 94219688 94253827 93329455 92434241 91971976 91485909 91271819 90340975
3579 90340975 88029434 86508904 84997237 83199591 80675189 78116271 75950489 73543418
3571 73543418 72025273 70231841 67906399 65935129 64544059 62226252 60524533 58831625
3563 58831625 57614106 55130656 54705898 54376913 52623040 50524638 49428835 48136856
3555 48136856 46847743 45392216 44759351 44380773 44750494 43768911 42206016 42279931 42316730
3546 42316730 41875513 41229772 40997868 41174287 40873312 40748032 40716727 40396780 39898821 39680260
3536C9680260K83131J02583j65324O24667j546024q45163J73347k18630N27691
3527C8616538M44800J51139J94358l95871j069830m1537J82936l08059j81253
3518C7593221L62980o14792N18492p1815j49184j56196q6750j72092n09176K00193
3508C6914881n10931k9620n07534r11109O05162M07364r5786k83474k76280k3923
3498C5288750m62023J58011n44732k66005K14559N46128L3691O5905M12367J184044
3488C6630695m53102k53158j17931L03196J046865M74751K90404o90862R59108
3479C8189966O00129M87548k68679P03147k63161L3340N68123j35073J099541
3470D1014881J313429J468459N89795J043433K218250J934739K210152L196453
$$ plain form
3536 39680260 39963391 40065974 39900650 40525317 38979293 38134130 38307477 38088847 38616538
3527 38616538 39061338 39212477 39406835 39010964 37941134 37899597 38082533 37774474 37593221
3518 37593221 37956201 37341409 37859901 37788086 37638902 37482706 37395956 37223864 36714688 36914881
3508 36914881 36403950 36374330 35866796 34955687 35560849 35968213 35872427 35588953 35312673 35288750
3498 35288750 34826727 34984738 34440006 34174001 34388560 34934688 34968379 35034284 35446651 36630695
3488 36630695 36177593 35924435 35806504 36109700 37156565 37631316 37921720 37230858 38189966
3479 38189966 38790095 39277643 39008964 39712111 39448950 39482290 40050413 39915340 41014881
3470 41014881 42328310 43796769 44386564 45429997 47648247 49582986 51793138 54989591
3462E4989591K180384J657783k12838k346159k097859k878838k439019j331745
3454D7521300j078639m32818K178n51894L9288P00810N45645J28683N73245P7789
3444D7525587R80435Q31925J458797J827543J067395K207706K873056J738978
3436F0511422K857698K385736L840239M347939L846833N213488N891281L217417
3428I2112053k070088n648889o717504n836329m768134l097478k757459j535433
3420E9680739m81360p24125o20411m0741r3988r06769j05012L95767J13411P17592
3410E7935103Q05552J207078J444731P98497J478381J659692K720844K452811
3402G0502689K605579K036898L563191M183370M879838L008896k410396l484322
$$ plain form
3462 54989591 57169975 58827758 58614920 56268761 54170902 51292064 48853045 47521300
3454 47521300 46442661 46009843 46012021 45460127 45499415 46200225 46745870 46874553 47447798 47525587
3444 47525587 48506022 49337947 50796744 52624287 53691682 55899388 58772444 60511422
3436 60511422 63369120 65754856 69595095 73943034 77789867 83003355 88894636 92112053
3428 92112053 90041965 84393076 77675572 71839243 67071109 63973631 61216172 59680739
3420 59680739 59199379 58475254 57854843 57814102 57720114 56813345 56708333 57104100 57217511 57935103
3410 57935103 58740655 59947733 61392464 62190961 63669342 65329034 68049878 70502689
3402 70502689 73108268 75145166 78708357 82891727 87771565 90780461 88370065 84885743
3394H4885743n683222n320945l052123k919763k084051j523270j457994m02773
3386F2441602m08312l32456M52724R36553J60368J72796O24001J451271J141883
3377F6640430P96220O36017J216334J056192K033603J722310N67724J456584J730296
3368G7855710K062023J819715J853947R22803N02869k1547j281724j515959j062502
3359H1135335j103717K28554M83281j377014J6517J014949R28102j10152J132080
3350H2347935P84708O58495Q81139J838359J301946J589656K015304O76103R74542
3341I3068187K007863J401585p29181m90364P75453j44143N0731J010400J426790
3332I8377321J327026J136709J006992K111567K263517J734093L41052M55847
$$ plain form
3394 84885743 79202521 73881576 70829453 67909690 65825639 64302369 62844375 62441602
3386 62441602 62033290 61700834 62153558 63090111 63250479 63423275 64047276 65498547 66640430
3377 66640430 67436650 68072667 69289001 70345193 72378796 74101106 74668830 76125414 77855710
3368 77855710 79917733 81737448 83591395 84514198 85017067 84995520 83713796 82197837 81135335
3359 81135335 80031618 80260172 80743453 79366439 79382956 80397905 81326007 81215855 82347935
3350 82347935 83132643 83791138 84672277 86510636 87812582 89402238 91417542 92093645 93068187
3341 93068187 95076050 96477635 95748454 95258090 96033543 95889400 95940131 96950531 98377321
3332 98377321 99704347 100841056 101848048 103959615 106223132 107957225 108298277 108754124
3324A08754124J104783M89449J394796J192800Q84284K183585K602878J426328
3316A20033027K629066L039969K191303L089369L862498M318886M669143L469055
3308A47302316J246781L35865Q80785K48553J061297L43284J511917L021263L320600
3299A59272661M103731K774279L209572J485512P35290M83247J201542J696940
3291A74962774J430951J462717K261779L131683M296124L812902M587093N186645
3283B01132668M571438N589332P055845P757484P539321R939786R041691R966772
3275B62594337J0940032J0766820J0520937J2070031J2707098J4583091J5807082
3268C49989428J6011639J4802180J3579684J2668686R723964P898593M100836
$$ plain form
3324 108754124 109858907 110348356 111743152 112935952 113820236 116003821 118606699 120033027
3316 120033027 122662093 125702062 127893365 130982734 134845232 139164118 143833261 147302316
3308 147302316 148549097 148884962 149765747 150014300 151075597 151418881 152930798 155952061 159272661
3299 159272661 163376392 166150671 169360243 170845755 171581045 172064292 173265834 174962774
3291 174962774 176393725 177856442 180118221 183249904 187546028 191358930 195946023 201132668
3283 201132668 205704106 211293438 218349283 226106767 233646088 243585874 252627565 262594337
3275 262594337 273534369 284301189 294822126 306892157 319599255 334182346 349989428
3268 349989428 366001067 380803247 394382931 407051617 416775581 424674174 428775010
3261D28775010m06592n571890j2457296j8424239k1847964k1938140k1039501
3254C27089388j9726559j7848300j5278671j3577195j1816555j1157455r198893
3247B28485760q087893p591401o834186o244212n538782m722970m548055m084884
3239A80833377m553538m505940k766018j331957k297856l245259k332693j792229
3231A58007887j640435l379313k106651k077487j999618j770044j009074j126816
3223A42898449j439634j393342k551518l224874l425697l776769l779047l393388
3215A19914180k241604k013569k848698j599729j127428j541357j115644j616559
3207A05809592j503373k399070q94246k10618j691930r39037m64433n44699j409602
$$ plain form
3261 428775010 428368418 422796528 410339232 391914993 370067029 348128889 327089388
3254 327089388 307362829 289514529 274235858 260658663 248842108 237684653 228485760
3247 228485760 220397867 212806466 205972280 199728068 194189286 189466316 184918261 180833377
3239 180833377 176279839 171773899 169007881 167675924 165378068 162132809 159800116 158007887
3231 158007887 156367452 152988139 150881488 148804001 146804383 145034339 144025265 142898449
3223 142898449 141458815 140065473 137513955 134289081 130863384 127086615 123307568 119914180
3215 119914180 117672576 115659007 112810309 111210580 110083152 108541795 107426151 105809592
3207 105809592 104306219 101907149 101012903 100802285 99110355 98171318 97706885 97162186 95752584
3198I5752584p10303K01216j140463j533023j133005p74517p133q9197q46983
3189H9719176j807789j01811r17287k513771j719694p05597l34493l57416j454943
3180G9806375l22466j331264j188184j72526p63085j731391k54647l62201j682049
3171G1998562j258732n84802m32245p49216o34858Q8834o29525j234602j971203
3162F4592213n91616J48451j503752P06442m53837o18905n77198n50709p1555
3153F1079534M84445j40524j344804r46264L43513j144178j085442n87857m32580
3144E6225843k98998j64215n43189j166903q32547p9236m58994m79054l89532
3135E1813175K15443m8069o79900m22100k82667k08061o40780j85656Q6326l43804
$$ plain form
3198 95752584 95042281 95243497 94103034 92570011 91437006 90662489 90655356 90566159 89719176
3189 89719176 87911387 87809576 86892289 84378518 82658824 81953227 81618734 81261318 79806375
3180 79806375 79483909 78152645 76964461 76791935 76028850 74297459 74042812 73680611 71998562
3171 71998562 70739830 70155028 69722783 68973567 68338709 68427543 67798018 66563416 64592213
3162 64592213 64000597 64149048 62645296 63351738 62897901 62278996 61701798 61151089 61079534
3153 61079534 61563979 61423455 60078651 59132387 59475900 58331722 57246280 56658423 56225843
3144 56225843 55926845 55762630 55219441 54052538 53219991 53140755 52681761 52202707 51813175
3135 51813175 52028618 51980549 51300649 50878549 50595882 50387821 49747041 49561385 49647711 49303907
3125D9303907k77180o54196P59128p5651p18175L42005k69541n8050M74742K62787
3115D9089776o79515n39399n62184r55533j237149l21514m26673j64118k2225
3106D4181466q92029k68471m13929j229842P4057l13096q59743l7928K14764N93915
3096D1049164J33333K61447j39400r16779p41170M9934K63704m29957m67897N39358
3086C9601737R7741K7545p95917o70040j4576q53887n38556m61423M3177L17099
3076C6752900j5812J95778j404163L92048P72350J51152p30299j139569P4683
3067C5049068k48687r0585k99975k39074M23911L4852r51263K41380l19843j55815
3057C3443969j42725J67749K09643K54309o18456j006470K60711J14981J17838
$$ plain form
3125 49303907 49026727 48372531 49131659 49056008 48337833 48679838 48410297 48352247 48826989 49089776
3115 49089776 48410261 47870862 47308678 46353145 45115996 44794482 44367809 44203691 44181466
3106 44181466 43289437 43020966 42607037 41377195 41451252 41138156 40278413 40240485 40455249 41049164
3096 41049164 41182497 41443944 41304544 40387765 39646595 39696529 39960233 39530276 39062379 39601737
3086 39601737 39699478 39727023 38931106 38261066 38246490 37392603 36854047 36392624 36435801 36752900
3076 36752900 36737088 36932866 35528703 35920751 36693101 36844253 36113954 34974385 35049068
3067 35049068 34800381 34709796 34409821 34170747 34594658 34629510 33678247 33919627 33599784 33443969
3057 33443969 33301244 33468993 33678636 33932945 33314489 32308019 32568730 32683711 32801549
3048C2801549l98011l55816P66040J7049r56972J161659K07858r75258L14921
3039C2583019M46372R33408j188186K25713Q86710K98602K02124j16617J176112
3030C5447257K22709p29512Q44770O68194n86223o96680N5112J172130n279o09364
3020C5783114L56572N59415J038795k27325k50056M5901J12941K48764Q63928
3011C8532049j8171o71591J83953N74174J72885P14880O22694K45216M9091L81550
3001D0786730J511107P35898O85370R94405M08849o304R28819M27086j41581P53431
2991D7083810L3836O71326p1698j54809M6752p15659L85168N25912L11626Q10942
2981D8927206P51207K07174J8314L75481O06637Q4477R97472k77206L45389J459274
$$ plain form
3048 32801549 32403538 32047722 32813762 32830811 31873839 33035498 33243356 32268098 32583019
3039 32583019 33029391 33962799 32774613 33000326 33887036 34185638 34387762 34271145 35447257
3030 35447257 35669966 34940454 35785224 36453418 35867195 35170515 35225627 36397757 36392478 35783114
3020 35783114 36139686 36699101 37737896 37510571 37260515 37306416 37419357 37668121 38532049
3011 38532049 38513878 37842287 38026240 38600414 38773299 39488179 40110873 40356089 40405180 40786730
3001 40786730 42297837 43033735 43719105 44713510 45122359 45116055 46044874 46471960 46330379 47083810
2991 47083810 47117646 47788972 47717274 47562465 47609217 46893558 47278726 47804638 48116264 48927206
2981 48927206 49678413 49885587 49903901 50279382 50886019 50970496 51967968 51690762 52036151 53495425
2971E3495425N14608K62692J034531J356774R8776N54827J903004K78224J635685
2962F1134546K179735J711477P29107K83108J578852J638383L55312N18549K066153
2953G2195222Q94591J481501Q07780P63283P83421O61806J174570O27958R83586
2944H0373718K98668O03429N97020J426718R14281N12565J995139J456404J604531
2935H9782473J660207K346093K034652O66176K447767L086941L562378K224503
2927A07811190K866830M026869L675624K862582K508767J739632q6182n97399
2919A24807913j605971l098473m026278k433291k984472j748982k031104j773285
2911A05106057n04106J79488K06506Q95782J391839J323750J542844Q76303J614141
$$ plain form
2971 53495425 54010033 54272725 55307256 56664030 56762806 57317633 59220637 59498861 61134546
2962 61134546 63314281 65025758 65754865 66037973 67616825 69255208 69610520 70129069 72195222
2953 72195222 73089813 74571314 75379094 76142377 76925798 77587604 78762174 79390132 80373718
2944 80373718 80672386 81275815 81872835 83299553 84213834 84726399 86721538 88177942 89782473
2935 89782473 91442680 93788773 95823425 96489601 98937368 102024309 105586687 107811190
2927 107811190 110678020 114704889 118380513 121243095 123751862 125491494 125405312 124807913
2919 124807913 123201942 120103469 116077191 113643900 110659428 108910446 106879342 105106057
2911 105106057 104601951 104781439 104987945 105883727 107275566 108599316 110142160 111018463 112632604
2902A12632604J868619K705217J262075J482591J578052O64370J01059N31833
2894A22826420k6676j434282k174858k030621k058842k302173k956261m222263
2886A05620444l173393k099066l729753k504404j122218j164487o92803q09833
2878I0324487n42673o53255j706606j23923o3242j561955p79252n96781j201878
2869H3094922j435312j825185k465311k378461j998203j996495k106277k094013
2861F6795665k705187j426956j880020k628741j884062j812636j145143p78307
2853E2534613j395110n75837j187362j059120o66928l72262o95511j009283j510895
2844D4062305p41667r5984j290487j344881j182333l01352p88714j258355j37305
$$ plain form
2902 112632604 114501223 117206440 118468515 119951106 121529158 122193528 122294587 122826420
2894 122826420 122799744 121365462 119190604 117159983 115101141 112798968 109842707 105620444
2886 105620444 102447051 100347985 96618232 94113828 92991610 91827123 91134320 90324487
2878 90324487 89781814 89128559 87421953 87298030 87234788 85672833 84893581 84296800 83094922
2869 83094922 81659610 79834425 77369114 74990653 72992450 70995955 68889678 66795665
2861 66795665 64090478 62663522 60783502 58154761 56270699 54458063 53312920 52534613
2853 52534613 51139503 50563666 49376304 48317184 47650256 47277994 46582483 45573200 44062305
2844 44062305 43320638 43224654 41934167 40589286 39406953 39105601 38316887 37058532 36921227
2835C6921227o49397p96879k48672r48699j127001p49771Q4742k50191k73356
2826C1962003l17329n52578Q977r55225l17100j327116l63543r0461j311576o35310
2816B6100742l13714l16064L33919o12987l23893J4799j8609m27682q89320k77709
2806B3269482j07617j18311j022962p6706M6326K14056m27597n8040o45989o25223
2796B0447419K41951k01089j002011p15439n43287L51567m06611l89145l67878
2787A7415477j64310q7485q60975n24351P415m10148J71179J69100k14246n595
2777A5496061k01014n597r8515K35491P2697K66049q85382Q3522l03509l75928
2767A4283875q37313J28202j16776j13512l73058q62184m8075l33305j053855
$$ plain form
2835 36921227 36271830 35474951 35226279 34277580 33150579 32400808 32485550 32235359 31962003
2826 31962003 31644674 31092096 31101073 30145848 29828748 28501632 28138089 28047628 26736052 26100742
2816 26100742 25787028 25470964 25804883 25191896 24868003 24882802 24864193 24436511 23547191 23269482
2806 23269482 23161865 23043554 22020592 21943886 21990212 22204268 21776671 21718631 21072642 20447419
2796 20447419 20689370 20488281 19486270 18770831 18227544 18579111 18172500 17783355 17415477
2787 17415477 17251167 17163682 16302707 15778356 15785771 15375623 15546802 15715902 15501656 15496061
2777 15496061 15295047 15289450 15190935 15426426 15499123 15765172 14879790 14963312 14659803 14283875
2767 14283875 13446562 13574764 13457988 13344476 12971418 12109234 12061159 11727854 10673999
2758A0673999l15924N89358P34866L5952o85396N6591l94376l63806k29642m29640
2748I671982Q3588L37099O3524l55785j75925p84608L90853L19146l08188J98667
2738I440353o41214N67066L6900j139084j63292N06318Q23876p83642m73052M79685
2728H653914j103719n6720j17117L62771n63739o46979j73402K73900k50181Q00455
2718G179183M06114m57235n31450n33343N05821L90285k51237l95955j69584R48355
2708G090954K59308l15704m07860j95957n26180l59848k48996j86564N75657p04412
2698D980398l89581K07517M46414J78644r39042P58055J033115m00019K13059
2689F088560n58452K62784L35643m79824l34303l41787M46015K99703j2665K16116
$$ plain form
2758 10673999 10358075 10947433 11682299 11718251 11032855 11089446 10695070 10331264 10101622 9671982
2748 9671982 9755570 10092669 10156193 9800408 9624483 8839875 9230728 9549874 9241686 9440353
2738 9440353 8799139 9366205 9403105 8264021 8100729 8607047 9430923 8647281 8174229 8653914
2728 8653914 7550195 7493475 7376358 7739129 7175390 6528411 6355009 6628909 6378728 7179183
2718 7179183 7585297 7128062 6596612 6063269 6569090 6959375 6708138 6312183 6142599 7090954
2708 7090954 7350262 7034558 6626698 6430741 5904561 5544713 5295717 5109153 5684810 4980398
2698 4980398 4590817 4798334 5244748 5423392 4484350 5242405 6275520 5875501 6088560
2689 6088560 5530108 5792892 6128535 5648711 5314408 4972621 5418636 5718339 5705674 5921790
2679E921790n27422k28463K03854L20234p42376L96079P39870j87077q58724P3331
2669E111096K61136M2166J24962q45622o371K4838J44419p8769p10224O16586
2659D684217L74179j76675j01000P9572j4159m02052M65774n15797n54212N62448
2649D402295R0320j28776M86062l546j67062j01111j37681K82095l6125M8951
2639D735422O65454J10657n81545L10192k36809O28M73871p94119N24258j67749
2629E040260L26282P63557j010615j17606l47109j285732N71732N32350o26425
2620C846694J300676J46539q53802k87197J87302J49025O46643n32875k77129
2611D325876L34743M81725k62875K06299Q74161p60972m39844j31135K62090Q06799
$$ plain form
2679 5921790 5394368 5165905 5369759 5689993 4947617 5343696 6083566 5896489 5037765 5111096
2669 5111096 5372232 5414398 5539360 4693738 4687367 4712205 4856624 4777855 4067631 4684217
2659 4684217 5058396 4881721 4780721 4860293 4846134 4444082 4909856 4394059 3839847 4402295
2649 4402295 4492615 4363839 4849901 4846355 4679293 4578182 4440501 4722596 4686471 4735422
2639 4735422 5400876 5511533 4929988 5240180 5003371 5003999 5477870 4683751 5208009 5040260
2629 5040260 5366542 6130099 5119484 5001878 4654769 3369037 3940769 4473119 3846694
2620 3846694 5147370 5293909 4440107 4152910 4340212 4489237 5135880 4603005 4325876
2611 4325876 4660619 5142344 4879469 5085768 5959929 5198957 4759113 4627978 4890068 5696867
2601E696867j45389p01698J42220l91450M91878p8389n1463m03359k01642N84650
2591D942225l908p18999N6559J5934r43171J923L07568J087649L8447o40997p3466
2580D069764l97502N23796l4247L1935l63625J6330k11667k98074p32816M21762
2570C025656J010759p4216o74374k10674K03763j60697k22888j23017K44529K29469
2560C248310J0579l86559p0178m01167O00616J20995P22644l50754k27318k01898
2550C065270p94714n64251j430K55455P95933j06504K25561K82397n2804m91453
2540B613460n484J091187J46934q67693q63129j09747k28590L58343M05304o7241
2530B473344J23080M32772J56666o1899Q8875N4507n18073n47403m85104J29806
$$ plain form
2601 5696867 5551478 4849780 4992000 4600550 5092428 5014039 4962576 4559217 4357575 4942225
2591 4942225 4938317 4219318 4275877 4291811 3348640 3350563 3658131 4745780 4784227 4143230 4069764
2580 4069764 3672262 4196058 4161811 4193746 3830121 3846451 3634784 3336710 2603894 3025656
2570 3025656 4036415 3962199 3287825 3077151 3280914 3120217 2897329 2774312 3018841 3248310
2560 3248310 3258889 2872330 2802152 2400985 3001601 3122596 3845240 3494486 3267168 3065270
2550 3065270 2270556 1706305 1704875 1960330 2756263 2649759 2875320 3157717 3104913 2613460
2540 2613460 2607976 3699163 3846097 2978404 2115275 2005528 1776938 2135281 2540585 2473344
2530 2473344 2596424 3029196 3185862 3123963 3212838 3267345 2749272 2201869 1716765 1846571
2520A846571K75878p254l86755J025574n19196Q1202r18408J00255N7748j55700
2510A399915J028759P01705Q0591p29143k01665o20637K70311q52914k41922J32190
2500I67190J225636M07701L03055l66083o31008l99632N318N76720k30630o11993
2490A246274j07477P61064J31067l49364l76777o60117M31917M54513n51745k55054
2480G24301N86863R20716n44393j159406K87062P33860k59623l26264r21846P41163
2470G82433R75101m88344j96289M29856j45161l16694q14943M76614P52857j10654
2460A344776J51312n4004j99842q16415k67522L11068J182157j65357J00005J88126
2450A774304j77385n92518o58991Q30684P66722n02414j11061K10155p49740j30337
$$ plain form
2520 1846571 2122449 2115195 1728440 2754014 2234818 2316020 1397612 1497867 1555615 1399915
2510 1399915 2428674 3130379 3210970 2481827 2280162 1659525 1929836 1076922 835000 967190
2500 967190 2192826 2600527 2903582 2537499 1906491 1506859 1512177 2088897 1858267 1246274
2490 1246274 1138797 1899861 2030928 1681564 1304787 644670 1076587 1531100 979355 724301
2480 724301 1311164 2231880 1687487 528081 815143 1549003 1289380 963116 41270 782433
2470 782433 1757534 1269190 1072901 1502757 1357596 1040902 225959 702573 1455430 1344776
2460 1344776 1496088 1442084 1242242 425827 158305 469373 1651530 1486173 1586178 1774304
2450 1774304 1596919 1004401 345410 1176094 1942816 1440402 1329341 1539496 789756 659419
2440F59419M32254J058756m01811j71297m7459N81710L2547o2227k16117j187387
2430F78388K11667P44244j03501k56176L89078k37876O95761k69750r26720R7917
2420A023032K88320K20312L73376o68481o1194J80587J9068L19136J58967L91889
2410B245012p14167J4521j043723K36528M83026R8116P24448K90473o15200K01539
2400A920573m63137k2734J9918k16362l77869k30920J986339J75898p69404M17379
2390B439681R44559j176019n80159R97695P91505o36831m10450k98324k62743
2381A808914n23059k08197L99235q53917l37016J028126L97245K52504o53054
2372A310781L76730O6063k87276J32850n05850k53503k7277L56472k31387N24772
$$ plain form
2440 659419 1091673 2150429 1748618 1577321 1529862 2111572 2144119 2081892 1865775 678388
2430 678388 890055 1634299 1530798 1274622 1663700 1425824 2121585 1851835 925115 1023032
2420 1023032 1311352 1531664 1905040 1236559 1175365 1355952 1375020 1694156 1853123 2245012
2410 2245012 1530845 1545366 501643 738171 1221197 1319313 2043761 2334234 1719034 1920573
2400 1920573 1457436 1434702 1454620 1238258 860389 629469 2615808 2791706 2022302 2439681
2390 2439681 3384240 2208221 1628062 2625757 3417262 2780431 2369981 2071657 1808914
2381 1808914 1285855 1077658 1476893 622976 285960 1314086 1711331 1963835 1310781
2372 1310781 1687511 1753574 1466298 1599148 1093298 839795 812518 1168990 937603 1462375
2362A462375P07761p35771k99826J89155m64072K52918K63285N52921k60609j99785
2352A468352N46736j68574j72288J65008q44327l78024J070698n86168n01515
2343E99898o4075j35901R90395q141n13235M99752L66917J9237q09044j32728
2333H13075J031815r4988n89858P14122K88081P2280m81185r08472L52966L44548
2323A542384J85089L51082j004427m6949N11237m05631Q77256p38501l90336Q26551
2313A707755l45034q04461M95133P82007k5550j13982k14828K77098L11361j36360
2303A933139J31854n3562j023305K42767R59557j72441j014p93095K75823l5594
2293A464129K43060M40700J49052N69621m78491j027367J42700K88637n76789
$$ plain form
2362 1462375 2170136 1434365 1134539 1323694 859622 1112540 1375825 1928746 1668137 1468352
2352 1468352 2015088 1846514 1674226 1839234 994907 616883 1687581 1101413 599898
2343 599898 535823 399922 1390317 1382176 868941 1368693 1735610 1754847 945803 813075
2333 813075 1844890 1749902 1160044 1874166 2162247 2234527 1753342 844870 1197836 1542384
2323 1542384 1727473 2078555 1074128 1027179 1538416 1132785 2010041 1271540 881204 1707755
2313 1707755 1362721 558260 1053393 1835400 1809850 1695868 1481040 1758138 2069499 1933139
2303 1933139 2064993 2011431 988126 1230893 2190450 2018009 2016995 1223900 1499723 1464129
2293 1464129 1707189 2147889 2296941 2866562 2388071 1360704 1503404 1792041 1215252
2284A215252K4417K06930J9664J158926J77009p99011o2716l28856J38649j22567
2274A627697K96256Q38511j57021j126887O17113j75282J85527N90349k79488
2265B416775j85911N25314K04985L95073o32030q50288N37864k92440L98020M15332
2255B932694o8469M46886l19182q47288l75413M73269L60249J25960m2666O48751
2245C334791J72750l07996O65486m48208n00670m69563N34652P74806k46988o51114
2235B857946J15357o4490M78665J25145j16690M53412L31878l65898n35525M30444
2225C710244Q02430L29793j100728M83936q1473l18039Q95027q6061L12448j46612
2215D800965j6398M70295l45988J163165O15061M46374l20882J31155M49180o21197
$$ plain form
2284 1215252 1239669 1446599 1466263 2625189 2802198 2003187 1940471 1611615 1750264 1627697
2274 1627697 1923953 2762464 2605443 1478556 2095669 1920387 2105914 2696263 2416775
2265 2416775 2230864 2756178 2961163 3356236 2724206 1873918 2411782 2119342 2517362 2932694
2255 2932694 2864225 3311111 2991929 2144641 1769228 2242497 2602746 2728706 2686040 3334791
2245 3334791 3507541 3199545 3865031 3416823 2916153 2446590 2981242 3756048 3509060 2857946
2235 2857946 2973303 2908813 3387478 3512623 3395933 3849345 4181223 3815325 3279800 3710244
2225 3710244 4512674 4842467 3741739 4225675 4144202 3826163 4721190 4635129 4947577 4800965
2215 4800965 4784567 5254862 4908874 6072039 6687100 7133474 6812592 6943747 7392927 6771730
2205F771730M85372N01063M28522J98075N76847l04274l18804m78565m53816J52937
2195G559087R82120L11297l60393j56995Q7461N50344M478L74582L68240K28060
2185I948281q94574j47092O49280j35451L20649P53620L22312o07245J65135R6920
2175A0471835L1829M44875O9637O04817Q34717M78786L41742K28618m85281R79234
2165A4000809P56692J435052L03846K58472P89261l14531M83286J103387J239555
2156B0055829J21837J995819O34157K80037J397405K053796O35862K089022J573306
2147C0837070J765554J477486K064650K688595L083835L435369L057811M183051
2139E2593421N000069M700893N563983N380472O410587O824254R360248J0451944
$$ plain form
2205 6771730 7257102 7758165 8186687 8384762 8961609 8657335 8338531 7859966 7406150 7559087
2195 7559087 8541207 8852504 8492111 8335116 8422577 8972921 8977399 9351981 9720221 9948281
2185 9948281 9053707 8906615 9555895 9420444 9741093 10494713 10817025 10209780 10374915 10471835
2175 10471835 10503664 10948539 11018176 11622993 12457710 12936496 13278238 13506856 13021575 14000809
2165 14000809 14757501 16192553 16496399 16754871 17544132 17229601 17712887 18816274 20055829
2156 20055829 20177666 22173485 22807642 23087679 24485084 26538880 27174742 29263764 30837070
2147 30837070 32602624 34080110 36144760 38833355 41917190 45352559 48410370 52593421
2139 52593421 57593490 62294383 67858366 73238838 79649425 86473679 95833927 106285871
2131A06285871J1771641J4102493J8348727J9778781K0381030K5912927L2157080
2124B48738550L9051388M8942489L6211472j4390348m3431425n5671818n0203848
2117B09246460l9141778k9491582k1333694j4768719j2183572r525523o836799
2110G5964793m981714m940165l940303k317528m153248m167052m153602m327669
2102D2983512l552236j802582k011117j492421k429092j215801j402679j289352
2094B7788232j844978j020840p30863r12258j041255m9580p22916l60329p01657
2085B0403556j259582j025724j169095l73341o43144r91411N69713q25798k93515
2076A4391659n13278o18200n42036m89296P46355p96439k98056K7093J28382n35559
$$ plain form
2131 106285871 118057512 132160005 150508732 170287513 190668543 216581470 248738550
2124 248738550 287789938 336732427 372943899 358553551 315122126 259450308 209246460
2117 209246460 170104682 140613100 119279406 104510687 92327115 82801592 75964793
2110 75964793 70983079 66042914 62102611 59785083 55631835 51464783 47311181 42983512
2102 42983512 39431276 37628694 35617577 34125156 31696064 30480263 29077584 27788232
2094 27788232 25943254 24922414 24191551 23279293 22238038 22188458 21465542 21105213 20403556
2085 20403556 19143974 18118250 16949155 16575814 15932670 14941259 15510972 14685174 14391659
2076 14391659 13878381 13260181 12718145 12228849 12975204 12178765 11880709 11907802 12036184 11500625
2066A1500625l63785n12088l81022l78344l39593l05421k78949j07022k84684
2057H549717J39277N52865n66540n43415l12768l16770p24037o72730N38962M47260
2047G091821M83979l21855O6149p15800j135423N10893J152947r8016p50384k91961
2037E992350Q21881j035985k72389n10416o15957J222329l89624M3031p93457
2028D461763j21583N13351K06545n51572k35985k8296O9520Q6852m62143O88m16770
2017C522370L52068l58368k57952m19458O48417o3705m67885L14638m00495l3921
2007B835709N64799l04926j56454o44741K15920L76001n54302K30322L18184j97624
1997B682888o76173L37480j35031O40581m32038j52038J19827k03702J80748J97532
$$ plain form
2066 11500625 11136840 10624752 10243730 9865386 9525793 9220372 8941423 8834401 8549717
2057 8549717 8688994 9241859 8675319 8131904 7819136 7502366 6778329 6105599 6644561 7091821
2047 7091821 7575800 7253945 7320094 6604294 5468871 5979764 7132711 7034695 6284311 5992350
2037 5992350 6814231 5778246 5505857 4995441 4379484 5601813 5212189 5255220 4461763
2028 4461763 4340180 4853531 5060076 4508504 4272519 4244223 4313743 4400595 3938452 3939140 3522370
2017 3522370 3874438 3516070 3258118 2838660 3487077 3423372 2955487 3270125 2869630 2835709
2007 2835709 3400508 3095582 2939128 2294387 2510307 2886308 2332006 2562328 2880512 2682888
1997 2682888 2006715 2344195 2209164 2849745 2417707 2265669 2385496 2181794 2362542 2560074
1987B560074M34598o96130q34822O83195m10191j00015p20865j45550J065096
1978A835390N77887l45101o37565R77844l57552k95317j37260K59283K99065n3689
1968B122985K82037l07061K57743M79515p63162n78673K21841J71493M5392q17518
1958A114592K54304K45085Q1717l98376J26590J041519j71448n27890n55865P6534
1948A286762N30522M00350P2003J57276k57986j55856k38754n77244k79615p78970
1938A58488o11782P72439N03782P41587J68606p84699J08828K05771l07765k03320
1928G51935L46422P06523p80993n30619m4183K73935J08750P38722m70714p46530
1918C53248K71466Q9589J36576j77696j65439p66400Q87917j8445N9938L6527
$$ plain form
1987 2560074 2994672 2298542 1463720 2146915 1736724 1636709 915844 770294 1835390
1978 1835390 2413277 2068176 1430611 2408455 2050903 1755586 1618326 1877609 2176674 2122985
1968 2122985 2405022 2097961 2355704 2835219 2072057 1493384 1715225 1886718 1932110 1114592
1958 1114592 1368896 1613981 1695698 1297322 1423912 2465431 2293983 1766093 1210228 1286762
1948 1286762 1817284 2217634 2289637 2446913 2188927 2033071 1794317 1217073 937458 158488
1938 158488 -453294 319145 822927 1564514 1733120 948421 1057249 1263020 955255 751935
1928 751935 1098357 1804880 1023887 493268 449085 723020 831770 1570492 1099778 353248
1918 353248 624714 714303 850879 673183 507744 -258656 629261 610816 670754 707281
1908G07281j21631L61338K7848J98379p5607j74819J03479o07882k13645j76088
1898B8653j04367O87699R67790K74289N1194J62162n42588N17790K8944n33237
1888A538329m28806K95400J35103o28990J28843M92633o32787O9648k62482J008252
1878A715143J62247o72534M25589J22773K4288l17721l93047j93680K22016Q1131
1868A176205m1599k19122p46457O55348R19264r92258N23073K50298q13686L58154
1858A069220N10125O73366j16689n26463n00783K13604R11220L43742J91468n69320
1848B199490j66512K94190j020435j197852O05559j1240K62395J15472o87279
1839C93788l17523J135925J89576l23665j90929m9446q73919M88311K68960l18211
$$ plain form
1908 707281 585650 946988 974836 1173215 1097608 922789 1026268 418386 204741 28653
1898 28653 -75714 611985 1579775 1854064 1905258 2067420 1524832 2042622 2071566 1538329
1888 1538329 1109523 1404923 1540026 911036 1039879 1532512 899725 969373 706891 1715143
1878 1715143 1877390 1204856 1630445 1753218 1777506 1459785 1066738 873058 1095074 1176205
1868 1176205 1134606 915484 169027 824375 1743639 751381 1274454 1524752 711066 1069220
1858 1069220 1579345 2252711 2136022 1609559 1108776 1322380 2233600 2577342 2768810 2199490
1848 2199490 2032978 2327168 1306733 108881 714440 703200 965595 1081067 393788
1839 393788 76265 1212190 1401766 1078101 887172 837726 -36193 452118 721078 402867
1829D02867m71233l00580J467227R2442j167007L96459L12300Q10178j53455j83010
1819A206188P6074p01331O64595p79344r5862K30756n3355P59126N3167j76770
1809A183244K82544j48137p02109n77920Q8989K97516M8357m51153M85707m78037
1799B9001O37813j90645K08115J5382r8372Q1403n28311O35850K42843k38836
1789G94243n40055N9516P6338O7847m70190K19472M41408l86637p6202P36M55497
1778F41973q37856J913O93950j009215M32847O99431k08008Q3359k1316L83414
1768H60492j93522m43131P11922k36639o77788r3040j37364N57012J51587l61814
1758A37715L71837j77911m20122n4411O57309L15605j28486m21580l48877J13399
$$ plain form
1829 402867 -68366 -368946 1098281 1190723 23716 420175 732475 1542653 1389198 1206188
1819 1206188 1282262 580931 1245526 466182 370320 601076 547721 1306847 1360014 1183244
1809 1183244 1465788 1317651 615542 37622 126611 424127 472484 21331 507038 29001
1799 29001 666814 476169 684284 699666 601294 682697 154386 790236 1033079 794243
1789 794243 254188 313704 390042 457889 -12301 207171 648579 261942 185740 186476 641973
1778 641973 -195883 -193970 499980 -509235 -76388 623043 415035 498394 477078 860492
1768 860492 666970 223839 935761 699122 21334 -71706 -209070 347942 499529 137715
1758 137715 509552 331641 -88481 -142892 514417 830022 701536 279956 -68921 44478
1748D4478q1766R5321k43768j91553R1267J91479J01531O08346j73680o45419
1738b03764R9132L80774m33582p22285Q8443J02698K01856P03230K68996k19168
1728B66330o91397J66450l6052J13016O23612N17613l32781n19995J346665r19733
1718E33728j61826N48379R4706j98793n30316M44795m12886m95852m85836J147078
1708D83177n73033p5804J42874o74475n94480R01352J214387l82292n28613j78961
1698b65868q3000r92184P44766p9430P53833k56982O29954j58581n42244N76451
1688C26715r5888j49411P62536P00223n42460k03568m86156m78421n98632j93047
1678i58109N46883N79927J117888p0284k91765j28008m67424M62894j64413L2454
$$ plain form
1748 44478 -37288 58033 -185735 -377288 -286021 -94542 6989 615335 441655 -203764
1738 -203764 -104632 276142 -157440 -879725 -791282 -688584 -486728 216502 485498 266330
1728 266330 -425067 -258617 -294669 -181653 441959 959572 626791 106796 1453461 533728
1718 533728 371902 920281 1014987 816194 285878 730673 317787 -178065 -663901 483177
1708 483177 -89856 -165660 -22786 -697261 -1291741 -390389 823998 441706 -86907 -265868
1698 -265868 -348868 -1341052 -596286 -675716 78117 -178865 451089 292508 -249736 326715
1688 326715 230827 81416 843952 1544175 1001715 798147 311991 -166430 -765062 -958109
1678 -958109 -411226 168701 1286589 1216305 924540 796532 329108 792002 627589 660043
1668F60043J2391K09466l13820q32248M43629R8127j194097R3157J404267J97004
1658G77919p50291P85426n67133n88367m44705M89362J78974n46035M29472J52846
1648h2532P8756O6073L3585j7878M33059p33996P78115L74366p26827k17494j42701
1637a57474q6347l7711N25378l87365k04814M20861K91709Q6728r4988j73408
1627A82569O15593M57821j66009j240007m63513O3105Q04240O02023j29009p95248
1617f8435k46438J049030k11085P0784M10136k95395j447808O82888j19380k24417
1607d00120J89397M15684j26084N53353k60781j11595j94318J06793J06135K16066
1597D94530K37626l56856j44128m37804j39687N13174K46831o83322K93867j59175
$$ plain form
1668 660043 672434 881900 568080 -264168 179461 277588 -916509 -823352 580915 777919
1658 777919 27628 813054 245921 -342446 -787151 -297789 -118815 -664850 -235378 -82532
1648 -82532 -3776 62297 95882 78004 511063 -222933 555182 929548 202721 -14773 -157474
1637 -157474 -243821 -281532 243846 -143519 -348333 72528 364237 450965 355977 182569
1627 182569 798162 1255983 1089974 -150033 -613546 -550441 253799 855822 726813 -68435
1617 -68435 -314873 734157 523072 593856 1003992 708597 -739211 -56323 -175703 -400120
1607 -400120 -210723 204961 78877 632230 371449 259854 65536 172329 278464 494530
1597 494530 732156 375300 231172 -206632 -346319 166855 413686 -269636 24231 -134944
1587a34944j92460j34366M56273N25434N40773L1209k86504o67107m62852N11128
1577A86584l45038O923k15964l66685L4574j60345r7737K323R36658J57031M1794
1566A80118m32458Q73475n26535L22635L21573L70822M6653l93904k7201M55869
1556A191047j56087J58653n91986l89861N63230R065r4536M16587k36720o37679
1546B31713M83450n11384k41882J64758L75266m7473K77983n1927q7107n48786
1536D4611k36378k57880j8773N24115Q74694j33850o94367o26936K1559m10621
1526i13826O7339j9184Q20022O75214m65109J08360m07538O5503l97495k90187
1516g56901J029238N68020p09196l16405J196890Q12767q58058n03640J61363
$$ plain form
1587 -134944 -327404 -461770 -5497 519937 1060710 1091919 805415 138308 -324544 186584
1577 186584 -158454 -151531 -367495 -734180 -699606 -859951 -957688 -955365 -18707 138324 180118
1566 180118 -252340 621135 94600 417235 738808 1109630 1156283 762379 735178 1191047
1556 1191047 1034960 1193613 601627 211766 774996 784061 689525 1106112 869392 231713
1546 231713 715163 203779 -38103 126655 501921 454448 732431 680504 593397 44611
1536 44611 -191767 -449647 -468420 55695 930389 796539 102172 -524764 -503205 -913826
1526 -913826 -846487 -865671 -45649 629565 164456 272816 -134722 -69219 -466714 -756901
1516 -756901 272337 840357 131161 -185244 1011646 1824413 966355 462715 624078
1507F24078O7595o90051n30509M84207k97410k690N66567L26632j71486k67945
1497A08988K80986L71703p10156J79199J62535n1701L5223j83350l84545l72045
1487e63163R44061n01107l76285N19391N76891k42237k20304n0189N9789m08509
1477b61662L44800K79562L88781J6099p25122M24229p39028m28736O42721J31551
1467G3195o46657K93889k25513M20180P84180n87296P8128J34735l75339K8589
1457b1909j12874K08782N93418k46647l12011K05638Q9892m56657l89751k23694
1447f65813R57123n31464M6761R18191j109004n0086Q9286N68876K73477k35935
1437B61412M49956j024293k50811Q03383q9449N89592o8125p22238K1275L2092
$$ plain form
1507 624078 691673 1622 -528887 -44680 -342090 -344780 221787 548419 376933 108988
1497 108988 389974 761677 51521 230720 393255 341554 376777 193427 -191118 -563163
1487 -563163 380898 -120209 -496494 22897 599788 357551 137247 87058 146847 -261662
1477 -261662 83138 362700 751481 767580 42458 466687 -272341 -701077 -58356 73195
1467 73195 -573462 -279573 -505086 -84906 699274 111978 190106 324841 -50498 -21909
1457 -21909 -134783 73999 667417 420770 108759 314397 404289 -52368 -442119 -665813
1447 -665813 291310 -240154 -193393 724798 -384206 -434292 -345006 223870 497347 261412
1437 261412 711368 -312925 -563736 239647 150198 739790 671665 -50573 -29298 2794
1427B794N48811M41886O0943n20653l34378p51970P60638L1499k01981O1765n71243
1416d71889m09890J29091L64749n97788Q22067L0478K22100m95845n56245L78376
1406e84796P6926l09754m48604N20821N38393J07588N09183J24661q37628o3997
1396c67207N40573K52516k60520M6908j98458m9818O54573L53577l30475o86792
1386d5123j1938k33229L82981l97697j79701L11819m33833j24791Q66219J88789
1376C23496j51134j73563K28353o34297j21147K58435l40835O10733L02492p5906
1366B26627P7140j03111J46752N5135N37063n0135o49857k6986L29861m40012
1356A02477n74998m39651J15976Q59063j21706L89679N94555o98973j76693L87337
$$ plain form
1427 2794 551605 993491 1054434 533781 199403 -552567 208071 239570 37589 99354 -471889
1416 -471889 -881779 -752688 -387939 -985727 -163660 -133182 88918 -406927 -963172 -584796
1406 -584796 -507870 -817624 -1266228 -745407 -207014 -99426 409757 534418 -303210 -367207
1396 -367207 173366 425882 165362 212270 13812 -36006 618567 972144 641669 -45123
1386 -45123 -57061 -290290 92691 -305006 -484707 -172888 -606721 -731512 134707 323496
1376 323496 172362 -1201 227152 -407145 -528292 -269857 -610692 41 302533 226627
1366 226627 303767 200656 347408 402543 939606 889471 239614 212628 542489 102477
1356 102477 -472521 -912172 -796196 62867 -58839 330840 925395 226422 49729 437066
1346D37066j351J69985o12027j22781J49965j12063J58465R8194J11553j88387
1336H8619k48461K78053k50954J21697R27752N4962o57208k66345r928M63100
1326E01287m21198N32876n49310O582L31181m75884l46796l49268l38780P58717
1316c50593M45286L76349j104J22789l13434m77268l30146R227K56064P17216
1306D54386M13706j94409L08626r10325K55136o37633P98180k17776m74400N47938
1296C43429J4096M52127m43790j51912P7421L48768p97625m79867K07093p27499
1286a157759m5665K25891P86240L88366L26196m94432K17510n43179o15211L43822
1276e68221l17516J034602l77992o6093K35810K47472R1920J0584k64850M2237
$$ plain form
1346 437066 435715 605700 -6327 -129108 20857 -91206 67259 165453 277006 88619
1336 88619 -159842 118211 -132743 -11046 916706 971668 314460 48115 38187 501287
1326 501287 80089 612965 63655 70237 401418 -74466 -421262 -770530 -1109310 -350593
1316 -350593 94693 471042 469938 592727 279293 -197975 -528121 -518894 -262830 454386
1306 454386 868092 673683 982309 71984 327120 -310513 487667 269891 -204509 343429
1296 343429 357525 809652 365862 213950 291371 640139 -157486 -637353 -430260 -1157759
1286 -1157759 -1203424 -977533 -191293 197073 523269 28837 246347 -296832 -912043 -568221
1276 -568221 -885737 148865 -229127 -295220 -59410 188062 279982 290566 25716 67953
1266F7953O203L94091K10832n25633p59245p72959R71025J69192o5564M0634m71976
1255g35447K15319O69463J2508K86631r9358m98878M96845n70970j69709L52284
1245d1312q1462n68445O55914R12323j37485m71887r42992M92990J48652P831
1235b5873K69790n81921J77809k55263M75981j72126k46642J32984J02470L74080
1225B51289j92526m56919q4635Q68976n99118P08057l43178m64973J33622j84105
1215c63510j61920k38549l05039J039775N43744N23364j030648j68143K09475
1206D8549N24758Q4635o67610j80077l5506P5268p66248N1548l69365K71021J057938
1195I4911r6390k49187n03303L82497J211440n31014o70540J15717n9464m58597
$$ plain form
1266 67953 74156 468247 679079 153446 -605799 -1378758 -407733 -238541 -304105 -263471 -735447
1255 -735447 -520128 149335 161843 448474 349116 -149762 347083 -223887 -393596 -41312
1245 -41312 -122774 -691219 -35305 877018 739533 267646 -675346 -182356 -33704 -25873
1235 -25873 243917 -338004 -160195 -415458 60523 -111603 -358245 -225261 -122791 251289
1225 251289 58763 -398156 -482791 386185 -212933 495124 151946 -313027 -179405 -363510
1215 -363510 -525430 -763979 -1069018 -29243 514501 1037865 7217 -160926 48549
1206 48549 573307 657942 -9668 -189745 -225251 -149983 -916231 -864683 -1234048 -963027 94911
1195 94911 -1479 -250666 -753969 -371472 839968 308954 -361586 -245869 -305333 -763930
1185g63930N59542M79681l9678K88582o04006J21660l35159j48898k51531R4160
1175e99577J073416k50493j50303o38042J75228P265L99534N2522K16099O38357
1165I24006K81760l03709r4662o83094n17175R65041L35263j05365m34031P5614
1155D43648K44371p34603P92098m01685j72924j07108m61061k04285n5357R29474
1145B72568o4820M77725m0808l49780Q75401k11258m64058k08546l8538j91307
1135E6579p3979k43208L60915j63446K96804j22384N5543n63787j17001M08967
1125a04997O40740O04494M7279k39347j026589J32560J56835K40682m65647k79899
1115b93889l93966O83927O42400N770J15868l59343p4253J46728l78259l64392
$$ plain form
1185 -763930 -204388 275293 235615 524197 -79809 41851 -293308 -442206 -693737 -599577
1175 -599577 473839 223346 73043 -564999 -389771 -382506 17028 69550 285649 924006
1165 924006 1205766 902057 807395 124301 -392874 572167 907430 802065 368034 443648
1155 443648 688019 -46584 745514 343829 170905 63797 -397264 -601549 -656906 272568
1145 272568 207748 685473 644665 294885 1170286 959028 494970 286424 247886 56579
1135 56579 -17400 -260608 100307 -63139 233665 111281 166824 -396963 -513964 -104997
1125 -104997 535743 1140237 1187516 948169 -78420 54140 210975 451657 -13990 -293889
1115 -293889 -687855 -3928 638472 644242 760110 400767 326514 473242 94983 -269409
1105b69409o7606M81699p00383n9620K27767m31316P06593L55316k5817L07207
1095E24431p92670M4182O34894k92656L36434K41064J76005o45841N2400P04918
1085I83161l96419n0412q6066M09828q79978J90615O20403l51683q9173j05746
1075B44530K58189M80406l38653k39103n42930j129655K85150M74916j4292k75687
1065g97129j86125L91180M40241m17405j86496P64819l07651p99753M72055J30427
1055d95837k00514k00401J235151L79136l10524J89983K74019p56151m19105j05948
1045d10191l86666M63668j52862O69644m35535Q7186J412409j426445K04803M78305
1035E04316n32734N4883o53771O11648J47J96511J39910j05462M8046K18922k73775
$$ plain form
1105 -269409 -337015 144684 -555699 -615319 -387552 -818868 -112275 243041 217224 524431
1095 524431 -268239 -224057 410837 118181 454615 695679 871684 225843 278243 983161
1085 983161 586742 536330 450264 860092 -19886 170729 791132 439449 350276 244530
1075 244530 502719 983125 644472 405369 -137561 -1267216 -982066 -507150 -521442 -797129
1065 -797129 -983254 -592074 -151833 -569238 -755734 9085 -298566 -1098319 -626264 -495837
1055 -495837 -696351 -896752 338399 717535 407011 596994 871013 114862 -304243 -410191
1045 -410191 -796857 -333189 -486051 183593 -251942 -164756 1247653 -178792 26011 504316
1035 504316 -28418 26465 -627306 -15658 -15511 181000 320910 215448 263494 482416 208641
1024B08641o56855q2460N24036K55415M4050n73638p322L58474j140406N76106
1014d93959k38663M54914N82649M44814L07536n25293J19513l43730j31853j53497
1004B2431k21418r5283J67244O27767n98573j4510J373112r74775n21136N86354
994C51213j226m90640L07010J56227n300p3404K84880m99469K44815j91153l40918
983b57965K7002J51405k79063J37619K72123J94530k17128o34078N67432J54897
973A16774M15796l13338m52659l2451o78744K66136O57062m24577n8559N34620
963C0060J87380o39640K71283N11350q03960m53864O69598O04238l68783p5913
953f8251J04985o65629K97516L20575o92822L29311K69644K0324N8692p62111
$$ plain form
1024 208641 -448214 -530674 -6638 248777 292827 -280811 -288133 70341 -1070065 -493959
1014 -493959 -732622 -277708 304941 749755 1057291 531998 651511 307781 175928 22431
1004 22431 -198987 -294270 -127026 500741 -97832 -112342 1260770 285995 -235141 351213
994 351213 349987 -140653 166357 322584 317284 243880 528760 29291 274106 82953 -257965
983 -257965 -230963 -79558 -358621 -221002 51121 245651 28523 -605555 -38123 116774
973 116774 532570 219232 -233427 -265878 -944622 -678486 -21424 -446001 -504560 30060
963 30060 217440 -422200 -150917 360433 -443527 -897391 -227793 376445 7662 -68251
953 -68251 36734 -628895 -331379 -10804 -703626 -374315 -104671 -84347 -25655 -787766
943g87766N85762l51972L01388l01437J335482J30316n43862L31274p68650J27686
933E8221O9109r88504k3161J021401P3856L9984l90574N39269Q10878n11291q0359
922F18829j27072l41927j00170l67777k8980K28422o55936N46789J070215p0385
912G72008n15192K32607K11870o61722p97438N00317J02365k68530M22830K09176
902B08291j14512J70613L07629J48220j432050L2217M91982q07785P79144K34182
892A7931q5360O57852O50192r83915l67512L33246J27670k47570j68822m99214
882e65502K90499p71813O96812J5096p87715L24191l95513l09473Q13316M45277
872b44825K33442o18357o02835m0019J459332M15829j450693O89267J81007j037051
$$ plain form
943 -787766 -202004 -553976 -252588 -554025 781457 911773 367911 699185 -69465 58221
933 58221 127330 -861174 -884335 137066 210922 250906 -139668 399601 1210479 699188 618829
922 618829 491757 149830 49660 -318117 -347097 -118675 -774611 -227822 842393 772008
912 772008 256816 489423 701293 39571 -757867 -257550 -155185 -423715 -885 208291
902 208291 93779 264392 572021 720241 -711809 -679592 -187610 -995395 -216251 17931
892 17931 -67429 590423 1240615 256700 -110812 222434 350104 102534 -66288 -565502
882 -565502 -275003 -1046816 -350004 -334908 -1122623 -798432 -1193945 -1503418 -690102 -244825
872 -244825 -11383 -629740 -1232575 -1272594 186738 602567 -848126 -158859 22148 -1014903
862a014903k22618P24843n25835p1340K95623K06381M94907K42636K78022l92981
852A4735k90705n40982j83037o6879Q63133L37770P5817n22074K9815l35921j56264
841g74592J98090M83914J52592n50501J39768l65404J076937p35679K55144k53689
831c73420Q69245k10114q82301L88403q6767O00249j74047j37321K51266M49709
821F94902K7354j562081n11993R26320P59422L48493m33924o9125r15203l35802
811a071637R08794j9372N39257l5699j96906N6768k51399M3281R7445l78760M6226
800b62002Q46598r39716J45699o15162J90344K97306K32138P36590j014745Q85423
790E02473L34782k81281k74980j149054N47012R81271k18898j08348M9646k93227
$$ plain form
862 -1014903 -1237521 -512678 -1038513 -1109853 -814230 -607849 -112942 129694 407716 14735
852 14735 -275970 -816952 -999989 -1066868 -203735 134035 209852 -312222 -282407 -618328 -774592
841 -774592 -576502 -92588 60004 -490497 -350729 -716133 360804 -374875 -119731 -373420
831 -373420 495825 285711 -596590 -208187 -294954 305295 131248 -6073 245193 694902
821 694902 722256 -839825 -1351818 -425498 333924 682417 248493 179368 -735835 -1071637
811 -1071637 -162843 -182215 357042 321343 124437 181205 -70194 -26913 70532 -308228 -262002
800 -262002 584596 -355120 -209421 -824583 -634239 -336933 -104795 631795 -382950 502473
790 502473 837255 555974 280994 -868060 -321048 660223 441325 332977 382623 89396
780H9396K60894l64905l41807n19732J044221N28020j162991l95472R51823M39158
770E28605q78781K78815q8797M89704m2007k23912l62969M8165M71473o89892
760d69596m22740Q41146j80361o18489O1572o4774K60978L88033K93397n05092
750d15926k24828K10289J09080J46713j07806L79620o43837k03876m27639J90129
740i88081N60269l71275m40244N26007O31144l15134k63188j45970J73487N14862
730a18123O11680L93823k01413r83402J3430J93382J66930L55870l75323K544
720E9398N61851m70563K79868k28565q83989K15647M00179L10094k38000n12863
710e06943q8260R00182k23922m07245K03988q1004k72858l65395L29143N1697
$$ plain form
780 89396 350290 -14615 -356422 -876154 168067 696087 -466904 -862376 89447 528605
770 528605 -350176 -71361 -160158 329546 287539 63627 -299342 -251177 220296 -469596
760 -469596 -892336 -51190 -231551 -850040 -788468 -853242 -592264 -204231 89166 -415926
750 -415926 -640754 -430465 -321385 -174672 -282478 97142 -546695 -750571 -1178210 -988081
740 -988081 -427812 -799087 -1239331 -713324 -82180 -397314 -660502 -806472 -632985 -118123
730 -118123 493557 887380 685967 -297435 -284005 -90623 76307 432177 56854 59398
720 59398 621249 150686 430554 201989 -682000 -466353 -66174 243920 5920 -506943
710 -506943 -595203 304979 81057 -326188 -122200 -203204 -476062 -841457 -512314 -460617
700d60617j38271N09031J91690M3647N41431n1190K57501p3841j04185m27215
690B87981k78726o22037L04743N13682j03111k67755j90037p74840P37449M42340
680D9689j027708R57920K69090J42545J22405o91763j24136K83972r70876N15555
670d73307Q17511K15471p50494p28615M58338J34632M1193K60137K34600P8590
660B88056q43789j42192k44787p60467M81575K69496r545O83355M9089r6062K4990
649c00281m61591R04814L68472q23251J5187O6941r2978K71543j57750p26398
639i35292o05514Q13130J51099N4573N3930K76708J66354m33589J11441j23149
629d70309J73507m28438M37086O31373l22265M7454p10771j53110N16440K84501
$$ plain form
700 -460617 -598888 -89857 101833 145480 686911 635721 893222 819381 715196 287981
690 287981 9255 -612782 -308039 205643 102532 -165223 -355260 -1130100 -392651 49689
680 49689 -978019 -20099 248991 391536 513941 -177822 -301958 -17986 -988862 -473307
670 -473307 344204 559675 -190819 -919434 -461096 -326464 -285271 -25134 209466 288056
660 288056 -555733 -697925 -942712 -1703179 -1221604 -952108 -961653 -278298 -229209 -325271 -300281
649 -300281 -761872 142942 511414 -311837 -296650 -229709 -322687 -51144 -208894 -935292
639 -935292 -1540806 -727676 -576577 -522004 -468074 -191366 -25012 -458601 -347160 -470309
629 -470309 -296802 -725240 -288154 343219 20954 68408 -642363 -795473 -279033 5468
619E468l39483j61436r3507K48127J140311n41173m58871r37P87345N58338o42551
608E01631q47882n99710J474520Q9185q65617p06362O9892O81304P22620o99594
598a80013K30064j10951p53594K75212L06688L53j49962J22557J0904J3084j90780
587d26438N16058n79251L78357O34299J54547J3332m56744l49943J7479J0649
577h7655L30214j8387k42489m04987L00565J104502m83887l47659n86657J16911
567c19529j73708L44505N16469L26747m8330r01170k59116J78955m981J8536k31991
556e53613l4147J92077K37432l93489m05103J223490O41825n35261l08978l62492
546b98259p69087O84128O07991j52804j30436L95323p85447k12245Q59036k90064
$$ plain form
619 5468 -334015 -495451 -588958 -340831 799480 258307 -200564 -201501 585844 1144182 501631
608 501631 -346251 -945961 528559 617744 -247873 -954235 -884343 -203039 519581 -180013
598 -180013 50051 -60900 -814494 -539282 -232594 -232241 -382203 -259646 -248742 -235658 -426438
587 -426438 89620 -489631 -111274 523025 677572 690904 234160 -115783 -98304 -87655
577 -87655 242559 224172 -18317 -423304 -122739 981763 497876 150217 -436440 -319529
567 -319529 -493237 -148732 367737 694484 646154 -255016 -514132 -335177 -340158 -321622 -553613
556 -553613 -587760 -395683 -158251 -551740 -956843 266647 908472 373211 64233 -298259
546 -298259 -1067346 -383218 224773 71969 -58467 336856 -448591 -660836 198200 -91864
536i1864k94931Q66056n46296o87083N09200M54462r19934R07757L85073J19116
526G01556m75612k25812j42702m41962r608j86158P7046O40913L75188L03405
516F16254k42325p20847L80495j44090P50276j45568j104622L26559K28981J65099
506A10212m12741L39200k63530k1507J116974l80419k45417j10220r12018N18813
496b60653Q90267l30652l93510l4129j93974p04285M81459l31103L48573J31497
486c96510n2108J44201J67715m50277K33980J95414n30218M39260n050M8554l53614
475e58653l26750J31832P83618M3761m03966m57832o09800P86787J78289K93831
465a38883k51747J55880p49941K38659L3058l32071K24756M14362K71889J31112
$$ plain form
536 -91864 -386795 479261 -67035 -754118 -244918 209544 -710390 197367 582440 701556
526 701556 225944 132 -142570 -584532 -594140 -780298 -703252 -62339 312849 616254
516 616254 373929 -346918 33577 -110513 639763 494195 -610427 -283868 -54887 110212
506 110212 -302529 36671 -226859 -248366 868608 488189 242772 132552 -779466 -260653
496 -260653 629614 298962 -94548 -128677 -322651 -1026936 -545477 -876580 -528007 -396510
486 -396510 -448618 -304417 -136702 -586979 -352999 -157585 -687803 -248543 -253593 -205039 -558653
475 -558653 -885403 -753571 30047 73808 -330158 -787990 -1397790 -611003 -432714 -138883
465 -138883 -390630 -234750 -984691 -746032 -712974 -1045045 -820289 -405927 -134038 -2926
455b926L86673m97310k45640Q58474K3985l49623o69553N7178j6683L17296k52669
444c90798l96593L29675m17169L82176O61752n20662r95578N81664P69906n57094
$$ plain form
455 -2926 383747 -113563 -359203 499271 523256 173633 -495920 -438742 -455425 -138129 -390798
444 -390798 -787391 -457716 -874885 -492709 169043 -351619 -1347197 -765533 4373 -552721
$$ [...]
##END NTUPLES=NMR SPECTRUM
##END=
