##TITLE=1H_TG-2341-C2X
 DMSO-d6
 8 sc, 
 20.09.2022
##JCAMPDX= 6.0         $$ Bruker NMR JCAMP-DX V2.0
##DATA TYPE= NMR SPECTRUM
##DATA CLASS= NTUPLES
##ORIGIN= UXNMR, Bruker Analytische Messtechnik GmbH
##OWNER= root
$$ XWIN-NMR		Version 3.5
$$ Tue Sep 20 12:48:48 2022 Russian Standard Time (UT+4h)  she@DPX200
##.OBSERVE FREQUENCY= 200.1313499994
##.OBSERVE NUCLEUS= ^1H
##.ACQUISITION MODE= SIMULTANEOUS
##.ACQUISITION SCHEME= undefined
##.AVERAGES= 8
##.DIGITISER RES= 18
##SPECTROMETER/DATA SYSTEM= spect
##.PULSE SEQUENCE= zg30
##.SOLVENT NAME= DMSO
##.SHIFT REFERENCE= (INTERNAL, DMSO, 0, 15.705)
##AUDIT TRAIL= $$ (NUMBER, WHEN, WHO, WHERE, WHAT)
$$ ##TITLE= Audit trail, XWIN-NMR		Version 3.5
$$ ##JCAMPDX= 5.01
$$ ##ORIGIN= Bruker BioSpin GmbH
$$ ##OWNER= she
$$ F:/spectra/data/she/nmr/H-F/1/pdata/1/auditp.txt
$$ ##AUDIT TRAIL=  $$ (NUMBER, WHEN, WHO, WHERE, WHAT)
(   1,<2022-09-20 12:47:38.98 +0400>,<she>,<DPX200>,
      <created by zg, POWCHK disabled, PULCHK disabled
       configuration hash MD5:
       00 E9 B6 7A A2 85 ED C7 34 08 36 98 17 FE 4E 26
       data hash MD5: 16K
       37 AA 23 61 5E 20 C1 88 3D 55 CB E6 73 73 6F 1C>)
(   2,<2022-09-20 12:47:42.25 +0400>,<she>,<DPX200>,
      <Start of raw data processing
       efp BC_mod = 2 LB = 0.24 FT_mod = 6 PKNL = 1 PHC0 = -18035.85 PHC1 = 8.00069 SI = 16K 
       data hash MD5: 16K
       ED 71 75 1F 6D AA DE E8 A1 57 F4 E9 5C 61 2A D9>)
(   3,<2022-09-20 12:48:03.59 +0400>,<she>,<DPX200>,
      <pk PHC0 = -0.7094384 PHC1 = 0 
       data hash MD5: 16K
       8D 6E F1 0D AE 3F BA 69 11 D8 A1 E3 A5 E0 D1 D0>)
(   4,<2022-09-20 12:48:18.96 +0400>,<she>,<DPX200>,
      <abs ABSG = 5 
       data hash MD5: 16K
       0E 73 E4 CF D6 1F A6 F9 06 81 17 34 BE D8 3F 27>)
$$ ##END=
$$ 
$$ hash MD5
$$ 60 B5 A1 70 CD 6B 38 2B 22 8B 63 7E 5C E7 98 E3
##$RELAX= 
##$RELAX= 
##$RELAX= 
##$RELAX= 
##$RELAX= 
##$RELAX= 
$$ Bruker specific parameters
$$ --------------------------
##$DU= <F:/spectra>
##$EXPNO= 1
##$NAME= <H-F>
##$PROCNO= 1
##$TYPE= <nmr>
##$USER= <she>
##$AMP= (0..31)
100 100 100 100 100 100 100 100 100 100 100 100 100 100 100 100 100 100 
100 100 100 100 100 100 100 100 100 100 100 100 100 100 
##$AQSEQ= 0
##$AQ_mod= 1
##$AUNM= <au_zg>
##$AUTOPOS= <>
##$BF1= 200.13
##$BF2= 200.13
##$BF3= 200.13
##$BF4= 200.13
##$BF5= 200.13
##$BF6= 200.13
##$BF7= 200.13
##$BF8= 200.13
##$BYTORDA= 1
##$CFDGTYP= 0
##$CFRGTYP= 5
##$CHEMSTR= <none>
##$CNST= (0..31)
1 1 145 1 1 1 1 1 1 1 1 1 1 1 1 1 1 1 1 1 1 1 1 1 1 1 1 1 1 1 1 1 
##$CPDPRG= <>
##$CPDPRG1= <>
##$CPDPRG2= <>
##$CPDPRG3= <>
##$CPDPRG4= <mlev>
##$CPDPRG5= <mlev>
##$CPDPRG6= <mlev>
##$CPDPRG7= <mlev>
##$CPDPRG8= <mlev>
##$CPDPRGB= <>
##$CPDPRGT= <>
##$D= (0..31)
0 1.2 0 0 0 0 0 0 0 0.06 0 0.03 0 0 0 0 0.0002 0 0 0 0 0 0 0 0 0 0 0 0 
0 0 0 
##$DATE= 1663663658
##$DBL= (0..7)
120 120 120 120 120 120 120 120 
##$DBP= (0..7)
150 150 150 150 150 150 150 150 
##$DBP07= 0
##$DBPNAM0= <>
##$DBPNAM1= <>
##$DBPNAM2= <>
##$DBPNAM3= <>
##$DBPNAM4= <>
$$ [...]
##$SUBNAM3= <"">
##$SUBNAM4= <"">
##$SUBNAM5= <"">
##$SUBNAM6= <"">
##$SUBNAM7= <"">
##$SUBNAM8= <"">
##$SUBNAM9= <"">
##$SW= 18.0517283424941
##$SWIBOX= (0..15)
0 0 2 0 0 0 0 0 0 0 0 0 0 0 0 0 
##$SW_h= 3612.71676300578
##$TD= 16384
##$TD0= 1
##$TE= 0
##$TE2= 300
##$TE3= 300
##$TEG= 300
##$TL= (0..7)
0 120 120 120 120 120 120 120 
##$TP= (0..7)
150 150 150 150 150 150 150 150 
##$TP07= 0
##$TPNAME0= <>
##$TPNAME1= <>
##$TPNAME2= <>
##$TPNAME3= <>
##$TPNAME4= <>
##$TPNAME5= <>
##$TPNAME6= <>
##$TPNAME7= <>
##$TPOAL= (0..7)
0.5 0.5 0.5 0.5 0.5 0.5 0.5 0.5 
##$TPOFFS= (0..7)
0 0 0 0 0 0 0 0 
##$TUNHIN= 0
##$TUNHOUT= 0
##$TUNXOUT= 0
##$USERA1= <user>
##$USERA2= <user>
##$USERA3= <user>
##$USERA4= <user>
##$USERA5= <user>
##$V9= 5
##$VALIST= <valist>
##$VCLIST= <CCCCCCCCCCCCCCC>
##$VD= 0
##$VDLIST= <DDDDDDDDDDDDDDD>
##$VPLIST= <PPPPPPPPPPPPPPP>
##$VTLIST= <TTTTTTTTTTTTTTT>
##$WBST= 1024
##$WBSW= 4
##$XGAIN= (0..3)
0 0 0 0 
##$XL= 0
##$YL= 0
##$YMAX_a= 97866
##$YMIN_a= -187238
##$ZGOPTNS= <>
##$ZL1= 120
##$ZL2= 120
##$ZL3= 120
##$ZL4= 120
##$ABSF1= 15.70502
##$ABSF2= -2.346829
##$ABSG= 5
##$ABSL= 3
##$ALPHA= 0
##$AQORDER= 0
##$ASSFAC= 0
##$ASSFACI= 0
##$ASSFACX= 0
##$ASSWID= 0
##$AUNMP= <proc_1d>
##$AZFE= 0.1
##$AZFW= 0.1
##$BCFW= 0
##$BC_mod= 2
##$BYTORDP= 0
##$COROFFS= 0
##$CY= -3
##$DATMOD= 1
##$DC= 0
##$DFILT= <>
##$DTYPP= 0
##$F1P= 0
##$F2P= 0
##$FCOR= 1
##$FTSIZE= 16384
##$FT_mod= 6
##$GAMMA= 0
##$GB= 0
##$INTBC= 1
##$INTSCL= 3.70164e-10
##$ISEN= 128
##$LB= 0.24
##$LEV0= 0
##$LPBIN= 0
##$MAXI= 10000
##$MC2= 0
##$MEAN= 0
##$ME_mod= 0
##$MI= 1.114404
##$NCOEF= 0
##$NC_proc= -10
##$NLEV= 6
##$NOISF1= 3.799351
##$NOISF2= 2.8
##$NSP= 0
##$NTH_PI= 0
##$NZP= 0
##$OFFSET= 15.70502
##$PC= 1
##$PHC0= -18036.56
##$PHC1= 8.00069
##$PH_mod= 1
##$PKNL= yes
##$PPARMOD= 0
##$PSCAL= 0
##$PSIGN= 0
##$REVERSE= no
##$SF= 200.130013311053
##$SI= 16384
##$SIGF1= 3
##$SIGF2= 2
##$SINO= 5.538805
##$SIOLD= 16384
##$SREGLST= <1H.CDCl3>
##$SSB= 0
##$STSI= 16384
##$STSR= 0
##$SW_p= 3612.71676300578
##$SYMM= 0
##$S_DEV= 0
##$TDeff= 16384
##$TDoff= 0
##$TI= <>
##$TILT= no
##$TM1= 0
##$TM2= 0
##$TOPLEV= 0
##$USERP1= <user>
##$USERP2= <user>
##$USERP3= <user>
##$USERP4= <user>
##$USERP5= <user>
##$WDW= 1
##$XDIM= 16384
##$YMAX_p= 329525791
##$YMIN_p= -11005797
$$ End of Bruker specific parameters
$$ ---------------------------------
##NTUPLES= NMR SPECTRUM
##VAR_NAME=  FREQUENCY,     SPECTRUM/REAL,   SPECTRUM/IMAG
##SYMBOL=    X,             R,               I
##VAR_TYPE=  INDEPENDENT,   DEPENDENT,       DEPENDENT
##VAR_FORM=  AFFN,          ASDF,            ASDF
##VAR_DIM=   16384,         16384,           16384
##UNITS=     HZ,            ARBITRARY UNITS, ARBITRARY UNITS
##FACTOR=    0.220516191357247, 1,           1
##FIRST=     3143.04585181731, 0,            0
##LAST=      -469.670911188475, 0,           0
##MIN=       -469.670911188475, -11005797,   0
##MAX=       3143.04585181731, 329525791,    0
$$ Real data points
##PAGE= N=1
##DATA TABLE= (X++(R..R)), XYDATA
$$ [...]
6626A7921469P81102k84633o42092J293797j295516j860597J071480J279552j327647
6617A6936915P0687R27844j127781K21146n91579J613307q97986J022747j567862
6608A6607438j583095m57488j399525J901283Q9307P98225j229743l694893J614539
6599A2646048L173244J2829j428071j08739k773547J191648r4690k11922M94664
6590A2901464R029K67612l230926L63289R53751J763061p73938r55440J83340
6581A1481242Q2253L34707J065613p37253p26849j637089o75459J928316K26276
6572A1341757l60618J012112J538882j865415J59072j893510K606177J99545p69457
6563A1968545k446349j227399l24297N41328M206171j160380m62049j861652J47440
$$ plain form
6626 17921469 18702571 18417938 17775846 19069643 17774127 15913530 16985010 18264562 16936915
6617 16936915 17007602 17935446 16807665 17028811 16437232 18050539 17152553 18175300 16607438
6608 16607438 15024343 14566855 13167330 15068613 15157920 15956145 14726402 11031509 12646048
6599 12646048 15819292 15832121 14404050 14295311 11521764 12713412 12618722 12406800 12901464
6590 12901464 12910493 13178105 9947179 10310468 11264219 13027280 12253342 11297902 11481242
6581 11481242 11563495 11898202 12963815 12226562 11499713 9862624 9187165 11115481 11341757
6572 11341757 10981139 11993251 13532133 11666718 11825790 9932280 12538457 12738002 11968545
6563 11968545 9522196 8294797 7970500 8511828 12717999 11557619 11095570 9233918 9381358
6554I381358p09248O44585j58182j374510j491485J140076Q49582k69806J067649
6545I080019Q85995l26297j542377R76588J450427L17133l27592j905437j888442
6536F720017j00196J773547k93733P69006j030521N38260m53375p03737o15192
6527F604076r39414M76866K50170o75757q98059K447476O41133q8382O3921J016334
6517H898364j98133j61821q9245k545114J738161k77166o07411j640310J577321
6508F694646Q9160L64819j96642m40362J086340M12844q32134Q65442j146718
6499F897395P62199P40746k5045k43750J23870K332037k627883j99830k033586
6490E726153K959383q07781j872154J186451J205413j165214K11373j073804Q01525
$$ plain form
6554 9381358 8672110 9316695 9158513 7784003 6292518 7432594 8282176 8012370 9080019
6545 9080019 9966014 9639717 8097340 9073928 10524355 10841488 10513896 8608459 6720017
6536 6720017 6619821 8393368 8099635 8868641 7838120 8376380 7923005 7219268 6604076
6527 6604076 5664662 6141528 6391698 5715941 4817882 7265358 7906491 7818109 7882030 8898364
6517 8898364 8700231 8538410 8449165 5904051 7642212 7365046 6757635 5117325 6694646
6508 6694646 6783806 7148625 6951983 6511621 7597961 8010805 7178671 8044113 6897395
6499 6897395 7659594 8400340 8375295 8131545 8255415 10587452 7959569 7759739 5726153
6490 5726153 8685536 7877755 6005601 7192052 8397465 7232251 7443624 6369820 7171345
6481G171345q85830N82785l17766Q56930m52477j421763N72269q27946o60566
6472D616981J339683J382017Q49447P7267q56708M83527o30649r10126K33481
6463F584920J349120J082840k131936o96077L48343m95242J164157o33961m07286
6454F164878J079820R40765o41723L12814p36169j13434J765543O75266o15158
6445H832602k595261J305543Q42339j676565R99546P35639o89817k025788P21746
6436F449984N80954J523785j437583m42965K63137o47076J96918J130677J73462
6427G791293j231149J076198j35011j35379J415448m2567o78653R54948P67635
6418I782763k528875j689682J822655p19273l276744J536841K430617O54523J431307
$$ plain form
6481 7171345 6285515 6868300 6550534 7407464 6954987 5533224 6105493 5277547 4616981
6472 4616981 5956664 7338681 8188128 8265395 7408687 7892214 7261565 6351439 6584920
6463 6584920 7934040 9016880 6884944 6188867 6537210 6041968 7206125 6572164 6164878
6454 6164878 7244698 8185463 7543740 7856554 7120385 7006951 8772494 9447760 8832602
6445 8832602 6237341 7542884 8385223 6708658 7708204 8443843 7754026 5728238 6449984
6436 6449984 7030938 8554723 7117140 6674175 6937312 6290236 6487154 7617831 7791293
6427 7791293 6560144 7636342 7501331 7365952 8781400 8738833 8060180 9015128 9782763
6418 9782763 7253888 5564206 7386861 6667588 3390844 4927685 7358302 8012825 9444132
6409I444132K57298l50737j912607j333595K84325m139J978932N74677M0972P051
6399H986309m98862r34607p44839J606598R70601l308791R36909L543847p5846
6390A0481319j65514k004774m51133J406321j283362m88642Q59987p3183p23502
6381G557517O34964J368104Q27086K8790R85584r13367j643724P12570l57557
6372I199967j69992n6722R07400r02757Q60075J043210L47377m03935k112185
6363H712438K190373N4458K01922K0397M10024j510258J660321P61170j364416
6354A1136429m13635o93545J311910J42877k81501J29005J063250j040865o25990
6345A0727935j141226J97495O22085J14640Q99830l77651l09977J155685J4628
$$ plain form
6409 9444132 9701430 9350693 7438086 6104491 6388816 6384677 8363609 8938286 8979258 8986309
6399 8986309 8487447 7552840 6808001 8414599 9385200 6076409 7013318 10557165 10481319
6390 10481319 10315805 8311031 7859898 9266219 7982857 7494215 8354202 8281019 7557517
6381 7557517 8192481 9560585 10387671 10416461 11402045 10488678 8844954 9557524 9199967
6372 9199967 9029975 8973253 9880653 8977896 9837971 10881181 11228558 10824623 8712438
6363 8712438 10902811 10957269 11159191 11179588 11589612 10079354 11739675 12500845 11136429
6354 11136429 10722794 10029249 11341159 11484036 11202535 11331540 12394790 11353925 10727935
6345 10727935 9586709 9784204 10406289 10520929 11420759 11043108 10733131 11888816 11903444
6336A1903444N75012j94989M64453o03347P91922J021331j310489j152884K450521
6327A3944974n22239K16379o74238J114907O76319P4423j241539Q50559L06972
6318A4746517j142024J259842P12361j058690j060599k93993j744149J010857
6310A2430122O02613J260522L40396J732384k371211J12614J933142k046502K34968
6301A4229048J000441O37078j950423O13092K89806k5815J23424j08254R96628
6292A5805025l65509J741901K44448r24322o18270L10699k9038L10704P3214O07640
6282A7156492M30216P5378k315663P77865L767254J204970j165434r65249n04387
6273A8461442j390860P19187N74584n92532k76373j193646J561793K27546M19564
$$ plain form
6336 11903444 12478456 12283467 12747920 12144573 12936495 13957826 12647337 11494453 13944974
6327 13944974 13422735 13639114 12964876 14079783 14756102 14830525 13588986 14439545 14746517
6318 14746517 13604493 14864335 15576696 14518006 13457407 13163414 11419265 12430122
6310 12430122 13032735 14293257 14633653 16366037 13994826 14107440 16040582 13994080 14229048
6301 14229048 15229489 15866567 13916144 14529236 14819042 14793227 14916651 14808397 15805025
6292 15805025 15439516 17181417 17425865 16501543 15883273 16193972 16164934 16475638 16548852 17156492
6282 17156492 17586708 17662086 15346423 16124288 19891542 21096512 19931078 18965829 18461442
6273 18461442 17070582 17789769 18364353 17771821 17495448 16301802 17863595 18091141 18510705
6264A8510705k297672M8147L80410O88193M84848j6928O25408J274965J05234
6255A9803310q49599J981851j415824j300001K107000R46350R46670K53069p16445
6246B1756381o89282N5706J516579P59292n66372L64806j17818k310979L4313
6237B0802626J483615j30861q00726J696213k45848q43030j03920J921417J881958
6228B5661444J200700j564923j193275j612073Q80452j49532L64294j282661p35830
6219B1568596J714850R67238Q24959Q05279j052999J690723r16713l93029K517637
6210B7726541n75928J119192m73583L77185K48069K61013R55955J048077j67624
6201C0518897j861713N02066o48331o05515Q06347j078804J024861n95658R69290
$$ plain form
6264 18510705 16213033 16261180 16641590 17329783 17814631 17797703 18423111 19698076 19803310
6255 19803310 18953711 20935562 19519738 18219737 20326737 21273087 22219757 22472826 21756381
6246 21756381 21067099 21122805 22639384 23398676 22832304 23197110 23079292 20768313 20802626
6237 20802626 22286241 22155380 21354654 23050867 22805019 21961989 21858069 23779486 25661444
6228 25661444 26862144 25297221 24103946 22491873 23372325 23222793 23587087 22304426 21568596
6219 21568596 23283446 24250684 25075643 25880922 24827923 26518646 25601933 25208904 27726541
6210 27726541 27150613 28269805 27796222 28173407 28421476 28682489 29638444 30686521 30518897
6201 30518897 28657184 29159250 28510919 27905404 28711751 27632947 28657808 28062150 29031440
6192B9031440Q40222L12284l04419j468626P30511k6511K246113m90161k027035
6183B8843818J596101J157083k3451k079953J491342J509181J41945j880687o88106
6174C0067273J126537J109222m3638J365999J272351j508764l117823Q65760J829017
6165C2965934L38817J427587L65910m62198n04032p26589P38908J667464J560456
6156C7372257j615637j065742J272237j573242K264940Q00651K46062J607725
6148C9309251p3836m02830l30607P17782k321397k80749K250548j610370N06584
6139C7764376J647899o3725L02168J039928k259099J836726J698291j84629o38345
6130D1143590J727357q1837J488222p31021j288965J422373j383763m46513J350990
$$ plain form
6192 29031440 29871662 30183946 29879527 28410901 29141412 29114901 31361014 30870853 28843818
6183 28843818 30439919 31597002 31573551 29493598 30984940 32494121 32636066 30755379 30067273
6174 30067273 31193810 32303032 32259394 33625393 34897744 33388980 30271157 31136917 32965934
6165 32965934 33304751 34732338 35098248 34636050 34132018 33405429 34144337 35811801 37372257
6156 37372257 35756620 34690878 35963115 34389873 36654813 37455464 37701526 39309251
6148 39309251 39235415 38832585 38501978 39219760 36898363 36617614 38868162 37257792 37764376
6139 37764376 39412275 39348550 39650718 40690646 38431547 40268273 41966564 41781935 41143590
6130 41143590 42870947 42789110 44277332 43546311 42257346 43679719 42295956 41849443 43200433
6121D3200433K759829j216332K986058j653043r16434L284202j002385l94150
6113D7048178N07391n70735Q62964k91259K23911l16205m34701N50804K89676
6104D7870024J724407O06971j76789J454465o27395j486916K703519n5505p88028
6095E1224753K69503K368067l49880N75307j589631N38668K990837K183850n693
6086E8205781k006111K412290M5416l14645J835976L46804l019932J193252J86169
6077E8885000N25026J195025J827791Q10535q71730n95653J792169P74417j341793
6068F3000787J57432M56847L52430J88389K01474O33254J571713L16454R11109
6059F7789889J334003n31411M00670j6482J182871J78535j199599J955047j26526
$$ plain form
6121 43200433 45960262 44743930 47729988 46076945 45160511 48444713 47442328 47048178
6113 47048178 47555569 46984834 47847798 47556539 47780450 47464245 47029544 47580348 47870024
6104 47870024 49594431 50201402 50024613 51479078 50851683 49364767 52068286 52012781 51224753
6095 51224753 51494256 53862323 53512443 54087750 52498119 53036787 56027624 58211474 58205781
6086 58205781 56199670 58611960 58657376 58342731 60178707 60525511 57505579 58698831 58885000
6077 58885000 59410026 60605051 62432842 63243377 62371647 61775994 63568163 64342580 63000787
6068 63000787 63158219 63615066 63967496 64155885 64357359 64990613 66562326 66878780 67789889
6059 67789889 69123892 68592481 68993151 68976669 70159540 70338075 69138476 71093523 70966997
6050G0966997J05916J057494J862155j356109J452193j06416m2669K769702j155073
6041G5554190k72591Q27430Q36724J548500L34181M63511P72130k81023J258925
6032H1041977l32729k527988J65533J224149K055482Q93536N94607N8279j092934
6023H2079912J487587N74709J206732L33589m00754j082737k61663J951667j297210
6014H4591832J013467O71109O48885J329860J156623j53412l44548K112574N58530
6005I1584920K21830l64251M07641J383793q91754o68823J050012N70452J335436
5996I4629256J283768J345715m52012r34613M40289K154453l94358O19350j65518
5987I8526330r80476k4005J163700j342721K11754l38139P29370m43443J570688
$$ plain form
6050 70966997 71072913 72130407 73992562 72636453 74088646 73982230 73939561 76709263 75554190
6041 75554190 75281599 76109029 76945753 78494253 78828434 79291945 80064075 79783052 81041977
6032 81041977 80709248 78181260 78346793 79570942 81626424 82519960 83114567 83172846 82079912
6023 82079912 83567499 84142208 85348940 85682529 85281775 84199038 83937375 85889042 84591832
6014 84591832 85605299 86276408 86925293 88255153 89411776 89258364 88913816 91026390 91584920
6005 91584920 91806750 91442499 91850140 93233933 92342179 91673356 92723368 93293820 94629256
5996 94629256 95913024 97258739 96806727 95872114 96312403 98466856 98072498 98691848 98526330
5987 98526330 97545854 97521849 98685549 97342828 97554582 97216443 97945813 97502370 99073058
5978I9073058Q07420n96367J571757n04823J452492n57787m86652J642516Q70382
5969A03271996P31150O20650j26707J43248j40458M17535R86913J820156R0180
5960A07814663j980513r25554m65250j424558J044334J610491J647689M29546
5952A07750848j005168J89191j468757q52471J343870R78637r23567N9027m84319
5943A05587291k02404J383705J850271n52819O190r09414j238694J866802M50245
5934A08241173l98285j150396J672326j738294o60531P14985J023240q53554j128048
5925A05722616j037006J55448J652634O21221j656263r76835n68159r62978j563403
5916A01387275j236514K156980j337360O88703K325391k064769j703801j584672
$$ plain form
5978 99073058 99880478 99284111 100855868 100351045 101803537 101245750 100759098 102401614 103271996
5969 103271996 104003146 104623796 104497089 104640337 104499879 104917414 105904327 107724483 107814663
5960 107814663 105834150 104908596 104443346 103018788 104063122 105673613 107321302 107750848
5952 107750848 106745680 106934871 105466114 104613643 105957513 106936150 106012583 106071610 105587291
5943 105587291 105384887 106768592 108618863 108066044 108072234 107162820 105924126 107790928 108241173
5934 108241173 107842888 106692492 108364818 106626524 105965993 106680978 107704218 106850664 105722616
5925 105722616 104685610 104841058 106493692 107114913 105458650 104481815 103913656 102950678 101387275
5916 101387275 100150761 102307741 100970381 101659084 103984475 101919706 100215905 98631233
5908I8631233K131441R51663j671303j746214R42088m20814J200313k060944j509060
5899I6448403k222393k478951K031368L20052P99257j536588L11827o65385k52813
5890I2754777j237524j415576k24351M68685k311022p18565L68320K95455q28097
5881H7152102j073714k40929l213075J218850p69650j10264j42889J09323J141717
5872H4071471j776718j353468m67728k17308n62641L36154k481007p77082M095
5863G6775768j417547N33944K44614j795419j296652j350014J11021k52756M9690
5854G1602649J85153L5522j212058j840680J164522j143452j363821J18850l32591
5845F7214094j023569j676964n65507J339128O01819l76412j413957j698200R46471
$$ plain form
5908 98631233 100762674 101714337 100043034 98296820 99238908 98818094 100018407 97957463 96448403
5899 96448403 94226010 91747059 93778427 94098479 94897736 93361148 93672975 93007590 92754777
5890 92754777 91517253 90101677 89877326 90346011 88034989 87316424 87684744 87980199 87152102
5881 87152102 86078388 85837459 82624384 83843234 83073584 82963320 82820431 82929754 84071471
5872 84071471 82294753 80941285 80473557 80256249 79693608 80029762 77548755 76771673 76775768
5863 76775768 75358221 75892165 76136779 74341360 73044708 71694694 71805715 71552959 71602649
5854 71602649 71787802 71823324 70611266 68770586 69935108 68791656 67427835 67546685 67214094
5845 67214094 66190525 64513561 63948054 65287182 65889001 65512589 64098632 62400432 63346903
5836F3346903j2861j884449j154443J525326M72808o82520j996116J282944j155949
5827E9741643k921455k4720r60970j73474r81929L28829k261603J359327K795065
5818E6900713l199880j752920n34065R86034l71699k801934J122115K6739j977690
5809D8397413M86518q30575K038088j496952l555224r0384m07908K287071J414288
5800D8242335j046898k054536j849555j77359p21303J345193K0133j628634P97598
5791D2926974N13237j516235j289212J139638J232828j378990j587973o14627
5783C9425640O17737k620777N36187M11366o73973o19287l59632J758530q79400
5774C7596391j477110j126741r04124m25011r16690p47331J281402K502506j350597
$$ plain form
5836 63346903 63334042 61449593 60295150 61820476 62293284 61610764 59614648 60897592 59741643
5827 59741643 56820188 56795468 55834498 55661024 54679095 55007924 52746321 54105648 56900713
5818 56900713 53700833 51947913 51413848 52399882 52028183 49226249 50348364 50375103 48397413
5809 48397413 48883931 48053356 50091444 48594492 45039268 44948884 44540976 46828047 48242335
5800 48242335 47195437 45140901 43291346 43113987 42392684 43737877 43758010 42129376 42926974
5791 42926974 43440211 41923976 40634764 41774402 43007230 41628240 40040267 39425640
5783 39425640 40043377 37422600 37958787 38370153 37696180 37076893 36717261 38475791 37596391
5774 37596391 36119281 34992540 34088416 33663405 32746715 31999384 33280786 35783292 34432695
5765C4432695k797224k067820J286680J157562j108928J763211m06312j609683
5757C0650181J864853Q78646j321480N85863r94165p36634j495096n21146q4772
5748B8826250K02574K48620q13R33143J23390q11241J932795j98743p27725k500261
5738B8027989n12216J73578L1045m77918Q85504J390760J63155k099178k680750
5729B4901969j454870M56334J713559K467527m16393m010513o9346J804519r42506
5720B4450280j507054K99745J357435k001479j697202K872770P34225k159933
5712B2348787O99963q61802K05908r87824j56715K03858j804442R71211M42618
5703B1061562J998663l39641j476596j547406O83079j61138k18642P2861K89343
$$ plain form
5765 34432695 31635471 29567651 30854331 32011893 30902965 32666176 32259864 30650181
5757 30650181 32515034 33393680 32072200 32658063 31663898 30927264 29432168 28911022 28826250
5748 28826250 29028824 29277444 29276631 30209774 30333164 29521923 31454718 31255975 30528250 28027989
5738 28027989 27515773 27689351 27720396 27242478 28127982 29518742 29681897 27582719 24901969
5729 24901969 23447099 23903433 25616992 28084519 27668126 23657613 23588267 25392786 24450280
5720 24450280 22943226 23242971 24600406 22598927 20901725 23774495 24508720 22348787
5712 22348787 23048750 22186948 22392856 21405032 21248317 21452175 19647733 20618944 21061562
5703 21061562 23060225 22720584 21243988 19696582 20379661 20218523 19999881 20072742 20362085
5694B0362085p9442r20388P64400p7703J195895J071885Q71137N69753j343917
5685B2413705l610834m37614K243680k642958O29689M22287k29370J731502O76366
5676B1196453p67642J246990k020441l20643M00851o10224L91673K73120P65516
5667B0555653j143853q44311L16759N27985J104319m87077O0589k94439O91282
5658B0486907q67631o8479k23947K775370j773731j193918J81893j6303P79810
5649B0079971L57061O25158m98947N33657j839028o90045j575511N71701l67906
5640A7196111J050284j052508o37984m53478O30305K50777J737496j329165j344169
5631A6047669m97112K077774M2353Q65353j1543l44659L47775P8625j219767k95220
$$ plain form
5694 20362085 20282643 19362255 20126655 20048952 21244847 22316732 23187869 23757622 22413705
5685 22413705 18802871 18365257 20608937 17965979 18595668 19017955 18788585 20520087 21196453
5676 21196453 20428811 21675801 19655360 19334717 19735568 19125344 19517017 19790137 20555653
5667 20555653 19411800 18567489 18884248 19412233 20516552 20029475 20090064 19795625 20486907
5658 20486907 19619276 19550797 19326850 22102220 20328489 19134571 19316464 19300161 20079971
5649 20079971 20437032 21062190 20563243 21096900 19257872 18567827 16992316 17564017 17196111
5640 17196111 18246395 17193887 16555903 16102425 16732730 16983507 18721003 17391838 16047669
5631 16047669 15550557 17628331 17670684 18536037 18524494 18179835 18527610 18606235 17386468 17091248
5621A7091248K246004k797131M83036J845222J5138k004077j120830m4588R99555
5612A6713577J223984J248158Q09631k306536o3464J040665K22101j448833J693572
5603A9132855l356L83239r97535j040619k31672k61396J297464j346147M73486
5594A7406319p53537k76052r34128K090051J960831q36426J71882o92665l92103
5585A7744172J393143k087912j094978K70332O49613J177982j64213j347179J730887
5576A8271847J43763P10545Q87950L56696l67462j95945j884651R79024N87671
5567A9489438R4909k13401K1401R13991j531181n88555j074920m37311K658687
5558A9333058R1438l03050j382781r01999K82739m77142l23235L443083j375280
$$ plain form
5621 17091248 19337252 16540121 17023157 18868379 18883517 16879440 15758610 15714022 16713577
5612 16713577 17937561 19185719 19995350 17688814 17625350 18666015 18888116 17439283 19132855
5603 19132855 19129499 19512738 18515203 17474584 17242912 16981516 18278980 16932833 17406319
5594 17406319 16652782 16376730 15442602 17532653 19493484 18657058 18828940 18136275 17744172
5585 17744172 19137315 17049403 15954425 16224757 16874370 18052352 17888139 16540960 18271847
5576 18271847 18415610 19126155 20014105 20370801 20003339 19807394 17922743 18901767 19489438
5567 19489438 19584347 19370946 19392347 20306338 18775157 18186602 17111682 16674371 19333058
5558 19333058 19424496 19121446 17738665 16836666 17119405 16642263 16319028 19762111 18386831
5549A8386831m02058L178146j545315j044889M1884J591429r89795m71323k589317
5540A6155593K533591J340142k588744K14349R51972J336753P85706j580642j431990
5531A7716730J135125M520j419535J175074r25940n69779K907404J900962j99469
5522B1725092n45472j507522j162832q39384j16758J50060P78442j50749P88796
5513A9119673K75199q02051k86484L483088N95433k276137Q82037J61478j218984
5504A9933252J358856j193633k179152J621466L8873M61526l46705o09411k58450
5495A8826622j697001Q58044J099465K29813K96217J817406p75237O37369J449313
5486B2742011j001830k11069q04281o43440L55270j042222J732882M9224n29492
$$ plain form
5549 18386831 17984773 21162919 19617604 18572715 18614599 20206028 19216233 18744910 16155593
5540 16155593 18689184 20029326 17440582 17654931 18606903 19943656 20729362 19148720 17716730
5531 17716730 18851855 18856375 17436840 18611914 17685974 17116195 20023599 21924561 21725092
5522 21725092 21179620 19672098 18509266 17669882 17553124 17703184 18481626 18330877 19119673
5513 19119673 19394872 18592821 18306337 21789425 22384858 20108721 20990758 21152236 19933252
5504 19933252 21292108 20098475 17919323 19540789 19579662 20041188 19694483 19085072 18826622
5495 18826622 17129621 17987665 19087130 19316943 19613160 21430566 20655329 21292698 22742011
5486 22742011 21740181 21529112 20724831 20081391 20436661 19394439 21127321 21176545 20647053
5477B0647053P17034j735969P90689Q92094N87131j987974k09363j87756J594630
5468B1107569q04263k94528o9498k38930J625536m04605M48948l80376j358385
5459A9631468J280501k630700k9342R90160R98768P64025j400975L82297r38737
5450A9047465N34383j148628Q96296Q51957P4794n77914N14010j62006k85718
5441A9744639p08852M24084N27931k88447n90790p46567j2334Q98180m55549m63011
5431A8329284j329224m66106K45132K315382M18927j044448O44616J30617N17800
5422A9761980l017319L29930K524411J07723j279634r71839k82840L86617k86954
5413A7272075j246489J561189J162343j294181n91085n45712K20394J338446r32575
$$ plain form
5477 20647053 21364087 19628118 20418807 21310901 21898032 19910058 19700695 19512939 21107569
5468 21107569 20303306 20008778 19939280 19700350 21325886 20921281 21370229 20989853 19631468
5459 19631468 20911969 18281269 18251927 19242087 20240855 21004880 19603905 19986202 19047465
5450 19047465 19581848 18433220 19329516 20181473 20256267 19678353 20192363 20030357 19744639
5441 19744639 19035787 19459871 19987802 19699355 19108565 18361998 18349664 19247844 18792295 18329284
5431 18329284 17000060 16533954 16779086 19094468 19513395 18468947 19113563 19244180 19761980
5422 19761980 16744661 17074591 19599002 19706725 18427091 17455252 17172412 17559029 17272075
5413 17272075 16025586 17586775 18749118 17454937 16863852 16318140 16538534 17876980 16944405
5404A6944405L88003J080701k81871n07417q61997N70868Q17506l62299m310801
5395A3477098K684375L57629j692212R2866j717082O668J525227o81809K235961
5386A6288721k62209Q28990J00523l11225j930515N61305J836225r58262j333858
5377A4819695l70578J511778J831342k14643k411440n90413j52431K095493j325744
5368A5193059M682K036435j358716j288897J04644Q56729j009545j194899J217846
5359A4561338o51323j177586R87964J78041Q50538J221016j344495j14000K590405
5350A7101898M60999k993667N00756n21579J427038O91803j799341j589139J513604
5341A4792372l27197j388159K52762q65060K90564J411872n31873j92787j246648
$$ plain form
5404 16944405 17332408 18413109 18131238 17623821 16761824 17332692 18150198 17787899 13477098
5395 13477098 16161473 16519102 14826890 14919756 13202674 13209342 14734569 14052760 16288721
5386 16288721 16026512 16855502 16956025 16644800 14714285 15275590 17111815 16153553 14819695
5377 14819695 14449117 15960895 17792237 17577594 15166154 14575741 14423310 16518803 15193059
5368 15193059 15197741 17234176 15875460 14586563 14691207 15547936 14538391 13343492 14561338
5359 14561338 13910015 12732429 13720393 13898434 14748972 15969988 14625493 14511493 17101898
5350 17101898 17562897 14569230 15069986 14548407 15975445 16667248 14867907 13278768 14792372
5341 14792372 14465175 13077016 13329778 12464718 12755282 14167154 13635281 13442494 12195846
5332A2195846M16177Q7828r42789j896564K146789K000556j528357Q83725j303001
5323A2060210K93881K27578J090165L28510j620665k09231N28479J783237q8927
5314A4393237j529545K013606j499489M40272J943822o22971n82337M17227j311450
5305A3662372R1914K91308j263537K65576j966075J830473o32616m94636k15249
5296A1569530P80891P07079l38761o93273j94006P54295M07063l43715n05947
5287A2143156J156724M84423K37466o07599O7014j455068J734726m90824K36470
5278A3506488L55835k228971M91268J138635K411151k069562l58321n31247p14492
5269A2000784j93904J307523J21181R26676j08456J897304M767j553821Q68356
$$ plain form
5332 12195846 12612023 12699851 11757062 9860498 12007287 14007843 12479486 13363211 12060210
5323 12060210 12354091 12581669 13671834 14000344 12379679 12170448 12698927 14482164 14393237
5314 14393237 12863692 14877298 13377809 13818081 15761903 15138932 14556595 14973822 13662372
5305 13662372 13754286 14045594 12782057 13047633 11081558 12912031 12279415 11784779 11569530
5296 11569530 12350421 13057500 12718739 12025466 11831460 12585755 12992818 12649103 12143156
5287 12143156 13299880 13784303 14021769 13414170 13481184 12026116 13760842 13270018 13506488
5278 13506488 13862323 11633352 12124620 13263255 15674406 13604844 13246523 12715276 12000784
5269 12000784 11806880 13114403 13235584 14162260 14053804 15951108 15955875 14402054 15270410
5260A5270410J554284j849137m16200j143367j239533K186125k101524P38120
5252A2999178o69132q32086J403134K31160n67203Q43949M41238o33936P28637
5243A3944939J067067n03439k301837J01986N15694L7282J940747O84232j119759
5234A4366912o93028Q47197J37323O45817r57136J621171j829196k82950J44205
5225A4000315l85255J287188J517603r96012M80651J13610n27869K15901P94531
5216A6500663j321750p4445P15293O36457j60531L50500n11969l51175J06714
5207A5889757N27737J442931O62687j398491j273317j691036J101192J338457
5199A6599917J97684J038882K68368j464993j028982J266535J74695n99728j000038
$$ plain form
5260 15270410 16824694 14975557 14559357 13415990 12176457 14362582 12261058 12999178
5252 12999178 12330046 11497960 12901094 13132254 12565051 13409000 13850238 13216302 13944939
5243 13944939 15012006 14508567 12206730 12308716 12824410 12861692 14802439 15486671 14366912
5234 14366912 13673884 14521081 14658404 15304221 14347085 15968256 14139060 13856110 14000315
5225 14000315 13615060 14902248 16419851 15423839 15904490 16018100 15490231 15706132 16500663
5216 16500663 15178913 15104468 15819761 16456218 16295687 16646187 16134218 15783043 15889757
5207 15889757 16417494 17860425 18523112 17124621 15851304 14160268 15261460 16599917
5199 16599917 16797601 17836483 18104851 16639858 15610876 16877411 17052106 16452378 15452340
5190A5452340o38518r86103K143802o45251p47737j186326J671340J881426K45436
5181A7190409j144239n49441r50458j162465L699818Q76410j67988J39951k57604
5172A7674393P09723j486946P86965k9024R08165L16102j772953k052029J885309
5163A6939705j10493J397004L38199l044611k04363J843737j453750N87078J741012
5154A8033518j477903l22394J489393J237987n50799N3882J519353J877917O61661
5145B2522615r23619r7192J149218k836198K012701l60196p77276R48359M08315
5136B2046727j251875N74515J486318J407172k090025r36354k97679r85107J605458
5127B1559150K78259J717144k046983Q69420K97198l79902l11538K4228j117496
$$ plain form
5190 15452340 14813822 13827719 15971521 15326270 14578533 13392207 15063547 16944973 17190409
5181 17190409 16046170 15496729 14546271 13383806 17083624 17960034 17792046 17931997 17674393
5172 17674393 18384116 16897170 17684135 17655111 18563276 18879378 17106425 15054396 16939705
5163 16939705 16829212 18226216 18564415 15519804 15315441 17159178 15705428 16292506 18033518
5154 18033518 16555615 16233221 17722614 18960601 18409802 18463684 19983037 21860954 22522615
5145 22522615 21598996 21501804 22651022 19814824 21827525 21467329 20690053 21638412 22046727
5136 22046727 20794852 21369367 22855685 24262857 22172832 21236478 20938799 19953692 21559150
5127 21559150 21837409 23554553 21507570 22376990 22674188 22294286 21982748 22006976 20889480
5118B0889480k5447J904610n54505K913951q7936k64596M7485o54699L16273r71379
5108B3513237J756705j232989j228406P41768J017709n10796J086870O79365k019891
5099B3803572Q28171K440900o7734n94520o91410J687202n97275m30372p40078
5090B5638456j274086J158555o4824R47418K190009r78792j240493J5192L88238
5081B6779673m26760N28875P43288J657807N23637j424316J660245R78708j310348
5072B9710809k78704L99420r60206p90138N9108n55946p36686K82238m35833J374983
5062B8069045L84381o22411J874746R91903o48647l11401J59829j137342j083926
5053B7676177K779453J653577j368746L42128K237960j488478J79086Q38627o6635
$$ plain form
5118 20889480 20864033 22768643 22214138 25128089 25040153 24775557 24823042 24168343 24484616 23513237
5108 23513237 25269942 24036953 22808547 23550315 24568024 24057228 25144098 25823463 23803572
5099 23803572 24631743 27072643 27004909 26410389 25718979 27406181 26808906 26378534 25638456
5090 25638456 24364370 25522925 25458101 26405519 28595528 27616736 26376243 26391435 26779673
5081 26779673 26352913 26881788 27625076 29282883 29806520 28382204 30042449 31021157 29710809
5072 29710809 29432105 29831525 28871319 28081181 28140289 27584343 26847657 27129895 26694062 28069045
5062 28069045 28453426 27831015 29705761 30697664 30049017 29737616 29897445 28760103 27676177
5053 27676177 30455630 32109207 30740461 31082589 33320549 31832071 32011157 32849784 32783149
5044C2783149j378214l37390J539801M24032n87620m43080j997200L122634N66346
5035C3692458R84346P66881l04241q26193K95557Q92097k34827J31839P85767
5026C6183684p46471R5814J82072n60914k72190N16484l15643J579992R17330
5017C7580158N09790j210419k273715J854103p74451O67249q89069K018689J859263
5008C9341598j146192R44244l07917n53437J188445q57943j321833Q35186Q83982
4999C9006133o76145q36304j620105K955289J326392L2451k026075K049275J380065
4990D1590976j215268j478199j15717J364224l25944n56485j38295M64348p43722
4981C8845918K75033N38756L02055k72440K505212N91535k587496k074740L51389
$$ plain form
5044 32783149 31404935 31067545 32607346 33031378 32443758 32000678 30003478 33126112 33692458
5035 33692458 34676804 35443685 35139444 34313251 34608808 35500905 35266078 35397917 36183684
5026 36183684 35437213 35533027 35715099 35154185 34881995 35398479 35082836 36662828 37580158
5017 37580158 38089948 36879529 34605814 36459917 35685466 36352715 35463646 37482335 39341598
5008 39341598 38195406 39139650 38831733 38278296 39466741 38608798 37286965 38122151 39006133
4999 39006133 38329988 37493684 35873579 38828868 40155260 40187711 38161636 40210911 41590976
4990 41590976 40375708 38897509 38781792 40146016 39820072 39263587 39125292 39589640 38845918
4981 38845918 39120951 39659707 39961762 39689322 42194534 42786069 40198573 38123833 38475222
4972C8475222J294128P16351L87053n0962J555843k179660r36439J041455j128735
4963C9174256j57K026601Q47027j365472M9649N2778l53606r96878J5214N63739
4953D0013151P5742K93967M68190R148J8589o83131m5469k52230q46100j24562
4943C8927295J266848J851140k456204K35704N08775J211678K400647l383259
4935D0562624j331091K561023L01301j60689j725652P14696p46547o87781K365909
4926D1853793M22922j960061K26751l42974J091237O2895p53108M80390J417348
4917D2499193m347N70524l45872k315096j196795k31581Q42000j377689K339863
4908D0780200j04757O13869N50346J395309j253311M69346j161552k181732m63484
$$ plain form
4972 38475222 39769350 40485701 40872754 40821792 42377635 40197975 39261536 40302991 39174256
4963 39174256 39174099 41200700 42047727 40682255 40731904 40784682 40431076 39434198 39449412 40013151
4953 40013151 40088893 40382860 40851050 40860198 40878787 40195656 40150187 39897957 39051857 38927295
4943 38927295 40194143 42045283 39589079 39824783 40333558 41545236 43945883 40562624
4935 40562624 39231533 41792556 42093857 41933168 40207516 40922212 40175665 39487884 41853793
4926 41853793 42276715 40316654 40543405 40200431 41291668 41354563 40601455 41081845 42499193
4917 42499193 42494846 43065370 42719498 40404402 39207607 38976026 39818026 38440337 40780200
4908 40780200 40675443 41289312 41839658 43234967 41981656 42451002 41289450 39107718 38644234
4899C8644234j143959L32420R08270r04171l39288J896927P25789j544675P68873
4890C9344420N96950M42895N88087O2599J497832k298567Q02837m23207m22798
4881D0191048J060180j473620j115607J790033j135578K48695k504848J489905
4873C8550208K27823q09440L64963j532647J195666J337068J684646k12950l57584
4864D0447753k112918p88374k99566J305457K6716N86949j338268K973283k72326
4855D0528706K96034j021275K95572J366623r16415K39809j871534J6302K219162
4846D1152984J65592j924937l242085r6054J504143J248215J18233J6434r56697
4837C7985828l53704J542242M26173K272436Q52829k9894j56604j946123j487566
$$ plain form
4899 38644234 37500275 37832695 38740965 37836794 37497506 39394433 40120222 38575547 39344420
4890 39344420 39941370 40384265 40972352 41034951 42532783 40234216 41037053 40613846 40191048
4881 40191048 41251228 39777608 38662001 40452034 39316456 39565151 37060303 38550208
4873 38550208 38778031 37968591 38333554 36800907 37996573 39333641 41018287 40805337 40447753
4864 40447753 38334835 37546461 37246895 38552352 38579068 39166017 37827749 40801032 40528706
4855 40528706 40824740 39803465 40099037 41465660 40549245 40789054 38917520 38933822 41152984
4846 41152984 41318576 39393639 36151554 36055500 37559643 38807858 38926091 38942525 37985828
4837 37985828 37632124 39174366 39600539 41872975 42725804 42695910 42539306 40593183 39105617
4828C9105617J087229k07959n36198p66773J26593O99361P01500J084776j396348
4819C9897798M64479R07424j318932q86569M46771R97567k04980J76785l69306
4810D0111037N07745N0380k794771J715K554614R3731j437515R29721P24561k039647
4800C8701571L331560k377312J80214M75410M93861J811263n83483K63693p28515
4791D1568262n59027j322982j191571N47069J087826J219388j397570J242169
4783D1193564M09351j861669J071088K429893l646j716618K97622n33060j576280
4774C9710245k80770o84770J545320J71507J356839j18386j459932L79993r33838
4765C9686208J540218M09334j184140J228041P72730k479569P87016l519016k96225
$$ plain form
4828 39105617 40192846 39984887 39448689 38681916 38808509 39507870 40209370 41294146 39897798
4819 39897798 40362277 41269701 39950769 39064200 39510971 40508538 40303558 40480343 40111037
4810 40111037 40618782 40669162 37874391 37876106 40430720 40524451 39086936 40016657 40741218 38701571
4800 38701571 42033131 39655819 39836033 40311443 40805304 42616567 42033084 42296777 41568262
4791 41568262 41009235 39686253 38494682 39041751 40129577 41348965 39951395 41193564
4783 41193564 41602915 39741246 40812334 43242227 43238581 41521963 41819585 41286525 39710245
4774 39710245 39429475 38744705 40290025 40461532 41818371 41699985 40240053 40620046 39686208
4765 39686208 41226426 41635760 40451620 41679661 42452391 39972822 40759838 37240822 36944597
4756C6944597J731856O50716K040746j017740n11872j36679J900020k126165j85160
4747C9290319J634208P82807o9801j046823J230886o80067o98623P15022n0388
4738D1107540j516311J124492m46009M12847N85361p50609J79342r47424j157047
4729C8592182j210519P98995J254017M66541o45534k68652K11745J369593m31141
4720D0137227j246317l48972j550607J074974M89400k53962K70687m70310k862085
4711C5240035J165003J076510K194521p69303l90022j578871K31299N73031l00043
4702C7442160O17982R5771k03489N36806Q38996k799916m49744J062383j28380
4693C7012569J325412q3786n44763J5555R69127n59396o56184j074455j216277
$$ plain form
4756 36944597 38676453 39327169 41367915 40350175 39838303 39701624 41601644 39475479 39290319
4747 39290319 40924527 41707334 41637533 40590710 41821596 41141529 40442906 41157928 41107540
4738 41107540 39591229 40715721 40269712 40682559 41267920 40517311 40696653 39749229 38592182
4729 38592182 37381663 38180658 39434675 39901216 39255682 38987030 39198775 40568368 40137227
4720 40137227 38890910 38541938 36991331 38066305 38555705 38301743 38572430 38102120 35240035
4711 35240035 36405038 37481548 39676069 38906766 38516744 36937873 37169172 37742203 37442160
4702 37442160 38060142 38155913 37952424 38489230 39328226 36528310 36078566 37140949 37012569
4693 37012569 38337981 38254195 37709432 37724987 38694114 38134718 37478534 36404079 35187802
4684C5187802J375361o62603j983261K162848Q49796k991920K433256j53003J739798
4675C7958074j80266k148182J337973K07082j707376K89578P13722k132073k49344
4666C4089188J249262O35002J044250j618257m71916j662016p303r6384L31623
4657C3493449m55289R82379J445960k20523o72789J173814j038724k533257J798159
4648C3973179q43749r72887J027732N59555N75165j989107j607567L036214j278808
4639C2479727q80144R99680M78866O69984j54636l70496l94925L02372J454696
4630C4585124j624246J185569K223844l571083o57197J638370p85641L71910L87992
4621C3754642j577829j374058J373470Q41698Q45014m95979j650602r44489P13833
$$ plain form
4684 35187802 36563163 35900560 33917299 36080147 36929943 33938023 36371279 36218276 37958074
4675 37958074 37777808 35629626 36967599 37174681 35467305 35756883 36470605 34338532 34089188
4666 34089188 35338450 35973452 37017702 35399445 34927529 33265513 33258210 33161826 33493449
4657 33493449 33038160 34020539 35466499 35245976 34573187 35747001 34708277 32175020 33973179
4648 33973179 33129430 32156543 33184275 33743830 34318995 32329888 30722321 33758535 32479727
4639 32479727 31599583 32599263 33078129 33748113 33593477 33222981 32828056 33130428 34585124
4630 34585124 32960878 34146447 36370291 32799208 32142011 33780381 32994740 33366650 33754642
4621 33754642 32176813 30802755 32176225 33017923 33862937 33366958 31716356 30771867 31485700
4612C1485700J302321q19056n71974J704516J660054j391443J37785o21144Q22969
4603C3709728M25467m96454r39534l01708N61860L81416j194179P24757J140915
4594C4012268k78716m58485N34140N5514P24141K83844r78868N50857k166387
4585C2278308K316339Q78832n18597J142103J12529Q46601N66756p88937M752
4576C6838686j774249Q04609J554631M59532n4550R77228o51542k73951k199388
4567C5681006J109032J819541j721128K239418J529398P37222O76516M93221k454984
4558D0109242k07974K43523K610614o73283j062754n23166J751904N77971j383848
4549D1442229r74801Q26823j573966P29429J509424j175012K216742J722111j72856
$$ plain form
4612 31485700 32788021 31968965 31396991 33101507 34761561 33370118 33507903 32886759 33709728
4603 33709728 34135195 33638741 32699207 32397499 32959359 33340775 32146596 32871353 34012268
4594 34012268 33733552 33275067 33809207 33864721 34588862 34872706 33893838 34444695 32278308
4585 32278308 34594647 35473479 34954882 36096985 36209514 37056115 37622871 36833934 36838686
4576 36838686 35064437 35869046 37423677 37883209 37828659 38805887 38154345 37880394 35681006
4567 35681006 36790038 38609579 36888451 39127869 40657267 41394489 42071005 42564226 40109242
4558 40109242 39901268 40144791 42755405 42082122 41019368 40496202 42248106 42826077 41442229
4549 41442229 40467428 41294251 39720285 40449714 41959138 40784126 43000868 44722979 44550123
4540D4550123j047994r61594J594171J619215l9365K54040K56119K13865l31237
4531D6107343O73777O65045R42179l18446J354956l568870L41077J520828J786764
4522D9504653M2141l47724K32447J689413l23174n3294K18215O30995l09714l85138
4512E0898820J704078l70124N16147l86327K059120j298926K51127q9916j629635
4503E1654364P47515L146838R46518n37685k22288q27745m4934K287106J645886
4494E8795575P44509P16166j617013Q5047J359971L38170L60074m63271K26987
4485F0546215K081871j348717k979242J358859J772660J412142J166003J562165
4477F5571956R80654Q07168K852808k270341k908896N03730O0132P49551K337840
$$ plain form
4540 44550123 43502129 42540535 44134706 45753921 45714556 45968596 46224715 46438580 46107343
4531 46107343 46781120 47446165 48388344 48069898 49424854 45855984 46197061 47717889 49504653
4522 49504653 49546794 49199070 49431517 51120930 50797756 50744462 50962677 51593672 51283958 50898820
4512 50898820 52602898 52232774 52748921 52362594 54421714 53122788 53373915 53283999 51654364
4503 51654364 52401879 55548717 56495235 55957550 55735262 54907517 54862583 57149689 58795575
4494 58795575 59540084 60256250 58639237 58724284 60084255 60422425 60782499 60319228 60546215
4485 60546215 62628086 61279369 58300127 59658986 61431646 62843788 64009791 65571956
4477 65571956 66552610 67359778 70212586 67942245 65033349 65537079 65597211 66346762 68684602
4468F8684602J61062k03787P88986j27601J812008M64601k6786J193559k47151
4459G2499493J29629J200570k51831L09789J019849k42665Q53185J072609J342330
4450G7932958Q02786j049576L1605N88780J189373j397205p80061K311824K00274
4441G9830758P24421J103477j86203p09183R70604J033657n49232O39394P86856
4432H3644549M21826Q69100k3183J821513J817341j251419k406962q0492j62586
4423H4649687L742112K570580l644692M54698O37457j62525J05276O22260O58074
4414H9632927M37099J278185n34394j256438K64732j90999O43416P45378J456683
4405I2476589l77093j304426k342861N39660K293610Q96806J083708K91485j85090
$$ plain form
4468 68684602 68845664 68641877 69430863 69303262 71115270 71579871 71553085 72746644 72499493
4459 72499493 72629122 73829692 73577861 73887650 74907499 74664834 75518019 76590628 77932958
4450 77932958 78735744 77686168 77717773 78306553 79495926 78098721 77318660 79630484 79830758
4441 79830758 80555179 81658656 81472453 80763270 81733874 82767531 82218299 82857693 83644549
4432 83644549 84066375 84935475 84912292 86733805 88551146 87299727 84892765 84812273 84649687
4423 84649687 88391799 90962379 87317687 87772385 88409842 88247317 88352593 88974853 89632927
4414 89632927 90070026 91348211 90813817 89557379 89822111 89631112 90274528 91019906 92476589
4405 92476589 92099496 90795070 88452209 88991869 91285479 92182285 93265993 93557478 93372388
4396I3372388M48235q43064q82688J96080L4221l90247p48342k38762j320233
4387H9627588R0050K793147N39496j442984k37793J028954K037730k454223p7670
4378I1904295J342540o17619l1723K69574k201202R73613K265713q22889o03755
4369I2478547M87295J45752l38348j124568j391046n69324Q42302k36676J070047
4360I1363981M65327k666785J831182K879093k405208j512438P91582K098639
4352I2845373j260632m89757N6254q32225j868738J124454J781167j316321N33083
4343I0572658n48342n74078M20500k00829N49326P29913q92483J92688N05582
4334I0754935k107160J641176K248583j727238n02743j69583M09555r18491j566785
$$ plain form
4396 93372388 93820623 92977559 92094871 92290951 92325172 91934925 91186583 90947821 89627588
4387 89627588 89717638 92510785 93050281 91607297 91369504 92398458 94436188 91981965 91904295
4378 91904295 93246835 92629216 92597493 92867067 90665865 91639478 93905191 93082302 92478547
4369 92478547 92965842 93111594 92773246 91648678 90257632 89688308 90530610 90293934 91363981
4360 91363981 91829308 89162523 90993705 93872798 91467590 89955152 90746734 92845373
4352 92845373 91584741 91094984 91151238 90319013 88450275 89574729 91355896 90039575 90572658
4343 90572658 90024316 89450238 89870738 89669909 90219235 90949148 90056665 90249353 90754935
4334 90754935 88647775 90288951 92537534 90810296 90307553 90137970 90547525 89629034 88062249
4325H8062249k37721K751242Q89499m58596k121289J978785p51624J399023n87170
4316I0924398j023781K177815q3851l10868J700076k174549j655175L039093M46974
4307I3040132j22116L37063M14438N6873Q7902j200300L88209P01932J555324
4298I5259457n15192j383715N16968K16439J912012J302158j450357m581L21796
4289I6174985k52310K340874K70706L75518R74740p9602J046318J260124n58123
4280A01553230m2915R26149k80361K96251J370425J083838k18860J462159P42356
4271A06892272J097538o67647j971975J307485k23681K206460J671790p54784
4263A09557458P09122K325150r30772l85237K013447J887929J301411r26487N51863
$$ plain form
4325 88062249 87824528 90575770 91465269 91006673 88885384 90864169 90112545 91511568 90924398
4316 90924398 89900617 92078432 91994581 91683713 93383789 91209240 89554065 92593158 93040132
4307 93040132 92918016 93255079 93669517 93726390 93814292 92613992 93002201 93704133 95259457
4298 95259457 94744265 93360550 93877518 94093957 96005969 97308127 95857770 95853189 96174985
4289 96174985 95922675 98263549 98534255 98909773 99884513 99804911 100851229 102111353 101553230
4280 101553230 101510315 102436464 102156103 102452354 103822779 104906617 104687757 106149916 106892272
4271 106892272 107989810 107322163 105350188 106657673 106433992 108640452 110312242 109557458
4263 109557458 110266580 112591730 111660958 111275721 113289168 115177097 116478508 115552021 116103884
4254A16103884j72660K522940J700828n59858k34762J962460J108798J309028
4246A23740658J58191L67972J871841j87886k97909R17468N04199K23944J68544
4237A27467022J673004J856189J285906R64566J06987N8056K563753K727501l83975
4228A38319009r19261O8676K314667M125015r37641R13962K228249M48486m0485
4219A46520677L55753K886319L30572P06036K735320J551341j894154K16194J794200
4210A55202258K342285m7553J176176L326732P94711J413045J251079J311142
4202A66769875J581494Q10242P19010N55262J463817j29186J707948L006891o99250
4193A75786103L212063L45035K865485M05881J755934K459792L35194O74336L307500
$$ plain form
4254 116103884 115931224 118454164 120154992 119595134 119360372 121322832 122431630 123740658
4246 123740658 123898849 124266821 126138662 125950776 125652867 126570335 127074534 127298478 127467022
4237 127467022 129140026 130996215 132282121 133246687 133353674 133411730 135975483 138702984 138319009
4228 138319009 137399748 137468424 139783091 143908106 142970465 143884427 146112676 146561162 146520677
4219 146520677 146876430 149762749 150093321 150799357 153534677 155086018 153191864 153408058 155202258
4210 155202258 157544543 157496990 158673166 161999898 162794609 164207654 165458733 166769875
4202 166769875 168351369 169161611 169880621 170435883 171899700 171770514 173478462 176485353 175786103
4193 175786103 178998166 179343201 182208686 182614567 184370501 186830293 187165487 187839823 191147323
4184A91147323J77990k26819k9240J519634O85775L850380K700725K387795K190151
4175B04403714j306450K343600K652283J054834P81482L505401j65058K691978
4167B15961784J612066J806388R05563K587035R83528j090655J461898K637029
4159B26864636K066980J960833J290319N94271J372802K744906K807977L664400
4151B43367124J191814q43702K12090M604638J609563J669014J194381N67530
4143B53572452R04027K386009m7553K626522K377423J960775J778633L459686
4135B69017974L44385J708165J569045P55923j1469J457456J585372J003850O75273
4126B78105974M183470M550228J036101L81819N6798J035159m29957J443765N95412
$$ plain form
4184 191147323 191325313 191098494 191069254 192588888 193274663 197125043 199825768 202213563 204403714
4175 204403714 203097264 205440864 208093147 209147981 209929463 213434864 213269806 215961784
4167 215961784 217573850 219380238 220285801 222872836 223856364 222765709 224227607 226864636
4159 226864636 228931616 230892449 232182768 232777039 234149841 236894747 239702724 243367124
4151 243367124 244558938 243715236 243927326 248531964 250141527 251810541 253004922 253572452
4143 253572452 254476479 256862488 256814935 259441457 261818880 263779655 265558288 269017974
4135 269017974 269362359 271070524 272639569 273395492 273384023 274841479 276426851 277430701 278105974
4126 278105974 282289444 286839672 287875773 288257592 288314390 289349549 288919592 290363357 290958769
4117B90958769K096376J425919J542561K187617p32404J587718J503973J695405
4109C02265934J090802J314395J30031O2823L34310k15942K012310J963054J568739
4100C10526456N79219K66631j738709J344511J562464J251690j34830J263306
4092C14920738L250696J067698l29054J422723j256811K010810o70260L25882
4084C20742422M86932J996183r32342n74446K255826k90025p38291m16289K264790
4075C24794760o72917J277212J20336J7711K647507k43088M81183j419761o59840
4066C26343103m30027R7858r32181J689301l25862J043901j81576J757022M64252
4057C29525791m01337p93543j074701p59871j203417N24812P97738n5261n02289
$$ plain form
4117 290958769 293055145 294481064 296023625 298211242 297478838 299066556 300570529 302265934
4109 302265934 303356736 304671131 304801162 304863985 305198295 304982353 306994663 308957717 310526456
4100 310526456 311105675 311372306 309633597 310978108 312540572 313792262 313657432 314920738
4092 314920738 318171434 319239132 318910078 320332801 319075990 321086800 320416540 320742422
4084 320742422 321229354 323225537 322293195 321718749 323974575 323684550 322946259 322529970 324794760
4075 324794760 324121843 325399055 325519391 325537102 328184609 327941521 328422704 327002943 326343103
4066 326343103 325913076 326010934 325078753 326768054 326442192 327486093 327304517 329061539 329525791
4057 329525791 329124454 328330911 327256210 326496339 325292922 325817734 326615472 326560211 326057922
4048C26057922j825849K98812K16320K275306L98806j100k232000j120965j622685
4039C22444567o43415J245737N43898j089582l11418l94199j228693r93973k294574
4030C17278348J136890j138499n21167j704662K88771l30020Q23853k5042j072050
4021C14736422j701907L99748l8257r38465n11671J660347k958226p40836j88297
4012C09718858L52517m45823K39394k352096k417313M45805L87878j562460j069809
4003C03296951p53829j318756j457169J392974j838182k320661q38867J535595
3995B97698056M42567k410207k845836k773330j034105R07942J066718k155079
3987B88896726j98860q94025j312566j026834J93493M76953j723785j105370q76976
$$ plain form
4048 326057922 324232073 324530885 324747205 327022511 327421317 327420217 325188217 324067252 322444567
4039 322444567 321801152 323046889 323590787 322501205 322189787 321795588 320566895 319572922 317278348
4030 317278348 318415238 317276739 316755572 315050910 315339681 315009661 315833514 315808472 314736422
4021 314736422 313034515 313434263 313396006 312457541 311945870 313606217 310647991 309907155 309718858
4012 309718858 310071375 309625552 309864946 307512850 305095537 305541342 305929220 304366760 303296951
4003 303296951 302543122 301224366 299767197 301160171 299321989 297001328 296162461 297698056
3995 297698056 298140623 295730416 292884580 290111250 289077145 289985087 291051805 288896726
3987 288896726 288697866 287803841 286491275 285464441 285657934 286134887 284411102 283305732 282428756
3978B82428756J09468k42713k003880o99130J97886o74956q82138k101581l44153
3969B75787559J279731K120853j262655k610714N87416n95369j874551m81537
3961B72950733j932288k504160p44755J35508J194900n93311j931156j192543
3953B65382928P26907P59748q70136o50081K610435q36706j043744k260011k018517
3944B61800823P59349j136840O71721J924972j155310j62549O92026j274546k182935
3935B59936711j407450j245651j59381K307131k280671o93760P91718p44723M27899
3926B56931823Q61114J323632J199633k255352q09394k875914r21415L059429
3918B56513556o56229K09211L008895M8490k670381j282842p60667J875533K77687
$$ plain form
3978 282428756 282538224 282295511 280291631 279592501 279790387 279115431 278233293 276131712 275787559
3969 275787559 277067290 279188143 277925488 275314774 275902190 275306821 273432270 272950733
3961 272950733 271018445 268514285 267769530 267905038 269099938 268506627 266575471 265382928
3953 265382928 266109835 266869583 265999447 265349366 267959801 267123095 266079351 263819340 261800823
3944 261800823 262560172 261423332 262095053 264020025 262864715 262702166 263394192 262119646 259936711
3935 259936711 258529261 257283610 257124229 259431360 257150689 256456929 257248647 256503924 256931823
3926 256931823 257792937 259116569 260316202 258060850 257251456 254375542 253454127 256513556
3918 256513556 255857327 256066538 259075433 259123923 256453542 255170700 254410033 256285566 256563253
3909B56563253j263198j131091J461742k0819k11708j75350J127476J009937K365093
3900B59725335n50616j50564n06122l67527j027987J072721K76142o10590o87568
3891B57173224K170429k07641n19058P49141K53747L93408O43226M53672k686715
3882B58423433N16734J258868j17930r67215o37954K474219j80488j48263P31154
3873B61352558k13425J014759P96N57693N03216N0098R5590j291316j472836J334266
3863B61931399R1311K579279J286304l204246m5829j135025n01609J847392r67793
3854B61881183L26993j046215j877994M9841K374962j168080k176317k40492o94503
3845B57429378J064150J423378k007960l89727k390713K27864K109068J351701
$$ plain form
3909 256563253 255300055 254168964 255630706 255609887 255398179 255222829 256350305 257360242 259725335
3900 259725335 259174719 259024155 258518033 258150506 257122519 258195240 258471382 257860792 257173224
3891 257173224 259343653 259136012 258616954 259366095 259619842 260013250 260656476 261110148 258423433
3882 258423433 258940167 260199035 260081105 259113890 258475936 260950155 260769667 260621404 261352558
3873 261352558 261139133 262153892 262154688 262712381 263215597 263265695 263361285 262069969 260597133 261931399
3863 261931399 262022710 264601989 265888293 262684047 262638218 261503193 261001584 262848976 261881183
3854 261881183 262208176 261161961 259283967 259333808 261708770 260540690 258364373 258123881 257429378
3845 257429378 258493528 259916906 257908946 257519219 255128506 255356370 257465438 258817139
3837B58817139j732597j902603J47351J250301j781605j456142N34343o29278
3829B53246909J66699k449930J70366j088732k735666P56520l38686j484508L6364
3820B46279336J90637l225688M5463O77799p13151o49209l33109j711668l208675
3811B37351735P16189j93572k264294j100654o57914o0284j918535k036056J710483
3802B31547098j792696k095475O2374J03324j063941j526019O59763k434185k723516
3793B20736727P27385J024813l473550k153236J61500k516392j454928J280377
3785B14332696K33917M44265q81664o24702p26967q29876p33242k658764q60881
3776B07694782j296974m61028J79022P13489K72690r49070l279313o35810k075849
$$ plain form
3837 258817139 257084542 255181939 255329290 256579591 254797986 253341844 253876187 253246909
3829 253246909 253413608 250963678 251134044 250045312 247309646 248066166 247727480 246242972 246279336
3820 246279336 246469973 243244285 243289748 243967547 243254396 242605187 242272078 240560410 237351735
3811 237351735 238067924 237874352 235610058 234509404 233851490 233791206 231872671 229836615 231547098
3802 231547098 229754402 227658927 227721301 227824625 226760684 225234665 225894428 223460243 220736727
3793 220736727 221464112 222488925 219015375 216862139 217023639 214507247 213052319 214332696
3785 214332696 214566613 215010878 214129214 213504512 212777545 211947669 211214427 208555663 207694782
3776 207694782 206397808 205936780 206115802 206829291 207101981 206152911 202873598 202237788 200161939
3767B00161939m251524J65602J35553P78420J120630l715383m41840J143107O8528
3758A95165032j50789N3001r47183k623461j121514R2653l17846k29422r95194
3749A88925277n62652p1320O44324n45591O83266J88387k436587k618957l06128
3740A83900019J087743m80957j125827j384545o80348K100541r45539Q31930l22358
3731A82980659k69014l13004j710088J823184o28896k279626K826191M12683k100849
3722A80741240j33272K12792O59725o38615l90568R60811L12589j381912j53970
3713A80188820l1634J959116q65243K071120j790793j367967J296665J801653
3705A83261737o23303k068665L58239K22749N06393M04911K190089p49541r25786
$$ plain form
3767 200161939 195910415 196076017 196211570 196989990 198110620 194395237 193953397 195096504 195165032
3758 195165032 195014243 195067244 194120061 191496600 190375086 190467739 190149893 189920471 188925277
3749 188925277 188362625 188291305 188935629 188390038 189073304 189261691 186825104 184206147 183900019
3740 183900019 184987762 184506805 183380978 181996433 181316085 183416626 182471087 183303017 182980659
3731 182980659 182711645 182398641 180688553 182511737 181882841 179603215 182429406 182842089 180741240
3722 180741240 180607968 180820760 181480485 180841870 180451302 181412113 181724702 180342790 180188820
3713 180188820 180157186 182116302 181251059 183322179 181531386 180163419 181460084 183261737
3705 183261737 182638434 180569769 180928008 181150757 181657150 182062061 184252150 183502609 182576823
3696A82576823J044317o54116J600550m87323m30529J459001J096412P24457j013136
3687A85916456j442495O14949j492199k60791Q2973L035208J265863m37552R57341
3678A88239753R91672r16134J150776O74058J43885O55905J604875J233022k613981
3669A91163831j026914J215812L63693m36406Q45183N07559L090685k06872J831160
3660A97347731m39909P51895j045058j61302J183902N01564P33374J470853J201027
3651B01544077o94936N70411O33488J329812O91088R7385J412336n71441P87669
3642B05799889j037199N74824J049069K71671J792962q8877J111445R6814J70807
3633B09741405K86291k79740m14253J083259J203433J532149N25618l7402P43905
$$ plain form
3696 182576823 183621140 182967024 184567574 184080251 183649722 185108723 186205135 186929592 185916456
3687 185916456 184473961 185088910 183596711 183335920 183418893 186454101 187719964 187282412 188239753
3678 188239753 189231425 188315291 189466067 190140125 190284010 190939915 192544790 193777812 191163831
3669 191163831 190136917 191352729 191716422 191280016 192125199 192632758 195723443 195516571 197347731
3660 197347731 196907822 197659717 196614659 196453357 197637259 198138823 198872197 200343050 201544077
3651 201544077 200849141 201419552 202053040 203382852 204073940 204171325 205583661 205012220 205799889
3642 205799889 204762690 205337514 206386583 206658254 208451216 208362339 209473784 209570598 209741405
3633 209741405 210027696 209747956 209333703 210416962 211620395 213152544 213678162 213640760 214384665
3624B14384665j311737R0497K108529Q30233j317226k60712J814244o31417Q14576
3615B16521652L397638j341816k511961R92185K0703o10470J034449p72468j206770
3606B15523142K642547L06452k450310p71976J158271M64364j904300K54047J851139
3597B17073376J6203q01493R71056L62164O16143k010756j479370O92591J30719
3588B15570633J219195J0679j116011K2449p28596j286463j101543j315102M37014
3579B11712255j80302J273163N85708l073061l095573J222555k40446j689726
3571B06514573J434405j445639j767518L023O56204k793845k373540k29206m13656
3562A99584801k97479j178418q27255m11382O5970p69017k815654p21708p2365
$$ plain form
3624 214384665 213072928 213163425 215271954 216102187 214784961 214524249 216338493 215707076 216521652
3615 216521652 219919290 218577474 216065513 217057698 217078401 216467931 217502380 216729912 215523142
3606 215523142 218165689 218472141 216021831 215249855 216408126 216872490 214968190 215222237 217073376
3597 217073376 217089579 216288086 217259142 217621306 218237449 216226693 214747323 215439914 215570633
3588 215570633 216789828 216800507 215684496 215706945 214978349 213691886 212590343 211275241 211712255
3579 211712255 211531953 212805116 213390824 210317763 207222190 208444745 208204299 206514573
3571 206514573 207948978 206503339 204735821 204738844 205395048 202601203 200227663 199998457 199584801
3562 199584801 199287322 198108904 197281649 196870267 196936237 196167220 193351566 192629858 192557493
3553A92557493k322532o03415k543581j08622j221706n99547j429610k149028
3545A81579452K8146M5968j353918l396949k13050o39876m078769j016185M00406
3536A71355225P09643j150403o82420k42698k312807j455522j582608J5965r44567
3527A63709808k372814j363386J005674P6607k586591j358051j849522j267973
3519A53993752k820585j546220j633834l87541L19721j419664j016948j436723
3511A44051958k338895q81726k579120l124002K792012q90842j958300l74181
3503A34696904J90966k731351l116966J517297j827927j358856k745980o88187
3495A23935900o50117j420740m24410k653785J325120J4445j949466l395867M86182
$$ plain form
3553 192557493 190234961 189631546 187087965 186979343 185757637 185158090 183728480 181579452
3545 181579452 181607598 181653566 180299648 176902699 176689649 176049773 171971004 170954819 171355225
3536 171355225 172064868 170914465 170232045 169989347 167676540 166221018 164638410 164654375 163709808
3527 163709808 161336994 159973608 160979282 161055889 158469298 157111247 155261725 153993752
3519 153993752 151173167 149626947 147993113 147605572 147925293 146505629 145488681 144051958
3511 144051958 141713063 140831337 138252217 135128215 137920227 137029385 135071085 134696904
3503 134696904 134887870 132156519 129039553 130556850 128728923 127370067 124624087 123935900
3495 123935900 123285783 121865043 121440633 118786848 120111968 120126413 118176947 114781080 115267262
3486A15267262j537084j384665l715527k102432J082085p49897j968846J693099
3478A06583995j590303j402811k184255j262313K42872k63246j170444k66765
3470I8686730m68358j805996j496298k050697J737104P3563j558313p03941k936636
3461H9477158k790271k85581k065595Q24562j104782r03705k269715J89574K87215
3452H1358860M84019k900843r60307P63724P6731j820150J43319k792179m23622
3443G3929552P92225j613059j653842O3589k93002k190516j672136J035348N80058
3434F8978217j762458r7546n54767j307403j484692j776396p5186J638440k033103
3425F1525106o32997Q23708j002148l548527J08470J063360p74618J90513J62800
$$ plain form
3486 115267262 113730178 112345513 108629986 106527554 107609639 106859742 104890896 106583995
3478 106583995 104993692 103590881 101406626 100144313 100387185 100123939 98953495 98686730
3470 98686730 98218372 96412376 94916078 92865381 94602485 94676048 93117735 92413794 89477158
3461 89477158 86686887 86401306 84335711 85160273 84055491 83151786 80882071 81071645 81358860
3452 81358860 81842879 78942036 77981729 78745453 78822184 77002034 77145353 74353174 73929552
3443 73929552 74721777 73108718 71454876 71518465 71225463 69034947 67362811 68398159 68978217
3434 68978217 67215759 67118213 66563446 65256043 63771351 61994955 61919769 63558209 61525106
3425 61525106 60892109 61715817 60713669 57165142 57273612 58336972 57562354 57752867 57915667
3416E7915667q68664j002494m52429j054170p75180N27905l304202k413749J797421
3407E0370105J780005k139536L88712r94192j158291j60427k190704p6847r89771
3398D4829054J136947K429639j726506l41671j17572p44132k583705p58960j97287
3389D1925807J11472J926421q86612l568071J203566Q88082j231804p30928J95763
3380C9833696j003832N82289j964022N16865J5939J000884j229283o78977O06911
3371C7680470n41157o51921P36109j331524j154680j66192k003959P37247O0547
3362C3364940m25523j889532Q03653n1578J98909j956505J768665J613124j787324
3353C1638829j715428M42660K081411p82555j089703j296500k878783K834702
$$ plain form
3416 57915667 57047003 56044509 55592080 54537910 53762730 54290635 50986433 48572684 50370105
3407 50370105 52150110 50010574 50399286 49405094 48246803 48086376 45895672 45818825 44829054
3398 44829054 45966001 48395640 46669134 46327463 46209891 45465759 42882054 42123094 41925807
3389 41925807 42037279 43963700 43077088 39509017 40712583 41600665 40368861 39637933 39833696
3380 39833696 38829864 39412153 37448131 37964996 37980935 38981819 37752536 37073559 37680470
3371 37680470 37139313 36487392 37223501 35891977 34737297 34571105 32567146 33304393 33364940
3362 33364940 32939417 31049885 31853538 31801960 32000869 30044364 31813029 33426153 31638829
3353 31638829 29923401 30366061 32447472 31664917 30575214 29278714 26399931 29234633
3345B9234633J18623o33723o19100q19676n62886J862401K041678j597551k027398
3336B6997001p46891L20274J044893n70689p73949J649926j922028k477308K134751
3327B5655980L57881l432219p248J82305n20692J394822K79092N40190k277595
3318B2172516J296327K63810J083311j664510J204938j0755O96209r7625k383218
3309B2561003R09373O19929K46775j786486q39868j168994J843646N08041j766967
3300B1126452J89252j864416m69817K221259j193222r22928N56531N64848O99302
3291B0907261j52889L33555j832877n04201j64286K74606M59306n90092m35483
3282A8294900k12884j68325o08964j393326O99665K262391j429926J663149K08646
$$ plain form
3345 29234633 29353256 28719533 28100433 27280757 26717871 28580272 30621950 29024399 26997001
3336 26997001 26250110 26570384 27615277 27044588 26270639 27920565 25998537 23521229 25655980
3327 25655980 26013861 22581642 22574394 22756699 22236007 23630829 23909921 24450111 22172516
3318 22172516 23468843 23732653 24815964 23151454 24356392 24345637 25041846 24944221 22561003
3309 22561003 23470376 24090305 24337080 22550594 21710726 20541732 22385378 22893419 21126452
3300 21126452 21315704 19451288 18981471 21202730 20009508 19086580 19643111 20207959 20907261
3291 20907261 20754372 21087927 19255050 18750849 18586563 18861169 19320475 18730383 18294900
3282 18294900 18082016 17913691 17304727 15911401 16611066 18873457 17443531 19106680 19315326
3273A9315326J126083Q27871q3917k208363j319155K10980J324453l97448l137093
3264A5658737J47789Q65094p00694l08397O73003Q46056o44353J134595p43191
3255A6928639o57214r70388L5396J294965j90648n63884n81070l85117L06647
3246A5217326L109601L69125j735153O16146j349117M3495j517754J77084j407008
3237A3523745o76907N52161J376967j966942n20254J00646J46335q2981J363868
3228A3816638j285557J299486J371584k052532L28633N80254J015955j146638
3220A3927823M63226o42853l57835R94078m56747o45117K349437j020514N49237
3211A5160735l10951l011931j626000J445963k121574J720956K88362K005145
$$ plain form
3273 19315326 20441409 21269280 21185363 18977000 17657845 17868825 19193278 18795830 15658737
3264 15658737 15806526 16671620 15970926 15662529 16335532 17181588 16537235 17671830 16928639
3255 16928639 16271425 15301037 15336433 16631398 16440750 15876866 15295796 14910679 15217326
3246 15217326 18326927 18696052 16960899 17577045 16227928 16271423 14753669 14930753 13523745
3237 13523745 12846838 13398999 14775966 12809024 12288770 12389416 12535751 12452770 13816638
3228 13816638 12531081 13830567 15202151 13149619 13478252 14058506 15074461 13927823
3220 13927823 14391049 13748196 13390361 14384439 13927692 13282575 15632012 14611498 15160735
3211 15160735 14849784 11837853 10211853 11657816 9536242 11257198 11545560 13550705
3203A3550705L14190j363652R88515j560362k70905M97533m26962R57028Q74259
3194A3560349j304536l45425J299412P60585j360362j567904j177980N20014N20907
3185A0905060m39236j435080o96620K453911N10451R14575o84765r53052M92453
3176A1067697M19060J365654r70047m96855L14686q65737J253846L65804l97436
3167A2056672R75329K33864l437133J56396m94314k71260J288100k79998j392061
3158H835595m79501J538420J788004J66723j361945k227075k937430J790074J913487
3149I026352K83438j68227k183501P95878j69396q84166j8708O05612P28023L016
3139H018321J032891o81336q39422j136652Q7037K55121K36279P47040J675936
$$ plain form
3203 13550705 13864895 12501243 13489758 11929396 11658491 12156024 11729062 12686090 13560349
3194 13560349 12255813 11910388 13209800 13970385 12610023 11042119 9864139 10384153 10905060
3185 10905060 10465824 9030744 8334124 10788035 11298486 12213061 11528296 10575244 11067697
3176 11067697 11486757 12852411 11882364 11385509 11700195 10834458 12088304 12454108 12056672
3167 12056672 13032001 13265865 9828732 9985128 9490814 9219554 10507654 10227656 8835595
3158 8835595 8356094 9894514 11682518 11849241 10487296 8260221 5322791 7112865 9026352
3149 9026352 9309790 9141563 6958062 7753940 7584544 6700378 6681670 7287282 8015305 8018321
3139 8018321 9051212 8369876 7530454 6393802 6480839 6735960 6972239 7719279 9395215
3130I395215J206494n90288k279482j589971O40394J077985k227986j438878K00402
3121D393885L43016k53490l88492M62060L736063l73887P12594Q32758j291367
3112H173140k191223o83798q10952l74125J815268P24275j233715O90813L81331
3103F491014l06414j525641K30413J957045j110k095608m10580P64789J333512
3094F437420O50515n37454j136357N92534Q18912N71501r68648j156356N71112
3085E843179R24545j312067j005681J591585j453293J380589j158986O62613j077866
3076D394618l54629n20504r98046J66312M37915R46171J057784J421882O23089
3067G174592n02161r69264j159994J157714R34779m30999J52831j736826j940320
$$ plain form
3130 9395215 10601709 10011421 7731939 6141968 6782362 7860347 5632361 4193483 4393885
3121 4393885 4736901 4483411 4094919 4556979 8293042 7919155 8631749 9464507 8173140
3112 8173140 5981917 5298119 4487167 4113042 5928310 6652585 5418870 6109683 6491014
3103 6491014 6184600 4658959 4889372 6846417 6845307 4749699 4339119 5103908 6437420
3094 6437420 7087935 6550481 5414124 6006658 6825570 7397071 6428423 5272067 5843179
3085 5843179 6767724 5455657 4449976 6041561 4588268 5968857 4809871 5472484 4394618
3076 4394618 4039989 3519485 2521439 2687751 3125666 4071837 5129621 6551503 7174592
3067 7174592 6672431 5703167 4543173 5700887 6635666 6204667 6357498 4620672 2680352
3058B680352J427829J270913j375450r6144r98845l19213J467864j542415N39803
3049C054694q30530Q5338J531058J220482N34670j481014J079242p13953q83490
3040C596497O74675k213372p53526J362585J176701j36979J88980j458763j297623
3031A139175K607244k95249r85592J408999L83364l7873N30787j445629R06552
3022D211778K73699j171264J57903p79826Q2266j671491j168712L268604P99219
3013D002176j888031O44515j264627J428225L61864m27991q35342l35238J566842
3004C252393P4934J24338O21355k315646p61738P54280K038500M305694k050368
2995F043742k405574L75432j455132l7596P92847K144418j514039j040473K138209
$$ plain form
3058 2680352 4108181 5379094 4003644 3907500 2908655 2589442 4057306 2514891 3054694
3049 3054694 2224164 2309502 3840560 5061042 5595712 4114698 5193940 4479987 3596497
3040 3596497 4271172 2057800 1304274 2666859 3843560 3706581 3895561 2436798 1139175
3031 1139175 3746419 3451170 2465578 3874577 4257941 4220068 4750855 3305226 4211778
3022 4211778 4485477 3314213 3472116 2692290 2774556 1103065 -65647 3202957 4002176
3013 4002176 2114145 2758660 1494033 2922258 3284122 2856131 2020789 1685551 3252393
3004 3252393 3327327 3451665 4073020 1757374 995636 1749916 3788416 8094110 6043742
2995 6043742 3638168 4013600 2558468 2520872 3313719 5458137 3944098 2903625 5041834
2986E041834j43735j870722m98264N76940J78287J193081j832870K20022k086216
2977G78357j601462o80115K194151M45602j624117n49834j17147O11037M89327
2968e4201L54994J290533j391560J498020o13127j225239K461249R95750j319649
2959A996770m83052N50513p52633P23867J455196r10581j502223j597714L25952
2950a93905Q81614o92381J214121J364926k35331o72341n14358M88316R85627
2941B626288m32299J53421j120982K484057J062878l079253j80356M91390l62892
2932A642252K67514k65066K1529k97852R22369J13512q82727Q18806j185276j389917
2922b34856l37707Q24691k08039J631844j76760j009136J986843R82829j109146
$$ plain form
2986 5041834 4898099 3027377 2529113 3106053 3284340 4477421 2644551 2864573 778357
2977 778357 -823105 -1503220 690931 1136533 -487584 -1037418 -1154565 -543528 -54201
2968 -54201 300793 1591326 199766 1697786 1084659 -140580 2320669 3316419 1996770
2959 1996770 1513718 2064231 1311598 2035465 3490661 2580080 1077857 -519857 -193905
2950 -193905 687709 -4672 1209449 2574375 2339044 1666703 1152345 1640661 2626288
2941 2626288 2193989 2347410 1226428 3710485 4773363 1694110 1513754 2005144 1642252
2932 1642252 1909766 1644700 1666229 1368377 2290746 2404258 1521531 2340337 1155061 -234856
2922 -234856 -572563 252128 44089 1675933 1499173 490037 2476880 3459709 2350563
2913B350563q76548P4551L70640J13706r71408j140298j236836P78007R37050
2904C99427J47570R06017r59117j902039K211677q2919l78809q84018L16722q4710
2894c10199n65012k16390R85207l86654J951591O86906Q2700j30340j88378L14408
2884B223839o76209M0177j980165k628135J483624J110973j060121L24185j057589
2875b219421m67925J815891L58843n39536J826439J916680o52955k034855l82446
2866c79285q04781O36504j506213Q90040R32139o34122q40365J102638j098108
2857a701553j174104J673065P27188O25276M56171K068904k33585j650575j087584
2848b96797j889585J460258k4064m16067R84343K119045j228197p98589N93547
$$ plain form
2913 2350563 1474015 1548566 1919206 2032912 1061504 -78794 -1315630 -537623 399427
2904 399427 546997 1453014 493897 -1408142 803535 720616 341807 -542211 -225489 -310199
2894 -310199 -875211 -1091601 -106394 -493048 1458543 2145449 2228149 2097809 1909431 2223839
2884 2223839 1547630 1587807 -392358 -3020493 -1536869 -425896 -1486017 -1161832 -2219421
2875 -2219421 -2687346 -871455 -512612 -1052148 774291 2690971 2038016 3161 -379285
2866 -379285 -1184066 -547562 -2053775 -1163735 -231596 -865718 -1706083 -603445 -1701553
2857 -1701553 -2875657 -1202592 -475404 149872 606043 2674947 2441362 790787 -296797
2848 -296797 -2186382 -726124 -750188 -1166255 -181912 1937133 708936 -89653 503894
2839E03894q87542o82036K10086K56485P73449J091534O13349l507155j106271
2830b734207J634295L32695J320965p75666k76631P25733o80448l75012J476644
2821F48368q86654J251864j452083O08828J709061O62197k513824l31366j258553
2812a562162q67262J656998N44767O14874j943949n18596j1787R79463m37889
2803a545543j01347L30470q50579m58207R88512L143429j652889m05019j341066
2794a892239l69131P24521M77286k371414K82109K254364q95280J164935j817305
2785b442154P53964J156698j251812j122694J775454L116399k857010k05966n28207
2776a605328j847160L105716J068073r11341j841773j903055L90072J591298K282281
$$ plain form
2839 503894 -383648 -1065684 -855598 -599113 174336 1265870 1879219 -1627936 -2734207
2830 -2734207 -1099912 -767217 553748 -221918 -498549 227184 -453264 -828276 648368
2821 648368 -238286 1013578 -438505 170323 1879384 2541581 27757 -303609 -1562162
2812 -1562162 -2429424 -772426 -227659 387215 -1556734 -2075330 -2087117 -1107654 -1545543
2803 -1545543 -1646890 -1316420 -2166999 -2625206 -1636694 1506735 -146154 -551173 -1892239
2794 -1892239 -2261370 -1536849 -1059563 -3430977 -3148868 -894504 -1789784 -624849 -2442154
2785 -2442154 -1688190 -531492 -1783304 -2905998 -1130544 1985855 -871155 -1077121 -1605328
2776 -1605328 -3452488 -346772 721301 -190040 -2031813 -3934868 -3544796 -1953498 328783
2767C28783k78283k791378j85425J149060R87969j402642J070007J447495Q50421
2758A176007j738017J101845j196364K8605l22468j786988J755831j65306j964187
2749c111042k257314L211250j089032j753804J524555J325813M84134j241126
2741b906566J76932L37854R19369k82620j306826J064588J359094l81153j492408
2732b511736m30963l42759O10039j616546P05641K030810k12858j371272M16774
2723b722870J392749j8270n76891R6478J064384j903409J825145k279114p27712
2714c849510K406252N65674p59032L6645m81393J476871j448031q16312L24112
2705b544724J551483Q0995j332237M1529R3302K325988k143513M23435L78083
$$ plain form
2767 328783 50500 -2740878 -2926303 -1777243 -789274 -2191916 -1121909 325586 1176007
2758 1176007 -562010 539835 -656529 -627924 -950392 -2737380 -981549 -1146855 -3111042
2749 -3111042 -5368356 -2157106 -3246138 -4999942 -3475387 -2149574 -1665440 -2906566
2741 -2906566 -2729634 -2391780 -1472411 -1755031 -3061857 -1997269 -638175 -1019328 -2511736
2732 -2511736 -2942699 -3285458 -2675419 -4291965 -3586324 -1555514 -1768372 -3139644 -2722870
2723 -2722870 -1330121 -1348391 -1925282 -1828804 -764420 -2667829 -842684 -3121798 -3849510
2714 -3849510 -1443258 -877584 -1636616 -1599971 -2081364 -604493 -2052524 -2868836 -2544724
2705 -2544724 -993241 -912246 -2244483 -2202954 -2109652 216336 -1927177 -1503742 -1125659
2696a125659j496025j585954J414228J890253q84229j72089J560222L84318l32765
2687c47700M12500N60899q95197j878768l35066P89204r07188M10728N70807J190523
2677d29258O53574k295814k27557m67851Q73945K57266J292344p77287j889389
2668c010027j617106j94981K467512J907470n00732n18699m79698J628388j81084
2659d98957k167754M08545N66397N8257L6842m3800M01697J484810k12919M5454
2649G8572j788698k53923N28258k13002j107947j292159J36755K622993j360563
2640b649714J113378R13150m54747l95535m03905J226085k92088k63473J41281
2631a065568j528013L12819J139156J624763K36676k132857p76633k01550J760645
$$ plain form
2696 -1125659 -2621684 -4207638 -2793410 -903157 -1787386 -1959475 -399253 -14935 -347700
2687 -347700 64800 625699 -269498 -2148266 -2483332 -1694128 -2601316 -2190588 -1619781 -429258
2677 -429258 224316 -2071498 -2299055 -2766906 -1892961 -1635695 -343351 -1120638 -3010027
2668 -3010027 -4627133 -4822114 -2354602 -447132 -947864 -1466563 -1946261 -317873 -498957
2659 -498957 -2666711 -2258166 -1691769 -1633512 -1596670 -1640470 -1238773 246037 33118 78572
2649 78572 -1710126 -1964049 -1435791 -1648793 -2756740 -4048899 -3912144 -1289151 -2649714
2640 -2649714 -1536336 -623186 -1077933 -1473468 -1877373 -651288 -943376 -1206849 -1065568
2631 -1065568 -2593581 -2280762 -1141606 483157 719833 -1413024 -2189657 -2391207 -630562
2622f30562k07170n65672K491218p86752j836870j68706q27576K16331K227092
2613h8667n85167J165429k83058N27943k996987N64690J039987k632181R8717
2604c189294N49493K23331M97978M54543q41275r5131J478062m18809m66353K78686
2594a528769j925506r7547P32222K395929p81554o11275j489332K269212M29213
2585f07407K6303r14799n55123N89238k77758J12347M52226p90491L05456P04348
2575i55660j699147P26744J686402L07354j725992j274450M47394L68696j33297
2566b251956j748566N54116n39481n71476P1272O58964K249J113014J449268q08382
2556b070978K529559L67695j432829j529750K7672q86054J342492J000128Q34241
$$ plain form
2622 -630562 -837732 -1403404 1087814 301062 -1535808 -1704514 -2532090 -2315759 -88667
2613 -88667 -673834 491595 208537 736480 -2260507 -1695817 -655830 -3288011 -3189294
2604 -3189294 -2639801 -2416470 -1918492 -1463949 -2305224 -2400355 -922293 -1341102 -1807455 -1528769
2594 -1528769 -3454275 -3551822 -2819600 -423671 -1205225 -1816500 -3305832 -1036620 -607407
2585 -607407 -581104 -1495903 -2051026 -1461788 -1739546 -1627199 -1174973 -1965464 -1660008 -955660
2575 -955660 -2654807 -1928063 -241661 65693 -1660299 -2934749 -2487355 -2118659 -2251956
2566 -2251956 -4000522 -3446406 -3985887 -4557363 -4486091 -3827127 -3824878 -2711864 -1262596 -2070978
2556 -2070978 458581 826276 -606553 -2136303 -2108631 -2994685 -1652193 -652065 182176
2547A82176o24862j171960J568963r76061k582854J058131j65761j826898q09640
2538e348766P2073L515707k66113K04751K04037J299103r14742J14193Q3419L8741
2528i97597o06220j476448k59032K63479J093635k03373J426251q71223j066748
2519b697276M17797r764k80963J610763q1339N49406K06234n05642Q8154K00277
2509e02353k055695J17755J128244q02039J80233m60196J081758r98924j180642
2500c491859J89235L298251P57158j060150r69744r44914o48608O28306M59702
2491a782623J379258j221012k138287R19669R70136J923461q0514j064008k54570
2482a348490N3808J618291j69498J06460r38119Q24899K98266j794858j80507
$$ plain form
2547 182176 -442686 -1614646 -45683 -1021744 -3604598 -2546467 -2712228 -4539126 -5348766
2538 -5348766 -5276693 -1760986 -2027099 -1822348 -1618311 -319208 -1233950 -1119757 -1036338 -997597
2528 -997597 -1603817 -3080265 -3339297 -3075818 -1982183 -2185556 -759305 -1630528 -2697276
2519 -2697276 -2279479 -2289243 -2570206 -959443 -1040782 -491376 -285142 -790784 -702630 -502353
2509 -502353 -2558048 -2440293 -1312049 -2114088 -1933855 -2394051 -1312293 -2311217 -3491859
2500 -3491859 -3302624 -4373 752785 -307365 -1277109 -2222023 -2870631 -2242325 -1782623
2491 -1782623 -403365 -1624377 -3762664 -2842995 -1872859 50602 -29912 -1093920 -1348490
2482 -1348490 -1294682 323609 154111 260571 -677548 147351 445617 -1349241 -1529748
2473a529748L72189K39705K05211o14366P1314m65300n88062j254369j192537
2464d755963J534947l07617Q11058j470140K755100N68846J215038m07304m94611
2455e50646J931177n59625k879812J76043k300486J017502J174581K86493J284651
2446d20122j252393J77998j677720K726852J969383l205773J085589J58574o02348
2437a039960K51407l68999N83366K14537p32434j567901J772543L05077M55745
2428a26619j390496l00714L290931l64205j794755j094729j02157m12125n05460
2419b800329K30784n81073o2006l09679K150033J149368Q08103j037196m62191
2410i14186j489762q89062J274710j700551j13104M83806K090834R51397j928304
$$ plain form
2473 -1529748 -1157559 -917854 -712643 -1327009 -1255695 -1720995 -2309057 -3563426 -4755963
2464 -4755963 -3221016 -3528633 -2717575 -4187715 -1432615 -863769 351269 -56035 -550646
2455 -550646 1380531 820906 -2058906 -1882863 -4183349 -3165847 -1991266 -1704773 -420122
2446 -420122 -1672515 -1494517 -3172237 -445385 1523998 -1681775 -596186 -437612 -1039960
2437 -1039960 -788553 -1157552 -574186 -359649 -1092083 -2659984 -887441 -582364 -126619
2428 -126619 -1517115 -1817829 1473102 1108897 -685858 -1780587 -1882744 -2294869 -2800329
2419 -2800329 -2569545 -3150618 -3212624 -3522303 -1372270 -222902 585201 -451995 -914186
2410 -914186 -2403948 -3293010 -2018300 -3718851 -3831955 -3348149 -1257315 -305918 -2234222
2401b234222J159354l05844j490352K8744L799956r31740k353212j352902J667313
2392b012905J178242k266504J75849k65941J632174o22122l20547J256713m11051
2383a656092n01451M9101m58344O75334J296272q98945m67628Q38750k70496m59253
2373a852752j178731m47382O0389J847185J34772j041472O06872j85811N83259
2364a473671J92572l01690M03412p69174L04371Q66407J069215Q05083l7365j026820
2354C2340Q54704l68554j021500Q28905j63739p0117p55176j443142K073705m91253
2344e23827p14627n05389P49419k349338J814357J571015j44802J082177j524128
2335e45143O92283K290783k85863j015646R11632K5615n54020j840630K30035
$$ plain form
2401 -2234222 -1074868 -1380712 -2871064 -2842320 957636 25896 -2327316 -3680218 -2012905
2392 -2012905 -834663 -3101167 -2925318 -3191259 -1559085 -2181207 -2501754 -1245041 -1656092
2383 -1656092 -2157543 -2108442 -2566786 -1891452 -595180 -1494125 -1961753 -1123003 -1393499 -1852752
2373 -1852752 -3031483 -3478865 -3418476 -1571291 -1436519 -2477991 -1871119 -2056930 -1473671
2364 -1473671 -1281099 -1582789 -1179377 -1948551 -1644180 -777773 291442 1096525 1059160 32340
2354 32340 887044 518490 -503010 325895 162156 92039 -663137 -2106279 -32574 -523827
2344 -523827 -1238454 -1743843 -994424 -3343762 -1529405 41610 -103192 978985 -545143
2335 -545143 147140 2437923 2152060 1136414 2048046 2073661 1519641 -320989 -90954
2326i0954R03246M40348j049378j8699r32212J0650k719224J502729J287053J329526
2316F63085J29726j451535J338547l57830K98595P68076r05665K585867o24750
2307B444116j166537j518572j166265K00379P79039J305642J106444P95532j829471
2298I50307j175161J12751J22198L91798K07034j214796J47391K442664M72788
2289B456974j712379r00350J232015k90599J104231K65232m83881O56615k217359
2280A10499j794151K591540R10869p71803q96313O3125J206413j022769R13223
2271A310633j60697J040307j154536J055446l3535k139991R10819N90851q1180
2262A338117m791l01029j114026J748892o00744j639277J356776o18362P21003
$$ plain form
2326 -90954 812292 1252640 203262 184563 -747649 -736999 -3456223 -1953494 -666441 663085
2316 663085 792811 -658724 679823 321993 620588 1388664 482999 3068866 2444116
2307 2444116 1277579 -240993 -1407258 -1206879 -427840 877802 1984246 2779778 950307
2298 950307 -224854 -112103 10095 401893 608927 -605869 -458478 1984186 2456974
2289 2456974 744595 -155755 1076260 785661 1889892 2155124 1671243 2327858 110499
2280 110499 -1683652 907888 1818757 1046954 150641 213766 1420179 397410 1310633
2271 1310633 1149936 2190243 1035707 2091153 2057618 -82373 828446 1419297 1338117
2262 1338117 1333326 1032297 -81729 1667163 1066419 -572858 783918 165556 886559
2253H86559M25331K17643J883861l12438j048299P17042j06466K28320J13600
2244C005153j079300O26615O96078j434754r90747n55789Q71526N91832m49834
2235A280780P21189L51033k043094n8358K076923J596119m26989l09575j186615
2226B001413J002563j042399p62710J933472O14131J447409l6827m29224L65952
2217E093780k19092Q64103N95133P29168k924757j867433o83864n70159J81758
2208A198637O52874J461994j121735J784330J31570N50585O37369l96233J235106
2199F134497r58543M53500O13842j513475p62821N95936p9035Q69932J482300
2190F836133K08350P32961j117147r65345n40295J405690k63199L56009j822886
$$ plain form
2253 886559 1311890 1529533 3413394 3100956 2052657 2769699 2663233 2891553 3005153
2244 3005153 1925853 2552468 3248546 1813792 823045 267256 1138782 1730614 1280780
2235 1280780 2001969 2353002 309908 251550 2328473 3924592 3497603 3188028 2001413
2226 2001413 3003976 1961577 1198867 3132339 3746470 5193879 5157052 4727828 5093780
2217 5093780 4874688 5738791 6333924 7063092 4138335 2270902 1587038 1016879 1198637
2208 1198637 1851511 3313505 2191770 3976100 4107670 4658255 5295624 4899391 6134497
2199 6134497 5175954 5629454 6243296 4729821 3967000 4562936 4483901 5353833 6836133
2190 6836133 7044483 7777444 6660297 5694952 5154657 6560347 6297148 6653157 4830271
2181D830271j389323J748062P10296M63086J113661M68200j85541Q3242n13235
2172G328719J86908N43762N61998k123602p2783J119104j005968J833923j744666
2163F627395J064496J702253j07821j982335J01376M37546l38500K13416j278822
2154F439004J031703J02785J114671j27633j516372o18715J800110k37261J151294
2145I139586r26035n59128J300940J267206q84086j240638j113506K63701r62342
2136F285698P65569J976122J67389j595123q34321K29211p54297r96918J191089
2127F434419J654385N58829P60202K50101Q42139N3445k639575m62289Q72544
2118H324200p7748M58707p78242M72454J219273K47385k22188N72140k089358
$$ plain form
2181 4830271 3440948 5189010 5899306 6362392 7476053 7944253 7758712 7841954 7328719
2172 7328719 7515627 8059389 8621387 6497785 6425002 7544106 6538138 8372061 6627395
2163 6627395 7691891 9394144 9286323 7303988 7405364 7842910 7504410 7717826 6439004
2154 6439004 7470707 7573492 8688163 8560530 7044158 6425443 8225553 7988292 9139586
2145 9139586 8213551 7654423 8955363 10222569 9338483 8097845 6984339 7248040 6285698
2136 6285698 7051267 9027389 9194778 7599655 6765334 6994545 6240248 5243330 6434419
2127 6434419 8088804 8647633 9407835 9657936 10500075 10553520 7913945 7451656 8324200
2118 8324200 8246452 8705159 7926917 8399371 9618644 9866029 9643841 10215981 8126623
2109H126623j27858p51083K05075J143790n25763J02180m36290l93819J420219
2100H763074j402368J080068r14853O68464j762782O26040K458029K10607k129880
2091G596399n65446k60822l03263R08982J214358K14113k02435K52116o81981
2082H172021k200348P85037q28150J014631l48802n73029J066894j836694L8541
2073E290101J394388J10429k322215L2872j828839J767927J250324r5165r8062
2064E501760J90207m49509p90775j586638q25103P33299L473848p2983q44933
2055E329173o03834J401076q2007r16390j568281j377434J001992J277031j410692
2046C050634q17150p89268K436235p54598M75020k75624R17598j361971l36845
$$ plain form
2109 8126623 7998765 7247682 7452757 8596547 8070784 8172964 7736674 7342855 8763074
2100 8763074 7360706 8440774 7525921 8194385 6431603 7057643 9515672 9726279 7596399
2091 7596399 7030953 6770131 6466868 7375850 8590208 8804321 8601886 8854002 8172021
2082 8172021 5971673 6756710 5928560 6943191 6594389 6021360 7088254 5251560 5290101
2073 5290101 6684489 6794918 4472703 4505575 2676736 4444663 5694987 5599822 5501760
2064 5501760 5691967 5242458 4451683 2865045 2039942 2773241 6247089 6174106 5329173
2055 5329173 4725339 6126415 6044408 5128018 3559737 2182303 3184295 4461326 3050634
2046 3050634 2233484 1444216 3880451 3125853 3600873 3325249 4242847 2880876 2544031
2037B544031P13783j17238J724603j898328J534597l54214L66058m69111p08971
2028C335210j00444k60436J26710j685355R00812J70261Q85820Q63227k647698
2019A588107q39405J347214J190181n86764j32318o56917r01696O86912M7990
2010A743304q52057L14106Q92114o31158J598157M73734k107696r19777n84456
2001g3729P04207J535390M64136q27546L26095J53682J63760r95226J320436n32056
1991B239149j222808p83529n56975O70849O43286J671603r72591L86415J173716
1982C249115r85710q66379k208463K36135J146949j62704K82492J938762q46200
1973A783997j421163L28140J786417q74736m98223j602644O8561j161987K267920
$$ plain form
2037 2544031 3257814 3140576 4865179 2966851 4501448 4147234 4513292 4044181 3335210
2028 3335210 3234766 2974330 3101040 1415685 2316497 2486758 3372578 4235805 1588107
2019 1588107 748702 2095916 3286097 2699333 2567015 1910098 1008402 1695314 1743304
2010 1743304 891247 1205353 2097467 1466309 3064466 3538200 1430504 510727 -73729
2001 -73729 630478 2165868 2630004 1802458 2128553 2282235 2445995 1450769 2771205 2239149
1991 2239149 1016341 232812 -324163 346686 989972 2661575 1688984 2075399 3249115
1982 3249115 2263405 1397026 -811437 -575302 571647 408943 691435 2630197 1783997
1973 1783997 362834 690974 2477391 1602655 1104432 -498212 -429651 -1591638 676282
1964F76282J474479L33384l84353O11961j67126j181535j00127j074777L06765
1955D94953P20752M25439N60121o05259j640602J165407k5527N17154K99999j142745
1945G69692m79579r24337n07784k75111J687849J319422K98050Q7520j090782
1936H84940p36089L6229K168255j849647j053532J206977j57960j704876p84119
1927a989822J514345o89338Q20095o6765P73401m230j832681N50953j107567J318237
1917g13372j972472J26956j37253P03230K06967K778451O99271k21741L78306
1908A848343N28856j095716l021825j189795J371020K281560q46886K20867N52792
1899F49216K622559r79839l688718J816462M65123J202999k86561p86484j108361
$$ plain form
1964 676282 2150761 2484145 2099792 2711753 2544627 1363092 1262965 188188 494953
1955 494953 1215705 1641144 2201265 1596006 -44596 1120811 1095284 1612438 1912437 769692
1945 769692 290113 -634224 -1142008 -1417119 270730 1590152 1888202 1975722 884940
1936 884940 148851 185080 2353335 503688 -549844 657133 499173 -1205703 -1989822
1927 -1989822 -475477 -1164815 -344720 -411485 361916 357686 -1474995 -924042 -2031609 -713372
1917 -713372 -2685844 -2558888 -2696141 -1992911 -1785944 992507 1691778 1470037 1848343
1908 1848343 2377199 1281483 -1740342 -2930137 -1559117 722443 -124443 96424 649216
1899 649216 3271775 2291936 -1396782 419680 884803 2087802 1801241 1014757 -93604
1890i3604R55553o57932n42390m56789R52414j254256p52516J481097p06356N49464
1880e25315j202946j452226J469286K178696o85413O85720L40344J203826m03629
1871A608343p00330k135198j386022N34785J855495M03806L85326J83905L21403
1862A071513L37895J266302q09691q09243m46180k237724q24162J966729K67579
1853b16982l66932j273703j063083R70416q58413J080022K197267j655609P51787
1844d35230J01923r40066Q10136J036598K14691j948264j737556J061233M28673
1835a407862K017913j160612l83193N87645j71993j034533m24381O20867q7500
1826a443649N29376j819969P01773P09374J777147k8749j168514o8947o62115
$$ plain form
1890 -93604 861949 204017 -338373 -795162 157252 -1097004 -1849520 -368423 -1074779 -525315
1880 -525315 -1728261 -3180487 -1711201 467495 -217918 467802 808146 2011972 1608343
1871 1608343 908013 -1227185 -2613207 -2078422 -222927 180879 566205 750110 1071513
1862 1071513 1409408 2675710 1866019 1056776 610596 -1627128 -2451290 -484561 -216982
1853 -216982 -583914 -1857617 -2920700 -1950284 -2808697 -1728675 468592 -1187017 -435230
1844 -435230 -333307 -1273373 -463237 573361 788052 -1160212 -2897768 -1836535 -1407862
1835 -1407862 610051 -550561 -933754 -346109 -518102 -1552635 -1977016 -1356149 -1443649
1826 -1443649 -914273 -2734242 -2032469 -1323095 454052 425303 -743211 -812158 -1474273
1817a474273j3715R34672O80635K4387K78103j958244K55036p54486M06229M25898
1807a195758q08575J351239Q20884J792565k73758r9955o91916k05672k61674
1798D27380K08908j059468P93799j456959N23978j582417J268743J276324l39025
1789F1263J32568m68460j490482p59031J734034l76161n82648J191059J481449
1780I23591l59054j154990j65327M76338j140078k8737m50770L00189J070748
1771e28090l62122n40858O71288o36761J23761J137894k49322m83856J335557
1762D67491j22872N71348P06031J49830j383810j839345O0576m14202R9191K314117
1752F08355j248600p69809P50480l01784M4638J446708l73731j218880J39957
$$ plain form
1817 -1474273 -1487988 -553316 127319 151706 429809 -1528435 -1273399 -2027885 -1621656 -1195758
1807 -1195758 -2004333 -653094 167790 1960355 1686597 1586642 894726 689054 427380
1798 427380 636288 -423180 370619 -1086340 -562362 -2144779 -876036 400288 61263
1789 61263 193831 -274629 -1765111 -2524142 -790108 -1166269 -1748917 -557858 923591
1780 923591 564537 -590453 -755780 -279442 -1419520 -1448257 -1899027 -1598838 -528090
1771 -528090 -890212 -1431070 -759782 -1396543 -1272782 -134888 -384210 -868066 467491
1762 467491 344619 915967 1621998 1771828 388018 -1451327 -1390751 -1804953 -1705762 608355
1752 608355 -640245 -1410054 -659574 -961358 -916720 529988 156257 -1062623 -922666
1743i22666p75596K32389n66463R30246k28867L48133O09647J175626k579573
1734a777124n33788L039259j834542q24258j163297K92502k96688J777093R91559
1725c29284j249706K11694J096741l85772J24904p02503L80150O09138J602366
1716A357728r88341k966002m82509N99763P72841O76850j1200p90081Q57693J341122
1706C67864J93026K63456k981211n1305J340017k11089q99205J65639Q37244J95532
1696g80032j035887K096157q09454j670085O52032j65635J56710p63194n24921
1687b844309r63799K209962j148725J494076K245768o66990j508806J453526j038588
1678g67885q55251K41405m41163n7260L88457m80922O92182m18612O61508J724406
$$ plain form
1743 -922666 -1698262 -1465873 -2032336 -1102090 -1330957 -982824 -373177 802449 -1777124
1734 -1777124 -2310912 728347 -1106195 -1930453 -3093750 -2801248 -3097936 -1320843 -329284
1725 -329284 -1578990 -1367296 -270555 -656327 -531423 -1233926 -853776 -244638 1357728
1716 1357728 369387 -2596615 -3079124 -2479361 -1706520 -1029670 -1040870 -1830951 -973258 367864
1706 367864 560890 824346 -2156865 -2208170 -868153 -1079242 -1978447 -1812808 -975564 -780032
1696 -780032 -1815919 280238 -529216 -2199301 -1547269 -1712904 -1556194 -2319388 -2844309
1687 -2844309 -3808108 -1598146 -2746871 -1252795 992973 325983 -1182823 270703 -767885
1678 -767885 -1623136 -1381731 -1822894 -1880154 -1491697 -1972619 -1280437 -1699049 -1037541 686865
1668F86865j163573O3544P87435k18043j121971R19966J409766o53621j930578
1659a220210j190673Q64802m56842Q46025n06021J770388N29625O58902p72688
1650E23308j822320M26189K330834j478266j76911J206728Q16832j155226l343102
1641b671934K748819q41108r13212J524436p5703M32651j735152l42772k27155
1632b101130l90070J233645Q54733l5840q04163Q04665K343052k525203m77023
1623a097334R72221r11088J283962k49635M66955L52713J008391j870357Q18721
1614G74549j95542q93868M52557j115763J41581j205692j84101J664823K094916
1605A533460K38315k600508j482421Q70556j769439K23740J468603l45085Q91560
$$ plain form
1668 686865 -476708 -413164 374271 156228 -965743 -45777 1363989 710368 -1220210
1659 -1220210 -2410883 -1546081 -2002923 -1156898 -1662919 107469 637094 1295996 523308
1650 523308 -1299012 -872823 1458011 -20255 -197166 1009562 1826394 671168 -2671934
1641 -2671934 76885 -764223 -1677435 -152999 -228702 203949 -1531203 -1873975 -2101130
1632 -2101130 -2491200 -1257555 -402822 -438662 -1242825 -438160 1904892 -620311 -1097334
1623 -1097334 -125113 -1036201 247761 -1874 465081 817794 1826185 -44172 774549
1614 774549 579007 -314861 137696 -978067 -836486 -2042178 -2226279 -561456 1533460
1605 1533460 1771775 -828733 -2311154 -1440598 -3210037 -2986297 -1517694 -1862779 -971219
1596i71219P27427k11829n56478j152712l5929K489543R33281r23471j649332
1587a350719Q13007k79153R59619p10887p09967k44494O24618J20616M93181k035933
1577b320112K71354J421435Q54097r09267p1067K107006j308217N2271j465460
1568a367960m28278m81650J00155J862561r95705j377166L95451m70669j236599
1559c999860p58913K50629J262901R16400L236377j359194m90172J694067J471259
1550B223494m98097O26063k111171J47174l94338j885592K67726j92401N46558
1541a270584p78009P78591l12138K36278K21903L72902o59925K41069J752535
1532E82622q38960J675853l243528q45607N70583K0934J417611O41324m08591
$$ plain form
1596 -971219 -243792 -455621 -1012099 -2164811 -2200740 288803 1222084 298613 -1350719
1587 -1350719 -537712 -816865 142754 -568133 -1278100 -1522594 -897976 -777360 -284179 -2320112
1577 -2320112 -2048758 -627323 226774 -682493 -753560 1353446 45229 97500 -1367960
1568 -1367960 -1796238 -2277888 -2177733 -315172 -1310877 -2688043 -2292592 -2763261 -3999860
1559 -3999860 -4758773 -4508144 -3245243 -2328843 907534 -451660 -941832 752235 2223494
1550 2223494 1725397 2351460 240289 387463 -6875 -1892467 -1624741 -1817142 -1270584
1541 -1270584 -2048593 -1270002 -1582140 -1345862 -1123959 -751057 -1410982 -1169913 582622
1532 582622 -256338 1419515 -1824013 -2669620 -2099037 -2078103 -660492 -19168 -427759
1523d27759q17764l15917j143704J818012Q71348m2137k695847J311457k36352
1514a678663p06755j344694K760811k6415O59299l61114J101206o3748j541930
1505a202003L84282K73209P07911j100925J806075p91114k725001J94291L22645
1496b130630R17779R77671j22671j954305J650180K721997j598987k090687q33529
1487b463182K939648j569880l55174J099981o28358O65138j882267R19834J522559
1478B48299j13756r51772j425158k19120J044386j36596o0616q44602k51773J544623
1468a166085L32045M53939p28391N96298O3725R7742K935535j022605j029488
1459E32715L48507k109159j732458J431361J758629J645445n41187k001083m22691
$$ plain form
1523 -427759 -1245523 -1561440 -2705144 -887132 -15784 -57921 -2753768 -1442311 -1678663
1514 -1678663 -2385418 -3730112 -969301 -995716 -336417 -697531 403675 339927 -1202003
1505 -1202003 -817721 -544512 163399 -937526 868549 77435 -2647566 -2453275 -2130630
1496 -2130630 -1212851 -235180 -357851 -2312156 -661976 2060021 461034 -1629653 -2463182
1487 -2463182 476466 -1093414 -1448588 -348607 -976965 -311827 -2194094 -1274260 248299
1478 248299 134543 -817229 -2242387 -2461507 -1417121 -1553717 -1614333 -2458935 -2710708 -1166085
1468 -1166085 -834040 -380101 -1108492 -512194 -448469 -350727 2584808 1562203 532715
1459 532715 881222 -1227937 -2960395 -1529034 229595 1875040 1333853 -667230 -1089921
$$ [...]
##END NTUPLES=NMR SPECTRUM
##END=
