##TITLE=1H_TG-2341-B42
 CDCl3
 8 sc, 
 14.1.2022
##JCAMPDX= 6.0         $$ Bruker NMR JCAMP-DX V2.0
##DATA TYPE= NMR SPECTRUM
##DATA CLASS= NTUPLES
##ORIGIN= UXNMR, Bruker Analytische Messtechnik GmbH
##OWNER= root
$$ XWIN-NMR		Version 3.5
$$ Fri Jan 14 14:08:04 2022 Russian Standard Time (UT+4h)  she@DPX200
##.OBSERVE FREQUENCY= 200.131346
##.OBSERVE NUCLEUS= ^1H
##.ACQUISITION MODE= SIMULTANEOUS
##.ACQUISITION SCHEME= undefined
##.AVERAGES= 8
##.DIGITISER RES= 18
##SPECTROMETER/DATA SYSTEM= spect
##.PULSE SEQUENCE= zg30
##.SOLVENT NAME= CDCl3
##.SHIFT REFERENCE= (INTERNAL, CDCl3, 0, 15.7149)
##AUDIT TRAIL= $$ (NUMBER, WHEN, WHO, WHERE, WHAT)
$$ ##TITLE= Audit trail, XWIN-NMR		Version 3.5
$$ ##JCAMPDX= 5.01
$$ ##ORIGIN= Bruker BioSpin GmbH
$$ ##OWNER= she
$$ F:/spectra/data/she/nmr/H-F/1/pdata/1/auditp.txt
$$ ##AUDIT TRAIL=  $$ (NUMBER, WHEN, WHO, WHERE, WHAT)
(   1,<2022-01-14 14:06:17.96 +0400>,<she>,<DPX200>,
      <created by zg, POWCHK disabled, PULCHK disabled
       configuration hash MD5:
       00 E9 B6 7A A2 85 ED C7 34 08 36 98 17 FE 4E 26
       data hash MD5: 16K
       BA 71 B0 A6 2C CB 9F 43 7F 58 85 2D 59 3B A5 8C>)
(   2,<2022-01-14 14:06:20.15 +0400>,<she>,<DPX200>,
      <Start of raw data processing
       efp BC_mod = 2 LB = 0.24 FT_mod = 6 PKNL = 1 PHC0 = -15787.83 PHC1 = 18.40079 SI = 16K 
       data hash MD5: 16K
       22 BB CA 0F 43 12 56 1E 60 73 FC 84 10 F8 A2 D4>)
(   3,<2022-01-14 14:07:11.04 +0400>,<she>,<DPX200>,
      <pk PHC0 = -80.61248 PHC1 = -5.400005 
       data hash MD5: 16K
       48 51 17 F2 AC 98 89 FB 31 6D EA A3 3B E9 28 A1>)
(   4,<2022-01-14 14:07:14.21 +0400>,<she>,<DPX200>,
      <abs ABSG = 5 
       data hash MD5: 16K
       AF F5 15 52 74 C2 9D 26 DE 4B 0E A9 08 35 9F A9>)
$$ ##END=
$$ 
$$ hash MD5
$$ A9 E5 31 6A 9A 25 71 52 A7 74 08 04 EA EF 09 D3
##$RELAX= 
##$RELAX= 
##$RELAX= 
##$RELAX= 
##$RELAX= 
##$RELAX= 
$$ Bruker specific parameters
$$ --------------------------
##$DU= <F:/spectra>
##$EXPNO= 1
##$NAME= <H-F>
##$PROCNO= 1
##$TYPE= <nmr>
##$USER= <she>
##$AMP= (0..31)
100 100 100 100 100 100 100 100 100 100 100 100 100 100 100 100 100 100 
100 100 100 100 100 100 100 100 100 100 100 100 100 100 
##$AQSEQ= 0
##$AQ_mod= 1
##$AUNM= <au_zg>
##$AUTOPOS= <>
##$BF1= 200.13
##$BF2= 200.13
##$BF3= 200.13
##$BF4= 200.13
##$BF5= 200.13
##$BF6= 200.13
##$BF7= 200.13
##$BF8= 200.13
##$BYTORDA= 1
##$CFDGTYP= 0
##$CFRGTYP= 5
##$CHEMSTR= <none>
##$CNST= (0..31)
1 1 145 1 1 1 1 1 1 1 1 1 1 1 1 1 1 1 1 1 1 1 1 1 1 1 1 1 1 1 1 1 
##$CPDPRG= <>
##$CPDPRG1= <>
##$CPDPRG2= <>
##$CPDPRG3= <>
##$CPDPRG4= <mlev>
##$CPDPRG5= <mlev>
##$CPDPRG6= <mlev>
##$CPDPRG7= <mlev>
##$CPDPRG8= <mlev>
##$CPDPRGB= <>
##$CPDPRGT= <>
##$D= (0..31)
0 1.2 0 0 0 0 0 0 0 0.06 0 0.03 0 0 0 0 0.0002 0 0 0 0 0 0 0 0 0 0 0 0 
0 0 0 
##$DATE= 1642154777
##$DBL= (0..7)
120 120 120 120 120 120 120 120 
##$DBP= (0..7)
150 150 150 150 150 150 150 150 
##$DBP07= 0
##$DBPNAM0= <>
##$DBPNAM1= <>
##$DBPNAM2= <>
##$DBPNAM3= <>
##$DBPNAM4= <>
$$ [...]
##$SUBNAM2= <"">
##$SUBNAM3= <"">
##$SUBNAM4= <"">
##$SUBNAM5= <"">
##$SUBNAM6= <"">
##$SUBNAM7= <"">
##$SUBNAM8= <"">
##$SUBNAM9= <"">
##$SW= 18.0517287032376
##$SWIBOX= (0..15)
0 0 2 0 0 0 0 0 0 0 0 0 0 0 0 0 
##$SW_h= 3612.71676300578
##$TD= 16384
##$TD0= 1
##$TE= 0
##$TE2= 300
##$TE3= 300
##$TEG= 300
##$TL= (0..7)
0 120 120 120 120 120 120 120 
##$TP= (0..7)
150 150 150 150 150 150 150 150 
##$TP07= 0
##$TPNAME0= <>
##$TPNAME1= <>
##$TPNAME2= <>
##$TPNAME3= <>
##$TPNAME4= <>
##$TPNAME5= <>
##$TPNAME6= <>
##$TPNAME7= <>
##$TPOAL= (0..7)
0.5 0.5 0.5 0.5 0.5 0.5 0.5 0.5 
##$TPOFFS= (0..7)
0 0 0 0 0 0 0 0 
##$TUNHIN= 0
##$TUNHOUT= 0
##$TUNXOUT= 0
##$USERA1= <user>
##$USERA2= <user>
##$USERA3= <user>
##$USERA4= <user>
##$USERA5= <user>
##$V9= 5
##$VALIST= <valist>
##$VCLIST= <CCCCCCCCCCCCCCC>
##$VD= 0
##$VDLIST= <DDDDDDDDDDDDDDD>
##$VPLIST= <PPPPPPPPPPPPPPP>
##$VTLIST= <TTTTTTTTTTTTTTT>
##$WBST= 1024
##$WBSW= 4
##$XGAIN= (0..3)
0 0 0 0 
##$XL= 0
##$YL= 0
##$YMAX_a= 83835
##$YMIN_a= -137622
##$ZGOPTNS= <>
##$ZL1= 120
##$ZL2= 120
##$ZL3= 120
##$ZL4= 120
##$ABSF1= 15.71714
##$ABSF2= -2.334709
##$ABSG= 5
##$ABSL= 3
##$ALPHA= 0
##$AQORDER= 0
##$ASSFAC= 0
##$ASSFACI= 0
##$ASSFACX= 0
##$ASSWID= 0
##$AUNMP= <proc_1d>
##$AZFE= 0.1
##$AZFW= 0.1
##$BCFW= 0
##$BC_mod= 2
##$BYTORDP= 0
##$COROFFS= 0
##$CY= -3
##$DATMOD= 1
##$DC= 0
##$DFILT= <>
##$DTYPP= 0
##$F1P= 0
##$F2P= 0
##$FCOR= 1
##$FTSIZE= 16384
##$FT_mod= 6
##$GAMMA= 0
##$GB= 0
##$INTBC= 1
##$INTSCL= 0
##$ISEN= 128
##$LB= 0.24
##$LEV0= 0
##$LPBIN= 0
##$MAXI= 10000
##$MC2= 0
##$MEAN= 0
##$ME_mod= 0
##$MI= 1.114404
##$NCOEF= 0
##$NC_proc= -9
##$NLEV= 6
##$NOISF1= 3.799351
##$NOISF2= 2.8
##$NSP= 0
##$NTH_PI= 0
##$NZP= 0
##$OFFSET= 15.71494
##$PC= 1
##$PHC0= -15868.44
##$PHC1= 13.00078
##$PH_mod= 1
##$PKNL= yes
##$PPARMOD= 0
##$PSCAL= 0
##$PSIGN= 0
##$REVERSE= no
##$SF= 200.130007328614
##$SI= 16384
##$SIGF1= 3
##$SIGF2= 2
##$SINO= 5.538805
##$SIOLD= 16384
##$SREGLST= <1H.CDCl3>
##$SSB= 0
##$STSI= 16384
##$STSR= 0
##$SW_p= 3612.71676300578
##$SYMM= 0
##$S_DEV= 0
##$TDeff= 16384
##$TDoff= 0
##$TI= <>
##$TILT= no
##$TM1= 0
##$TM2= 0
##$TOPLEV= 0
##$USERP1= <user>
##$USERP2= <user>
##$USERP3= <user>
##$USERP4= <user>
##$USERP5= <user>
##$WDW= 1
##$XDIM= 16384
##$YMAX_p= 434420789
##$YMIN_p= -3927024
$$ End of Bruker specific parameters
$$ ---------------------------------
##NTUPLES= NMR SPECTRUM
##VAR_NAME=  FREQUENCY,     SPECTRUM/REAL,   SPECTRUM/IMAG
##SYMBOL=    X,             R,               I
##VAR_TYPE=  INDEPENDENT,   DEPENDENT,       DEPENDENT
##VAR_FORM=  AFFN,          ASDF,            ASDF
##VAR_DIM=   16384,         16384,           16384
##UNITS=     HZ,            ARBITRARY UNITS, ARBITRARY UNITS
##FACTOR=    0.220516191357247, 1,           1
##FIRST=     3145.03107159916, 0,            0
##LAST=      -467.685691406615, 0,           0
##MIN=       -467.685691406615, -3927024,    0
##MAX=       3145.03107159916, 434420789,    0
$$ Real data points
##PAGE= N=1
##DATA TABLE= (X++(R..R)), XYDATA
$$ [...]
6921C595939j56722J44129k06756j129360K48975N70797K06763R8719M3906m02624
$$ 3595939 3439217 3583346 3376590 2247230 2496205 3067002 3273765 3372484 3416390 3013766
6911C013766j46931K03541m96463j42013L82797l5380o24782j87885M78713p8320
$$ 3013766 2866835 3070376 2573913 2431900 2814697 2779317 2154535 1966650 2445363 2367043
6901B367043M74090P38397k68957m63594m09639j74424J038521j14945J0828m00532
$$ 2367043 2841133 3579530 3310573 2846979 2437340 2262916 3301437 3186492 3197320 2796788
6891B796788o92565j17582M64372M30474k66925k50768r43141R76864M03453l46491
$$ 2796788 2104223 1986641 2451013 2881487 2614562 2363794 1420653 2397517 2800970 2454479
6881B454479l30829r25337K22390L97704o73763J69418N5794J87528J135944N97638
$$ 2454479 2123650 1198313 1420703 1818407 1144644 1314062 1369856 1557384 2693328 3290966
6871C290966j22241J19124q57934j04295R22627P1416m00510p87619k89833K30314
$$ 3290966 3168725 3287849 2429915 2325620 3248247 3319663 2919153 2131534 1841701 2072015
6861B072015K65586J8667k96474L89993k08478N2312L03431N25196l63620n34779
$$ 2072015 2337601 2356268 2059794 2449787 2241309 2293621 2597052 3122248 2758628 2223849
6851B223849K01239K95082J62141j33125N0982K58506l53617k83343p62334K08846
$$ 2223849 2425088 2720170 2882311 2749186 2800168 3058674 2705057 2421714 1659380 1868226
6841A868226M54411j99385n18423R12499m29857o67210O23284L07396K65117r95206
$$ 1868226 2322637 2123252 1604829 2517328 2087471 1420261 2043545 2350941 2616058 1620852
6831A620852k45807J41953K4328M98308K63658j001693K18357J55973j66534n44909
$$ 1620852 1375045 1516998 1541326 2039634 2303292 1301599 1519956 1675929 1509395 964486
6821I64486M66231L15062N01969k55490Q9621K45598o29711M42828K3162J05499
$$ 964486 1430717 1745779 2247748 1992258 2081879 2327477 1697766 2140594 2163756 2269255
6811B269255p78395L71029O63851j20914P11334P05986O79514j407772o11296
$$ 2269255 1490860 1861889 2525740 2404826 3116160 3822146 4501660 3093888 2482592
6802B482592o1297k19650j04855j36051R522r2064L25092P0615o2884j60748m69217
$$ 2482592 2421295 2201645 2096790 1960739 1970261 1878197 2203289 2273904 2211020 2050272 1581055
6791A581055j80889J76298N25673j35914K85828J03298q28791J13087O39582J93115
$$ 1581055 1400166 1576464 2102137 1966223 2252051 2355349 1526558 1639645 2279227 2472342
6781B472342R2017L35218l77582J55225P8242k66634m12454J79855Q4746P82017
$$ 2472342 2564359 2899577 2521995 2677220 2755462 2488828 2076374 2256229 2340975 3122992
6771C122992o25626m94383q253m9960k8205L11830M34205l89602L8007K51137
$$ 3122992 2497366 2002983 1994730 1944770 1916565 2228395 2662600 2272998 2311005 2562142
6761B562142L3841m29320r0994K44932k93027J35707M41225K77924l5727r73612
$$ 2562142 2595983 2166663 2075669 2320601 2027574 2163281 2604506 2882430 2846703 1873091
6751A873091J0369j08198k9672K96355k3272N4903K92342j85946k12872L66588
$$ 1873091 1883460 1775262 1745590 2041945 2018673 2073576 2365918 2179972 1967100 2333688
6741B333688o04930O11086p4685k83017k47681M5250P67822j22572J69383K58894
$$ 2333688 1728758 2339844 2265159 1982142 1734461 1779711 2547533 2424961 2594344 2853238
6731B853238j07040r01558P74467K98984m45861P2419J05288k22436J37922N6925
$$ 2853238 2746198 1844640 2619107 2918091 2472230 2544649 2649937 2427501 2565423 2622348
6721B622348L58714l82172p7712m70218m59860P36469R39412R5275j89034K01153
$$ 2622348 2981062 2598890 2521178 2050960 1591100 2327569 3266981 3362256 3173222 3374375
6711C374375M99185j85227m83713p3735k99535M33523j87298o16546N39096l95502
$$ 3374375 3873560 3688333 3204620 3130885 2831350 3264873 3077575 2461029 3000125 2604623
6701B604623N11618M4115L22254m28702r50379R34636J25744J23991n57803K28963
$$ 2604623 3116241 3160356 3482610 3053908 2103529 3038165 3163909 3287900 2730097 2959060
6691B959060M82263m51472k65486L15950J20227L46527J42638l69259k38751k45870
$$ 2959060 3441323 2989851 2724365 3040315 3160542 3507069 3649707 3280448 3041697 2795827
6681B795827o0094m4617q03397P83193J21200O6630j19682o16992q2868M20927
$$ 2795827 2735733 2691116 1887719 2670912 2792112 2858742 2739060 2122068 2039200 2460127
6671B460127N51578L83633j51271p19370q1413k26535Q63785k15985p2525m54664
$$ 2460127 3011705 3395338 3244067 2524697 2443284 2216749 3080534 2864549 2792024 2337360
6661B337360n47578L47370L3157m71465P29632K07342k27526P03489j321l09822
$$ 2337360 1789782 2137152 2170309 1698844 2428476 2635818 2408292 3111781 3110460 2800638
6651B800638m72283L53341p30636p2102L2432K49547K72246j26142K96319L46113
$$ 2800638 2328355 2681696 1951060 1878958 1911390 2160937 2433183 2307041 2603360 2949473
6641B949473p27356O62936K45685N86409n43926j270637M44235j093J09141N14445
$$ 2949473 2222117 2885053 3130738 3717147 3173221 1902584 2346819 2345726 2454867 2969312
6631B969312j85324J49312N50709j98317l8691J08863l02638J42178j995q63517
$$ 2969312 2783988 2933300 3484009 3285692 3247001 3355864 3053226 3195404 3193409 2329892
6621B329892L44270J240980k58690P3533K17090n20317k80329n99247n86912L94338
$$ 2329892 2674162 3915142 3656452 3729985 3947075 3426758 3146429 2547182 1960270 2354608
6611B354608M36959J292073K50705q39871n44616l45633j33584J5730l09807Q40311
$$ 2354608 2791567 4083640 4334345 3494474 2949858 2604225 2470641 2486371 2176564 3016875
6601C016875M06689l23738M95762l81901l31518J384J5240p6057L69419k26006
$$ 3016875 3423564 3099826 3595588 3213687 2882169 2883553 2898793 2822736 3192155 2966149
6591B966149j51144K24254L06074k30042j115009o64003J246266N98263J53896
$$ 2966149 2815005 3039259 3345333 3115291 2000282 1336279 2582545 3180808 3334704
6582C334704q26533J35945R15513K30194m83706q9648O29344q17580k67798M14671
$$ 3334704 2508171 2644116 3559629 3789823 3306117 3216469 3845813 3028233 2760435 3175106
6572C175106o25904N99825l87233M98834L52044l93931q4933O38467Q7778R4976
$$ 3175106 2549202 3149027 2761794 3260628 3612672 3218741 3133808 3772275 3860053 3955029
6562C955029n61429m33039k23575j9294k61770K36181K66383Q0167J15437J87676
$$ 3955029 3393600 2960561 2736986 2717692 2455922 2692103 2958486 3038653 3154090 3341766
6552C341766m4895k08249l25600N65360K67582m84958j17018J39105k56211j35375
$$ 3341766 3296871 3088622 2763022 3328382 3595964 3111006 2993988 3133093 2876882 2741507
6542B741507q9974K53578m26550N83140l3949M60196p3951R609O27273j058152
$$ 2741507 2651533 2905111 2478561 3061701 3027752 3487948 3413997 3423606 4050879 2992727
6532B992727j02941L98870P03397m41789O39378o57575q11846R3681K85839k36755
$$ 2992727 2889786 3288656 3992053 3550264 4189642 3532067 2720221 2813902 3099741 2862986
6522B862986O33154L41351L72289m58246r58730k3552P16223l08286L63775j65474
$$ 2862986 3496140 3837491 4209780 3751534 2792804 2769252 3485475 3177189 3540964 3375490
6512C375490J83589K12041N5630l78994p6449l79386L93409Q6805n59772N3411
$$ 3375490 3559079 3771120 3826750 3447756 3371307 2991921 3385330 3472135 2912363 2965774
6502B965774M31926J094995r12915j19424j19303p13976R64512K4440p17849j91709
$$ 2965774 3397700 4492695 3579780 3460356 3341053 2627077 3591589 3616029 2898180 2706471
6492B706471p0729l28022K13597R1922J222159q36585N25120P31264n6999o92788
$$ 2706471 2635742 2307720 2521317 2613239 3835398 2998813 3523933 4255197 4198198 3505410
6482C505410J41984L51174q40950p38303j64017N48327J257578K10939r17353
$$ 3505410 3647394 3998568 3157618 2419315 2255298 2803625 4061203 4272142 3354789
6473C354789K88973K76630m53968j33291J39606m16277J91168J13651O28287j286416
$$ 3354789 3643762 3920392 3466424 3333133 3472739 3056462 3247630 3361281 3989568 2703152
6463B703152o25226R39348k21507k05863J056737P6985l14328m45900R70954J40178
$$ 2703152 2077926 3017274 2795767 2589904 3646641 3723626 3409298 2963398 3934352 4074530
6453D074530o43737L60148J52303o13942k82293K83553k57588k50857O45630O42325
$$ 4074530 3430793 3790941 3943244 3329302 3047009 3330562 3072974 2822117 3467747 4110072
6443D110072j96282L93291Q0490J99359K18489l89972j075019K19075R74505m85987
$$ 4110072 3913790 4307081 4387571 4586930 4805419 4415447 3340428 3559503 4534008 4048021
6433D048021j92051J99642q930O60635J92908o02932J58933j263173M30095L44422
$$ 4048021 3855970 4055612 4046682 4707317 4900225 4297293 4456226 3193053 3623148 3967570
6423C967570l44507L925k57765k77487k14852n43940k60295N69246K70118K71046
$$ 3967570 3623063 3626988 3369223 3091736 2876884 2332944 2072649 2641895 2912013 3183059
6413C183059N40474m32274n6601j17545r4626M55354J75269r30572J176559J28094
$$ 3183059 3723533 3291259 3234658 3117113 3022487 3477841 3653110 2722538 3899097 4027191
6403D027191j444546N09560Q89432p2312m15897K43676L6221k0549K09657p0056
$$ 4027191 2582645 3092205 3981637 3909325 3493428 3737104 3773325 3752776 3962433 3892377
6393C892377n4652N64202m42868r61314M73287o31061k57311N34496j187828J326319
$$ 3892377 3837725 4401927 3959059 2997745 3471032 2839971 2582660 3117156 1929328 3255647
6383C255647R7768p92300J041460k67563P77006m07926K0814j80695J41560k10303
$$ 3255647 3353415 2561115 3602575 3335012 4112018 3704092 3724906 3544211 3685771 3475468
6373C475468K41420R79736m40319m13954p74862K72687m55797k99331J99025M75273
$$ 3475468 3716888 4696624 4256305 3842351 3067489 3340176 2884379 2585048 2784073 3259346
6363C259346M5136p01841P62342L15189n81174r6143O65137Q95351M42287j179138
$$ 3259346 3304482 2602641 3364983 3680172 3098998 3002855 3667992 4563343 5005630 3826492
6353C826492q21016J052208K033M10426K20890K0439j42080j56424l79315j305824
$$ 3826492 3005476 4057684 4059717 4470143 4691033 4711472 4569392 4412968 4033653 2727829
6343B727829N319J088523R7214O4687J33636M92607n95313K29053o79901P4395
$$ 2727829 2733148 3821671 3918885 3983572 4117208 4609815 4014502 4243555 3563654 3638049
6333C638049Q6340Q38747k74062p57210k47326L24584L8005L33982J105764j143093
$$ 3638049 3724389 4563136 4289074 3531864 3284538 3609122 3647127 3981109 5086873 3943780
6323C943780l96264J58020O21992j41645n36596P5739J62473O10476O02669p29681
$$ 3943780 3547516 3705536 4327528 4185883 3649287 3725026 3887499 4497975 5100644 4370963
6313D370963R0905M21975o17773J36982L09653n9613l97022n3956R8991K19893
$$ 4370963 4461868 4883843 4266070 4403052 4712705 4653092 4256070 4202114 4301105 4520998
6303D520998K24232j80161n37278N06579L89456o60606L81287q3378k76180m0893
$$ 4520998 4745230 4565069 4027791 4534370 4923826 4263220 4644507 4561129 4284949 4244056
6293D244056q83018O8632Q03235K2540q3789R5360j46392k09966k08234J85396
$$ 4244056 3361038 3429670 4232905 4255445 4171656 4267016 4120624 3910658 3702424 3887820
6283C887820L42533p28733r6084L83723M22704R9199j50605o86185l83208K52132
$$ 3887820 4230353 3501620 3405536 3789259 4211963 4311162 4160557 3474372 3091164 3343296
6273C343296K09283N01627o12074N66945J075160q99812o43823n7868k93640J369434
$$ 3343296 3552579 4054206 3442132 4009077 5084237 4184425 3540602 3482734 3189094 4558528
6263D558528j73865k84952N98645J41548M94361k71890k60971j99998n24384M45210
$$ 4558528 4384663 4099711 4698356 4839904 5334265 5062375 4801404 4601406 4077022 4522232
6253D522232J25392l76707p73791R2903R43898J56884J41659K40949J002315j096782
$$ 4522232 4647624 4270917 3497126 3590029 4533927 4690811 4832470 5073419 6075734 4978952
6243D978952n06531K28598k68075k22217O82084R09434q1769j314855J18859J87513
$$ 4978952 4472421 4701019 4432944 4210727 4892811 5802245 5720476 4405621 4524480 4711993
6233D711993J19805j90003J76657J59241r475R15Q88813n20127n03995j56942
$$ 4711993 4831798 4641795 4818452 4977693 4968218 4969133 5857946 5337819 4833824 4676882
6223D676882q57077L68657L50320L70224J63682N54403p62368n50895J66712M10896
$$ 4676882 3819805 4188462 4538782 4909006 5072688 5627091 4864723 4313828 4480540 4891436
6213D891436P47152j74796p23373L83948j85122r62936l45048l04067L43151P88177
$$ 4891436 5638588 5463792 4740419 5124367 4939245 3976309 3631261 3327194 3670345 4458522
6203D458522R06192j0556q56484o45651P47626J011391m33206K92506L3601l44503
$$ 4458522 5364714 5354158 4497674 3852023 4599649 5611040 5177834 5470340 5503941 5159438
6193E159438J34239R3031j13279k11572J2930O69591P21663m09283k46275j61946
$$ 5159438 5293677 5386708 5273429 5061857 5074787 5744378 6466041 6056758 5810483 5648537
6183E648537q3687J93741M49840k57081O58353m0676j471955k24479L99294q9232
$$ 5648537 5564850 5758591 6208431 5951350 6609703 6569027 5097072 4872593 5271887 5182655
6173E182655j86684O67068k65645J09003P25087k97417j24637R335l39215K5504
$$ 5182655 4995971 5663039 5397394 5506397 6231484 5934067 5809430 5818765 5479550 5505054
6163E505054M15890K92790p77915R21862j9175p57540p2298L97149k45663k8131
$$ 5505054 5920944 6213734 5435819 6357681 6338506 5580966 5508668 5905817 5660154 5632023
6153E632023Q09337R1239j51614k31517l3447L34349l01040Q5199P79253J4157
$$ 5632023 6441360 6532599 6380985 6149468 6116021 6450370 6149330 6234529 7013782 7027939
6143G027939q72654n50184Q89307O10470l91076Q93498m36337K55142L83361k4546
$$ 7027939 6155285 5605101 6494408 7104878 6713802 7607300 7170963 7426105 7809466 7784920
6133G784920o23668n70444J466321o56092J52297m19168n92757L39937m50311
$$ 7784920 7161252 6590808 8057129 7401037 7553334 7134166 6541409 6881346 6431035
6124F431035j37961m3121J4532M8605r4992n50882K53486J82133n74830m29377
$$ 6431035 6293074 6249953 6264485 6313090 6218098 5667216 5920702 6102835 5528005 5098628
6114E098628Q87369K37726N01866P8198N07826m67707o35536N73673K78582J54671
$$ 5098628 5985997 6223723 6725589 6803787 7311613 6843906 6208370 6782043 7060625 7215296
6104G215296o7098N14554k45185l30413J08498N60547O08446l34621o99268K24202
$$ 7215296 7148198 7662752 7417567 7087154 7195652 7756199 8364645 8030024 7330756 7554958
6094G554958L2972J004490O53999J66908o31134J14457p23943m28808m68481J61666
$$ 7554958 7587930 8592420 9246419 9413327 8782193 8896650 8172707 7743899 7275418 7437084
6084G437084J52719m63414N79263L63027n34548m8697n42373m35682K77487j38851
$$ 7437084 7589803 7126389 7705652 8068679 7534131 7485434 6943061 6507379 6784866 6646015
6074F646015K5636l27105o74427j55994r874P98326k6017L83486Q13672J07646
$$ 6646015 6671651 6344546 5670119 5514125 5504251 6302577 6276560 6660046 7473718 7581364
6064G581364O1750l22682N06712r83397n28511R89087J5909L04000P1896q90414
$$ 7581364 7643114 7320432 7827144 6843747 6315236 7304323 7320232 7624232 7696128 6805714
6054F805714p37369l12351L33960N61975j90772L57741p92926k24086j26241R56653
$$ 6805714 6068345 5755994 6089954 6651929 6461157 6818898 6025972 5801886 5675645 6632298
6044F632298L93510k58802P2087N4680k81388L4476P10969n36274K71668K96790
$$ 6632298 7025808 6767006 6839093 6893773 6612385 6646861 7357830 6821556 7093224 7390014
6034G390014O06126p0346l99282k62199k80870k17923k24771j54775J302807k85374
$$ 7390014 7996140 7925794 7526512 7264313 6983443 6765520 6540749 6385974 7688781 7403407
6024G403407J7237m24804l5081m60083O20525K18946J40058k1476j71951O8544
$$ 7403407 7420644 6995840 6960759 6500676 7121201 7340147 7480205 7458729 7286778 7355322
6014G355322P65976r88824j09877m40738K98203J73139R8807L29947k75268n57696
$$ 7355322 8121298 7132474 7022597 6581859 6880062 7053201 7152008 7481955 7206687 6648991
6004F648991L71009J502529N0371M09741n91925K83017l81104l04849j24622j83250
$$ 6648991 7020000 8522529 8572900 8982641 8390716 8673733 8292629 7987780 7863158 7679908
5994G679908m02435q38193M97484J342865l39269L24021M90699k46895J87204
$$ 7679908 7277473 6439280 6936764 8279629 7940360 8264381 8755080 8508185 8695389
5985H695389k20108j15502J488673j142420m5675J38338M33729j85255j06782
$$ 8695389 8475281 8359779 9848452 8706032 8660357 8798695 9232424 9047169 8940387
5976H940387K08290m85988j70025J10117R94432R4323J96878j4304o91204m64933
$$ 8940387 9148677 8662689 8492664 8602781 9597213 9691536 9888414 9874110 9182906 8717973
5966H717973P96980N65791M93300Q86812J61292q10683q11522p99661L83140O25469
$$ 8717973 9514953 10080744 10574044 11460856 11622148 10811465 9999943 9200282 9583422 10208891
5956A0208891l27861L72903m9827n31901J122192P44361q68723l64027J98257
$$ 10208891 9881030 10253933 10204106 9672205 10794397 11538758 10670035 10306008 10504265
5947A0504265j045793L36126J6619k75873J057879L29176N37165o04104l72009
$$ 10504265 9458472 9794598 9811217 9535344 10593223 10922399 11459564 10855460 10483451
5938A0483451j13320j99750N57709J018256R0850o9664O86986k69172l81822O24160
$$ 10483451 10370131 10170381 10728090 11746346 11837196 11767532 12454518 12185346 11803524 12427684
5928A2427684l67446O05404J435995l61254p19301k83305o72780M55317m93224
$$ 12427684 12060238 12665642 14101637 13740383 13021082 12737777 12064997 12520314 12027090
5919A2027090K09402J066792n86691R16749j67565k92619Q0520l80222N81487
$$ 12027090 12236492 13303284 12716593 13633342 13465777 13173158 13253678 12873456 13454943
5910A3454943m03205l3006O9896N7571j05895R79638o00277j86160O03039J54665
$$ 13454943 13051738 13018732 13088628 13146199 13040304 14019942 13419665 13233505 13836544 13991209
5900A3991209n15423K36953M58700l10725m23592N28346M11925j022157P59372
$$ 13991209 13475786 13712739 14171439 13860714 13437122 13965468 14377393 13355236 14114608
5891A4114608N19603o89506p62001J33160Q44407O5658R38099l8839l63878o1360
$$ 14114608 14634211 13944705 13182704 13315864 14160271 14225929 15164028 15125189 14761311 14699951
5881A4699951p17313O87543O45947O09960J081510j14386m38094M70657o37148
$$ 14699951 13982638 14670181 15316128 15926088 17007598 16893212 16455118 16925775 16288627
5872A6288627j71756N65554K85381l10508j21874K08311L72691j039637L89079
$$ 16288627 16116871 16682425 16967806 16657298 16535424 16743735 17116426 16076789 16465868
5863A6465868L89903L49409J20590J350507R43968o398P01268m80240m46521J516790
$$ 16465868 16855771 17205180 17325770 18676277 19620245 19613847 20315115 19834875 19388354 20905144
5853B0905144M11790N40096l36330J380645J084583n49379L62559J575023K81721
$$ 20905144 21316934 21857030 21520700 22901345 23985928 23436549 23799108 25374131 25655852
5844B5655852Q11210K39729m09925M20281L23825K17173l79300J14423Q67792
$$ 25655852 26467062 26706791 26296866 26717147 27040972 27258145 26878845 26993268 27861060
5835B7861060M31900P40472J260974J641122J007183J838708J368863J459518
$$ 27861060 28292960 29033432 30294406 31935528 32942711 34781419 36150282 37609800
5827C7609800K518697L208592M043408L080642N034875M205629K728301q01162
$$ 37609800 40128497 43337089 47380497 50461139 55496014 59701643 62429944 61628782
5819F1628782l827485n399935m165781k951893k309863m97843k65980K95764q0594
$$ 61628782 57801297 52401362 48235581 45283688 42973825 42475982 42210002 42505766 42425172
5810D2425172L82398J913109J346077J387317K091442L159691J278423J117504
$$ 42425172 42807570 44720679 46066756 47454073 49545515 52705206 53983629 55101133
5802E5101133J259817J202483m53231k70484O42006L44460l20554m26325M73053
$$ 55101133 56360950 57563433 57110202 56839718 57481724 57826184 57505630 57079305 57552358
5793E7552358l65631n48634P81073J083576J759991O73141J414835Q92451J839931
$$ 57552358 57186727 56638093 57419166 58502742 60262733 60935874 62350709 63243160 65083091
5784F5083091K639333J291162J711741O34450J22093M07924k49263o32540J086021
$$ 65083091 67722424 69013586 70725327 71359777 71481870 71889794 71640531 71007991 72094012
5775G2094012J6726k50014N14710k81298J062657M16829J162701J409237Q79717
$$ 72094012 72110738 71860724 72375434 72094136 73156793 73573622 74736323 76145560 77025277
5766G7025277J351307K281220K772712K271190K030291J545086K32061m79086
$$ 77025277 78376584 80657804 83430516 85701706 87731997 89277083 89509144 89030058
5758H9030058k50116j209817p16819L41835J40568k27695n60581M10812M96393
$$ 89030058 88779942 87570125 86853306 87195141 87335709 87108014 86547433 86958245 87454638
5749H7454638R40866R24236Q35269J530021J804673J352582J245985J986688L207731
$$ 87454638 88395504 89319740 90155009 91685030 93489703 94842285 96088270 98074958 101282689
5740A01282689L03788j7368k07187r71316j459091j773031j939703l277532j756121
$$ 101282689 101586477 101569109 101361922 100390606 98931515 97158484 95218781 91941249 90185128
5731I0185128q22786j338323j924755p23144j435731l80771q35783l99626n37137
$$ 90185128 89362342 88024019 86099264 85376120 83940389 83559618 82723835 82324209 81787072
5722H1787072q50363n83875l71421j83989l84364n70437l07886n52189P00671
$$ 81787072 80936709 80352834 79981413 79797424 79413060 78842623 78534737 77982548 78683219
5713G8683219L17788o46288l16530M10304O04843O17376M86054m18451J17520
$$ 78683219 79001007 78354719 78038189 78448493 79053336 79670712 80156766 79738315 79855835
5704G9855835R53997Q14498O6170j267405L06962n69069j98739r99736j138141
$$ 79855835 80809832 81624330 81690500 80423095 80730057 80160988 79962249 78962513 77824372
5695G7824372o07705l73828l03710j016952j475599n91285R36889J14205R7512
$$ 77824372 77216667 76842839 76539129 75522177 74046578 73455293 74392182 74506387 74603899
5686G4603899M65048N11991j81093n45137o45763J06894j72782o13163j118703
$$ 74603899 75068947 75580938 75399845 74854708 74208945 74315839 74143057 73529894 72411191
5677G2411191m73374m05159l94240k74357r77972q24159q80144j054865k81941
$$ 72411191 71937817 71532658 71138418 70864061 69886089 69061930 68181786 67126921 66844980
5668F6844980m97902o08832p75774j74394j84219j84031L64776l600k3926r85328
$$ 66844980 66347078 65738246 64962472 64788078 64603859 64419828 64784604 64781004 64757078 63771750
5658F3771750J43699p02537n16569n07398n93803K67886j148467j4985N65415
$$ 63771750 63915449 63212912 62696343 62188945 61595142 61863028 60714561 60699576 61264991
5649F1264991J009359l11776p87557O29432R12667M8853k65322k28006J55901
$$ 61264991 62274350 61962574 61175017 61804449 62717116 62765969 62500647 62272641 62428542
5640F2428542o12799J019983q3720j359245N5944m56459n80972k58290n82344
$$ 62428542 61815743 62835726 62752006 61392761 61448705 60992246 60411274 60152984 59570640
5631E9570640n39550P5584k06629j291552p49138J1391r21133k23523j05305n632
$$ 59570640 59031090 59106674 58900045 57608493 56859355 56870746 55949613 55726090 55620785 55615153
5621E5615153L47513l53746r88249l09362o20191l23649n8527p67740r56786L12180
$$ 55615153 55962666 55608920 54620671 54311309 53691118 53367469 53308942 52541202 51584416 51896596
5611E1896596n69712j240819j56980l70699q41000l85791L44728j146738J31496
$$ 51896596 51326884 50086065 49929085 49558386 48717386 48331595 48676323 47529585 47661081
5602D7661081M6570j125176L77345l5993K51572r6407l53137O03207j59152M17839
$$ 47661081 47707651 46582475 46959820 46923827 47175399 47078992 46725855 47329062 47169910 47587749
5592D7587749M96083k22172j57297m09466K62848J071249J74971O33527N07408
$$ 47587749 48083832 47861660 47704363 47294897 47557745 48628994 48803965 49437492 49944900
5583D9944900R33147J563615J601211K365636K422855L524174N331420O019863
$$ 49944900 50878047 52441662 54042873 56408509 58831364 62355538 67686958 73706821
5575G3706821O684391M749793K879538q10841n928395p405912p719917m069052
$$ 73706821 80391212 85141005 88020543 87209702 81281307 73875395 66155478 62086426
5567F2086426k347206k171988j026687j589934j499857l88328m35584k45277q13029
$$ 62086426 59739220 57567232 56540545 54950611 53450754 53062426 52626842 52381565 51568536
5558E1568536m93838K4868q07621K35973Q8798j85533m09379J02333Q14683r44516
$$ 51568536 51074698 51099566 50291945 50527918 50616716 50431183 50021804 50124137 50938820 49994304
5548D9994304k3419P64207J84491K006310P51733o7419j296689j280761L19206
$$ 49994304 49970885 50735092 50919583 52925893 53677626 53610207 52313518 51032757 51351963
5539E1351963q50565o24169j74181m83872p08220j02304R81343m46786n6526J175064
$$ 51351963 50501398 49877229 49703048 49219176 48510956 48408652 49389995 48943209 48886683 50061747
5529E0061747M01548m09310j27318j001600o7741l02284j020656k28332j099027
$$ 50061747 50463295 50053985 49926667 48925067 48857326 48555042 47534386 47306054 46207027
5520D6207027o95959j253999l4666l05958j088044j45448m9682k84460l25010
$$ 46207027 45511068 44257069 44222403 43916445 42828401 42682953 42633271 42348811 42023801
5511D2023801K10356R12764j315619q09705M9697p23810K35654L08152q10589
$$ 42023801 42234157 43146921 41831302 41021597 41071294 40347484 40583138 40891290 40080701
5502D0080701m06527J20405k16080j117310j206174L07383Q80979j12778o33179
$$ 40080701 39674174 39794579 39578499 38461189 37255015 37562398 38443377 38330599 37697420
5493C7697420o35054n31808p15356r32687M22018J55412o91249m40042j18105
$$ 37697420 37062366 36530558 35815202 34882515 35304533 35459945 34768696 34328654 34210549
5484C4210549j085049J18789P06113k15067p28892o6028J48275J39976r58064
$$ 34210549 33125500 33244289 33950402 33735335 33006443 32940415 33088690 33228666 32270602
5475C2270602j344472o93694n53430K03454k23393k91476q18767m86086n89432
$$ 32270602 30926130 30232436 29679006 29882460 29659067 29367591 28548824 28062738 27473306
5466B7473306J74710J33554m61173n80982k52057N16478j92733q17974k46073
$$ 27473306 27648016 27781570 27320397 26739415 26487358 27003836 26811103 25993129 25747056
5457B5747056l23665n02628o69900l22743J16038K68211j087676j12686N4938
$$ 25747056 25423391 24920763 24250863 23928120 24044158 24312369 23224693 23112007 23166945
5448B3166945j049385k31698k56613n75472K6872o2411r55836k08066L3821M7386
$$ 23166945 22117560 21885862 21629249 21053777 21080649 21018238 20062402 19854336 19888157 19935543
5438A9935543P3513j37934j181488n23301m11224M03582J309289k32250l60516
$$ 19935543 20009056 19871122 18689634 18166333 17755109 18158691 19467980 19235730 18875214
5429A8875214q95643k23259k91973k84466J64164j55230L03152k06837j026298
$$ 18875214 17979571 17756312 17464339 17179873 17344037 17188807 17491959 17285122 16258824
5420A6258824k14061K37651j77402L2722m82584j39018K46814O75336o17722n94071
$$ 16258824 16044763 16282414 16105012 16137734 15655150 15516132 15762946 16438282 15820560 15226489
5410A5226489L96320k16179j77403J43496M70424l7753j20642l85713k53661o97946
$$ 15226489 15622809 15406630 15229227 15372723 15843147 15805394 15684752 15299039 15045378 14347432
5400A4347432m07643k01054l46999P70685J76546j59039M80887j29970k94710
$$ 14347432 13939789 13738735 13391736 14162421 14338967 14179928 14660815 14530845 14236135
5391A4236135k91168l86979n6122J42245l48127n73113l17919J37282O01298l50509
$$ 14236135 13944967 13557988 13501866 13644111 13295984 12722871 12404952 12542234 13143532 12793023
5381A2793023l37477K92285Q3641j86478J76722N9343J578437j37834n90880q14066
$$ 12793023 12455546 12747831 12831472 12644994 12821716 12881059 14459496 14321662 13730782 12916716
5371A2916716j04568K33521j75983O36170K35628q18781J44894q56143n4889O25615
$$ 12916716 12812148 13045669 12869686 13505856 13741484 12922703 13067597 12211454 12156565 12782180
5361A2782180p67484L48387J32972o86200j57841P05015L02869p86504r39007
$$ 12782180 12014696 12363083 12496055 11809855 11652014 12357029 12659898 11873394 10934387
5352A0934387j28377L22567M45213m79863J24737K66464m71690l42396Q2444k44513
$$ 10934387 10806010 11128577 11573790 11093927 11218664 11485128 11013438 10671042 10753486 10508973
5342A0508973K49345r9952K3897M7047Q1158k34970q5584P38091n52529K44577
$$ 10508973 10758318 10658366 10682263 10729310 10810468 10575498 10489914 11228005 10675476 10920053
5332A0920053L7675l76349n6503j91428j63133K47812K53218J50496m62137l87014
$$ 10920053 10957728 10581379 10524876 10333448 10170315 10418127 10671345 10821841 10359704 9972690
5322I972690M06612r79349L90409j6710L78407N03146n0820l02603o55421k05209
$$ 9972690 10379302 9399953 9790362 9773652 10152059 10655205 10604385 10301782 9646361 9441152
5312I441152M61535J35710n24254l12702J86798n98465L373M04555L83885m70716
$$ 9441152 9902687 10038397 9514143 9201441 9388239 8789774 8793147 9197702 9581587 9110871
5302I110871K65484m34643o11170l39061M23601J079272o75599J70530Q2041j051295
$$ 9110871 9376355 8941712 8330542 7991481 8415082 9494354 8818755 8989285 9071326 8020031
5292H020031L66089O29343m85330l85529L46217k12957j78830p7303K84238L26289
$$ 8020031 8386120 9015463 8530133 8144604 8490821 8277864 8099034 8021731 8305969 8632258
5282H632258j00186N2661J86868L71442o9543k36981o55161J83876n87554o87789
$$ 8632258 8532072 8584733 8771601 9143043 9073500 8836519 8181358 8365234 7777680 7089891
5272G089891K6142O36374O91073l43036L36892J14380n60978M31600K5034k12511
$$ 7089891 7116033 7752407 8443480 8100444 8437336 8551716 7990738 8422338 8447372 8234861
5262H234861R38506J140937O88629L91127K42317J226290R03599Q62732n1504
$$ 8234861 9173367 10314304 11002933 11394060 11636377 12862667 13766266 14628998 14577494
5253A4577494p08916j598415p69664j078906j019013q46567q35260L01023R70611
$$ 14577494 13868578 12270163 11500499 10421593 9402580 8556013 7720753 8021776 8992387
5244H992387N13594o05025l09516M08142K47461m74318n41364K2869o96292k69333
$$ 8992387 9505981 8900956 8591440 8999582 9247043 8772725 8231361 8254230 7557938 7288605
5234G288605l25812o8857L2309l61484M21105J47149J98918O88227p35917l58264
$$ 7288605 6962793 6893936 6926245 6564761 6985866 7133015 7331933 8020160 7284243 6925979
5224F925979j81044P51451K6152k98402q0292K43504O75074N4760m89360n91705
$$ 6925979 6744935 7496386 7522538 7224136 7143844 7387348 8062422 8117182 7627822 7036117
5214G036117k4496P4143J174490m41270M24576J85089q55006q53565P805J034495
$$ 7036117 7011621 7085764 8260254 7818984 8243560 8428649 7573643 6720078 6727883 7762378
5204G762378J01169m36168L52331K57031L47660Q18675j090863J86362R64164
$$ 7762378 7863547 7427379 7779710 8036741 8384401 9203076 8112213 8298575 9262739
5195I262739Q5777J10274l76954M88332k08387R37795J4712r40481K63220N99795
$$ 9262739 9348516 9458790 9081836 9570168 9361781 10299576 10314288 9373807 9637027 10236822
5185A0236822j228152O32000J036928p50178Q4677k61653J55716m06140J86558
$$ 10236822 9008670 9640670 10677598 9927420 10012097 9750444 9906160 9500020 9686578
5176I686578M00524k1954r3529M98832K43732M32598k95189n62657L06739M82425
$$ 9686578 10087102 10065148 9971619 10470451 10714183 11146781 10851592 10288935 10595674 11078099
5166A1078099Q40531o81330n40767N37146J39106q7411K79875l88765Q40314k24005
$$ 11078099 11918630 11237300 10696533 11233679 11372785 11285374 11565249 11176484 12016798 11792793
5156A1792793k36926q30920j72880N62951O33556K48842L88046P41295P86919
$$ 11792793 11555867 10724947 10552067 11115018 11748574 11997416 12385462 13126757 13913676
5147A3913676M96421K13215N82728J084192K19030n77878O7320l79864L65454
$$ 13913676 14410097 14623312 15206040 16290232 16509262 15931384 15998704 15618840 15984294
5138A5984294M69776l80496J4188L01905L09203k36484m3348O46990K77089j35278
$$ 15984294 16454070 16073574 16087762 16389667 16698870 16462386 16419038 17066028 17343117 17207839
5128A7207839M39956l4856N6599J68462m92465Q04577J90557J09377L05817J180161
$$ 17207839 17647795 17612939 17669538 17838000 17345535 18150112 18340669 18450046 18755863 19936024
5118A9936024J69951o8103N65270L82339Q6032n29735p56051N92266q14946j143937
$$ 19936024 20105975 20037872 20603142 20985481 21071513 20541778 19785727 20377993 19563047 18419110
5108A8419110m06245r33847q09150o6288j529986j540285N96129M24662P7510
$$ 18419110 18012865 17079018 16269868 16203580 14673594 13133309 13729438 14154100 14231610
5099A4231610O72188j87655L91662l07141N83254j659q3955K40835K63030J164708
$$ 14231610 14903798 14716143 15107805 14800664 15383918 15382259 15298304 15539139 15802169 16966877
5089A6966877K0724J91594M35024k8486m5961j80595j015141l13227j131005m71487
$$ 16966877 16987601 17179195 17614219 17585733 17539772 17359177 16344036 16030809 14899804 14428317
5079A4428317m23998j55441J108195o93661n11317o47699l16627L51384M85117
$$ 14428317 14004319 13848878 14957073 14263412 13752095 13104396 12787769 13139153 13624270
5070A3624270J73009j41681P43M9446R00992r52472l03897P9722k38185j96635
$$ 13624270 13797279 13655598 13656341 13705787 14606779 13654307 13350410 13430132 13191947 12995312
5060A2995312p28136l41344j24004J42539O66917o4901l6785M04805l72052P63672
$$ 12995312 12267176 11925832 11801828 11944367 12611284 12546383 12509598 12914403 12542351 13306023
5050A3306023j88466k73780R82087o52596M03061N3208q4862J03735k18369k29360
$$ 13306023 13117557 12843777 13825864 13173268 13576329 13629537 13544675 13648410 13430041 13200681
5040A3200681M86101J76231j37742l37646m0698J07526j68414l55818K13465K25653
$$ 13200681 13686782 13863013 13725271 13387625 13346927 13454453 13286039 12930221 13143686 13369339
5030A3369339l50763j50029Q77143L84665q07012j57100R28048K12666J86142
$$ 13369339 13018576 12868547 13745690 14130355 13323343 13166243 14094291 14306957 14493099
5021A4493099M2136l14151J68416m94949J10218q83985P24234M17344r5331Q89499
$$ 14493099 14535235 14221084 14389500 13894551 14004769 13120784 13845018 14262362 14167031 15056530
5011A5056530l80808o10132M15835j35911K70366J30348N42378N30899J991J96899
$$ 15056530 14675722 14065590 14481425 14345514 14615880 14746228 15288606 15819505 15821496 16018395
5001A6018395q8376l374m73140J4459L5933n24592O4116o99739k6565k97917N34210
$$ 16018395 15930019 15926645 15453505 15467964 15503897 14979305 15043421 14343682 14317117 14019200 14553410
4990A4553410j162091L94491M95782K66051Q90865j91734J202751J53194P42176
$$ 14553410 13391319 13785810 14281592 14547643 15438508 15246774 16449525 16602719 17344895
4981A7344895K74721O65508R6433l22799j90530M61009k95238j67903R6633o71682
$$ 17344895 17619616 18285124 18381557 18058758 17868228 18329237 18033999 17866096 17962729 17291047
4971A7291047k48135M84998J37839p52008j137113K25422N88421K81514m4396
$$ 17291047 17042912 17527910 17665749 16913741 15776628 16002050 16590471 16871985 16827589
4962A6827589k55394J065754L85082o44810J41418m99526k31738l26394n8025
$$ 16827589 16572195 17637949 18023031 17378221 17519639 17020113 16788375 16461981 16403956
4953A6403956p47332k08684n3844m14887j79668K27600L31205O2602l30420j20464
$$ 16403956 15656624 15447940 15394096 14979209 14799541 15027141 15358346 15420948 15090528 14970064
4943A4970064k03102r2361J90776O51159L29410n32954n94790q6716J67299K56431
$$ 14970064 14766962 14674601 14865377 15516536 15845946 15312992 14718202 14631486 14798785 15055216
4933A5055216K41093M14208l4794J91085P3445l45429M22168l64879N39767o23509
$$ 15055216 15296309 15710517 15675723 15866808 15940253 15594824 16016992 15652113 16191880 15568371
4923A5568371R09384J11300n37898k54194K27233K89002R8400K61746K62004J48020
$$ 15568371 16477755 16589055 16051157 15796963 16024196 16313198 16411598 16673344 16935348 17083368
4913A7083368Q23251Q14358p89262o06283l21104P68786M58023N22855p11345
$$ 17083368 17906619 18720977 17931715 17325432 17004328 17773114 18231137 18753992 18042647
4904A8042647L07940n00946o26027n12705M38715J94500L39054k76385n58929
$$ 18042647 18350587 17849641 17223614 16710909 17149624 17344124 17683178 17406793 16847864
4895A6847864K67875p58875O20420k46642P48557n702L985k89172K56739l35735
$$ 16847864 17115739 16356864 16977284 16730642 17479199 17473497 17477482 17188310 17445049 17109314
4885A7109314n57376k28341m93250r85349M57381j76314n31038N78958j88762
$$ 17109314 16551938 16323597 15830347 14844998 15302379 15126065 14595027 15173985 14985223
4876A4985223J67789p9147m40062M84062n22907L46295J076118j367994n17490
$$ 14985223 15153012 15073865 14633803 15117865 14594958 14941253 16017371 14649377 14131887
4867A4131887Q53659J08209j142l4785l27393k10993M18973l3854L36552M88930
$$ 14131887 14985546 15093755 15092613 15057828 14730435 14519442 14938415 14904561 15241113 15730043
4857A5730043k94750R11448q29483r9182q73301P75588O45656K02856O60064l33788
$$ 15730043 15435293 16346741 15517258 15418076 14544775 15320363 15966019 16168875 16828939 16495151
4847A6495151L10097l41437n04822N76135K66540p60960J73806l89321j15279
$$ 16495151 16805248 16463811 15958989 16535124 16801664 16040704 16214510 15825189 15709910
4838A5709910n82267L22877J48876l9619k49304p65349p96241J55978k88915L46800
$$ 15709910 15127643 15450520 15599396 15559777 15310473 14545124 13748883 13904861 13615946 13962746
4828A3962746N463n4779K80269n92515O11837q07448l70863o46184l32436Q27966
$$ 13962746 13968209 13913430 14193699 13601184 14213021 13405573 13034710 12388526 12056090 12884056
4818A2884056r6305l53598P17525m13876p06216O5348m62272Q64495R27739o84937
$$ 12884056 12787751 12434153 13151678 12737802 12031586 12096934 11634662 12499157 13426896 12741959
4808A2741959j198720K54893j82049j7662M54305j33737j081215J1489j60377
$$ 12741959 11543239 11798132 11616083 11598421 12052726 11918989 10837774 10849263 10688886
4799A0688886N08939P49912m81032L22703L06405n58040l60568O14559o18239
$$ 10688886 11197825 11947737 11466705 11789408 12095813 11537773 11177205 11791764 11173525
4790A1173525j45403k83952r1925l9657M96277K73260L25171R77408j6342j63796
$$ 11173525 11028122 10744170 10652245 10612588 11108865 11382125 11707296 12684704 12668362 12504566
4780A2504566m47750l52659k09203J07382m9816k85394M46335N09704l6757K24229
$$ 12504566 12056816 11704157 11494954 11602336 11552520 11267126 11713461 12223165 12186408 12410637
4770A2410637O04318j41584l35674j17475K29977k38817n67607j37461P47415
$$ 12410637 13014955 12873371 12537697 12420222 12650199 12411382 11843775 11706314 12453729
4761A2453729o532J99105K97186J125582N16659L49847P5772l96400k99705n58790
$$ 12453729 12447197 12646302 12943488 14069070 14585729 14935576 15011348 14614948 14315243 13756453
4751A3756453j17646M01875J396495q6836o41821M86663m39716Q04559R4005j90402
$$ 13756453 13638807 14040682 15437177 15350341 14708520 15195183 14755467 15560026 15654031 15463629
4741A5463629j83334J006462J30580K81364O27788M4911m2232M9055m6496r22465
$$ 15463629 15280295 16286757 16417337 16698701 17326489 17371400 17329168 17378223 17331727 16409262
4731A6409262J98423J110485O64193n74255J36368N19083o66978M77701R67411
$$ 16409262 16607685 17718170 18382363 17808108 17944476 18463559 17796581 18274282 19241693
4722A9241693K65422K9768N8859J011712R53525J62684P19277J142675K98949
$$ 19241693 19507115 19536883 19595742 20607454 21560979 21723663 22442940 23585615 23884564
4713B3884564J73597K09477P88868o53672n90770L4732o73207P21406J522028
$$ 23884564 24058161 24267638 25056506 24402834 23812064 23846796 23173589 23894995 25417023
4704B5417023q31001K39859K93253N14401n02056L74695l17595M80928J83728
$$ 25417023 24586022 24825881 25119134 25633535 25131479 25506174 25188579 25669507 25853235
4695B5853235l23826q53823p01882K57819o64440k98225n04276q49593K21508
$$ 25853235 25529409 24675586 23973704 24231523 23567083 23268858 22764582 21914989 22136497
4686B2136497K05901j318060o9243L07067M5812K51001K62767J60006l06316o07383
$$ 22136497 22342398 21024338 20955095 21262162 21307974 21558975 21821742 21981748 21675432 21068049
4676B1068049l89580N82956J52505O27027m63319M80124Q19342K00413O4914M59173
$$ 21068049 20678469 21261425 21413930 22040957 21577638 22057762 22877104 23077517 23142431 23601604
4666B3601604L07211L60701m48996o7847M26509N68487J975080M96875l2203K65345
$$ 23601604 23908815 24269516 23820520 23752673 24179182 24747669 26722749 27219624 27187421 27452766
4656B7452766J307991J268590Q06527J188797Q48967L55755J30045Q69157R85256
$$ 27452766 28760757 30029347 30835874 32024671 32873638 33229393 33359438 34228595 35213851
4647C5213851Q48970J493230n9899J01979M87789M58515L48550k49021p13237
$$ 35213851 36062821 37556051 37496152 37598131 38085920 38544435 38892985 38643964 37930727
4638C7930727j46394m97865l71947J44909p1295n30113r49425p84430p22538j175659
$$ 37930727 37784333 37286468 36914521 37059430 36988135 36458022 35508597 34724167 34001629 32825970
4628C2825970n60847k004052n99774K22310K42731j237445m34298j82781j887395
$$ 32825970 32265123 30261071 29661297 29883607 30126338 28888893 28454595 28271814 26384419
4619B6384419K10370K06646r27231O43979J78020o89514J173228O55902m05763
$$ 26384419 26594789 26801435 25874204 26518183 26696203 26006689 27179917 27835819 27430056
4610B7430056m69719N52670K33654K1527Q14517l35401m11478Q35396L58059K25042
$$ 27430056 26960337 27513007 27746661 27768188 28582705 28247304 27835826 28671222 29029281 29254323
4600B9254323O03852J993358P36357M15709P03273O01019O00591n58085L93928
$$ 29254323 29858175 31851533 32587890 33003599 33706872 34307891 34908482 34350397 34744325
4591C4744325M2318Q10288J28411o5579P40928O54758k45580m30494J63145J24859
$$ 34744325 34786643 35596931 35725342 35659763 36400691 37055449 36809869 36379375 36542520 36667379
4581C6667379n58676q5120p41448n31530j34226n54029k98850m66239l42889M10879
$$ 36667379 36108703 36023583 35282135 34750605 34616379 34062350 33763500 33297261 32954372 33365251
4571C3365251N8133K13025j43004n58563O72453R66592O45269o15700J54193q29876
$$ 33365251 33423384 33636409 33493405 32934842 33607295 34573887 35219156 34603456 34757649 33927773
4561C3927773l31653Q75787M32924o24559j38357O52638l14067l19731M22712
$$ 33927773 33596120 34471907 34904831 34280272 34141915 34794553 34480486 34160755 34583467
4552C4583467L47646J097209N13372J33267j53913K68985P45278J408498j02034
$$ 34583467 34931113 36028322 36541694 36674961 36521048 36790033 37535311 38943809 38841775
4543C8841775J74951Q27096p20020R89107J221272l22820q05038n16969n22821
$$ 38841775 39016726 39843822 39123802 40112909 41334181 41011361 40206323 39689354 39166533
4534C9166533j7285o29641j277897j242074j201519j01890P9469j005542q73904
$$ 39166533 39149248 38519607 37241710 35999636 34798117 34696227 34775696 33770154 32896250
4525C2896250K0270P37998o38608j397754k30975K92588J88739O08987O36166
$$ 32896250 32916520 33654518 33015910 31618156 31387181 31679769 31868508 32477495 33113661
4516C3113661j4615k575K00493l57429n3945q13145P62651J120159n22716J43364
$$ 33113661 33099046 33096471 33296964 32939535 32885590 32072445 32835096 33955255 33432539 33575903
4506C3575903N38632J795061Q03605o9735J585029P84889M78696M63979N81209
$$ 33575903 34114535 35909596 36713201 36643466 38228495 39013384 39492080 39956059 40537268
4497D0537268M86128K5007l82789j447247N10949N52582q55822j33620O1171J57177
$$ 40537268 41023396 41048403 40665614 39218367 39729316 40281898 39426076 39292456 39353627 39510804
4487C9510804L43465Q63230J675371J39204K20900K451q81292j468662q19424
$$ 39510804 39854269 40717499 42392870 42532074 42752974 42755425 41874133 40405471 39586047
4478C9586047J34129K11052l24231K56291k69986n71960J66446j38257j153859
$$ 39586047 39720176 39931228 39606997 39863288 39593302 39021342 39187788 39049531 37895672
4469C7895672O5427L67637K79497k65286p23680k77476j231350k55498l58335
$$ 37895672 37961099 38328736 38608233 38342947 37619267 37341791 36110441 35854943 35496608
4460C5496608q7697p42334j00971l24184K08488n58591J29610p7429m37518k44894
$$ 35496608 35408911 34666577 34565606 34241422 34449910 33891319 34020929 33943500 33505982 33261088
4450C3261088m85910j45596K08819P4949O44929l85912N15465P6486m26197j61447
$$ 33261088 32775178 32629582 32838401 32913350 33558279 33172367 33687832 33764318 33338121 33176674
4440C3176674M0333P53504P36147N22195l4283L35359r91128R39454R74160O42135
$$ 33176674 33217007 33970511 34706658 35228853 35194570 35529929 34538801 35478255 36452415 37094550
4430C7094550J20141N73474r11912o20403K95275o96054N49711J66755m10531
$$ 37094550 37214691 37788165 36876253 36255850 36551125 35855071 36404782 36571537 36161006
4421C6161006l37974m73701N19310o37496M55143J59700M38275j0960N810K49964
$$ 36161006 35823032 35349331 35868641 35231145 35686288 35845988 36284263 36273303 36279113 36529077
4411C6529077p12642M51946R92105J48176L52018J99278p84039p53214p12388
$$ 36529077 35816435 36268381 37260486 37408662 37760680 37959958 37175919 36422705 35710317
4402C5710317j51226K28075o79927k93326j49170L10010J6354M32030M2889Q55029
$$ 35710317 35559091 35787166 35107239 34813913 34664743 34974753 34991107 35423137 35466026 36321055
4392C6321055M31608k62569m12013M07402Q59850K97403o52281O94690P98321
$$ 36321055 36752663 36490094 36078081 36485483 37345333 37642736 36990455 37685145 38483466
4383C8483466j063093o44014J05327N8847q7772j69519j198420K76606o76045
$$ 38483466 37420373 36776359 36881686 36940533 36852761 36683242 35484822 35761428 35085383
4374C5085383o8555n12327L01971o85458j00473M49861l56918J51324J35409j141398
$$ 35085383 35016828 34504501 34806472 34121014 34020541 34470402 34113484 34264808 34400217 33258819
4364C3258819k63051m76986j99930K00784m76166O4258O2906o102m63673j262237
$$ 33258819 32995768 32518782 32318852 32519636 32043470 32107728 32170634 32164532 31700859 30438622
4354C0438622l66280n84069r4433j27724j22089l29093n27128j50486o6172m63154
$$ 30438622 30072342 29488273 29393840 29266116 29144027 28814934 28287806 28137320 28071148 27607994
4344B7607994R80554o65779M00186j37634p44843Q95234l01334j29714j80242
$$ 27607994 28588548 27922769 28322955 28185321 27440478 28335712 28034378 27904664 27724422
4335B7724422J37472R60494J14983j063763m71250l67861J175906L21706o23524
$$ 27724422 27861894 28822388 28937371 27873608 27402358 27034497 28210403 28532109 27908585
4326B7908585p21396P7414L73316N26008J014774o42356o44364l03464p49895
$$ 27908585 27187189 27264603 27637919 28163927 29178701 28536345 27891981 27588517 26838622
4317B6838622R83863l42007q49412l97428N36995P06405j80238j68928K44236
$$ 26838622 27822485 27480478 26631066 26233638 26770633 27477038 27296800 27127872 27372108
4308B7372108o62999r30110m77797J61129K58465J45791j62286j45269L7548m51173
$$ 27372108 26709109 25778999 25301202 25462331 25720796 25866587 25704301 25559032 25596580 25145407
4298B5145407K96075K34350L02036N50794q79878p44269N23509J78047o6950o35316
$$ 25145407 25441482 25675832 25977868 26528662 25648784 24904515 25428024 25606071 25539121 24903805
4288B4903805o2284K17755J11610k42984N1377N203o7538k81718K32566J492111
$$ 24903805 24841521 25059276 25170886 24927902 24979279 24984482 24916944 24635226 24867792 26359903
4278B6359903l44624q57792p4627N43576K46077o07933J61727O55823j06682N83678
$$ 26359903 26015279 25157487 25082860 25626436 25872513 25264580 25426307 26082130 25975448 26559126
4268B6559126L37057j115239N2007O27069O88777j0880l82287L8394J83236K41960
$$ 26559126 26896183 25780944 25832951 26460020 27148797 27137917 26755630 26794024 26977260 27219220
4258B7219220j20130K60388J027601M71311j134918n14639O07699L54735n75879
$$ 27219220 27099090 27359478 28387079 28858390 27723472 27208833 27816532 28171267 27595388
4249B7595388P1063M81474O04533M09785O78529O17441K25443O37006N96331M88633
$$ 27595388 27666451 28147925 28752458 29162243 29840772 30458213 30683656 31320662 31916993 32405626
4239C2405626L48103J91360J244090J063700o84643K42990P86800O77490J027850
$$ 32405626 32753729 32945089 34189179 35252879 34568236 34811226 35598026 36275516 37303366
4230C7303366l28706L7152L15050O46212J98751J085886k89158M87382O26025
$$ 37303366 36974660 37011812 37326862 37973074 38171825 39257711 38968553 39455935 40081960
4221D0081960O4624O31771J623502K57240O45052J355285n39116J088614J595840
$$ 40081960 40146584 40778355 42401857 42659097 43304149 44659434 44120318 45208932 46804772
4212D6804772K096484J291153J643438J174172J619915J878635J522706J219722
$$ 46804772 48901256 50192409 51835847 53010019 54629934 56508569 58031275 59250997
4204E9250997J678135K319379K511676K693081L205118K861968L057528L296686
$$ 59250997 60929132 63248511 65760187 68453268 71658386 74520354 77577882 80874568
4196H0874568M140475M676532M981614N255887N885089N958912P410848J0044831
$$ 80874568 85015043 89691575 94673189 99929076 105814165 111773077 119183925 129228756
4188A29228756J2171530J4671636J7757429K2431288K6779342L2270721L8771136
$$ 129228756 141400286 156071922 173829351 196260639 223039981 255310702 294081838
4181B94081838M3905719M2151682L5873900J8407650k644746j9326779k9792051
$$ 294081838 337987557 380139239 416013139 434420789 431776043 412449264 382657213
4174C82657213l0648983k6241479j9543853j5460075j1772223r443448p370356
$$ 382657213 352008230 325766751 306222898 290762823 278990600 269547152 262176796
4167B62176796o527098o039653l851925l158485m23804J727780K541397L036861
$$ 262176796 255649698 249610045 245758120 242599635 242175831 243903611 246445008 249481869
4159B49481869J174549k04854m415276m942691m003972m443515m502826n817077
$$ 249481869 250656418 250451564 246036288 241093597 237089625 232646110 228143284 222326207
4151B22326207n575755n331135l342295k153919j479105r53169q11080j121426
$$ 222326207 216750452 211419317 208077022 205923103 204443998 203490829 202679749 201558323
4143B01558323k565594l449220l837025k515638j532865j390525j940571m009463
$$ 201558323 198992729 195543509 191706484 189190846 187657981 186267456 184326885 180317422
4135A80317422n065023n459964q623896j0008856j0235408j1125782j0738930
$$ 180317422 175252399 169792435 161168539 151159683 140924275 129798493 119059563
4128A19059563q488293p447389n723938n713799m869688l902958m194725k869687
$$ 119059563 110571270 103123881 97399943 91686144 86816456 82913498 78718773 75849086
4120G5849086j297774k301592k890030j883081j486142k323898r948n96618r10977
$$ 75849086 74551312 72249720 69359690 67476609 65990467 63666569 63656621 63060003 62149026
4111F2149026r44322j116263p81761j979412j660225j328154j775911j431932
$$ 62149026 61204704 60088441 59306680 57327268 55667043 54338889 52562978 51131046
4103E1131046j997091j707744k152310p12631l49941k330375j73223p36039j110193
$$ 51131046 49133955 47426211 45273901 44561270 44211329 41880954 41707731 40971692 39861499
4094C9861499j340420m06327p84351J9131j005209j841094n70966J35009k35432
$$ 39861499 38521079 38114752 37330401 37349532 36344323 34503229 33932263 34067272 33831840
4085C3831840l03079j300009J4799p8938N68103p53574l88077l13140o25229L07231
$$ 33831840 33528761 32228752 32243551 32164613 32732716 31979142 31591065 31277925 30652696 30959927
4075C0959927j159131n52391Q27080N27649o11166M7395j177211o0881K09587
$$ 30959927 29800796 29248405 30075485 30603134 29991968 30039363 28862152 28801271 29010858
4066B9010858L73239Q83612m4925o64196N76532l51779n88473L4594m53187P63365
$$ 29010858 29384097 30267709 30222784 29558588 30135120 29783341 29194868 29229462 28776275 29539640
4056B9539640O47369k73587N2979R27384l90180l50433N36816K95554L50879Q33954
$$ 29539640 30187009 29913422 29966401 30893785 30503605 30153172 30689988 30985542 31336421 32170375
4046C2170375J062095Q17238L08706J046058R76225L31856N31690J043676L80429
$$ 32170375 33232470 34049708 34358414 35404472 36380697 36712553 37244243 38287919 38668348
4037C8668348M87367P53532J100619P87680P40033J125434J416712N46409J456414
$$ 38668348 39155715 39909247 41009866 41797546 42537579 43663013 45079725 45626134 47082548
4028D7082548J604611J945360N11641J497340K541436R73516K650175K107210
$$ 47082548 48687159 50632519 51144160 52641500 55182936 56156452 58806627 60913837
4020F0913837K211177J568126K021409J814632J858665K324472J563798K670493
$$ 60913837 63125014 64693140 66714549 68529181 70387846 72712318 74276116 76946609
4012G6946609J637971K137846K994682L087029K399532K411375L204308J921571
$$ 76946609 78584580 80722426 83717108 86804137 89203669 91615044 94819352 96740923
4004I6740923K861941K801077K576642J684287K393919K480586K592495L362016
$$ 96740923 99602864 102403941 104980583 106664870 109058789 111539375 114131870 117493886
3996A17493886J812404J823545K745902K245015J743537J470997K158393N36997
$$ 117493886 119306290 121129835 123875737 126120752 127864289 129335286 131493679 132030676
3988A32030676K616141K444305L01890N59568P56256P54997J124312M33183J47761
$$ 132030676 134646817 137091122 137393012 137952580 138708836 139463833 140588145 141021328 141169089
3979A41169089O05588k82625q03972j044145m90976o59745j200506j340361r74217
$$ 141169089 141774677 141492052 140688080 139643935 139152959 138493214 137292708 135952347 134978130
3970A34978130k021370j436071j691370k322769j866946k741754k074691k287106
$$ 134978130 132956760 131520689 129829319 127506550 125639604 122897850 120823159 118536053
3962A18536053k191222k446120j751948j823818k894948l079595k815624j932922
$$ 118536053 116344831 113898711 112146763 110322945 107427997 104348402 101532778 99599856
3954I9599856k558610k605526k772931k985879j376817j101519l551366j681485
$$ 99599856 97041246 94435720 91662789 88676910 87300093 86198574 82647208 80965723
3946H0965723k036214k698410k216637j122623j936406k228345k618085j699729
$$ 80965723 78929509 76231099 74014462 72891839 70955433 68727088 66109003 64409274
3938F4409274j926892j633126j554130j267632k194087j350495j418870j318130
$$ 64409274 62482382 60849256 59295126 58027494 55833407 54482912 53064042 51745912
3930E1745912j063726j529847q1508j747353m78937j423265r62554j814970j287406
$$ 51745912 50682186 49152339 49070831 47323478 46844541 45421276 44458722 42643752 41356346
3921D1356346j668989j362889j400206q26921m81644m38366j05350j147751r99672
$$ 41356346 39687357 38324468 36924262 36097341 35615697 35177331 35071981 33924230 32924558
3912C2924558M33396q11045r77224l33691O5417j19722n29408n45273o17530k32843
$$ 32924558 33357954 32546909 31569685 31235994 31301411 31181689 30652281 30107008 29489478 29256635
3902B9256635p66078M44408l53435q08228o35097L58404k94578j27777j52474
$$ 29256635 28490557 28934965 28581530 27773302 27138205 27496609 27202031 27074254 26921780
3893B6921780r3629o80261o09922O86762l16869N34638r16921o91478m84640m4093
$$ 26921780 26828151 26147890 25537968 26224730 25907861 26442499 25525578 24834100 24349460 24305367
3883B4305367m87790j113686k55478o40528L40253q69433m22582r41638l31290
$$ 24305367 23817577 22703891 22448413 21807885 22148138 21278705 20856123 19914485 19583195
3874A9583195P76123q90234n43800M77750J05043n88521J85077N80k78226j094028
$$ 19583195 20359318 19469084 18925284 19403034 19508077 18919556 19104633 19105213 18826987 17732959
3864A7732959O2588p37037p97346R784l86268O81061k13438p43623L11600P60878
$$ 17732959 17795547 17058510 16261164 16270948 15884680 16565741 16352303 15608680 15920280 16681158
3854A6681158m2470o47882J87865q47505o12756l0121n94190K32862N31596L91915
$$ 16681158 16638688 15990806 16178671 15331166 14718410 14688289 14094099 14326961 14858557 15250472
3844A5250472k21149O94026r45524L4431K96503n51486j78597j37612p03595p30438
$$ 15250472 15029323 15723349 14777825 14812256 15108759 14557273 14378676 14241064 13537469 12807031
3834A2807031L19925N09414J70667n31483l44644J594254j56150j031978j50263
$$ 12807031 13126956 13636370 13807037 13275554 12930910 14525164 14369014 13337036 13186773
3825A3186773k30642R11612J2265j91197L33624K1425k40048M2095j45713j12515
$$ 13186773 12956131 13867743 13880008 13688811 14022435 14043860 13803812 13845907 13700194 13587679
3815A3587679K85597j525o00788O10618o43879j25836L90059L03988l5280j31620
$$ 13587679 13873276 13871751 13270963 13881581 13237702 13111866 13501925 13805913 13770633 13639013
3805A3639013J18898O13893m79650k72335P90169M71739j85309r1798m13808J24282
$$ 13639013 13757911 14371804 13892154 13619819 14409988 14881727 14696418 14604620 14190812 14315094
3795A4315094J91409q4261L43504l80477j66615o4937K40645O78495J065046o07606
$$ 14315094 14506503 14422242 14765746 14385269 14218654 14153717 14394362 15072857 16137903 15530297
3785A5530297l08526j87236L99256o2876M4064M11575K53415J03789K79076l70145
$$ 15530297 15221771 15034535 15433791 15370915 15414979 15826554 16079969 16183758 16462834 16092689
3775A6092689l22840m49795R91509j93389Q60553q3268o64739r872J50009j1867
$$ 16092689 15769849 15320054 16311563 16118174 16978727 16895459 16230720 16220848 16370857 16358990
3765A6358990R0171N12059J74969m28763K67220J05435n83810O71267Q41615N65077
$$ 16358990 16449161 16961220 17136189 16707426 16974646 17080081 16496271 17167538 18009153 18574230
3755A8574230p32229n80257J240920O61163q1322m15927R41500J361905O0971
$$ 18574230 17842001 17261744 18502664 19163827 19082505 18666578 19608078 20969983 21030954
3746B1030954J065704K16470o87593m85094R25639J05287l8334J53663R29595
$$ 21030954 22096658 22313128 21625535 21140441 22066080 22171367 22133033 22286696 23216291
3737B3216291m94518N79346K40768J184866n9455n08630J127947K50982P97610
$$ 23216291 22721773 23301119 23541887 24726753 24667298 24158668 25286615 25537597 26335207
3728B6335207p4057N78585Q38987O67384N14168O35595l61820J23196j17540K30729
$$ 26335207 26261150 26839735 27678722 28346106 28860274 29495869 29134049 29257245 29139705 29370434
3718B9370434J281472L46263M13762K96071N90188P04120J102527P56624J52131
$$ 29370434 30651906 30998169 31411931 31708002 32298190 33002310 34104837 34861461 35013592
3709C5013592R39711J549527L30520O74782L30462J492658O85475P31811R70108
$$ 35013592 35953303 37502830 37833350 38508132 38838594 40331252 41016727 41748538 42718646
3700D2718646J533485P34931N21807J961382J343170R55276J358630R25442M28728
$$ 42718646 44252131 44987062 45508869 47470251 48813421 49768697 51127327 52052769 52481497
3691E2481497R36974J045403R21622J168075J788757J072579N71154R97145N27236
$$ 52481497 53418471 54463874 55385496 56553571 58342328 59414907 59986061 60983206 61510442
3682F1510442P33385P51756P14783R75872P41870R13686J479401M02292J77923
$$ 61510442 62243827 62995583 63710366 64686238 65428108 66341794 67821195 68223487 68401410
3673F8401410R82767J354905P19768M39014J328116J363038J011032J845902J375673
$$ 68401410 69384177 70739082 71458850 71897864 73225980 74589018 75600050 77445952 78821625
3664G8821625K20927J829398R58862N25929J631389J908674K253960K444363K267474
$$ 78821625 79042552 80871950 81830812 82356741 83988130 85896804 88150764 90595127 92862601
3655I2862601K199360J618037K128791K420063K481104K661222L277893J457706
$$ 92862601 95061961 96679998 98808789 101228852 103709956 106371178 109649071 111106777
3647A11106777K574018K326508K013169J811792K728999K445516J670874K088085
$$ 111106777 113680795 116007303 118020472 119832264 122561263 125006779 126677653 128765738
3639A28765738J716278K578438J754327J334133J875092J797408J811736J103917
$$ 128765738 130482016 133060454 134814781 136148914 138024006 139821414 141633150 142737067
3631A42737067O00546J985131M13965J627115J430961P97412O69339J006463J608402
$$ 142737067 143337613 145322744 145736709 147363824 148794785 149592197 150261536 151267999 152876401
3622A52876401J534543J531201Q96588J531236J602106J140827J600272K581132
$$ 152876401 154410944 155942145 156838733 158369969 159972075 161112902 162713174 165294306
3614A65294306K169653K862745K476552K391052L023438L854862L911361L949229
$$ 165294306 167463959 170326704 172803256 175194308 178217746 182072608 185983969 189933198
3606A89933198L212088L198208L076719M494067L985601L553125L751606L621419
$$ 189933198 193145286 196343494 199420213 203914280 207899881 211453006 215204612 218826031
3598B18826031L678343M575791L565110L397858J977789L333175L068878K244665
$$ 218826031 222504374 227080165 230645275 234043133 236020922 239354097 242422975 244667640
3590B44667640L480794L217214K295012J765866J419457J022101L192879J273735
$$ 244667640 248148434 251365648 253660660 255426526 256845983 257868084 261060963 262334698
3582B62334698N38836J60923Q20130N90074L07896J03249r32541o91459j383865
$$ 262334698 262873534 263034457 263854587 264444661 264752557 264855806 263923265 263231806 261847941
3573B61847941k088452j619474j697991k027626j932249j104619j641767j999784
$$ 261847941 259759489 258140015 256442024 254414398 252482149 251377530 249735763 247735979
3565B47735979k498390j602666k082840j473153k328584k218846j348861j570774
$$ 247735979 245237589 243634923 241552083 240078930 237750346 235531500 234182639 232611865
3557B32611865j424466j514299j554227m98253m03293r8488j27343K97059N43242
$$ 232611865 231187399 229673100 228118873 227620620 227217327 227118839 226991496 227288555 227831797
3548B27831797m37690J49120R33935O48187M88978J298001j30041R6376K77210
$$ 227831797 227394107 227543227 228477162 229125349 229614327 230912328 230782287 230878663 231155873
3539B31155873J46195M43217N98333Q24922m504l37319l8417N80836j171533j264255
$$ 231155873 231302068 231745285 232343618 233168540 233164036 232826717 232788300 233369136 232197603 230933348
3529B30933348o55144l89367j105926k178402j806015j456094j999072p75730
$$ 230933348 230278204 229888837 228782911 226604509 224798494 223342400 221343328 220567598
3521B20567598j911871k209727j909247j482412j684979j588306k392178k497922
$$ 220567598 218655727 216446000 214536753 213054341 211369362 209781056 207388878 204890956
3513B04890956k184433k273878k421243k229503k466650l947530k590366j870808
$$ 204890956 202706523 200432645 198011402 195781899 193315249 189367719 186777353 184906545
3505A84906545k265834k797689k409932k364179k013765k693651j856454k535925
$$ 184906545 182640711 179843022 177433090 175068911 173055146 170361495 168505041 165969116
3497A65969116j987901k761114j588739k194468j886489k054799k428102k646073
$$ 165969116 163981215 161220101 159631362 157436894 155550405 153495606 151067504 148421431
3489A48421431j694961j741937p61397j512574k180917k224248j873395o55107
$$ 148421431 146726470 144984533 144223136 142710562 140529645 138305397 136432002 135776895
3481A35776895k009839p14281m26883j785896j541390k281912j579035r27105
$$ 135776895 133767056 133052775 132625892 130839996 129298606 127016694 125437659 124510554
3473A24510554j521704p32576r96794k470617k789921j402035r44418p60453j463503
$$ 124510554 122988850 122256274 121259480 118788863 115998942 114596907 113652489 112892036 111428533
3464A11428533k242683j304198j784714k144079k078193j743531j385757k697117
$$ 111428533 109185850 107881652 106096938 103952859 101874666 100131135 98745378 96048261
3456I6048261r40325k482229j921597q32996k210944j916444j739491j934456
$$ 96048261 95107936 92625707 90704110 89871114 87660170 85743726 84004235 82069779
3448H2069779k056380j379281j645275k057244j445443j439559j540612k253795
$$ 82069779 80013399 78634118 76988843 74931599 73486156 72046597 70505985 68252190
3440F8252190k558082k235960q17203j421047k537943j583089r50850j098805
$$ 68252190 65694108 63458148 62640945 61219898 58681955 57098866 56148016 55049211
3432E5049211j399162k698837j490923q66836r02194j836068j017668j157330
$$ 55049211 53650049 50951212 49460289 48593453 47691259 45855191 44837523 43680193
3424D3680193j430245l63047r39920j830931n78152j03338q49598j66134m37950
$$ 43680193 42249948 41886901 40946981 39116050 38537898 38434560 37584962 37418828 36980878
3415C6980878j821265r85625n35223j432955k61378m97530J94448j199551j044860
$$ 36980878 35159613 34173988 33638765 32205810 31944432 31446902 31641350 30441799 29396939
3406B9396939l99353j056813l36766k77502K82616l67263r60367k63363m43705
$$ 29396939 28997586 27940773 27604007 27326505 27609121 27241858 26281491 26018128 25574423
3397B5574423j078505p51432k45589l03492O13599n98636q23635k79950J89031
$$ 25574423 24495918 23744486 23498897 23195405 23809004 23210368 22386733 22106783 22295814
3388B2295814k68503m68841q80109r9853N23681r34312n26358o168p55282r07673
$$ 22295814 22027311 21558470 20678361 20578508 21102189 20167877 19641519 19635351 18880069 17972396
3378A7972396P83336l28849K92261j026667j206452M21988q6050K29801n13218
$$ 17972396 18755732 18426883 18719144 17692477 16486025 16908013 16821963 17051764 16538546
3369A6538546l56086m82527k01022J40817j50871K5512O6800q21916n7816J57138
$$ 16538546 16182460 15699933 15498911 15639728 15488857 15514369 15581169 14759253 14701437 14858575
3359A4858575o9754r94824m75628O33971j77279n8568p86884K08910k1474k9372
$$ 14858575 14788821 13793997 13318369 13952340 13775061 13716493 12929609 13138519 13117045 13087673
3349A3087673j1537L79152r62429l13372K36040L5222L59948n50753J34243K2169
$$ 13087673 13076136 13455288 12492859 12179487 12415527 12450749 12810697 12259944 12394187 12416356
3339A2416356m95069R142J42318n62832k00340l81514O0897J97387k04833R3298
$$ 12416356 11921287 11930429 12072747 11509915 11309575 10928061 10988958 11186345 10981512 11074810
3329A1074810O87382P35323m68200L54923K86484o44338M31862k56235j200532
$$ 11074810 11762192 12497515 12029315 12384238 12670722 12026384 12458246 12202011 11001479
3320A1001479J072043J095534p1940j90022j116213P74589j06437k07392k44999
$$ 11001479 12073522 13169056 13097116 12907094 11790881 12565470 12459033 12251641 12006642
3311A2006642O48784J95859n52977K1271m2960p53632J11089N09359l20320j28959
$$ 12006642 12655426 12851285 12298308 12319579 12276619 11522987 11634076 12143435 11823115 11694156
3301A1694156k21492M86345n39782Q1766K84999J55019N09813k87230K81705m22634
$$ 11694156 11472664 11959009 11419227 11500993 11785992 11941011 12450824 12163594 12445299 12022665
3291A2022665J11979l08785N76905N14333l49636P70965k68632J41348o7025k14948
$$ 12022665 12134644 11825859 12402764 12917097 12567461 13338426 13069794 13211142 13144117 12929169
3281A2929169k27466k03547J255106J85275l16261l78512R9938j95041J29618
$$ 12929169 12701703 12498156 13753262 13938537 13622276 13243764 13343702 13148661 13278279
3272A3278279o1112R59781O58802n35862J99319N83275j04512Q54729J14797J39591
$$ 13278279 13217167 14176948 14835750 14299888 14499207 15082482 14977970 15832699 15947496 16087087
3262A6087087M74685L7351R18891m94032j69099j045510l94995m51563l70389
$$ 16087087 16561772 16599123 17518014 17023982 16854883 15809373 15414378 14962815 14592426
3253A4592426k07387M4920j113221j181354M76930K836m94424l05762j28947J95523
$$ 14592426 14385039 14429959 13316738 12135384 12612314 12615150 12120726 11814964 11686017 11881540
3243A1881540k19451p22964K75998k00343L38881p3373L63362L36786q16610K54658
$$ 11881540 11662089 10939125 11215123 11014780 11353661 11280288 11643650 11980436 11163826 11418484
3233A1418484O24793o2725j461827p51720J6377m95729o68288J67015k16066M97757
$$ 11418484 12043277 11980552 10518725 9767005 9783382 9287653 8619365 8786380 8570314 9068071
3223I068071j36698n40797q69062l03100L2145J051816J73435n12670q30937L01377
$$ 9068071 8931373 8390576 7521514 7218414 7250559 8302375 8475810 7963140 7132203 7433580
3213G433580K70390l43781p34197N63377m60J24496M59529K21069o219l07558
$$ 7433580 7703970 7360189 6625992 7189369 7188909 7313405 7772934 7994003 7987784 7680226
3203G680226J61888K83534m31065m60113N80237r2953m55871N67652L16544p80864
$$ 7680226 7842114 8125648 7694583 7234470 7814707 7721754 7265883 7833535 8150079 7369215
3193G369215J99646p92961l52559k6222l5010r79926N42388L56930k40976M53657
$$ 7369215 7568861 6775900 6423341 6397119 6362109 5382183 5924571 6281501 6040525 6494182
3183F494182m40813j046106J130362L85154j084057L14097n3026p61824o08528
$$ 6494182 6053369 5007263 6137625 6522779 5438722 5752819 5699793 4937969 4329441
3174D329441L46817Q17869J132274r96273l70191m35472o93739N76292q6349p6220
$$ 4329441 4676258 5494127 6626401 5630128 5259937 4824465 4130726 4707018 4620669 4544449
3164D544449M29942M90892p38330k6576O24167K96999j065535J73409J98776N23323
$$ 4544449 4974391 5465283 4726953 4700377 5324544 5621543 4556008 4729417 4928193 5451516
3154E451516J17831o72001k77436p02057o41906J22483O12524L5136n60201K54195
$$ 5451516 5569347 4897346 4619910 3917853 3275947 3398430 4010954 4046090 3485889 3740084
3144C740084L78493m38959k16925K29128R00692k90566n20153P97101o01409o2959
$$ 3740084 4118577 3679618 3462693 3691821 4592513 4301947 3781794 4578895 3977486 3914527
3134C914527n97579k2268M77369m89108m87928M93608K26317r0503K97941n4587
$$ 3914527 3316948 3294680 3772049 3282941 2795013 3288621 3514938 3424435 3722376 3667789
3124C667789q04811l9738J043349L91502l61897n66853L87050r93229l29199P16772
$$ 3667789 2862978 2823240 3866589 4258091 3896194 3329341 3716391 2723162 2393963 3110735
3114C110735M71807K34423J38055j1947R64818n70564j142572p21667L14893J43083
$$ 3110735 3582542 3816965 3955020 3943073 4907891 4337327 3194755 2473088 2787981 2931064
3104B931064n69519L38095K01419L51627k71741m25293J69383L42686L97214M18819
$$ 2931064 2361545 2699640 2901059 3252686 2980945 2555652 2725035 3067721 3464935 3883754
3094C883754Q2345j278866K87804N94040m16493Q38179n10788N20506L7955m51237
$$ 3883754 3966099 2687233 2975037 3569077 3152584 3990763 3479975 4000481 4038436 3587199
3084C587199l13497M17517L51216r96874m36916l66941m69659q1802K92531K65255
$$ 3587199 3273702 3691219 4042435 3045561 2608645 2241704 1772045 1690243 1982774 2248029
3074B248029K7589l24896k7470K14716R7940J60263n11018l7058K92207O984M47950
$$ 2248029 2275618 1950722 1923252 2137968 2235908 2396171 1885153 1848095 2140302 2147286 2595236
3063B595236l30230j04831p03622J8898j69443m5797K40501L40993K41094j339116
$$ 2595236 2265006 2160175 1456553 1475451 1306008 1260211 1500712 1841705 2082799 743683
3053G43683L34020Q78862O4383n51040J242281J60692p6910N58172r11525K60798
$$ 743683 1077703 1956565 2020948 1469908 2712189 2872881 2795971 3354143 2442618 2703416
3043B703416l36454j291187j14264O59138O3581j3572J028813j582l96503l46377
$$ 2703416 2366962 1075775 961511 1620649 1684230 1670658 2699471 2697889 2301386 1955009
3033A955009M21686J67590j4398R2594j527613o34016J101107Q8885j40278J49968
$$ 1955009 2376695 2544285 2529887 2622481 1094868 460852 1561959 1650844 1510566 1660534
3023A660534K04570P37207o16095n85802R77163j32188m55418m671p09617M46364
$$ 1660534 1865104 2602311 1986216 1400414 2377577 2245389 1789971 1785300 1075683 1522047
3013A522047j73085J22322L8576J56509m65437O27589m94549K51662M35104j222613
$$ 1522047 1348962 1471284 1509860 1666369 1200932 1828521 1333972 1585634 2020738 798125
3003G98125L82348K00429N18618L1938m15211J56391j9576l90237o19590L75420
$$ 798125 1180473 1380902 1899520 1931458 1516247 1672638 1653062 1262825 643235 1018655
2993A018655L20954N02013l12757M23066M08148j5580m77115k38982L37371o78889
$$ 1018655 1339609 1841622 1528865 1951931 2360079 2344499 1867384 1628402 1965773 1286884
2983A286884M82096n8000j09451N28164n6970m52189O7695l4353M84799J93424
$$ 1286884 1768980 1710980 1601529 2129693 2072723 1620534 1688229 1653876 2138675 2332099
2973B332099j422262M44593K04892K15567r6521o72911l47980l188l22417Q38759
$$ 2332099 909837 1354430 1559322 1774889 1678368 1005457 657477 654289 331872 1170631
2963A170631L48412r12941K88811M08904R99047l26658l5594j65104o28532M96645
$$ 1170631 1519043 606102 894913 1303817 2302864 1976206 1940612 1775508 1146976 1643621
2953A643621j34186J57797L34467k41812K68391R03249K61894j275033l76659
$$ 1643621 1509435 1667232 2001699 1759887 2028278 2931527 3193421 1918388 1541729
2944A541729m39141L08224M6637n48508O44457K78477J42763m52296j28521K24848
$$ 1541729 1102588 1410812 1457449 908941 1553398 1831875 1974638 1522342 1393821 1618669
2934A618669J29880M27592n03250k07650P35603N67069n21267k58912m7929L36139
$$ 1618669 1748549 2176141 1672891 1465241 2200844 2767913 2246646 1987734 1939805 2275944
2924B275944j2818m19408J47071J288608n56426k21640o12005O3211p54963m14206
$$ 2275944 2263126 1843718 1990789 3279397 2722971 2501331 1889326 1952537 1197574 783368
2914G83368R39229P2534m14756k63932P66900J12775K92590J69773j74305k93151
$$ 783368 1722597 1795131 1380375 1116443 1883343 1996118 2288708 2458481 2284176 1991025
2904A991025k61527n42695L88569j05911J54669M13006M81634r3130p51020M30279
$$ 1991025 1729498 1186803 1575372 1469461 1624130 2037136 2518770 2425640 1674620 2104899
2894B104899j14075k25363K3135j33146Q44517R56537m69421n00008p20423K53786
$$ 2104899 1990824 1765461 1788596 1655450 2499967 3456504 2987083 2487075 1766652 2020438
2884B020438Q89847o61278J77173m14879l61441K1609o91236J01993M96636N18767
$$ 2020438 2910285 2249007 2426180 2011301 1649860 1671469 980233 1082226 1578862 2097629
2874B097629J44845l86263n52086J99935J02592J47983n26422N36614J37836j170432
$$ 2097629 2242474 1856211 1304125 1504060 1606652 1754635 1228213 1764827 1902663 732231
2864G32231Q93427N06295n94707O1559n75404n6818N91536o59303M63746N8405
$$ 732231 1625658 2131953 1537246 1598805 1023401 966583 1558119 898816 1362562 1420967
2854A420967J14025l8031q3523N26281o83297o76713j00910m56357O91789P31392
$$ 1420967 1534992 1496961 1413438 1939719 1256422 579709 478799 22442 714231 1445623
2844A445623O08157q5275r11067J28355k37953J67700m0102K26109j66748p3091
$$ 1445623 2053780 1968505 1057438 1185793 947840 1115540 1075438 1301547 1134799 1061708
2834A061708N73782q3811m10044l36796m84359J16214J69724M82078m71270J59017
$$ 1061708 1635490 1551679 1141635 804839 320480 436694 606418 1088496 617226 776243
2824G76243l15271n23595L72065Q01570L02576o34425N41309k84979n84294L66231
$$ 776243 460972 -62623 309442 1111012 1413588 779163 1320472 1035493 451199 817430
2814H17430M0847m90182J03097K46294N25705j052104k29500L07497L31751O9349
$$ 817430 858277 368095 471192 717486 1243191 191087 -38413 269084 600835 670184
2804F70184p5603Q2026N46856j65150R4378J60800n07838o52255L31748L20196
$$ 670184 594581 676607 1223463 1058313 1152691 1313491 805653 153398 485146 805342
2794H05342n57413O7467J96126Q72698P69245q81794k39835k7322l24243J68361
$$ 805342 247929 315396 511522 1384220 2153465 1271671 1031836 1004514 680271 848632
2784H48632N8164L69854r7061q59938k79551R69809M8348j22611m8386Q7409J8658
$$ 848632 906796 1276650 1179589 319651 40100 1009909 1058257 935646 887260 974669 993327
2773I93327J36740J35957K8665j13266p98157m33994K22467K7155m48548p1193
$$ 993327 1130067 1266024 1294689 1181423 383266 -50728 171739 198894 -249654 -320847
2763c20847P70340r658n70019O99638K68203m11768q14860J11750N96830K69628
$$ -320847 449493 439835 -130184 569454 837657 425889 -388971 -277221 319609 589237
2753E89237k44382j236245j30712R65364o05893k48231N79846P63998q2982j56384
$$ 589237 344855 -891390 -1022102 -56738 -662631 -910862 -331016 432982 350000 193616
2743A93616N5701K99553j07199m86518M60842j92883p64048K16116O78942M92766
$$ 193616 249317 548870 441671 -44847 415995 223112 -540936 -324820 354122 846888
2733H46888k93389k95079m30874J097135n30251q2485O46350m40912j089771L12227
$$ 846888 553499 258420 -172454 924681 394430 311945 958295 517383 -572388 -260161
2723b60161J099575p06702L71520N47908o04662O228P02762p22986M15368N87398
$$ -260161 839414 132712 504232 1052140 447478 453706 1156468 433482 848850 1436248
2713A436248m00560r87117N85821K88555N33308l90510J29055n84636k06299l36826
$$ 1436248 1035688 48571 634392 922947 1456255 1065745 1194800 610164 403865 67039
2703F7039L95672k40920k59304q26732P86045l01522j76675J182456j048421L1707
$$ 67039 462711 221791 -37513 -864245 -78200 -379722 -556397 626059 -422362 -390655
2693c90655P24259q91847O50919P37525n04560Q47034m22717p21102M02494L23951
$$ -390655 333604 -558243 92676 830201 325641 1172675 749958 28856 431350 755301
2683G55301j45006R1787j105108j103089O50474N46364M99807N78951r88254k03649
$$ 755301 610295 702082 -403026 -1506115 -855641 -309277 190530 769481 -218773 -422422
2673d22422M1064J032426K88468o16138o10440L10845L47235l55524j19948M65253
$$ -422422 -381358 651068 939536 323398 -287042 23803 371038 15514 -104434 360819
2663C60819J93961l99784m73432m59746N86058K34013K20740l16809p25887R53131
$$ 360819 554780 154996 -318436 -778182 -192124 41889 262629 -54180 -780067 173064
2653A73064L47391j53334J58159l35488k31748K59862L45496n77078o75317Q31323
$$ 173064 520455 367121 525280 189792 -41956 217906 563402 -13676 -688993 142330
2643A42330j19435J08261j12814j098115O57692M03001J47721L82636q36944K48720
$$ 142330 22895 131156 18342 -1079773 -422081 -19080 128641 511277 -325667 -76947
2633g6947P8183n72505K03414l9498J319390J29621j204139M57873M62032r84425
$$ -76947 1236 -571269 -367855 -407353 912037 1041658 -162481 295392 757424 -227001
2623b27001l10040J88137K39240j14068J035326M05226o22277l74460l48621M50771
$$ -227001 -537041 -348904 -109664 -223732 811594 1216820 594543 220083 -128538 322233
2613C22233J19483j319605J75448Q95743K6267l49925m46838J138179n32658L3498
$$ 322233 441716 -877889 -702441 193302 219569 -130356 -577194 560985 28327 61825
2603F1825N65209M7152p1512k84562j185781o83838L27456J524108o61220k81443
$$ 61825 627034 674186 602674 318112 -867669 -1551507 -1224051 300057 -361163 -642606
2593f42606K45178O09205R0977m66600K26320m42225M8086J161237l0339n52425
$$ -642606 -397428 211777 302754 -163846 62474 -379751 -331665 829572 799233 246808
2583B46808j026370K64440N66467j48332M0569l5895j55471l61588N26686M52863
$$ 246808 -779562 -515122 51345 -96987 -56418 -92313 -247784 -609372 -82686 370177
2573C70177K4225j17178m18822K17140J26959N32565k97103k87777J84550o75944
$$ 370177 394402 277224 -141598 75542 202501 735066 437963 150186 334736 -341208
2563c41208M81374L61366k04765j09118J82562l63470O20496l91484j19558m16988
$$ -341208 140166 501532 296767 187649 370211 6741 627237 235753 116195 -300793
2553c00793K79626l05057n3617j78017M49697j98326P10624O69276l89182j309342
$$ -300793 -21167 -326224 -379841 -557858 -108161 -306487 404137 1073413 684231 -625111
2543f25111M89532k7553L78415K19130n04578K26839k29200L41850j85347N04168
$$ -625111 -135579 -163132 215283 434413 -70165 156674 -72526 269324 83977 588145
2533E88145K90692l22510k20617k91818K37734K73486n7428O84214K18514k76114
$$ 588145 878837 556327 335710 43892 281626 555112 497684 1181898 1400412 1124298
2523A124298n52056M1801o21734k11706J010224K08717r34629J53993M23958J61533
$$ 1124298 572242 614043 -7691 -219397 790827 999544 64915 218908 642866 804399
2513H04399k15062j13150l64836J79191M44032O74511m29743m87770r2812r41110
$$ 804399 589337 476187 111351 290542 734574 1409085 979342 491572 398760 -542350
2503e42350j81870K64437o41069K82926N00483l00241j01904j97232J94650M2909
$$ -542350 -724220 -459783 -1100852 -817926 -317443 -617684 -719588 -916820 -722170 -679261
2493f79261N12957n0547N70709k81862m48009L02840j43290O26456r24457k85085
$$ -679261 -166304 -216851 353858 71996 -376013 -73173 -216463 409993 -514464 -799549
2483g99549J412067N43867n57959o46439j01759L77466N56203Q7484o09400o94275
$$ -799549 612518 1156385 598426 -48013 -149772 227694 783897 871381 261981 -432294
2473d32294J58938L76298j48076l35346n48228N13644K88467p523m55957P28786
$$ -432294 -273356 102942 -45134 -380480 -928708 -415064 -126597 -134120 -590077 138709
2463A38709M74691m30629J79632O48858J03547m35090j075156P50006l45701o98420
$$ 138709 613400 182771 362403 1011261 1114808 679718 -395438 354568 8867 -689553
2453f89553N11473O5491L045l01187M309K6196N27353R2943j16881j41955O39280
$$ -689553 -178080 -112589 -109544 -410731 -406422 -380226 147127 240070 123189 -18766 620514
2442F20514q6064M2100j83110l99071L39116J86453J83308m61225K92865l99493
$$ 620514 534450 576550 393440 -5631 333485 519938 703246 242021 534886 135393
2432A35393j63269k54979J52802J16018k73581J092029l48366o03603k9497K94700
$$ 135393 -27876 -282855 -130053 -14035 -287616 804413 456047 -147556 -177053 117647
2422A17647q67364r11137J052283J148525m69250L36796M23695k74153k59556
$$ 117647 -749717 -1660854 -608571 539954 70704 407500 831195 557042 297486
2413B97486J74279j99405j2670m29031r4928J30016L99587K31987p72436J55917
$$ 297486 471765 272360 259690 -169341 -264269 -134253 265334 497321 -275115 -119198
2403a19198R48771J10327m76382L98613M83073q95562q31249j69564Q01947m11615
$$ -119198 829573 939900 463518 862131 1345204 449642 -381607 -551171 250776 -160839
2393a60839R46306N48801Q9110N30886k38998o8558K10682p70713n97273m69718
$$ -160839 785467 1334268 1423378 1954264 1715266 1646708 1857390 1086677 489404 19686
2383A9686J21620O23751J92379k30721l79726o6129K67522j79180m29930N3312
$$ 19686 141306 765057 957436 726715 346989 280860 548382 369202 -60728 -7416
2373g416M57766K04805l14044n82485R1692M03872l04541N12925P1255L25526
$$ -7416 450350 655155 341111 -241374 -149682 254190 -50351 462574 533829 859355
2363H59355p32644n84481m47322N7976j70765M37564O79368N96037p70279N36661
$$ 859355 126711 -457770 -905092 -847116 -1017881 -580317 99051 695088 -75191 461470
2353D61470l32910n07868L55408J38722K45660m62132N13732K91420l85737l58494
$$ 461470 128560 -379308 -23900 114822 360482 -101650 412082 703502 317765 -40729
2343d0729Q11434r15674n23579L47228P7907N37484j004791M42560J76110J54053
$$ -40729 770705 -144969 -668548 -321320 -243413 294071 -710720 -268160 -92050 62003
2333F2003k00532q04074J052038l08493l69569j85664J25452R9743R4620k26887
$$ 62003 -138529 -942603 109435 -199058 -568627 -754291 -628839 -529096 -434476 -661363
2323f61363j06991O19490J94874m6467m16303l01582j27780J074306N97207q014
$$ -661363 -768354 -148864 46010 -457 -416760 -718342 -846122 228184 825391 817377
2313H17377l20467p06197m79303P13284q71275n84629J577239o75451o0987J011890
$$ 817377 496910 -209287 -688590 24694 -846581 -1431210 146029 -529422 -590409 421481
2303D21481j81173J24011m3152P5597p48540L4214L18496m37890K87021L60955
$$ 421481 240308 364319 321167 396764 -351776 -317562 934 -436956 -149935 211020
2293B11020j93187K89489K55378m87882k4423p7826J87954R97597j41930k85966
$$ 211020 17833 307322 562700 74818 50395 -27431 160523 1158120 1016190 730224
2283G30224K78855K92132l86757J13286L30117l8320Q5891k82875j31885q71574
$$ 730224 1009079 1301211 914454 1027740 1357857 1319537 1405428 1122553 990668 119094
2273A19094l37110j1542Q8663Q8187p20021P13437N80121k24798r08672J62050
$$ 119094 -218016 -229558 -140895 -52708 -772729 -59292 520829 296031 -612641 -450591
2263d50591M64903m66773J52318N68765M66321l86127L41069M57764l40943j87002
$$ -450591 14312 -452461 -300143 268622 734943 348816 689885 1147649 806706 619704
2253F19704N21250K95100p97136r99856L35018r786j13804L46081N44307m60687
$$ 619704 1140954 1436054 638918 -360938 -25920 -35706 -149510 196571 740878 280191
2243B80191l49037j16029N77455K47924k9513p42838Q23647P34806l02684k75180
$$ 280191 -68846 -184875 392580 640504 610991 -131847 691800 1426606 1123922 848742
2233H48742j40849N43921L10975r61299K93745K21451L51606m112l73988N86667
$$ 848742 707893 1251814 1562789 601490 895235 1116686 1468292 1464180 1090192 1676859
2223A676859K6597p38209j23318J042082p65329M24580j6988p59250N99160O67561
$$ 1676859 1703456 965247 841929 1884011 1118682 1543262 1526274 767024 1366184 2033745
2213B033745n79720m91449Q99830n18555L31778k84543k2730J67002m43363j15110
$$ 2033745 1454025 962576 1862406 1343851 1675629 1391086 1368356 1535358 1091995 976885
2203I76885l92819P54587N41434P51306M03632r2448q16173n81352M18401M81588
$$ 976885 584066 1338653 1880087 2631393 3035025 2942577 2126404 1545052 1963453 2445041
2193B445041p19383L78464J066591P85391K17461M65397J13604M9914m01798R0699
$$ 2445041 1725658 2104122 3170713 3956104 4173565 4638962 4752566 4802480 4400682 4491381
2183D491381l99203J23750L87344J93131J116212L60807l01242K65179n82745
$$ 4491381 4092178 4215928 4603272 4796403 5912615 6273422 5972180 6237359 5654614
2174E654614O67016R57199m00947R62576J42254O2104l4346M57182q4473l43168
$$ 5654614 6321630 7278829 6877882 7840458 7982712 8044816 8010470 8467652 8383179 8040011
2164H040011N09596o76300p0967J474065J094196L54269J06210R53505L83679
$$ 8040011 8549607 7873307 7802340 9276405 10370601 10724870 10831080 11784585 12168264
2155A2168264N36686K21455P31753Q43633k30313L80620Q78140L72632J439106
$$ 12168264 12704950 12926405 13658158 14501791 14271478 14652098 15530238 15902870 17341976
2146A7341976J593097J546050K040896J793920J851596K921158K217903K369245
$$ 17341976 18935073 20481123 22522019 24315939 26167535 29088693 31306596 33675841
2138C3675841L665202L259640K850520K010990K100998M004852M774592O990567
$$ 33675841 37341043 40600683 43451203 45462193 47563191 51568043 56342635 63333202
2130F3333202R483062J3571911J7071156K1835958K8463624L8405895N2677302
$$ 63333202 72816264 86388175 103459331 125295289 153758913 192164808 244842110
2123B44842110N4976236N1471082L1896389l5945953p8830725o6176849m3831803
$$ 244842110 299818346 351289428 383185817 347239864 268409139 202232290 158400487
2116A58400487k7000809k0259357j6010182j3967903j0497182p296123n463026
$$ 158400487 131399678 111140321 95130139 81162236 70665054 63368931 57905905
2109E7905905m807136k810379j778001j691869k988716m165772m514097k156038
$$ 57905905 53098769 50288390 48510389 46818520 43829804 39664032 35149935 32993897
2101C2993897k508625j148127k410331j963665j402206j729780m71630q39228
$$ 32993897 30485272 29337145 26926814 24963149 23560943 21831163 21359533 20520305
2093B0520305j451394r18919l95414n12228o2218j336211j893229p11392l68839
$$ 20520305 19068911 18149992 17754578 17242350 17180132 15843921 13950692 13239300 12870461
2084A2870461q52677q82391Q09011J91122j57565r98495j324043n51722R36325
$$ 12870461 12017784 11135393 11944404 12135526 11977961 10979466 9655423 9103701 10040026
2075A0040026q39522j126911l95940k70309K40147N82983j02969p71148R3566
$$ 10040026 9200504 8073593 7677653 7407344 7647491 8230474 8127505 7356357 7449923
2066G449923K18887n06234n81392K41421J48981j96720m17258j3500m21323k55450
$$ 7449923 7668810 7162576 6581184 6822605 6971586 6774866 6357608 6344108 5922785 5667335
2056E667335Q7891m49067M60798k50524p2646M78159n26067m37061j03085M52182
$$ 5667335 5755226 5306159 5766957 5516433 5443787 5921946 5395879 4958818 4855733 5307915
2046E307915J94500k50080o40516J19770j291391M70331O57107l33507j74490
$$ 5307915 5502415 5252335 4611819 4731589 3440198 3910529 4567636 4234129 4059639
2037D059639O39099k21429n06780k20981J79758j05191j57217j053091j89712
$$ 4059639 4698738 4477309 3970529 3749548 3929306 3824115 3666898 2613807 2424095
2028B424095P96669j80874J04686n74616N7876O35768j472065J38599L79420q00332
$$ 2424095 3220764 3039890 3144576 2569960 2627836 3263604 1791539 1930138 2309558 1509226
2018A509226R4474L88734K99134Q1483o16333N06738J19951o55461q05459k58439
$$ 1509226 1603700 1992434 2291568 2373051 1756718 2263456 2383407 1727946 922487 664048
2008F64048Q3868j46905Q76045k0695p67394R18944l2666p53243k07250L8922
$$ 664048 747916 601011 1477056 1456361 688967 1607911 1575245 822002 614752 653674
1998F53674O14213K51351J02266K59429m70120n8034q81570L44797j55563m18930
$$ 653674 1267887 1519238 1621504 1880933 1410813 1352779 471209 816006 660443 241513
1988B41513J104035L14270j36409L66539m53742L42826j37725r2004l64390l80449
$$ 241513 1345548 1659818 1523409 1889948 1436206 1779032 1641307 1549303 1184913 804464
1978H04464L81910L08127l14142n27524N43604n24686J76770m6707k72263M35438
$$ 804464 1186374 1494501 1180359 652835 1196439 671753 848523 801816 529553 964991
1968I64991l65631j87069l15251k11499Q08334N70151j60920k74726L94595p03877
$$ 964991 599360 412291 97040 -114459 693875 1264026 1103106 828380 1222975 519098
1958E19098L99325p9467L82200N6592m71354k37543r8756l76870J308375J05696
$$ 519098 918423 838956 1221156 1277748 806394 568851 470095 93225 1401600 1507296
1948A507296j388725L37942M00000k26801p34164o85595J245576j33509k69757
$$ 1507296 118571 456513 856513 629712 -104452 -790047 455529 322020 52263
1939E2263L55988j6977j42294l33633L09716O31465j198q11456n74677N06204
$$ 52263 408251 391274 248980 -84653 225063 856528 855330 43874 -530803 -24599
1929b4599N30846p2545K27930p54538l74655J323752l55168N16268n73187N792
$$ -24599 506247 433702 661632 -92906 -467561 856191 501023 1017291 444104 449896
1919D49896j15845l34047N15468P61190O0803m82652O72365m1635k42911r67608
$$ 449896 334051 4 515472 1276662 1337465 854813 1527178 1485543 1242632 275024
1909B75024L73939M19022k50474j79108M10299l68986o1849m04767R0154p30202
$$ 275024 648963 1067985 817511 638403 1048702 679716 617867 213100 303254 -426948
1899d26948l74559L59694J27292o6427l5944J30570R9295P18015j4457O60893
$$ -426948 -801507 -441813 -314521 -380948 -416892 -286322 -187027 530988 516531 1177424
1889A177424l78217J58629l28286m97242q4010J208565m15334n87235O81558P8153
$$ 1177424 799207 957836 629550 132308 48298 1256863 841529 254294 935852 1014005
1879A014005m41167l83621l96013K62386J00917q30913N23850J276160m64093
$$ 1014005 572838 189217 -206796 55590 156507 -674406 -150556 1125604 661511
1870F61511J07848k59772l00851N1037R38164K57171p27663K15701j793479l31705
$$ 661511 769359 509587 208736 259773 1197937 1455108 727445 943146 -850333 -1182038
1860a182038Q95981J000857p34744r6921J048175k93753L82828P92864R4529N46724
$$ -1182038 -286057 714800 -19944 -116865 931310 637557 1020385 1813249 1907778 2454502
1850B454502o13930r84369p62447R57635M3280l24854P10423j133296j275727
$$ 2454502 1840572 856203 93756 1051391 1094671 769817 1480240 346944 -928783
1841i28783L83388J27954N84545L28207k6410J81054q7596n69094k19921j4164
$$ -928783 -545395 -417441 167104 495311 468901 649955 562359 -6735 -226656 -240820
1831b40820M67394r3536K74463k12219N55086m02208J27455j19611k48307k31303
$$ -240820 226574 133038 407501 195282 750368 348160 475615 356004 107697 -123606
1821a23606k48718M98722R29616p95556J5235o99789l80075J80210M28256l04080
$$ -123606 -372324 126398 1056014 260458 275693 -424096 -804171 -623961 -195705 -499785
1811d99785k74418N91058o9869l78532M10837J08897j56088L20011r46696m3110
$$ -499785 -774203 -183145 -253014 -631546 -220709 -111812 -267900 52111 -894585 -937695
1801i37695L69602J012996k81082m84408P4143M6475J64777K68761q1855p9445
$$ -937695 -568093 444903 163821 -320587 -246444 -199969 -35192 233569 151714 72269
1791G2269J59786k95861p1887m1463l10864R76513l41929M73646m98263O32467
$$ 72269 232055 -63806 -135693 -177156 -488020 488493 146564 620210 121947 754414
1781G54414o33633J44611L77363k76048N73978j33906R0135l66275l63008L35422
$$ 754414 120781 265392 642755 366707 940685 806779 896914 530639 167631 503053
1771E03053P4263l89341j7716L56524n82496l96494k82499J89329M88198K20718
$$ 503053 577316 187975 170259 526783 -55713 -452207 -734706 -545377 -57179 163539
1761A63539l7657l78349k60575K43425p0679K47870o7964r8566p54288j25583
$$ 163539 125882 -252467 -513042 -269617 -340296 -92426 -160390 -258956 -1013244 -1138827
1751a138827J106636M44108n12410j48186j075726O01044N51265L09542m79411
$$ -1138827 -32191 411917 -100493 -248679 -1324405 -723361 -172096 137446 -341965
1742c41965M78235M42259l48395M94845r6697n05560j83243M3958m9948o0701
$$ -341965 136270 578529 230134 724979 628282 122722 -60521 -16563 -66511 -127212
1732a27212K22334O80292r39796p38035K67924M23854J08569K09795R9092P93544
$$ -127212 95122 775414 -164382 -902417 -634493 -210639 -102070 107725 206817 1000361
1722A000361N93379r16248o30203n7160o88103J91566j50421J70433q7624J57897
$$ 1000361 1593740 677492 47289 -9871 -697974 -506408 -656829 -486396 -574020 -416123
1712d16123k6105q7402j63639n8684K89867N23904k12292j76958P50199j092174
$$ -416123 -442228 -529630 -693269 -751953 -462086 61818 -150474 -327432 422767 -669407
1702f69407j14692Q47435q30953N61982N36040o51864k00118M66266q23081J549
$$ -669407 -784099 63336 -767617 -205635 330405 -321459 -521577 -55311 -878392 -876843
1692h76843M84822r5507J14007O58453M13163L54450n44415J51312k11780J94196
$$ -876843 -392021 -487528 -373521 284932 698095 1052545 508130 659442 447662 641858
1682F41858M000m06058m85429J00414j62690k37352K34902J21001R33504j57850
$$ 641858 645858 239800 -245629 -145215 -307905 -545257 -310355 -189354 744150 586300
1672E86300p03701r89668K2895L75798o40229N11593J219332j94053L76070l06207
$$ 586300 -117401 -1107069 -1084174 -708376 -1348605 -837012 382320 188267 564337 258130
1662B58130k98707M59465q59406j17634K66847m1911L1620K79041k28636l42205
$$ 258130 -40577 418888 -440518 -558152 -291305 -333216 -301596 -22555 -251191 -593396
1652e93396P06616O40258q10952J86515l3831m84281L70932J24088j07966j40127
$$ -593396 113220 753478 -57474 129041 95210 -389071 -18139 105949 -2017 -142144
1642a42144j06269K3854m0895M6955J42394m9448O01581K97436m43869j59404
$$ -142144 -248413 -224559 -265454 -218499 -76105 -125553 476028 773464 329595 170191
1632A70191k70968l49363k62337O34731J14406r94665k60584M3150J11240N39078
$$ 170191 -100777 -450140 -712477 -77746 36660 -958005 -1218589 -1175439 -1064199 -525121
1622e25121J68109L97597N9969j86347J89630n80472N59653J72807J958M49389
$$ -525121 -357012 40585 100554 -85793 103837 -476635 83018 255825 257783 707172
1612G07172L20685j53243n81408j2045n19564l95642R76167k69218J8459p5332
$$ 707172 1027857 874614 293206 281161 -238403 -634045 342122 72904 91363 16031
1602A6031j229806L40908J19793n48978N94468L81853P28130K63332j45844L52320
$$ 16031 -1213775 -872867 -753074 -1302052 -707584 -325731 402399 665731 519887 872207
1592H72207k92502M4241L89924r55773L75030m28133M06893k49881m03019M8097
$$ 872207 579705 623946 1013870 58097 433127 4994 411887 162006 -241013 -192916
1582a92916j035550O89735M57363M74820q4672R4708J36703K84860l65580q99292
$$ -192916 -1228466 -538731 -81368 393452 308780 403488 540191 825051 459471 -439821
1572d39821R43226n25540P51953M03309p01469o6625L32884J94053k04434k65574
$$ -439821 503405 -22135 729818 1133127 431658 365033 697917 891970 687536 421962
1562D21962Q53137n46601q17034O48916m83621r46255L19716N46892P4249K3098
$$ 421962 1275099 728498 -88536 560380 76759 -869496 -549780 -2888 71361 94459
1552I4459k02656L44158j58096k19269J67828Q93706K51671p5487o56587R1381
$$ 94459 -108197 235961 77865 -141404 26424 920130 1171801 1096314 439727 531108
1542E31108K30073j046427P52413l7508J83388J53793N71151r74513n56949O04472
$$ 531108 761181 -285246 467167 429659 613047 766840 1337991 363478 -193471 411001
1532D11001J10426m63591K63996N93781m39892L85079q06332l32871j62900J3125
$$ 411001 521427 57836 321832 915613 475721 860800 54468 -278403 -441303 -428178
1522d28178m56852l45665N13108J66796j27332l59014l36542R72471j91293P77294
$$ -428178 -885030 -1230695 -717587 -550791 -678123 -1037137 -1373679 -401208 -592501 184793
1512A84793l66592j72901J63330k98194J78918N67226m7118m55305n97012J22515
$$ 184793 -181799 -354700 -191370 -489564 -310646 256580 209462 -245843 -842855 -720340
1502g20340l96038Q61820N91224l50166Q61912l58611J37553m8217m35238l50273
$$ -720340 -1116378 -254558 336666 -13500 848412 489801 627354 579137 143899 -206374
1492b06374J465J86001K47439M1043r80230Q9761M02793M56757N265J21171n22951
$$ -206374 -204909 -18908 228531 269574 -710656 -620895 -218102 238655 243920 365091 -157860
1481a57860n06629J37181O59657j47135o77567k63079J192443l53794k30629k21683
$$ -157860 -664489 -527308 132349 -14786 -692353 -955432 237011 -116783 -347412 -569095
1471e69095M26859L00364l92725L41137O9143l18932N7438M97531Q7322l48423
$$ -569095 -142236 158128 -234597 106540 175683 -143249 -85811 411720 499042 150619
1461A50619o94648K89492o99113J28135M39649K19062m43090L39131J7057l75468
$$ 150619 -544029 -254537 -953650 -825515 -385866 -166804 -609894 -270763 -253706 -629174
1451f29174L2972K3247l76383L75475Q4704j08540N3825N63449j77438p27771
$$ -629174 -596202 -572955 -949338 -573863 -489159 -597699 -543874 19575 -157863 -885634
1441h85634m54327J14790M81339K02185P94377k16340m31585p4036Q1927j63823
$$ -885634 -1339961 -1225171 -743832 -541647 252730 36390 -395195 -469231 -387304 -551127
$$ [...]
##END NTUPLES=NMR SPECTRUM
##END=
