##TITLE=1H_TG-2341-B41
 CDCl3
 8 sc, 
 13.1.2022
##JCAMPDX= 6.0         $$ Bruker NMR JCAMP-DX V2.0
##DATA TYPE= NMR SPECTRUM
##DATA CLASS= NTUPLES
##ORIGIN= UXNMR, Bruker Analytische Messtechnik GmbH
##OWNER= root
$$ XWIN-NMR		Version 3.5
$$ Thu Jan 13 11:39:13 2022 Russian Standard Time (UT+4h)  she@DPX200
##.OBSERVE FREQUENCY= 200.131346
##.OBSERVE NUCLEUS= ^1H
##.ACQUISITION MODE= SIMULTANEOUS
##.ACQUISITION SCHEME= undefined
##.AVERAGES= 8
##.DIGITISER RES= 18
##SPECTROMETER/DATA SYSTEM= spect
##.PULSE SEQUENCE= zg30
##.SOLVENT NAME= D2O
##.SHIFT REFERENCE= (INTERNAL, D2O, 0, 15.7171)
##AUDIT TRAIL= $$ (NUMBER, WHEN, WHO, WHERE, WHAT)
$$ ##TITLE= Audit trail, XWIN-NMR		Version 3.5
$$ ##JCAMPDX= 5.01
$$ ##ORIGIN= Bruker BioSpin GmbH
$$ ##OWNER= she
$$ F:/spectra/data/she/nmr/H-F/1/pdata/1/auditp.txt
$$ ##AUDIT TRAIL=  $$ (NUMBER, WHEN, WHO, WHERE, WHAT)
(   1,<2022-01-13 11:38:05.31 +0400>,<she>,<DPX200>,
      <created by zg, POWCHK disabled, PULCHK disabled
       configuration hash MD5:
       00 E9 B6 7A A2 85 ED C7 34 08 36 98 17 FE 4E 26
       data hash MD5: 16K
       D1 41 2F 3A 64 45 06 B1 B5 46 32 2D B6 12 AA C4>)
(   2,<2022-01-13 11:38:08.15 +0400>,<she>,<DPX200>,
      <Start of raw data processing
       efp BC_mod = 2 LB = 0.24 FT_mod = 6 PKNL = 1 PHC0 = -15866.54 PHC1 = 12.40079 SI = 16K 
       data hash MD5: 16K
       52 11 68 EC 89 92 7F 10 4E D2 08 DC 30 0F E3 0E>)
(   3,<2022-01-13 11:38:22.64 +0400>,<she>,<DPX200>,
      <pk PHC0 = 0.2578043 PHC1 = -0.4000001 
       data hash MD5: 16K
       68 A0 26 60 F8 A3 5E 6B CA E0 C9 33 7A B9 81 3D>)
(   4,<2022-01-13 11:38:25.71 +0400>,<she>,<DPX200>,
      <abs ABSG = 5 
       data hash MD5: 16K
       04 F8 FD 6F 3F 8C 52 67 7D 30 AE 16 E7 8D 46 96>)
$$ ##END=
$$ 
$$ hash MD5
$$ CF 17 37 B3 80 37 C7 95 A3 83 6A A2 82 84 E3 B3
##$RELAX= 
##$RELAX= 
##$RELAX= 
##$RELAX= 
##$RELAX= 
##$RELAX= 
$$ Bruker specific parameters
$$ --------------------------
##$DU= <F:/spectra>
##$EXPNO= 1
##$NAME= <H-F>
##$PROCNO= 1
##$TYPE= <nmr>
##$USER= <she>
##$AMP= (0..31)
100 100 100 100 100 100 100 100 100 100 100 100 100 100 100 100 100 100 
100 100 100 100 100 100 100 100 100 100 100 100 100 100 
##$AQSEQ= 0
##$AQ_mod= 1
##$AUNM= <au_zg>
##$AUTOPOS= <>
##$BF1= 200.13
##$BF2= 200.13
##$BF3= 200.13
##$BF4= 200.13
##$BF5= 200.13
##$BF6= 200.13
##$BF7= 200.13
##$BF8= 200.13
##$BYTORDA= 1
##$CFDGTYP= 0
##$CFRGTYP= 5
##$CHEMSTR= <none>
##$CNST= (0..31)
1 1 145 1 1 1 1 1 1 1 1 1 1 1 1 1 1 1 1 1 1 1 1 1 1 1 1 1 1 1 1 1 
##$CPDPRG= <>
##$CPDPRG1= <>
##$CPDPRG2= <>
##$CPDPRG3= <>
##$CPDPRG4= <mlev>
##$CPDPRG5= <mlev>
##$CPDPRG6= <mlev>
##$CPDPRG7= <mlev>
##$CPDPRG8= <mlev>
##$CPDPRGB= <>
##$CPDPRGT= <>
##$D= (0..31)
0 1.2 0 0 0 0 0 0 0 0.06 0 0.03 0 0 0 0 0.0002 0 0 0 0 0 0 0 0 0 0 0 0 
0 0 0 
##$DATE= 1642059484
##$DBL= (0..7)
120 120 120 120 120 120 120 120 
##$DBP= (0..7)
150 150 150 150 150 150 150 150 
##$DBP07= 0
##$DBPNAM0= <>
##$DBPNAM1= <>
##$DBPNAM2= <>
##$DBPNAM3= <>
##$DBPNAM4= <>
$$ [...]
##$SUBNAM2= <"">
##$SUBNAM3= <"">
##$SUBNAM4= <"">
##$SUBNAM5= <"">
##$SUBNAM6= <"">
##$SUBNAM7= <"">
##$SUBNAM8= <"">
##$SUBNAM9= <"">
##$SW= 18.0517287032376
##$SWIBOX= (0..15)
0 0 2 0 0 0 0 0 0 0 0 0 0 0 0 0 
##$SW_h= 3612.71676300578
##$TD= 16384
##$TD0= 1
##$TE= 0
##$TE2= 300
##$TE3= 300
##$TEG= 300
##$TL= (0..7)
0 120 120 120 120 120 120 120 
##$TP= (0..7)
150 150 150 150 150 150 150 150 
##$TP07= 0
##$TPNAME0= <>
##$TPNAME1= <>
##$TPNAME2= <>
##$TPNAME3= <>
##$TPNAME4= <>
##$TPNAME5= <>
##$TPNAME6= <>
##$TPNAME7= <>
##$TPOAL= (0..7)
0.5 0.5 0.5 0.5 0.5 0.5 0.5 0.5 
##$TPOFFS= (0..7)
0 0 0 0 0 0 0 0 
##$TUNHIN= 0
##$TUNHOUT= 0
##$TUNXOUT= 0
##$USERA1= <user>
##$USERA2= <user>
##$USERA3= <user>
##$USERA4= <user>
##$USERA5= <user>
##$V9= 5
##$VALIST= <valist>
##$VCLIST= <CCCCCCCCCCCCCCC>
##$VD= 0
##$VDLIST= <DDDDDDDDDDDDDDD>
##$VPLIST= <PPPPPPPPPPPPPPP>
##$VTLIST= <TTTTTTTTTTTTTTT>
##$WBST= 1024
##$WBSW= 4
##$XGAIN= (0..3)
0 0 0 0 
##$XL= 0
##$YL= 0
##$YMAX_a= 392251
##$YMIN_a= -606575
##$ZGOPTNS= <>
##$ZL1= 120
##$ZL2= 120
##$ZL3= 120
##$ZL4= 120
##$ABSF1= 15.71714
##$ABSF2= -2.334709
##$ABSG= 5
##$ABSL= 3
##$ALPHA= 0
##$AQORDER= 0
##$ASSFAC= 0
##$ASSFACI= 0
##$ASSFACX= 0
##$ASSWID= 0
##$AUNMP= <proc_1d>
##$AZFE= 0.1
##$AZFW= 0.1
##$BCFW= 0
##$BC_mod= 2
##$BYTORDP= 0
##$COROFFS= 0
##$CY= -3
##$DATMOD= 1
##$DC= 0
##$DFILT= <>
##$DTYPP= 0
##$F1P= 0
##$F2P= 0
##$FCOR= 1
##$FTSIZE= 16384
##$FT_mod= 6
##$GAMMA= 0
##$GB= 0
##$INTBC= 1
##$INTSCL= 0
##$ISEN= 128
##$LB= 0.24
##$LEV0= 0
##$LPBIN= 0
##$MAXI= 10000
##$MC2= 0
##$MEAN= 0
##$ME_mod= 0
##$MI= 1.114404
##$NCOEF= 0
##$NC_proc= -6
##$NLEV= 6
##$NOISF1= 3.799351
##$NOISF2= 2.8
##$NSP= 0
##$NTH_PI= 0
##$NZP= 0
##$OFFSET= 15.71714
##$PC= 1
##$PHC0= -15866.28
##$PHC1= 12.00079
##$PH_mod= 1
##$PKNL= yes
##$PPARMOD= 0
##$PSCAL= 0
##$PSIGN= 0
##$REVERSE= no
##$SF= 200.130006887706
##$SI= 16384
##$SIGF1= 3
##$SIGF2= 2
##$SINO= 5.538805
##$SIOLD= 16384
##$SREGLST= <1H.CDCl3>
##$SSB= 0
##$STSI= 16384
##$STSR= 0
##$SW_p= 3612.71676300578
##$SYMM= 0
##$S_DEV= 0
##$TDeff= 16384
##$TDoff= 0
##$TI= <>
##$TILT= no
##$TM1= 0
##$TM2= 0
##$TOPLEV= 0
##$USERP1= <user>
##$USERP2= <user>
##$USERP3= <user>
##$USERP4= <user>
##$USERP5= <user>
##$WDW= 1
##$XDIM= 16384
##$YMAX_p= 478943018
##$YMIN_p= -519427
$$ End of Bruker specific parameters
$$ ---------------------------------
##NTUPLES= NMR SPECTRUM
##VAR_NAME=  FREQUENCY,     SPECTRUM/REAL,   SPECTRUM/IMAG
##SYMBOL=    X,             R,               I
##VAR_TYPE=  INDEPENDENT,   DEPENDENT,       DEPENDENT
##VAR_FORM=  AFFN,          ASDF,            ASDF
##VAR_DIM=   16384,         16384,           16384
##UNITS=     HZ,            ARBITRARY UNITS, ARBITRARY UNITS
##FACTOR=    0.220516191357247, 1,           1
##FIRST=     3145.47137603153, 0,            0
##LAST=      -467.24538697425, 0,            0
##MIN=       -467.24538697425, -519427,      0
##MAX=       3145.47137603153, 478943018,    0
$$ Real data points
##PAGE= N=1
##DATA TABLE= (X++(R..R)), XYDATA
$$ [...]
7140B679398J29906J48879N7125J85288K4611N9646J52290R6768J43597Q0802
7130C758310K8211J46733R9706K7261J12247J91669K57306Q0901K16583K42824
7120E161751J29098L21629K25435O6648K39374J55211J31106R5751J98846K33186
7110F958035J35318J75293K65460J43692K14646J15618K13572K58774K30273L95871
7100I106552K91191L09077K16415L41244L51725L89943N06069N33824M86561O45202
7090A3177803M83830O87469Q24823P24642Q60928J028087J118595J215718J445194
7081B1567089J584083J513041J550265J559399J626227J584332J716693J793780
7073C4494909J882108K112989K254809K535983K875100L212826L734290M428438
$$ y = [2679398, 2809304, 2958183, 3015308, 3200596, 3225207, 3284853, 3437143, 3533911, 3677508, 3758310, 3786521, 3933254, 4032960, 4060221, 4172468, 4364137, 4621443, 4702344, 4918927, 5161751, 5290849, 5612478, 5837913, 5904561, 6143935, 6299146, 6430252, 6526003, 6724849, 6958035, 7093353, 7268646, 7534106, 7677798, 7892444, 8008062, 8221634, 8480408, 8710681, 9106552, 9397743, 9706820, 9923235, 10264479, 10616204, 11006147, 11512216, 12046040, 12532601, 13177803, 13661633, 14349102, 15173925, 15898567, 16759495, 17787582, 18906177, 20121895, 21567089, 23151172, 24664213, 26214478, 27773877, 29400104, 30984436, 32701129, 34494909, 36377017, 38490006, 40744815, 43280798, 46155898, 49368724, 53103014, 57531452]
7065E7531452N318520O603753Q106822R705662J1277501J1993934J1630307R636105
7057A31804056N894596J357990l082518o599137q925668j0034769j0855162j1491422
7049H8067966j1444870j0736285r374206p479488n991281m781222l779372l089218
7041C1392024k549531k153282j889488j612767j384597j229720j113074r30066
7033A8529499q04741q48620p96315o80591n36956n35131p05243n81549o81981
7024A2358372o08207m98173m94144m33122m43807m33383k84171l77684l18311
7015H467370l13352k92182j71860k32732k69667k34730k61370l57498k73958j53507
7005E906514j43013k20640k20943j19529q1171j38568j80879k12902k48044o1589
$$ y = [57531452, 62849972, 69453725, 77560547, 87266209, 98543710, 110537644, 122167951, 131804056, 137698652, 139056642, 135974124, 129374987, 120449319, 110414550, 99559388, 88067966, 76623096, 65886811, 56512605, 49033117, 43041836, 38260614, 34481242, 31392024, 28842493, 26689211, 24799723, 23186956, 21802359, 20572639, 19459565, 18529499, 17724758, 16876138, 16079823, 15399232, 14862276, 14327145, 13621902, 13040353, 12358372, 11750165, 11251992, 10757848, 10324726, 9880919, 9447536, 9163365, 8785681, 8467370, 8154018, 7861836, 7689976, 7457244, 7187577, 6952847, 6691477, 6333979, 6060021, 5906514, 5763501, 5542861, 5321918, 5202389, 5121218, 4982650, 4801771, 4588869, 4340825, 4279236]
6995D279236P312q4473o1926m4581j04202j20751j25321N0272l2575p3135j37668
6984C552188k8419p1469j55457j33119j17201n1530q5807m856j04440j66458j90291
6973B443141p6958M2929k3829j3939p7627l2521J8513J9140j05418l1925o2937
6962B098569n2178k3284l0756q2023n4620R529p7416n7464j10315j05163l4000
6951A480879K2843m482k7301o7062J8777N4696j05512M0633k948q7664N3524o5717
6939A310666L1607j4233l5842l5509j0941p0536M70l4012j0848m2046p0943l2257
6927I85576Q840R7969N3374p3961P7351L1325m7384j08641r3307p0103o7581J43046
6915I36504O735j02586Q9070n8041K0569Q839O8528n6378j20185k1441J2329l2040
$$ y = [4279236, 4286548, 4202075, 4140149, 4095568, 3991366, 3870615, 3745294, 3795566, 3762991, 3689856, 3552188, 3523769, 3452300, 3296843, 3163724, 3046523, 2994993, 2909186, 2904330, 2799890, 2633432, 2443141, 2366183, 2409112, 2385283, 2371344, 2293717, 2261196, 2279709, 2298849, 2193431, 2161506, 2098569, 2046391, 2023107, 1992351, 1910328, 1855708, 1865237, 1787821, 1730357, 1620042, 1514879, 1480879, 1503722, 1499240, 1471939, 1404877, 1423654, 1478350, 1372838, 1413471, 1410523, 1322859, 1376383, 1310666, 1342273, 1328040, 1292198, 1256689, 1245748, 1175212, 1175682, 1141670, 1130822, 1088776, 1017833, 985576, 994416, 1092385, 1145759, 1071798, 1149149, 1180474, 1133090, 1024449, 931142, 861039, 793458, 936504, 943239, 840653, 929723, 871682, 892251, 901090, 969618, 913240, 793055, 771614, 783943, 751903]
6903G51903R4590j26127r2730J6350N6229j2761q7748J16658l5693k6644O795
6892F60822j61149N7152L3568k8664M141M4030P6588q828m0180o0431l1136M5891
6880E91804o5320n2779M0462O050J01947r680n6558R9965o853r8390l2847o544
6868E11257J02425j14064J0725P3461n4521P370R8140j4127p5644l3738j0197
6857E01087k0562J2071K3999j6489n9517L276J9395M6564K636J0482J0703j1471
6845E22174l8301j5125N5775L1148l6969q3538M2318j9865J6131K9789j85501
6834C18036k036O0551P075P7107n2767q4407J5611K2277k3260j16171K8338Q4239
6822C34593j02564R709J50357j82085l2999m1680O6163j4325P4064O3346j5200
$$ y = [751903, 846493, 720366, 627636, 643986, 700215, 687454, 599706, 716364, 680671, 654027, 660822, 499673, 556825, 590393, 561729, 565870, 609900, 686488, 677660, 637480, 577049, 545913, 591804, 526484, 473705, 514167, 520217, 622164, 612484, 555926, 655891, 649038, 550648, 517801, 511257, 613682, 499618, 510343, 583804, 529283, 536653, 634793, 620666, 545022, 511284, 501087, 480525, 492596, 516595, 500106, 440589, 443865, 463260, 509824, 512460, 522942, 533645, 522174, 483873, 468748, 524523, 555671, 518702, 435164, 477482, 457617, 473748, 503537, 318036, 316000, 376551, 383626, 460733, 407966, 323559, 339170, 361447, 338187, 222016, 250354, 334593, 232029, 241738, 392095, 210010, 177011, 135331, 201494, 187169, 261233, 324579, 309379]
6811C09379p9314O1409K8391J1634M9382n0094p9016j4734o7092L7007L6768J7210
6799B60930P3460q0341K4624m9299R4422L3260J060L0878q0348j21158K1997M0188
6787B49673N2885M6605o6820L9641N8206R0997n9837j43562n2280L9343P091O1908
6775C23850n2279k6130m819p9817J31913q009j6505O5237l9190k5346j6987m4321
6763B07597m994J948p0647K4713J04890l8129k1734M4708J11225l6754n2723r1230
6751A78870O9868N4790k7746q5327J6643l3174N6230p2924q3918J07068M5668
6740B26048P5382k353Q3395n36q9203N6988j8428k8365L9232j3933n30n1884j12544
6727A63269J47933m7672J2472J50236m8349o7807l392J042K679L2214q24K8506
$$ y = [309379, 230065, 291474, 319865, 331499, 380881, 330787, 251771, 237037, 169945, 206952, 243720, 260930, 334390, 254049, 278673, 229374, 323796, 357056, 358116, 388994, 308646, 187488, 209485, 249673, 302558, 349163, 282343, 321984, 380190, 471187, 411350, 267788, 215508, 254851, 261942, 323850, 271571, 245441, 240622, 160805, 292718, 284709, 268204, 333441, 294251, 268905, 251918, 207597, 202603, 204551, 133904, 158617, 263507, 225378, 203644, 248352, 359577, 322823, 270100, 178870, 248738, 303528, 275782, 190455, 207098, 173924, 230154, 157230, 73312, 180380, 226048, 301430, 299077, 382472, 381936, 292733, 349721, 331293, 302928, 342160, 328227, 327697, 275813, 163269, 311202, 263530, 276002, 426238, 377889, 310082, 306690, 307732, 310411, 342625, 341801, 370307]
6715C70307M0928m9553m9919K7165K8106n3391J54n716P9892k4917l0172p031
6703C25853L3169j1538k233J00857l3189J2806j0129P7765j29150n6579r837j5917
6691B81878M1484K8566O6279k5305o877M0487n1765k1667Q2928J02655o2649n4920
6679D21094O2089O0466l6737k7333J5184j11754N7494L3984P4169J31216J5602
6668F95474r0386j4524O5248Q4258p9736k8699J12662N8369K2027J09471k4490
6657I09674K8900P4448j8599L3186n7839p3129K561J365q0474o6081j3227q96
6645G39889j36262L2669p7015L014j3088J8990j702M4103p3233j685P9449M5915
6633F61044j9615o4688m1739o3895j6999j2183L0401J9437R6311p8509j4459n8259
$$ y = [370307, 411235, 361682, 311763, 338928, 367034, 313643, 313797, 308081, 387973, 363056, 332884, 325853, 359022, 347484, 345251, 446108, 412919, 425725, 415596, 493361, 364211, 307632, 297795, 281878, 323362, 351928, 418207, 392902, 386025, 426512, 374747, 353080, 436008, 538663, 476014, 421094, 483183, 543649, 506912, 479579, 494763, 383009, 440503, 474487, 548656, 679872, 695474, 605088, 590564, 655812, 740070, 660334, 631635, 744297, 802666, 824693, 934164, 909674, 938574, 1013022, 994423, 1027609, 969770, 896641, 899202, 900567, 820093, 754012, 740785, 739889, 603627, 636296, 559281, 562295, 549207, 568197, 566495, 610598, 537365, 535680, 615129, 661044, 641429, 576741, 535002, 471107, 454108, 441925, 472326, 491763, 588074, 509565, 495106, 436847]
6621D36847p5412l1068O2207m4458m0889K220J1388P8635l3793N7847p1157K6499
6609C78866O2183J7510q545P272j5300J9712n7240j7757Q2455P2276R9212P5519
6597G16163j27966j27340j6304N6120P237m3351m2494J2338R0326k2269q1649
6586D20811J06334P40K8604P4185p7581l5232N2977K773n9128K5913j25436M7197
6574D62157k1164k4893L2917N637L6699N8674k5350l3635k1287n483N0941P3963
6562E89176p1851Q6972l702p1062M7933O613O0216p1432j05002M8271O91j6246
6550E00577k0092J7081O5280R8089j02306j5682K0579K1163J6526j6836j1469
6539E72910p249N2534r8432N3810O9580N0921n5198o4735K4232L1623m2706n4411
$$ y = [436847, 361435, 330367, 392574, 348116, 307227, 309447, 320835, 399470, 365677, 423524, 352367, 378866, 441049, 458559, 450014, 457286, 441986, 461698, 404458, 386701, 469156, 541432, 640644, 716163, 588197, 460857, 444553, 500673, 507910, 464559, 422065, 434403, 524729, 502460, 420811, 527145, 527885, 556489, 630674, 553093, 517861, 570838, 573611, 514483, 540396, 414960, 462157, 440993, 416100, 449017, 454654, 491353, 550027, 524677, 491042, 469755, 464272, 515213, 589176, 517325, 604297, 600595, 529533, 577466, 584079, 644295, 572863, 467861, 516132, 516823, 500577, 480485, 497566, 562846, 660935, 558629, 542947, 563526, 584689, 601215, 584379, 572910, 565661, 618195, 519763, 573573, 643153, 694074, 638876, 574141, 598373, 629996, 587290, 532879]
6527E32879n4579l2922q808J27777L4289n846N4050r9641L0349L4000Q009L4541
6515F54098j3354j6189k2975L7307J31426r8000p5321J04969j07075P0650k36
6504F65300J18325l540j6116j36619j6499N7270M8782K1805o2157J7489K3605
6493G17645O4819j11227J07717l9882K183n8771M9682K8868q7693M2047j02237
6482F13151l2953N9352J40087M4869n5450j2196P3086p153n5771O883k5005j9567
6470G29333J29166m367R4012j3090p2687j9865n6832R0480m0502J02714m8358
6459H90004R4651P3701M872o4160j3086m1625K2747k3897P6640Q9585j4638N4177
6447A148971K9366J9124m2606K7352k9398l8324O7547n9975n4829K1371l6997
$$ y = [532879, 478300, 445378, 436570, 564347, 598636, 592790, 646840, 547199, 577548, 611548, 619557, 654098, 640744, 624555, 601580, 638887, 770313, 672313, 596992, 701961, 594886, 665536, 665300, 783625, 780085, 763969, 627350, 610851, 668121, 716903, 738708, 676551, 694040, 717645, 782464, 671237, 778954, 739072, 741255, 682484, 732166, 761034, 673341, 715388, 613151, 580198, 639550, 779637, 824506, 769056, 756860, 829946, 822793, 767022, 773905, 748900, 729333, 858499, 854132, 948144, 935054, 862367, 842502, 785670, 876150, 835648, 938362, 890004, 984655, 1058356, 1063228, 999068, 985982, 944357, 967104, 943207, 1019847, 1109432, 1094794, 1148971, 1178337, 1197461, 1154855, 1182207, 1152809, 1114485, 1182032, 1122057, 1067228, 1088599, 1051602]
6436A051602J5887j7881n310L8846J1040K737O6489K6830l4932K6313O2072P3559
6424A317252K2083k7510p3424o8898J23037L2083r8304J4215j131M8904P1852
6413A360159m7530L0802J12833P040j22870n5J4231m6398r8030n9700Q6690Q8845
6401A326017J0264K3868J00064O0910l7659K8660k3397m5038L8754K6859K7483
6390A536785l5627p0455o306o9900K6491N1583M0087l6611Q8581Q4825K1236l5428
6378A595261p3753j3616n6022O8414L3084m3093l3048O507J38322K9175M050l0125
6366A625156j24415N0712N9465R2935J2558N342R2R180M6920K3091o1804n478
6354A733754q7765J0523K581p0301N4483O8521L5087j8521J3523l8699o9333K3722
$$ y = [1051602, 1067489, 1049608, 1044298, 1083144, 1094184, 1096921, 1163410, 1190240, 1155308, 1181621, 1243693, 1317252, 1339335, 1311825, 1238401, 1169503, 1292540, 1324623, 1226319, 1240534, 1239403, 1288307, 1360159, 1312629, 1343431, 1456264, 1463304, 1340434, 1340379, 1354610, 1308212, 1210182, 1150482, 1237172, 1326017, 1336281, 1360149, 1460213, 1521123, 1483464, 1512124, 1488727, 1443689, 1482443, 1509302, 1536785, 1501158, 1430703, 1424397, 1354497, 1380988, 1432571, 1472658, 1436047, 1524628, 1609453, 1630689, 1595261, 1521508, 1507892, 1451870, 1520284, 1553368, 1510275, 1477227, 1483734, 1622056, 1651231, 1655281, 1625156, 1500741, 1551453, 1610918, 1703853, 1716411, 1721753, 1721845, 1731025, 1777945, 1801036, 1739232, 1733754, 1645989, 1656512, 1659093, 1588792, 1643275, 1711796, 1746883, 1728362, 1741885, 1703186, 1633853, 1657575]
6342A657575K5170M0931N0261L3176l7058Q991R3858K6634q0749n4270O0274N3399
6330A878192l3027K9167R3795j1518N5690m3220M2123j7918K3576j9563J0336
6319B007633M8182M5401K6695O430l6714L9663k2828J9608p7232o3509J01759
6308B095088O380K4833o2097J09073J11023j10107Q7378R4123K994n7976O9822
6297B370534m2777m3111N4566k1070J5854J17285N2225r9383L0769m6261q1486
6286B307145J83960J49202p8066l3670J477K7391l0866R2371l2124N8065L6452
6275B681337K1839K3150o7741j3992M9071R6648n6900N654Q5416M1559n7856O448
6263B814633R4349k2807N8604m5744N5646M2597o6737J935M2076K7698o4042M1713
$$ y = [1657575, 1682745, 1723676, 1773937, 1807113, 1770055, 1779046, 1872904, 1899538, 1818789, 1764519, 1824793, 1878192, 1845165, 1874332, 1968127, 1956609, 2012299, 1969079, 2011202, 1993284, 2016860, 1997297, 2007633, 2055815, 2101216, 2127911, 2134341, 2097627, 2137290, 2114462, 2134070, 2056838, 1993329, 2095088, 2101468, 2126301, 2064204, 2173277, 2284300, 2174193, 2261571, 2355694, 2358688, 2300712, 2370534, 2327757, 2284646, 2339212, 2318142, 2333996, 2451281, 2503506, 2404123, 2434892, 2388631, 2307145, 2491105, 2640307, 2562241, 2528571, 2530048, 2557439, 2526573, 2618944, 2586820, 2644885, 2681337, 2703176, 2726326, 2658585, 2644593, 2693664, 2790312, 2733412, 2739066, 2824482, 2866041, 2808185, 2814633, 2908982, 2886175, 2944779, 2899035, 2954681, 2997278, 2930541, 2932476, 2974552, 3002250, 2938208, 2979921]
6251B979921R6851R539j9595o3979J06007N6192K654O5128O6996m253l829Q8957
6239C380589m1726l7990Q2886J20032j8395r3588j3970J05487j9494M1413n0365
6228C454879k3026J62661N7663K6052J9346M665l3000M0399m2949R499M044J50435
6216C830668m6747m4184P6040q165L767Q6836L3469q970q894M3632j7946L6082
6204C975588K9475p4484N2646q996M8222J45110j4026J63665Q2141j50023l0608
6193D218710k200J42425P6635k2368R7042O1961j02184l5426J09094Q3872Q0732
6182D708293q8012K771J89301q4227L5901k8214r8959M7173O066N1892K3770K6273
6170D792028O7573R8893m7775j18020J57352J18364m9173j06639O5013O5784N9859
$$ y = [2979921, 3076772, 3086311, 3066716, 3002737, 3108744, 3164936, 3167590, 3232718, 3299714, 3295461, 3291632, 3380589, 3338863, 3300873, 3383759, 3503791, 3485396, 3391808, 3377838, 3483325, 3463831, 3505244, 3454879, 3431853, 3594514, 3652177, 3678229, 3697575, 3702240, 3669240, 3709639, 3666690, 3676189, 3680233, 3830668, 3783921, 3739737, 3815777, 3807612, 3811379, 3898215, 3931684, 3922714, 3913820, 3957452, 3939506, 3975588, 4005063, 3930579, 3983225, 3974229, 4022451, 4167561, 4153535, 4317200, 4399341, 4249318, 4218710, 4216510, 4358935, 4435570, 4413202, 4510244, 4572205, 4470021, 4434595, 4543689, 4627561, 4708293, 4620281, 4623052, 4812353, 4728126, 4764027, 4735813, 4636854, 4684027, 4690093, 4741985, 4765755, 4792028, 4859601, 4958494, 4910719, 4792699, 4950051, 5068415, 5019242, 4912603, 4977616, 5043400, 5103259]
6159E103259M6487K8043O5409K5466j4313M3329k6819O9705k3793o6042M5411
6148E296142J51123K5852j5562Q8978M5041J3116J8675N0540K3851O0081O31n0223
6136E708245L0937P5504N5606n0789J15135p0565m9250K29619R727j6741P455
6125F044883L2631M1461O8272L760Q3836L3586r4299Q5360Q876n8751J31378L2751
6113F413744O9924P295R9449R1391m1120r700n8271J43611Q1142N7568j21227
6102F733806p876J36304N4707m0214K2104Q4616P3005j2933K9787L5155l0199
6091G078262j06792J19732J77569j8871K7100Q3699p3126J50578J23568k1528
6081G540191L7671L7184L7334k3856M1879J3025J57721l8538o1340Q7689J66588
$$ y = [5103259, 5149746, 5177789, 5243198, 5268664, 5254351, 5297680, 5270861, 5340566, 5316773, 5250731, 5296142, 5447265, 5473117, 5457555, 5546533, 5591574, 5604690, 5623365, 5673905, 5697756, 5757837, 5758468, 5708245, 5739182, 5814686, 5870292, 5819503, 5934638, 5864073, 5814823, 6044442, 6054169, 6037428, 6044883, 6077514, 6118975, 6187247, 6191007, 6274843, 6308429, 6214130, 6299490, 6308366, 6249615, 6380993, 6413744, 6483668, 6490963, 6590412, 6681803, 6640683, 6630983, 6572712, 6716323, 6797465, 6855033, 6733806, 6725930, 6862234, 6916941, 6876727, 6898831, 6983447, 7056452, 7043519, 7073306, 7108461, 7078262, 6971470, 7091202, 7268771, 7249900, 7277000, 7360699, 7287573, 7438151, 7561719, 7540191, 7577862, 7615046, 7652380, 7628524, 7670403, 7683428, 7841149, 7802611, 7741271, 7828960, 7995548]
6070G995548J67984l9673o3990l8958m843Q4736K6155P764J5275k9210R6385R2118
6058H309291O0175N8330K0683P3217k3020O3198n0196K5255k1286J08072J7100
6047H640819K3590J29389J51754N185l0233J13232P7632k6213K6829K7521R2450
6036I231955M1549q7508J01439Q6098l8094N1694O1077N9597N7377J17161l8587
6025I643758j5400J0581J1187J10076J04498L3580j4750K8002k2637J55480K1132
6014A0065507P3824Q6931l3911O335O3618j25236r6338K44670J95171M4291m4052
6003A0480810q990Q3751L847P0104O2055o2581J12519N22l6216j1216P8590J0522
5991A0783717P1795J3114k1112M3095l7195Q975J9616P2773n7649K4828P855J0688
$$ y = [7995548, 8163532, 8123859, 8059869, 8020911, 8016068, 8100804, 8126959, 8134723, 8149998, 8120788, 8217173, 8309291, 8369466, 8427796, 8448479, 8521696, 8498676, 8561874, 8511678, 8536933, 8515647, 8623719, 8640819, 8664409, 8793798, 8945552, 8950737, 8920504, 9033736, 9111368, 9085155, 9111984, 9139505, 9231955, 9273504, 9185996, 9287435, 9373533, 9335439, 9387133, 9448210, 9507807, 9565184, 9682345, 9643758, 9628358, 9638939, 9650126, 9760202, 9864700, 9898280, 9883530, 9911532, 9888895, 10044375, 10065507, 10139331, 10226262, 10192351, 10198686, 10262304, 10137068, 10040730, 10285400, 10480571, 10524862, 10480810, 10471820, 10555571, 10559418, 10629522, 10691577, 10628996, 10741515, 10742037, 10705821, 10694605, 10773195, 10783717, 10855512, 10868626, 10847514, 10890609, 10853414, 10862389, 10882005, 10954778, 10897129, 10921957, 10929812, 10940500]
5979A0940500j1706J9784O5678o9892N283L5151L9948O1836O4635L3433p5162
5968A1109488l4882L2513O6173j4642o6353R0671J03598J0439k7803m1388j07337
5957A1120477n620K9547L4270M683M1400Q377q66O7993m4067j7503o7271J4416
5945A1185836Q6057k2131K8706k492p4494J02775J0930k0207j0005J04525k2267
5934A1367233k5305J1906O2737p8399o340n6788n2136O193m6322J4152O0113r003
5922A1248041K5535O4369j24670M3843p004o768q264o2816O5683q3985p513j62002
5910A0984449K9785M9700J1869n2611j43191J59756K7908o3074m1079l0647Q9853
5899A1022718O1546m3015P876n7331j00634n5746l2756P1450O639m640k6382p8019
$$ y = [10940500, 10928794, 10948578, 11014256, 10944364, 10949647, 10984798, 11024746, 11086582, 11151217, 11184650, 11109488, 11074606, 11107119, 11173292, 11158650, 11092297, 11182968, 11286566, 11297005, 11269202, 11227814, 11120477, 11114857, 11144404, 11178674, 11183357, 11224757, 11233134, 11232268, 11300261, 11256194, 11238691, 11171420, 11185836, 11271893, 11249762, 11278468, 11275976, 11201482, 11304257, 11315187, 11294980, 11284975, 11389500, 11367233, 11341928, 11353834, 11416571, 11338172, 11331832, 11275044, 11222908, 11229101, 11182779, 11196931, 11257044, 11248041, 11273576, 11337945, 11213275, 11257118, 11250114, 11243346, 11235082, 11172266, 11237949, 11153964, 11146451, 10984449, 11014234, 11063934, 11075803, 11023192, 10880001, 11039757, 11067665, 11004591, 10963512, 10932865, 11022718, 11084264, 11041249, 11049125, 10991794, 10891160, 10835414, 10802658, 10874108, 10880747, 10876107, 10849725, 10771706]
5887A0771706j5623N5021R1273k9190p0991P5725l2241o3367P780o3764L5365
5876A0761694J47712P4997n2121r0266l5683O9700k041J16457r6535O3949m5702
5865A0912161m6657k6272j06133K8080J01219l8904n2943K2477j1387J00752K5431
5854A0907824j16521O950J02642k6587n818K4494M6135o1840J35368R4053O9861
5843A1176561J26515P4788O2210K0734J41427N3466M2010l0355J39587J30995
5833A1937938k6787J14857K61559J36395J07896J72302J92804K39608J04562J72670
5823A3413804K27374J57091O5103K01382M24031K39772K73954L16507K94995K54089
5813A5868102L90081M34922N42006M89710M31196N44290N78650N68494M50798
$$ y = [10771706, 10756083, 10811104, 10902377, 10873187, 10802196, 10877921, 10845680, 10782313, 10790093, 10726329, 10761694, 10909406, 10984403, 10932282, 10842016, 10806333, 10876033, 10873992, 10990449, 10893914, 10957863, 10912161, 10865504, 10839232, 10733099, 10761179, 10862398, 10823494, 10770551, 10793028, 10781641, 10882393, 10907824, 10791303, 10798253, 10900895, 10874308, 10868490, 10892984, 10939119, 10877279, 11012647, 11106700, 11176561, 11303076, 11377864, 11440074, 11460808, 11602235, 11655701, 11697711, 11667356, 11806943, 11937938, 11911151, 12026008, 12287567, 12423962, 12531858, 12704160, 12896964, 13136572, 13241134, 13413804, 13641178, 13798269, 13863372, 14064754, 14488785, 14728557, 15002511, 15319018, 15614013, 15868102, 16258183, 16693105, 17235111, 17724821, 18156017, 18700307, 19278957, 19847451, 20298249]
5804B0298249N96165M50247K15923K53190J89224R8013L5943o5263m4659N508
5794B2032540M7003Q9286K39636L01319M01877N15764N55367N47600P03851R42241
5784B6376484R31238R08747Q69858P68978P04566M09981J05944j7221l56602l25320
5774C0376653o3895l2280J34184K76756L86477O97111P57907R94994J217872J196902
5764C5942681J491300J621894J690589J667883J470071J276004Q52980M70811
5756D6484213N3240m14187m52107m37900m05756l00967p9674m6708J96482N38560
5746D5135196P31019Q57497R61288J055376J079426J026373R78257P28786L57133
5737E2910351J62543k22446m32889o52514q63389q74502p85659p68207o79449
$$ y = [20298249, 20894414, 21344661, 21560584, 21813774, 22002998, 22101011, 22136954, 22071691, 22027032, 22032540, 22079543, 22168829, 22408465, 22709784, 23111661, 23627425, 24182792, 24730392, 25434243, 26376484, 27307722, 28216469, 29086327, 29855305, 30559871, 30969852, 31075796, 31058575, 30701973, 30376653, 30312758, 30280478, 30414662, 30691418, 31077895, 31775006, 32532913, 33527907, 34745779, 35942681, 37433981, 39055875, 40746464, 42414347, 43884418, 45160422, 46013402, 46484213, 46537453, 46123266, 45671159, 45233259, 44827503, 44526536, 44446862, 44400154, 44596636, 45135196, 45866215, 46723712, 47685000, 48740376, 49819802, 50846175, 51824432, 52553218, 52910351, 53072894, 52850448, 52417559, 51765045, 50901656, 50027154, 49241495, 48473288, 47793839]
5728D7793839m37303k73529j2690K35526M31024O82633Q70538J043760J181921
5719E1515719J368222J419789J410292J319127J086140Q21369M44801J59212L7776
5710E9582447J13486J86308L49277O81808R80254J351870J646022J952858K158124
5701F9002454K329747K562515K569054K558854K335423J948389J458758P90801
5693H5555995j65449p36291j381106j799966j719795j626022j425239j026526
5685G5675601n92819o5301L82886Q61537J176607J782862K117800K428046K612694
5676H6379913K430250K280846J737505R52114J14659o59772j397786j935821k164569
5667H7737339k272768k201589j935151j627483j351208r92883p80437n65975m31238
$$ y = [47793839, 47356536, 47083007, 47070317, 47305843, 47736867, 48419500, 49290038, 50333798, 51515719, 52883941, 54303730, 55714022, 57033149, 58119289, 58940658, 59385459, 59544671, 59582447, 59695933, 59882241, 60231518, 60913326, 61893580, 63245450, 64891472, 66844330, 69002454, 71332201, 73894716, 76463770, 79022624, 81358047, 83306436, 84765194, 85555995, 85390546, 84654255, 83273149, 81473183, 79753388, 78127366, 76702127, 75675601, 75082782, 75017481, 75400367, 76261904, 77438511, 79221373, 81339173, 83767219, 86379913, 88810163, 91091009, 92828514, 93780628, 93895287, 93235515, 91837729, 89901908, 87737339, 85464571, 83262982, 81327831, 79700348, 78349140, 77356257, 76575820, 76009845, 75578607]
5658G5578607k74229k35905k96443l00437m13809r49696j172831j432692j727408
5649F8775157j838914k000962j873619j814188j568926j525222j404688j169186
5641E5579452q28649o81212m14263l63921k43642l01385j22656j20740J2848k00495
5631E2315337k51490j85364l02855n27685o32050o13525o08526n81022n84557
5622D8028263n32004m12474m22655l92496k88044l46065j81921p9496k09449j20657
5612D5043002p7674j97684k47099k94081m92894n19016o45063p51842p61264q79171
5602D0177214q11375q69964q40918n72026o23280o03109n42980n81322o04432
5593C4127808o88725o01681p52855p75306p29871q77376r03617q21145q63028
$$ y = [75578607, 75304378, 75068473, 74772030, 74471593, 74057784, 73108088, 71935257, 70502565, 68775157, 66936243, 64935281, 63061662, 61247474, 59678548, 58153326, 56748638, 55579452, 54750803, 54069591, 53655328, 53291407, 53047765, 52746380, 52623724, 52502984, 52515832, 52315337, 52063847, 51878483, 51575628, 51047943, 50415893, 49802368, 49193842, 48612820, 48028263, 47496259, 47083785, 46661130, 46268634, 45980590, 45634525, 45452604, 45373108, 45163659, 45043002, 44965328, 44767644, 44520545, 44226464, 43733570, 43214554, 42569491, 41817649, 41056385, 40177214, 39365839, 38495875, 37654957, 37082931, 36459651, 35856542, 35313562, 34732240, 34127808, 33439083, 32837402, 32084547, 31309241, 30579370, 29701994, 28798377, 27977232, 27114204]
5584B7114204q30573q92023p64008q69564p97717p46003o90916p22598n86311
5575B0214491n29483m58429m42986n22560m94869m51789m87855m34789n00604
5566A5891127n32500l46815n31603m99585m62046m19490l48603l08528k78595
5557A2163362m41845k18059j99932k08868j82761l08594k30562k20555k63580
5548I888606k10964k65537j80843j85193j03870j91173j74405r7820j43617j57165
5538H178019j92835j90598j89350n7910K1716j23763r5045n5232j02181p8495
5528G114326q3690L6650j83742j53149o0926j9851k25228k6268n6742j06256j09793
5517F125331j00022O468r6685l1828P1921J30242O4315N9791J5064J25852L6724
$$ y = [27114204, 26283631, 25391608, 24627600, 23758036, 22960319, 22214316, 21523400, 20800802, 20214491, 19685008, 19226579, 18783593, 18261033, 17766164, 17314375, 16826520, 16391731, 15891127, 15358627, 15011812, 14480209, 13980624, 13518578, 13099088, 12750485, 12441957, 12163362, 11721517, 11503458, 11303526, 11094658, 10911897, 10603303, 10372741, 10152186, 9888606, 9677642, 9412105, 9231262, 9046069, 8942199, 8751026, 8576621, 8478801, 8335184, 8178019, 7985184, 7794586, 7605236, 7547326, 7569042, 7445279, 7350234, 7295002, 7192821, 7114326, 7030636, 7067286, 6883544, 6730395, 6669469, 6649618, 6424390, 6398122, 6341380, 6235124, 6125331, 6025309, 6031777, 5935092, 5903264, 5975185, 6105427, 6169742, 6229533, 6244597, 6370449, 6407173]
5506F407173l24921l12187j73953r7182k10237j38621j15985o2271j42736j24606
5496D704474q75j43506p4189K2375q3996m0465L4633j17432j47223J567J07046
5485D262409k2771m8790o7354r6408L7989n879r6392O9820N6385j12467j38765
5474C837777m635K5775n2097K7951k0230j4086L0890n6021J13663J1108J5410
5463C915505O5833r234Q2500k7701p3198j63568r4055j7355j65455j41071k4730
5452C347471K1972N8318j72625r0639J01521r8250L047K64k9462j04762p8n9660
5440B977117k9861J7215k6823k0375o1669M2485l0438j3066K3616j7533L0639
5429B891307j34988K188L8455j2062M2334L7357J9208j04884k5447J1136J06310
$$ y = [6407173, 6082252, 5770065, 5596112, 5498930, 5288693, 5150072, 5034087, 4971816, 4829080, 4704474, 4703599, 4560093, 4485904, 4508279, 4424283, 4383818, 4418451, 4301019, 4153796, 4155363, 4262409, 4239638, 4190848, 4123494, 4027086, 4065075, 4059196, 3962804, 4032624, 4089009, 3976542, 3837777, 3833142, 3858917, 3806820, 3834771, 3814541, 3800455, 3831345, 3775324, 3888987, 3900095, 3915505, 3981338, 3972104, 4054604, 4026903, 3953705, 3790137, 3696082, 3678727, 3513272, 3372201, 3347471, 3369443, 3427761, 3255136, 3164497, 3266018, 3167768, 3170815, 3171079, 3141617, 3036855, 3036777, 2977117, 2947256, 2964471, 2937648, 2917273, 2855604, 2898089, 2867651, 2854585, 2878201, 2860668, 2891307, 2756319, 2758507, 2796962, 2784900, 2827234, 2864591, 2883799, 2778915, 2753468, 2764604, 2870914]
5418B870914q8671n3825M6335m3689k6928j1968m3096O217O0938k7670J2217m3068
5406B657706m4150N1074J951o7519N9880J50787l0775o2691K1843M7073J357r320
5394B777216R1789J2134J4891K8612P715n7473o4409M8179N5490j21313o4512
5383B728319R7242Q1332j08538j4097R2908n2434j1116R2441j268j5379M4946
5372B934356P7471j0294m1744m673m5994o4123J28279R5078Q426R0719l9531K5373
5360C153343M0012k5139J24318k1873k7054k3104l5355J3992P0909m4285K5457
5349C251221M3007m8727O8722n2218n1140J5310L7697J14791J28588j22153p917
5338C377181q1286L7210L415O5069k4758n6463j27933K6340j01534j86161R950
$$ y = [2870914, 2782243, 2728418, 2774753, 2731064, 2704136, 2692168, 2649072, 2655289, 2716227, 2688557, 2700774, 2657706, 2613556, 2664630, 2666581, 2599062, 2658942, 2809729, 2778954, 2716263, 2738106, 2785179, 2786536, 2777216, 2869005, 2881139, 2896030, 2924642, 2932357, 2874884, 2810475, 2858654, 2914144, 2792831, 2728319, 2825561, 2906893, 2798355, 2784258, 2877166, 2824732, 2813616, 2906057, 2904789, 2889410, 2934356, 3011827, 3001533, 2959789, 2955116, 2909122, 2844999, 2973278, 3068356, 3076782, 3167501, 3127970, 3153343, 3193355, 3168216, 3292534, 3270661, 3243607, 3220503, 3185148, 3199140, 3270049, 3225764, 3251221, 3294228, 3245501, 3314223, 3262005, 3210865, 3226175, 3263872, 3378663, 3507251, 3385098, 3377181, 3295895, 3333105, 3336520, 3401589, 3376831, 3320368, 3192435, 3218775, 3117241, 2931080, 2941030]
5327B941030K0973J65608K6365j84033k4560M9250p9129j02676l1025j7794P4219
5316B838228m0773M3487K7674K2544O6315m1364N7905J9887r237o2188k8055m3321
5304B851102m9562K1610j00793l3061p2798P4150j02360j44575Q248J1467K5862
5293B489290r9031m482j1024n8251p939O2424n7473Q955K1764p7988j2804M2970
5281B296411l9778j902k937m3368j0609r150m6808M900j04678R64J1257K9949
5269B084251j13089n7243l8657r778q4121L6463J08411j00401P7986j91847r4410
5258A617565N3330l5724P6144l1212P5278m4460J2265n4403J8551l3285j12619
5247A541430Q2334O7324k4677N2387k9769k3606l982Q7330p5233j9585M4063p9627
$$ y = [2941030, 2962003, 3127611, 3153976, 2969943, 2945383, 2994633, 2915504, 2812828, 2781803, 2764009, 2838228, 2797455, 2840942, 2868616, 2891160, 2957475, 2916111, 2974016, 2993903, 2984666, 2922478, 2894423, 2851102, 2801540, 2823150, 2722357, 2689296, 2616498, 2690648, 2588288, 2443713, 2451961, 2463428, 2489290, 2390259, 2385777, 2374753, 2316502, 2308563, 2370987, 2313514, 2322469, 2344233, 2266245, 2253441, 2296411, 2256633, 2254731, 2251794, 2208426, 2197817, 2188667, 2141859, 2146759, 2042081, 2043045, 2054302, 2084251, 1971162, 1913919, 1875262, 1865484, 1781363, 1817826, 1926237, 1825836, 1903822, 1711975, 1617565, 1670895, 1635171, 1711315, 1680103, 1755381, 1710921, 1723186, 1668783, 1687334, 1654049, 1541430, 1623764, 1691088, 1666411, 1718798, 1689029, 1665423, 1661441, 1748771, 1673538, 1653953, 1698016, 1618389]
5235A618389p9523l4866K6186l8055N8504L7995o5042j18221O3626o9567j6921
5224A382505J1451j2351R5940j6071M6713p1229o770n4496p7552L9971N0668k664
5212A386115l3403l0050j16256k2124p765M0771L0323l3245L6667O0149J1247
5201A322429q2270L2084J1002n0818Q6208M4683l0875j8293J3782j18563k288
5190A207081J0812O2554O0787j15641n0633K862J00618J6139M6293k129l0872
5179A307871j55833P8612o1558m2350R4101n3658M7471P387j2259j14912J32306
5168A227178r7269M8353K268n4114L0367J0603n2835k3827m6054L9102J7314P8775
5156A179861m484j0751k7974l7702K3392M9168J2685k3955q424R9197m4463n2670
$$ y = [1618389, 1538866, 1504000, 1530186, 1492131, 1550635, 1588630, 1523588, 1405367, 1468993, 1399426, 1382505, 1393956, 1381605, 1477545, 1461474, 1508187, 1436958, 1430188, 1375692, 1298140, 1338111, 1388779, 1386115, 1352712, 1322662, 1206406, 1184282, 1176517, 1217288, 1247611, 1214366, 1251033, 1311182, 1322429, 1240159, 1272243, 1283245, 1232427, 1318635, 1363318, 1332443, 1314150, 1327932, 1209369, 1207081, 1217893, 1280447, 1341234, 1225593, 1174960, 1177822, 1278440, 1294579, 1340872, 1338743, 1307871, 1152038, 1230650, 1169092, 1126742, 1220843, 1167185, 1214656, 1222043, 1209784, 1094872, 1227178, 1129909, 1178262, 1180530, 1126416, 1156783, 1167386, 1114551, 1090724, 1044670, 1083772, 1101086, 1179861, 1175377, 1164626, 1136652, 1098950, 1122342, 1171510, 1184195, 1160240, 1151816, 1251013, 1206550, 1153880]
5144A153880l9156J06604J00500m3458m0660K821j3602j10605l2739J11701L6394
5133A231680j5717p0936j2904L1294O7821P7217k8008Q2967l7848p3375M281N1519
5121A307991k9933L6179m7005m1173j4151J8370k3458o8145K7102J37711p4442
5110A229046j3493J2548K1132M4364J3095M6336l1546K683N737o1866q155J29048
5098A388929l3618q8256O7473J3404J9533l4374R4349q333m6189J2077J18970
5087A503965N2828M8447k557P703L3064K5517Q772K7576J0833L4939N0072N297
5075A806456L5118p7297J116j00848k6941q1473R5672o1096m3756n912R939J4543
5063A565521n9201O5110N6010J01503j7417P6936K226Q6252O6814R5922j6502
$$ y = [1153880, 1114724, 1221328, 1321828, 1278370, 1237710, 1240531, 1226929, 1116324, 1083585, 1195286, 1231680, 1215963, 1145027, 1132123, 1163417, 1231238, 1308455, 1280447, 1363414, 1325566, 1252191, 1256472, 1307991, 1278058, 1314237, 1267232, 1226059, 1211908, 1230278, 1206820, 1138675, 1165777, 1303488, 1229046, 1215553, 1228101, 1249233, 1293597, 1306692, 1353028, 1321482, 1324165, 1329902, 1268036, 1259881, 1388929, 1355311, 1267055, 1334528, 1347932, 1367465, 1333091, 1427440, 1419107, 1372918, 1384995, 1503965, 1556793, 1605240, 1602683, 1610386, 1643450, 1668967, 1677739, 1705315, 1716148, 1751087, 1801159, 1806456, 1841574, 1764277, 1765393, 1664545, 1637604, 1556131, 1651803, 1590707, 1546951, 1541039, 1550978, 1565521, 1506320, 1571430, 1627440, 1728943, 1711526, 1788462, 1790688, 1876940, 1943754, 2039676, 2023174]
5052B023174J6589R540q1842n8129j5934r243n8373L1643n2072M666J46920J6506
5040A973445r9605r7215l2514L2117N4854K7412q8054L1817P2107q4846L1769
5029A821287N4974N477P8024K643o584o0887O9763N7046N4865k1559k5126J25664
5017B155587o3926M8660J05692m0426l0792n1071M0551J7420Q509R574p13N9647
5005B258712P0110Q3269l9268p5158J8539K3230o53L2659K6185J1722N3875q2596
4993B380626m4243J77694R2524M4064K1431Q5939O3757K1870M4201Q1868o371
4982B963360J07659P6692J43141P9642L8205J48244N4606Q9840N9674N7019J88180
4971D006262J68853O7132J33906Q4563J06925K16389J47640J26199K21982J63445
$$ y = [2023174, 2039763, 2049303, 1967461, 1909332, 1893398, 1884155, 1825782, 1857425, 1805353, 1810019, 1956939, 1973445, 1873840, 1776625, 1744111, 1776228, 1831082, 1858494, 1770440, 1802257, 1874364, 1789518, 1821287, 1876261, 1881738, 1959762, 1962405, 1955821, 1894934, 1964697, 2021743, 2076608, 2055049, 2029923, 2155587, 2091661, 2140321, 2246013, 2205587, 2174795, 2123724, 2164275, 2181695, 2190204, 2199778, 2199065, 2258712, 2328822, 2412091, 2372823, 2297665, 2316204, 2339434, 2338781, 2371440, 2397625, 2409347, 2463222, 2380626, 2336383, 2514077, 2606601, 2650665, 2672096, 2758035, 2821792, 2843662, 2887863, 2969731, 2963360, 3071019, 3147711, 3290852, 3370494, 3408699, 3556943, 3611549, 3701389, 3761063, 3818082, 4006262, 4175115, 4242247, 4376153, 4460716, 4567641, 4784030, 4931670, 5057869, 5279851, 5443296]
4961E443296J62366R7774K42702L24545K62091J98145J80412L95748M21689K87179
4951H015947L64779L62689M34097K89599M87579O11291M95550N00852N18867N10126
4941A2591376L99302L34999K63851Q1684J51449N4541j6577j27994j7025O9101
4931A3784707q6314M0360P9736n6999M0541m2902j26533r2096l17683m26064m43690
4920A2353063m56111m37717m00110l90373m54060l57233l16669l29708l17612
4911H893470k86386j80585j74936j76631j45385r1543o0518m3029j3649k1235
4901G699573J9227o0589j8795N1221m837J22535J12331J03498Q8294J68213J45173
4890H425844L06328K24942K71605K25242L11351L44785L88860M01681M26926M63724
$$ y = [5443296, 5605662, 5703436, 5946138, 6270683, 6532774, 6730919, 6911331, 7307079, 7728768, 8015947, 8380726, 8743415, 9177512, 9467111, 9954690, 10565981, 11061531, 11562383, 12081250, 12591376, 12990678, 13325677, 13589528, 13671212, 13822661, 13877202, 13860625, 13732631, 13715606, 13784707, 13698393, 13738753, 13818489, 13761490, 13802031, 13759129, 13632596, 13540500, 13222817, 12796753, 12353063, 11896952, 11459235, 11059125, 10668752, 10214692, 9857459, 9540790, 9211082, 8893470, 8607084, 8426499, 8251563, 8074932, 7929547, 7838004, 7777486, 7734457, 7720808, 7699573, 7718800, 7658211, 7639416, 7690637, 7685800, 7808335, 7920666, 8024164, 8112458, 8280671, 8425844, 8732172, 8957114, 9228719, 9453961, 9765312, 10110097, 10498957, 10900638, 11327564, 11791288]
4880A1791288M47776N65157O19935N56155N40636M79972M77299M54761M71877
4871A6404856K46132Q4916O7103q0866m8740j38995j85742j00848k22844k11959
4861A5813013j49117k93952l96303l89560m08150m83635o07823n14132o94515
4852A1875826p22788n78333o09564m93510n40617m45572m59506l63424l15316
4843G347196m27950l62691k09175k54587k11359l40153j41316j46523r4554m8961
4833E109927k86683j31824o3335j23873j42763o5351l8244j72192j38734l8040
4823C908888K7260N4445q5126j66044o8372q4651l8484o0834j12053q3775r1701
4812C199553k2681M4606q3750K1194k3223k3443j61373N5250J3371j25004J0748
$$ y = [11791288, 12239064, 12804221, 13424156, 13980311, 14520947, 15000919, 15478218, 15932979, 16404856, 16650988, 16735904, 16803007, 16722141, 16673401, 16534406, 16348664, 16247816, 16024972, 15813013, 15663896, 15369944, 14973641, 14584081, 14175931, 13692296, 13084473, 12570341, 11875826, 11153038, 10574705, 9965141, 9471631, 8931014, 8485442, 8025936, 7662512, 7347196, 6919246, 6556555, 6347380, 6092793, 5881434, 5541281, 5399965, 5253442, 5158888, 5109927, 4823244, 4691420, 4628085, 4504212, 4361449, 4296098, 4257854, 4085662, 3946928, 3908888, 3936148, 3990593, 3905467, 3739423, 3671051, 3586400, 3547916, 3487082, 3375029, 3291254, 3199553, 3176872, 3221478, 3137728, 3158922, 3135699, 3112256, 2950883, 3006133, 3019504, 2894500, 2905248]
4801B905248p1751J8844m3935n1490M0907k5494j43705l102L9130O8152N4062
4790B786866l0068l9428L686p4219R1179j17390l9546R1150O8003p5658J8687
4779B683262M3126R1370J0805q2843J07902K8184M8178j6041M2991l3066L2443
4768B956311J21633J33063m0621J38328R4705J8861m4230R7538J31234r884O1437
4757C658375J1769J00804R8128m6368p8625k2571R939O5352k5907r4536l0884
4746C645476N9248l607M5549o735k8383q2559J35531j00381O2339J35830O6931
4735C929239K4747j06171K838L3998n9248K3731R8257M1354o0802P5963K7129
4724D031035j3647M9260M0944j9381J05818K11810j2390J23888Q5795n8585N4370
$$ y = [2905248, 2833497, 2852341, 2808406, 2756916, 2797823, 2772329, 2628624, 2625522, 2664652, 2732804, 2786866, 2756798, 2717370, 2721056, 2646837, 2738016, 2620626, 2581080, 2672230, 2740233, 2664575, 2683262, 2726388, 2817758, 2828563, 2745720, 2853622, 2881806, 2929984, 2913943, 2956934, 2923868, 2956311, 3077944, 3211007, 3170386, 3308714, 3403419, 3422280, 3378050, 3475588, 3606822, 3596938, 3658375, 3670144, 3770948, 3869076, 3822708, 3744083, 3721512, 3731451, 3796803, 3770896, 3676360, 3645476, 3704724, 3701117, 3746666, 3739931, 3711548, 3628989, 3764520, 3664139, 3726478, 3862308, 3929239, 3953986, 3847815, 3850653, 3884651, 3825403, 3849134, 3947391, 3988745, 3927943, 4003906, 4031035, 4017388, 4066648, 4107592, 4088211, 4194029, 4405839, 4393449, 4517337, 4603132, 4544547, 4598917]
4713D598917J62184R5986J08554L6035J48836J13906J84168J55257J31227K18314
4703E953384J43278J21288K47864J44964L4694O5849L02030K99708J22454K61534
4693G697047K64259K74885L23028K99328K99102J84841M13461M47281N13091M78798
4683A1195121M63160N20592N47760O24978N88877P51638P07073N56098O45170
4674A6600467N35657N65170M27346L54206R4235J63423R8950J8718J51627K07802
4664A9217601Q5434K5912J11602N9847j1316j2715j79031l25964l75609m80839
4654A8114922o39158p05478n10047n81905n90344n67490k51054m58752k58467
4645A3552227k03811j39160j77387j11453o2240o018r6760P6184Q7118L4768J18008
$$ y = [4598917, 4761101, 4857087, 4965641, 5001676, 5150512, 5264418, 5448586, 5603843, 5735070, 5953384, 6096662, 6217950, 6465814, 6610778, 6645472, 6711321, 7013351, 7313059, 7435513, 7697047, 7961306, 8236191, 8559219, 8858547, 9157649, 9342490, 9755951, 10203232, 10716323, 11195121, 11658281, 12178873, 12726633, 13351611, 13940488, 14692126, 15399199, 15955297, 16600467, 17136124, 17701294, 18128640, 18482846, 18577081, 18740504, 18839454, 18858172, 19009799, 19217601, 19303035, 19328947, 19440549, 19500396, 19489080, 19476365, 19297334, 18971370, 18595761, 18114922, 17475764, 16770286, 16260239, 15678334, 15087990, 14520500, 14269446, 13810694, 13552227, 13348416, 13209256, 13031869, 12920416, 12858176, 12852158, 12755398, 12831582, 12918700, 12953468, 13071476]
4634A3071476J26933J43202K44354K22432L05357L07230K43591M97755L69319
4625A5531649M17607N28474O29784N83427P44431Q23180P93491R58625R65265
4616B1975933J016711J131892J272747J246987J081220J146190J117098J091063
4608C1079841R29061P73445O08000N07275L31000K06608R6691O1854k46975k54829
4598C4091971l21621l73872n01395p07604r15615j027887j034113j054414j054856
4589B7100594j148521j204864j183269r86592r91597r67453q99542p20805o76367
4580A8321584o83809p95244o45714m13750o19823n18206l99461m34037m13429
4571A3398111l67545l07723l88246l29831k73121l71752j99023j80561k40822
$$ y = [13071476, 13198409, 13341611, 13585965, 13808397, 14113754, 14420984, 14664575, 15162330, 15531649, 15949256, 16477730, 17107514, 17690941, 18435372, 19258552, 20052043, 21010668, 21975933, 22992644, 24124536, 25397283, 26644270, 27725490, 28871680, 29988778, 31079841, 32008902, 32782347, 33390347, 33897622, 34228622, 34435230, 34531921, 34593775, 34346800, 34091971, 33770350, 33396478, 32895083, 32187479, 31271864, 30243977, 29209864, 28155450, 27100594, 25952073, 24747209, 23563940, 22577348, 21585751, 20618298, 19718756, 18997951, 18321584, 17637775, 16842531, 16196817, 15783067, 15163244, 14645038, 14245577, 13811540, 13398111, 13030566, 12722843, 12334597, 12004766, 11731645, 11359893, 11160870, 10980309, 10739487]
4562A0739487k42863k25928j37780l4745j82804k28945m030j61235l2297l356
4552I485504n7701m6956J9973m2025n9388J00721O7318O4220j3633J57990J35559
4541I811582P4528J46098K1710J32478J45227K46139K19617K96944K18980J51645
4531A1464948K29699L60473K68984L07518L23473L46618M49079L60901L62628
4522A4474321L61087M68436M68551O13263O59487N68749N09761O75166P30928
4513A9529749P05699Q31390Q73498P61674O70687P92069N88853M61266L10830
4504B5525715J89275J7521l06659m26524n82956p09168o45770p43977q05733o28246
4494B0883478o28811o18049n15217n14017k56081j93039k59027k06943j39795
$$ y = [10739487, 10496624, 10270696, 10132916, 10098171, 9915367, 9686422, 9682392, 9521157, 9488860, 9485504, 9427803, 9380847, 9400820, 9358795, 9299407, 9400128, 9467446, 9531666, 9518033, 9676023, 9811582, 9886110, 10032208, 10053918, 10186396, 10331623, 10577762, 10797379, 11094323, 11313303, 11464948, 11694647, 12055120, 12324104, 12631622, 12955095, 13301713, 13750792, 14111693, 14474321, 14835408, 15303844, 15772395, 16385658, 17045145, 17613894, 18123655, 18798821, 19529749, 20235448, 21066838, 21940336, 22702010, 23372697, 24164766, 24753619, 25214885, 25525715, 25714990, 25732511, 25425852, 24999328, 24416372, 23707204, 23061434, 22317457, 21511724, 20883478, 20254667, 19636618, 19121401, 18607384, 18351303, 18158264, 17899237, 17692294, 17552499]
4485A7552499K1040j1712O4535J79061J73522J99477K28259K57107L40806L66921
4475A9371515N21918M76407M96414O58411N81206P04944O53698O63463P54484
4466B4882460N74276N40851M24990K42282N1735j929j88399l13713m58979l59848
4456B5393726m86471m50146k26436l33800m61420l80271m61881n34819m08583
4447B1649899l79475j21100k16029r6416n9768j68613k28949j43799l07547l15890
4437A9612313l55541n63241m13845m66212l96826m56761n75633m33275l24947
4428A5626032k96848k76029n20692k05702j24273j80712j93385j41206q2211j54321
4418A3450653J9317L5592J13095J43547M65K56375K58464K24588O1979K94554
$$ y = [17552499, 17573539, 17561827, 17626362, 17805423, 17978945, 18178422, 18406681, 18663788, 19004594, 19371515, 19893433, 20369840, 20866254, 21524665, 22105871, 22810815, 23464513, 24127976, 24882460, 25456736, 25997587, 26422577, 26664859, 26716594, 26714665, 26526266, 26212553, 25753574, 25393726, 24907255, 24457109, 24230673, 23896873, 23435453, 23055182, 22593301, 22058482, 21649899, 21270424, 21149324, 20933295, 20836879, 20777111, 20608498, 20379549, 20235750, 19928203, 19612313, 19256772, 18693531, 18279686, 17813474, 17416648, 16959887, 16384254, 15950979, 15626032, 15329184, 15053155, 14532463, 14326761, 14202488, 14021776, 13828391, 13687185, 13604974, 13450653, 13469970, 13505562, 13618657, 13762204, 13762669, 14019044, 14277508, 14502096, 14564075, 14858629]
4408A4858629K60270K79919L91672L61672L14703K15678L49664K62209K73308
4399A7567724J45450J5275M3291l2104j04519q9522k89805j12977k53191r3634
4389A6795988j58566j38964p937j08J81785R9631J20681J10103J20610Q8627J40124
4378A7351974N8989k3383j38640k56684k40084l49870k89650m05438n23409l21080
4368A4862725k47272m23773l38808l08191k52580r0600k42432k84700j00047J4006
4358A2588328r7525o0057L8455j3J30670J56079K08472J13524K19958L28370K24401
4347A3850662K52663K19762L73349L67298K57547K81938L34173K70835J35195
4338A6343422K26028L1093j39634N255M831k25104k80710k35034k53316j96028
$$ y = [14858629, 15118899, 15398818, 15790490, 16152162, 16466865, 16682543, 17032207, 17294416, 17567724, 17713174, 17728449, 17771740, 17739636, 17635117, 17545595, 17255790, 17142813, 16889622, 16795988, 16637422, 16498458, 16490521, 16490413, 16672198, 16771829, 16892510, 17002613, 17123223, 17211850, 17351974, 17410963, 17387580, 17248940, 16992256, 16752172, 16402302, 16112652, 15707214, 15183805, 14862725, 14615453, 14191680, 13852872, 13544681, 13292101, 13201501, 12959069, 12674369, 12574322, 12588328, 12490803, 12430746, 12469201, 12469188, 12599858, 12755937, 12964409, 13077933, 13297891, 13626261, 13850662, 14103325, 14323087, 14696436, 15063734, 15321281, 15603219, 15937392, 16208227, 16343422, 16569450, 16600543, 16460909, 16466164, 16470995, 16245891, 15965181, 15730147, 15476831, 15280803]
4328A5280803l78417k60741j59581j76724j6776J5315j4838l6205J09797J16103
4318A4478736J47099K00251J33763J78207K79475L0238K37239n989n4805N0056
4308A5674270p2518j14599k22466k65256l09007l22681k48156j73007k87853k41078
4298A3417649k59835j54322j33337j39148N7565j5034j01296J09125K0159O331
4288A2807857O7315Q0646J96198P9518K14019K40582J55504K33150J75039K53221
4278A4503049J93126J80062J95367K32238J88915J97249N7172O9567L3588j35724
4268A5714609j10208j95029k75649j93543j71885k16115j86193j82422j98794
4259A3984771q4567R8623J05488q4186J5093k5164J29386J64402J18933K52270
$$ y = [15280803, 14902386, 14641645, 14482064, 14305340, 14288564, 14303879, 14289041, 14252836, 14362633, 14478736, 14625835, 14826086, 14959849, 15138056, 15417531, 15447769, 15685008, 15679019, 15624214, 15674270, 15601752, 15487153, 15264687, 14999431, 14690424, 14367743, 14119587, 13946580, 13658727, 13417649, 13157814, 13003492, 12870155, 12731007, 12788572, 12773538, 12672242, 12781367, 12801526, 12807857, 12875172, 12955818, 13152016, 13231534, 13445553, 13686135, 13841639, 14074789, 14249828, 14503049, 14696175, 14876237, 15071604, 15303842, 15492757, 15690006, 15747178, 15816745, 15850333, 15714609, 15604401, 15409372, 15133723, 14940180, 14768295, 14552180, 14365987, 14183565, 13984771, 13900204, 13998827, 14104315, 14020129, 14035222, 14010058, 14139444, 14303846, 14422779, 14675049]
4249A4675049J85175J74358K22146K71656K00947K02408K48383J32748J98409
4240A6511279J46610J75945K76678J14029J50279K21442K55240K63066L76405
4231A8490973L99710M85219M33914N56172M45699M79334M70249L99709M50092
4222B2611071M84165L96242L87928L97126L96892L96734L98917M03793L69343
4213B6242211N22451N07903O06997N96529O54913P15898Q26101R40524Q51516
4204C2465043R14103J109768J071566J375134J392137J534533J789857J669045
4196D3321186J676200K079300K132328K307910K592067K775497L012558L446077
4188F3343123L660375M044215M450241M917273N251426O110897O794529P715043
$$ y = [14675049, 14860224, 15034582, 15256728, 15528384, 15729331, 15931739, 16180122, 16312870, 16511279, 16657889, 16833834, 17110512, 17224541, 17374820, 17596262, 17851502, 18114568, 18490973, 18890683, 19375902, 19809816, 20365988, 20811687, 21291021, 21761270, 22160979, 22611071, 23095236, 23491478, 23879406, 24276532, 24673424, 25070158, 25469075, 25872868, 26242211, 26764662, 27272565, 27879562, 28476091, 29131004, 29846902, 30673003, 31613527, 32465043, 33379146, 34488914, 35560480, 36935614, 38327751, 39862284, 41652141, 43321186, 44997386, 47076686, 49209014, 51516924, 54108991, 56884488, 59897046, 63343123, 67003498, 71047713, 75497954, 80415227, 85666653, 91777550, 98572079, 106287122]
4180A06287122Q795893R938704J1069842J2483431J4308291J6310602J9025886
4173A98219771K2428303K6344052L0610685L5470478L9803783M2148154M0080551
4166D35105777L1063599J2773642j1310341l4090764m7229635m9778680m5408528
4159B91125070l8749435l2422117k6628204k1788533j7782238j4729753j2406099
4152A26618691j0290407q602059p333887o148248n323956m597970l984164l806405
4144G6531595l558815l416197l187687k972978k671310k434322k418145k108016
4136E3764125j929611j953219j708408j619059j661294j527373j434778j417432
4128D0512951j229762j366957j339344j256469j327286j252406j203213r51834
$$ y = [106287122, 115083015, 125021719, 136091561, 148574992, 162883283, 179193885, 198219771, 220648074, 246992126, 277602811, 313073289, 352877072, 395025226, 435105777, 466169376, 478943018, 467632677, 433541913, 386312278, 336533598, 291125070, 252375635, 219953518, 193325314, 171536781, 153754543, 139024790, 126618691, 116328284, 107726225, 100392338, 94244090, 88920134, 84322164, 80338000, 76531595, 72972780, 69556583, 66368896, 63395918, 60724608, 58290286, 55872141, 53764125, 51834514, 49881295, 48172887, 46553828, 44892534, 43365161, 41930383, 40512951, 39283189, 37916232, 36576888, 35320419, 33993133, 32740727, 31537514, 30585680]
4120C0585680j033738j010132q72008q49385p71543p86094q05094p24825n33443
4111B3199418n27578n21221o23937n89587m87810l91628l79017m31462l97146
4102A8850032l90514l31390k62482l18950l37668j92305l21094l57284k37378
4093A6100967k17311l62108l93173k82150k50496k69168l55996r0805k62723l41656
4083A3275381j05959k52371k21610j90726j47115j48651k56841j45091m2834m2620
4073A1721563k18390j81374j44335R425j27349k27775o5231j96059j19338m9032
4063A0402105j12762n2369P402r9992k0669L2101r4109n3798n2072l3565J7343
4052I939615j14400J8872P2589J73163N5854P0213k938n4342L6288Q3564P2306
$$ y = [30585680, 29551942, 28541810, 27669802, 26820417, 26048874, 25262780, 24457686, 23732861, 23199418, 22671840, 22150619, 21526682, 20937095, 20449285, 20057657, 19678640, 19247178, 18850032, 18459518, 18128128, 17865646, 17546696, 17209028, 17016723, 16695629, 16338345, 16100967, 15883656, 15521548, 15128375, 14846225, 14595729, 14326561, 13970565, 13879760, 13617037, 13275381, 13169422, 12917051, 12695441, 12504715, 12357600, 12208949, 11952108, 11807017, 11764183, 11721563, 11503173, 11321799, 11177464, 11186889, 11059540, 10831765, 10766534, 10570475, 10451137, 10402105, 10289343, 10236974, 10244376, 10144384, 10123715, 10155816, 10061707, 10007909, 9955837, 9922272, 9939615, 9825215, 9844087, 9916676, 10089839, 10145693, 10215906, 10212968, 10158626, 10194914, 10278478, 10350784]
4041A0350784M6547J17269J55768O0388J04228O0941P5166O6031R5244L7559R0783
4030A1260708K37815J62199J77263N5327K12380J97764K68024J55619J08026J90385
4020A3025510J56186K28033L61234L99300K55809K51494L12678L33419L66169
4011A5689832L42442L61117M85669L52943N91365N12805M39585N72798O89337
4002B0037893N92037O58382O50727O54220P93779Q16682Q85016R82501R09562
3993B6980799R46785J046906J180610J097569J094487J338294J495289J399765
3985C6580504J371069J406019J495653J594884J633382J795530J806780J786983
3977D9470804J896602J830318J971863K004908K004730K226462K102545J985108
$$ y = [10350784, 10397331, 10514600, 10670368, 10730756, 10834984, 10895925, 10971091, 11037122, 11132366, 11169925, 11260708, 11498523, 11660722, 11837985, 11893312, 12105692, 12303456, 12571480, 12727099, 12835125, 13025510, 13181696, 13409729, 13770963, 14170263, 14426072, 14677566, 14990244, 15323663, 15689832, 16032274, 16393391, 16879060, 17232003, 17823368, 18336173, 18775758, 19348556, 20037893, 20629930, 21288312, 21939039, 22593259, 23387038, 24203720, 25088736, 26071237, 26980799, 27927584, 28974490, 30155100, 31252669, 32347156, 33685450, 35180739, 36580504, 37951573, 39357592, 40853245, 42448129, 44081511, 45877041, 47683821, 49470804, 51367406, 53197724, 55169587, 57174495, 59179225, 61405687, 63508232, 65493340]
3969F5493340K071266J993820K111892K055089K021317K059967J788337J868665
3961H1463693J784464J681374J646250J358557J201633J209986J214486Q85806
3953I2446249P79574P74440N23453L69791J75167Q8945k25278m18470o11784o76881
3943I3225206q48861r70612j170988j234517j393022j577176j565047j681500
3935H2783483j875797j847382j965136k082042k155977k155477k203538k195172
3927F6302962k223409k272679k115497k137295k215211k162602j972312j989977
3919D9213980k063054j868010j893440j789899j880601j702249j738194j487901
3911C4790632j378709j361287j402021j269533j213296j174760j100362r78517
$$ y = [65493340, 67564606, 69558426, 71670318, 73725407, 75746724, 77806691, 79595028, 81463693, 83248157, 84929531, 86575781, 87934338, 89135971, 90345957, 91560443, 92446249, 93225823, 94000263, 94523716, 94893507, 95068674, 95157619, 94932341, 94513871, 93902087, 93225206, 92376345, 91405733, 90234745, 89000228, 87607206, 86030030, 84464983, 82783483, 80907686, 79060304, 77095168, 75013126, 72857149, 70701672, 68498134, 66302962, 64079553, 61806874, 59691377, 57554082, 55338871, 53176269, 51203957, 49213980, 47150926, 45282916, 43389476, 41599577, 39718976, 38016727, 36278533, 34790632, 33411923, 32050636, 30648615, 29379082, 28165786, 26991026, 25890664, 24912147]
3903B4912147j005186r86038p84301q20906q72287p25667o18165n60857m78797
3894A8059943n85073o22017o17291l62943l62176l95168k92720m18730m10774
3885A3993051k79645l00094r6246m7447k14273k8469n5000n0353p6882j20429
3875A2724213Q787k83807k86188m04750m35051l75728l33637l93210k12073l30056
3865I678500k77692j61665j71819k53347j08901r3471j83283k43076j70636p0718
3855G943892j95645j25925p2323k1180k10795j19919k4714j11697q4263k8268
3845F949163j12236k55072m6431k0778M5421n7437q9460n1931j16403o9392N3436
3834F228880j25507j41090j33818J15851j32218K0732n0194j07902o3324p6747
$$ y = [24912147, 23906961, 22920923, 22136622, 21315716, 20443429, 19717762, 19099597, 18538740, 18059943, 17474870, 16852853, 16235562, 15872619, 15510443, 15115275, 14822555, 14403825, 13993051, 13713406, 13413312, 13317066, 13269619, 13055346, 13026877, 12971877, 12921524, 12844642, 12724213, 12733000, 12449193, 12163005, 11758255, 11323204, 10947476, 10613839, 10220629, 10008556, 9678500, 9400808, 9239143, 9067324, 8813977, 8705076, 8611605, 8428322, 8185246, 8014610, 7943892, 7748247, 7622322, 7549999, 7528819, 7318024, 7198105, 7173391, 7061694, 6977431, 6949163, 6836927, 6581855, 6535424, 6514646, 6560067, 6502630, 6413170, 6361239, 6244836, 6175444, 6228880, 6103373, 5962283, 5828465, 5944316, 5812098, 5832830, 5782636, 5674734, 5611410, 5534663]
3824E534663J04986J2595k9259j5345J3204j19530M335J3224k2494l3194M0607
3813E503792j37366J45230o0253j1811Q2966Q266p0137j3900r9489K1543M857
3802E373698J4096O5077o3392p6958j12350L7833l313j0631o5403Q6829m5244
3791E200242O699J21431O5543j27314p719J12383K161K5955J7828k6783k6516
3780E363910J3376J4935K7664q6405Q8502Q7014j36788J13735O2075k4277J12447
3769E636188j54679m5721J37064q2466o8865M8842J71375j11173j1148Q2475j23645
3758E478247J692J48335R1774j3556j01249R7328J54473K9186N0083k2326k2764
3747E891223p1331N4345P9604N6040Q9119J08336L9797L0186m4775K8990J56717
$$ y = [5534663, 5639649, 5652244, 5622985, 5607640, 5620844, 5501314, 5505649, 5518873, 5496379, 5463185, 5503792, 5366426, 5511656, 5451403, 5439592, 5522558, 5530824, 5460687, 5446787, 5347298, 5368841, 5373698, 5387794, 5452871, 5389479, 5312521, 5200171, 5238004, 5234691, 5224060, 5158657, 5245486, 5200242, 5206941, 5328372, 5393915, 5266601, 5258882, 5371265, 5373426, 5399381, 5417209, 5390426, 5363910, 5377286, 5392221, 5419885, 5333480, 5421982, 5508996, 5372208, 5485943, 5548018, 5523741, 5636188, 5481509, 5435788, 5572852, 5490386, 5421521, 5470363, 5641738, 5530565, 5519417, 5601892, 5478247, 5479939, 5628274, 5720048, 5706492, 5605243, 5702571, 5857044, 5886230, 5936313, 5913987, 5891223, 5819892, 5874237, 5953841, 6009881, 6099000, 6207336, 6247133, 6277319, 6232544, 6261534, 6418251]
3736F418251m9039J36327J15671R7099M4792J22576Q1165J7191P9573L2993J20832
3725G217431O6417J40121Q6112J73407J02559J37568J67639J00366P5321J63583
3715H430524J34165J43862J84965J59045K7880J60132J92113K65895K81309J31093
3705A0110983J24464K30287K12970J86094Q7364K17941L33181L74860L96563K18242
3695A2492949L54054J24969K30995N05258K50243L78546L07174L71355L34886
3686A5350429L61268L73685M87785L62910K93819M95906M61151M92525M12133
3677A9091611M88835M61597N03519N73903N66203O33562O55430N85043P72072
3668B4331775P84096P18742P71975Q29296R42054J004771Q74733R30748J083194
$$ y = [6418251, 6369212, 6505539, 6621210, 6718309, 6763101, 6885677, 6966842, 6984033, 7063606, 7096599, 7217431, 7283848, 7423969, 7510081, 7683488, 7786047, 7923615, 8091254, 8191620, 8266941, 8430524, 8564689, 8708551, 8893516, 9052561, 9080441, 9240573, 9432686, 9698581, 9979890, 10110983, 10235447, 10465734, 10678704, 10864798, 10952162, 11170103, 11503284, 11878144, 12274707, 12492949, 12847003, 12971972, 13202967, 13708225, 13958468, 14337014, 14644188, 15015543, 15350429, 15711697, 16085382, 16573167, 16936077, 17229896, 17725802, 18186953, 18679478, 19091611, 19580446, 20042043, 20545562, 21119465, 21685668, 22319230, 22974660, 23559703, 24331775, 25115871, 25834613, 26606588, 27435884, 28377938, 29382709, 30257442, 31188190, 32271384]
3659C2271384J039876J151105J127997J043016J044189J084058J033839J149205
3651D0944669J198204J014719J067199J115123J176135J066989R82751R14358
3643D9480147J050459R77038R63288R40837R47814R78726R18803J064950R60046
3634E8282108R67065J023833J067201J042351R76869J126549J038957J050743
3626F6575676J021074J129714J048050J064761J105788J038924J119780J175095
3618G5278862J120834J114062J225004J218847J217278J177835J183185J180470
3610H4716377J213848J073699J120016J126179J210943J030172Q58478J060635
3602I3410347J022729R47490R16319J054081R03375Q59826P99732R01363Q00411
$$ y = [32271384, 33311260, 34462365, 35590362, 36633378, 37677567, 38761625, 39795464, 40944669, 42142873, 43157592, 44224791, 45339914, 46516049, 47583038, 48565789, 49480147, 50530606, 51507644, 52470932, 53411769, 54359583, 55338309, 56257112, 57322062, 58282108, 59249173, 60273006, 61340207, 62382558, 63359427, 64485976, 65524933, 66575676, 67596750, 68726464, 69774514, 70839275, 71945063, 72983987, 74103767, 75278862, 76399696, 77513758, 78738762, 79957609, 81174887, 82352722, 83535907, 84716377, 85930225, 87003924, 88123940, 89250119, 90461062, 91491234, 92349712, 93410347, 94433076, 95380566, 96296885, 97350966, 98254341, 99114167, 99913899, 100815262, 101615673]
3593A01615673P67529P04670O06544P71122P40517P86350Q07600Q53130Q67690
3584A08520825R49554J153867J205796J091798J162350J298821J332134J472449
3576A18187594J432236J342890J434994J458948J435010J417351J330777J273671
3568A29313471J195218J325141J242079R77191Q65998P15725O25285N54873L21900
3559A37136881O5946R7330k3803q5313k91666l09644m15611o04727n73211n21188
3549A34474994n19442m25824n07414m44473n7814k1198J62993L86167N61398P80352
3539A34389739R53315J080550J226201J423468J481777J469198J355383J236475
3531A44616106J367257J086140Q18791O95069N86600M47265L94921L95500L04120
$$ y = [101615673, 102383202, 103087872, 103694416, 104465538, 105206055, 105992405, 106800005, 107653135, 108520825, 109470379, 110624246, 111830042, 112921840, 114084190, 115383011, 116715145, 118187594, 119619830, 120962720, 122397714, 123856662, 125291672, 126709023, 128039800, 129313471, 130508689, 131833830, 133075909, 134053100, 134919098, 135634823, 136260108, 136814981, 137136881, 137202827, 137300157, 137276354, 137191041, 136899375, 136589731, 136174120, 135569393, 134996182, 134474994, 133955552, 133529728, 133022314, 132577841, 132520027, 132498829, 132661822, 133047989, 133609387, 134389739, 135343054, 136423604, 137649805, 139073273, 140555050, 142024248, 143379631, 144616106, 145983363, 147069503, 147888294, 148583363, 149169963, 149617228, 150012149, 150407649, 150711769]
3522A50711769J26158m4276j11837k54850k75722m95407o99443p25684q04761
3513A47425947q48228j003007j008886p81995r29443p86856n34241m01871l84613
3504A40746807k40299j83835j57317M7419J14741J07008P9703J38768J8258p4971
3494A40596282k01540j91851l87621o23112n86169p17821r90257j085329j224432
3485A34588150j568959j600101j694269j873053k051021k081817k149287k298465
3477A19271178k289291k432463k360707k477235k491803k364609k480072k298832
3469A00076166k269323k237618k142829k139927j894332j892731j859722j570690
3461H4068994j511221j311654j351188j176140j023323p71626q88894p08177n06583
$$ y = [150711769, 150837927, 150793651, 150681814, 150426964, 150151242, 149655835, 148956392, 148230708, 147425947, 146577719, 145574712, 144565826, 143783831, 142854388, 142067532, 141533291, 141131420, 140746807, 140506508, 140322673, 140165356, 140212775, 140327516, 140434524, 140514227, 140652995, 140671253, 140596282, 140394742, 140202891, 139815270, 139192158, 138605989, 137888168, 136897911, 135812582, 134588150, 133019191, 131419090, 129724821, 127851768, 125800747, 123718930, 121569643, 119271178, 116981887, 114549424, 112188717, 109711482, 107219679, 104855070, 102374998, 100076166, 97806843, 95569225, 93426396, 91286469, 89392137, 87499406, 85639684, 84068994, 82557773, 81246119, 79894931, 78718791, 77695468, 76923842, 76034948, 75326771, 74820188]
3452G4820188o50841m90518l22534l79173k13089k49136l99664k27943k19758
3443G1667532l36607l13905l08706l31749m29116m73857n98171n88150o00574
3434F7686697p65710q47191q53788j013905j129599r97394j136399j177814j228335
3425E8536562j220970j311907j297738j222643j249817j387327j390561j236137
3417D8219462j217848j225739j017457r70931r25835p09249n42672n03966p46102
3408D0359663j406282k126524k233493j930356j677629j412670j377542j136488
3400B7058679r45945j013645r20079q57719r09062p76107o74336n27877m88651
3391A9945258m97511o51000m76356l75304m86177m77955l62624l65621l03971
$$ y = [74820188, 74169347, 73678829, 73356295, 72977122, 72764033, 72514897, 72115233, 71887290, 71667532, 71330925, 71017020, 70708314, 70376565, 69947449, 69473592, 68875421, 68287271, 67686697, 66920987, 66073796, 65220008, 64206103, 63076504, 62079110, 60942711, 59764897, 58536562, 57315592, 56003685, 54705947, 53483304, 52233487, 50846160, 49455599, 48219462, 47001614, 45775875, 44758418, 43787487, 42861652, 42152403, 41609731, 41105765, 40359663, 38953381, 36826857, 34593364, 32663008, 30985379, 29572709, 28195167, 27058679, 26112734, 25099089, 24179010, 23321291, 22412229, 21636122, 20961786, 20433909, 19945258, 19447747, 18796747, 18320391, 17945087, 17458910, 16980955, 16618331, 16252710, 15948739]
3382A5948739k74566k90076m83727l61948k11382k26751j97396j80248l62703
3373A3359942j87432j64116k34160k13428k66131k34212j24871j57762j24392
3364A1653438j42879k43416j61015j26711j40928j49118j24131j11608q5116p0500
3354A0298016m9393j45153j78894o8932j353j47831p4957J21896m0144j36258
3344I576997n9482p8471n2566p4858n0501j4192o4072j73833K9294k3956r6814
3333H917546q3067k5523N866O9572m5826m0286l1495R7196P6420J009R7588n1894
3321H987106J4332J80545l8651P3828R4748J61250O4155j2930K5580N1627K719
3310I604309J20347O6054P2629J01197L8731J19358J21033J09147N9266q538Q9073
$$ y = [15948739, 15674173, 15384097, 14900370, 14538422, 14327040, 14100289, 13902893, 13722645, 13359942, 13172510, 13008394, 12774234, 12560806, 12294675, 12060463, 11935592, 11777830, 11653438, 11510559, 11267143, 11106128, 10979417, 10838489, 10689371, 10565240, 10453632, 10368516, 10298016, 10248623, 10103470, 9924576, 9855644, 9854291, 9706460, 9631503, 9753399, 9713255, 9576997, 9517515, 9439044, 9386478, 9311620, 9261119, 9246927, 9182855, 9009022, 9038316, 9014360, 8917546, 8834479, 8808956, 8814822, 8884394, 8838568, 8798282, 8766787, 8863983, 8940403, 8941412, 9039000, 8987106, 9001438, 9181983, 9143332, 9217160, 9311908, 9473158, 9537313, 9524383, 9549963, 9601590, 9604309, 9724656, 9790710, 9863339, 9964536, 10003267, 10122625, 10243658, 10352805, 10412071, 10403533, 10492606]
3299A0492606K19065J92404J88150N1536K19617J89184J94200Q0729J51314K67231
3289A2246036K44910K63297K84570K00312K63913L05362K25722K61912L65443
3280A4661477M57151N42944N59869N95072O52300P74372P26957Q40609Q85603
3271B0696354O80065P22482N62689N30164J40874m2041k02651k81458l34920o80481
3261B1791077o20896n44156n93052n89781o74491o41179p50838p41824o72510
3252A5962350o19377o28416n97615o29116n66990l63222m72828m20423l34367
3243A1329996m77556l39787k92059l81980m05286j99207j72538k12175k10805
3234H638603k27373j77247j26041j69658j73308o1340j51121j28242j76725p1975
$$ y = [10492606, 10711671, 10904075, 11092225, 11143761, 11363378, 11552562, 11746762, 11827491, 11978805, 12246036, 12490946, 12754243, 13038813, 13239125, 13503038, 13808400, 14034122, 14296034, 14661477, 15118628, 15661572, 16221441, 16816513, 17468813, 18243185, 18970142, 19810751, 20696354, 21376419, 22098901, 22661590, 23191754, 23332628, 23290587, 23087936, 22806478, 22471558, 21791077, 21170181, 20626025, 20032973, 19443192, 18768701, 18127522, 17376684, 16634860, 15962350, 15342973, 14714557, 14116942, 13487826, 12920836, 12557614, 12084786, 11664363, 11329996, 10852440, 10512653, 10220594, 9838614, 9433328, 9234121, 9061583, 8849408, 8638603, 8411230, 8233983, 8107942, 7938284, 7764976, 7703636, 7552515, 7424273, 7247548, 7175573]
3224G175573k03303j40844j11966j48097k60581j86214k2777j11992j30912j00388
3214E758499k8501j58096j31563j3002k23034j87227N8048q6875K3314n0671q5794
3203D875098j442o195j0967o6420O4939j41991j4009l3927P1555o0082J13016
3192D789575K567j43016q9429j43492k17555j26446n7956l9515o6893j63934Q046
3181C751952K2982l2565o0792j11787N2649N4407j62264m5078j8643o521o068
3170C438272M2036j01117n0876J3917M4865O3325O6606M2592k7755o1666O4964
3159C535163r2088j34027j7469j56073j04518K5411n8197j00359P1461j31533
3149B837771p2544P5383o9481k4106l6908m4264r706J3365M8652K3576K4319q9925
$$ y = [7175573, 6972270, 6831426, 6719460, 6571363, 6310782, 6124568, 6101791, 5989799, 5858887, 5758499, 5729998, 5571902, 5440339, 5427337, 5204303, 5017076, 5075124, 4988249, 5011563, 4960892, 4875098, 4873656, 4867461, 4856494, 4790074, 4855013, 4713022, 4699013, 4665086, 4736641, 4676559, 4789575, 4792142, 4649126, 4559697, 4416205, 4198650, 4072204, 4014248, 3974733, 3907840, 3743906, 3751952, 3774934, 3742369, 3681577, 3569790, 3622439, 3676846, 3514582, 3469504, 3450861, 3444340, 3438272, 3480308, 3379191, 3328315, 3342232, 3387097, 3450422, 3517028, 3559620, 3531865, 3470199, 3535163, 3443075, 3309048, 3291579, 3135506, 3030988, 3056399, 2998202, 2897843, 2969304, 2837771, 2765227, 2840610, 2771129, 2747023, 2710115, 2665851, 2656145, 2669510, 2718162, 2741738, 2766057, 2676132]
3137B676132j13121P6493P786j53100j5755P5997J4105l335j23502m915k6158
3126B410627q9505K085m7732K1288m9654j41023q1237n8487j5176l5655O6597
3115A982128R397m4700k756N3639j1284m6372j4185K248m1262k5036j38538q5772
3103A637507N849R7634M8304o5286l9826k078o6201P0217L6388j18014R4291L2472
3091A731257j21208k7473M9804l0344J0939q1280N9160o555p5123o671q995J05803
3079A599314l0667j7371P1196j8130q3512m6558O0770J597j34573J3619M3205
3068A458890P8053r3622q5982q891n1782P0414N1598O2486r7461P413L4969k8059
3056A398026P34L2856m6084m394q357Q9257j4530k667n3000r8494N7102N9954
$$ y = [2676132, 2563011, 2639504, 2647290, 2494190, 2478435, 2554432, 2568537, 2565202, 2441700, 2436785, 2410627, 2321122, 2323207, 2275475, 2296763, 2247109, 2106086, 2024849, 1966362, 1951186, 1915531, 1982128, 1991525, 1946825, 1944069, 1997708, 1986424, 1940052, 1925867, 1928115, 1886853, 1861817, 1723279, 1637507, 1643356, 1740990, 1789294, 1724008, 1684182, 1682104, 1615903, 1686120, 1722508, 1604494, 1698785, 1731257, 1610049, 1582576, 1632380, 1602036, 1612975, 1531695, 1590855, 1584300, 1509177, 1502506, 1493511, 1599314, 1568647, 1551276, 1622472, 1604342, 1520830, 1474272, 1535042, 1536639, 1402066, 1415685, 1458890, 1536943, 1443321, 1357339, 1348448, 1296666, 1367080, 1418678, 1481164, 1383703, 1391116, 1426085, 1398026, 1398760, 1431616, 1385532, 1381138, 1372781, 1462038, 1447508, 1444841, 1391841, 1293347, 1350449, 1410403]
3044A410403P337m7622l2873k8709n9450N499L4412Q1355R2297l008j59851J3906
3032A313696L7323m1086J416J0540j31824k3616K41799N9551N8320j98869K0916
3021A348166K7632r476L0855L1606J24926L2755q7286N5729K3568K3281q1242
3010A520514p9987J21533M6475J23361L3184k62j3157r1369L5182p683R025q263
2998A688553j1254j53p7396R9818J8434o727O4690k466K6564k3026M5041N7212
2986A879290K6481J69174N8865n10M3039M7101P5611k441m0228O3713K8875j4197
2974B334773O8540R9775r9881J4491O2593Q3637J78338O2896J30800J34688P2798
2963C143448J09732K04561M9907R4583K08375K63530J12795J88917L17469K51237
$$ y = [1410403, 1417740, 1370118, 1337245, 1308536, 1249086, 1254585, 1288997, 1370352, 1462649, 1459641, 1299790, 1313696, 1351019, 1309933, 1311349, 1321889, 1190065, 1166449, 1408248, 1467799, 1526119, 1327250, 1348166, 1375798, 1366322, 1397177, 1428783, 1553709, 1586464, 1499178, 1554907, 1578475, 1601756, 1520514, 1440527, 1562060, 1608535, 1731896, 1765080, 1764818, 1751661, 1660292, 1695474, 1687791, 1696816, 1688553, 1677299, 1677146, 1599750, 1699568, 1718002, 1711275, 1775965, 1773499, 1800063, 1777037, 1822078, 1879290, 1905771, 2074945, 2133810, 2133300, 2176339, 2223440, 2299051, 2296610, 2256382, 2320095, 2348970, 2334773, 2403313, 2503088, 2403207, 2417698, 2480291, 2563928, 2742266, 2805162, 2935962, 3070650, 3143448, 3253180, 3457741, 3507648, 3602231, 3810606, 4074136, 4186931, 4375848, 4693317, 4944554]
2953D944554J93879K06129L32397L69095L77414K50868J46575J06502R2308j02743
2943F916978l5930M9592j7157J06842J03288K4045R7762r8013M9580J5616j1037
2932G201566J10354J95520K08621K75551J17457K40188K32655L07789N76742N27617
2922I994060O49055Q28683Q36553P36730N33350j71416r25019j113171r96036
2913A0372789r40089p55367n86241n16378m44829k07585k90757j59066j36420
2904F336057j35736j03069j32787l3327K226L202K835J24877k0681n9350J31561
2893F115808R8605R4843R4006J09998K5306m2621j23701k06807k48749k68545
2883E648143l25858l39122l17447l70935l02440j02248j58270k11054j83780l3361
$$ y = [4944554, 5138433, 5344562, 5676959, 6046054, 6423468, 6674336, 6820911, 6927413, 7019721, 6916978, 6881048, 6930640, 6913483, 7020325, 7123613, 7147658, 7245420, 7147407, 7196987, 7212603, 7201566, 7311920, 7507440, 7716061, 7991612, 8109069, 8349257, 8581912, 8889701, 9466443, 9994060, 10643115, 11471798, 12308351, 13045081, 13578431, 13407015, 12481996, 11368825, 10372789, 9432700, 8677333, 8091092, 7574714, 7129885, 6922300, 6631543, 6472477, 6336057, 6200321, 6097252, 5964465, 5931138, 5933364, 5936566, 5939401, 6064278, 6043597, 5984247, 6115808, 6214413, 6309256, 6403262, 6513260, 6538566, 6495945, 6372244, 6165437, 5916688, 5648143, 5322285, 4983163, 4665716, 4294781, 3992341, 3890093, 3731823, 3520769, 3336989, 3303628]
2873C303628j97632j45418l4072j25609j01870m8831q4281j30580n2907m4505
2863B337923j04338m3080q2333k4205j12125q3810K9496m0116L5980j18727o5221
2852A729444j02375O1281r7241j03683Q0439n1244o6172l6807m1905p458p6382
2841A287897M1753R0405o5293q0750l2340p3634J9667L00J2979j31259r1055J02016
2829A080686j9305l4073L71N008m5492m6936j09385n071Q075N5871n8296l6481
2817G94972R5887K6371l2299j52241J0217J16148J8880L026j41405k1722j5698
2806G02136n9890N989L3264M8338r0281k7907J42102l0786j40394k7039K5145
2795E80677M9038J40011q4226j58217J20864Q9526j06262J1765l8946M2230P33
$$ y = [3303628, 3105996, 2960578, 2926506, 2800897, 2699027, 2650196, 2565915, 2435335, 2382428, 2337923, 2233585, 2190505, 2108172, 2083967, 1971842, 1888032, 1917528, 1877412, 1913392, 1794665, 1729444, 1627069, 1688350, 1591109, 1487426, 1567865, 1516621, 1450449, 1413642, 1371737, 1364279, 1287897, 1329650, 1420055, 1354762, 1274012, 1241672, 1168038, 1187705, 1188005, 1200984, 1069725, 978670, 1080686, 1061381, 1027308, 1027679, 1032687, 987195, 940259, 830874, 825803, 833878, 889749, 831453, 794972, 890859, 917230, 884931, 732690, 742907, 859055, 877935, 880961, 739556, 717834, 702136, 642246, 648235, 681499, 729837, 639556, 611649, 753751, 722965, 582571, 555532, 580677, 629715, 769726, 685500, 527283, 648147, 737673, 631411, 643176, 604230, 646460, 647193]
2784F47193m7674K1235m1594r6870q2001Q3846k4468m4404L7117K5018m0691Q1554
2772E18261N6998l1388q2980P372N7846k9849j57300M3505K0580K1622M7340j48025
2760C23982O7707Q4723q3723O7929m5444Q5761J3543l8931j20564J181j1747J9959
2748C64376R7191o9509k7134L1506j0037p6052L5106k6295o1146K6770J61191
2737D45967k6394j50236n8778J27940j2859k6404Q9779O5300m8334m9162J02539
2726D59358M1717r2304m0790l8896j4348l1754q005J45395j8495l8716O1825P897
2714D32884p4827j950m3783n8689J09103r7659l9595L8911j48853O2329J15599
2703B93470O0602m40K2235m1415l7768r596p8213L1706m4807N2807l4179M4201
$$ y = [647193, 599519, 620754, 579160, 482290, 400289, 484135, 459667, 415263, 452380, 477398, 436707, 518261, 575259, 543871, 460891, 468263, 526109, 496260, 338960, 382465, 403045, 424667, 472007, 323982, 391689, 476412, 392689, 460618, 415174, 500935, 514478, 475547, 354983, 356164, 344417, 364376, 461567, 392058, 364924, 396430, 386393, 310341, 345447, 319152, 258006, 284776, 445967, 419573, 269337, 210559, 338499, 325640, 299236, 389015, 454315, 405981, 356819, 459358, 501075, 408771, 367981, 329085, 314737, 282983, 274978, 420373, 401878, 363162, 424987, 432884, 358057, 356107, 312324, 253635, 362738, 265079, 225484, 264395, 115542, 177871, 293470, 354072, 353632, 375867, 334452, 296684, 287088, 208875, 240581, 195774, 248581, 214402, 258603]
2691B58603K8639l4441j21210N3048K001R3973P5059r9228j22593n8598L6370
2680A11623O0634L7338k747N6746q3927j3827l1777Q9334J3699m3980j7527p0383
2668A05206R0086K0116p5456K3963J6411m6223j6079M9024M1664j36664L7733
2657A09781N5450J7572N0730K0033j4257p6242j5279P0040K940q4869Q0094L9605
2645B55598r7775J6281Q6950n6410K7543J7922q194R871P304P1146N5210k9876
2633C55570l4787q5730k2704l708n3363k9116M5775M7379N5981l5027j3434K7023
2621B53859p7128j4585q1189l0878J56484M241p4924m0507j2944j0609j9035N0713
2609A03498Q4335M033j9664K140J0180j07396M2108N005n8913J15308K0706J963
$$ y = [258603, 287242, 252801, 131591, 184639, 186640, 280613, 355672, 256444, 133851, 75253, 111623, 172257, 209595, 206848, 263594, 179667, 165840, 134063, 223397, 237096, 193116, 175589, 105206, 195292, 215408, 139952, 163915, 180326, 134103, 118024, 167048, 208712, 72048, 109781, 165231, 182803, 233533, 253566, 239309, 163067, 147788, 217828, 220768, 135899, 215993, 255598, 157823, 174104, 261054, 204644, 232187, 250109, 241915, 251786, 259090, 330236, 385446, 355570, 320783, 235053, 212349, 208641, 155278, 126162, 171937, 219316, 275297, 240270, 226836, 253859, 176731, 162146, 80957, 50079, 206563, 210804, 135880, 95373, 82429, 71820, 52785, 103498, 187833, 191866, 172202, 174342, 184522, 77126, 119234, 124239, 65326, 180634, 201340, 203303]
2597B03303n219l4563O1352r7768r2098K7797Q7600k2951J520L8883k9245k6722
2585A11889r719Q5591r425r047L0510P8446n4622o036L3560q9726j4876L7322
2573A83867j6523r9559N9019m2179O706O0614Q9311r6280o3162m369k3712j5487
2561C8246j5562O9213l742M3844J00988j8545q9309P0288l2297k1070j06575l0348
2549E131O8500P3867p4424L0824K8675j15866L1531J3948K5405m3526q2681Q6
2537c8530J27202J7481j00827k2017J18482J95007r6549p6890j0634l494M9059
2526A58290j9827n9345l7946k440k7034N0361N1954k4007J136L8726L9988j78622
2514h766r3934P7094J00410l5661O6322J3314n5808o8734j6593K9930J15732j03134
$$ y = [203303, 198084, 163521, 224873, 127105, 35007, 62804, 150404, 127453, 128973, 167856, 138611, 111889, 102170, 187761, 178336, 169289, 199799, 278245, 223623, 217587, 251147, 161421, 146545, 183867, 167344, 67785, 126804, 84625, 91331, 151945, 241256, 144976, 81814, 77445, 53733, 38246, 22684, 91897, 88155, 131999, 232987, 214442, 125133, 195421, 163124, 142054, 35479, 5131, 73631, 147498, 73074, 103898, 132573, 16707, 48238, 62186, 87591, 44065, -38616, -38530, 88672, 106153, 5326, -16691, 101791, 296798, 200249, 123359, 112725, 109231, 158290, 138463, 79118, 41172, 38732, 11698, 62059, 114013, 90006, 91142, 129868, 169856, -8766, -102700, -25606, 74804, 39143, 105465, 118779, 62971, -5763, -22356, 7574, 123306, 20172]
2502B0172K9113q319J917M9911l0990n2288m9435P9170L9570r4249k9234Q6321
2490D1659P2738M6073L9386o2831k5691p0407j9694R7745N6733O927j59806l8082
2478a5250O5694k4654m3821J07146N4003o959K4777O0910r3619o3681P1932R8147
2466B34625j58151n089K603L0459J3226J3283L1146l8261k641K3290j45758j9566
2454b0834N7385K5044R0044j4281j10896L7158J98r510P7494J7207j18596n8461
2442b8048P4154k2016k3153P9434l7335P7613p925l1743K1953l0298N7902J7657
2430A48195k8373r7050p620R0242N1421p6680p620K3914N3046p5646O2938J8840
2418A55607j8234N7641p7819l5227L9390L6418k005M2269o7430J2911K4538k4944
$$ y = [20172, 49285, 40966, 42883, 92794, 61804, 9516, -39919, 39251, 78821, -15428, -44662, 41659, 114397, 160470, 199856, 137025, 111334, 40927, 21233, 118978, 175711, 182638, 22832, -15250, 50444, 25790, -18031, 89115, 143118, 136159, 160936, 221846, 128227, 64546, 136478, 234625, 76474, 71385, 73988, 104447, 117673, 130956, 162102, 123841, 121200, 144490, -1268, -20834, 36551, 61595, 151639, 137358, 26462, 63620, 63818, 54308, 131802, 149009, 30413, -28048, 46106, 24090, 937, 80371, 43036, 120649, 112724, 80981, 102934, 72636, 130538, 148195, 119822, 22772, 15152, 105394, 156815, 80135, 72515, 96429, 149475, 73829, 136767, 155607, 137373, 195014, 117195, 81968, 121358, 157776, 155771, 198040, 130610, 143521, 168059, 143115]
2406A43115o6907L2981j29551O3627P0182O3380J0492j6850M2642j16218p927
2395H8966o4150l8055J41577Q4168o0092J3117k7107L0265J14892m6712M178J62829
2383D03876r8671r4206p21m3357m0823J5525P7791k4881j62306l6168Q8191m0228
2371D4022N575P0634k1577l9839Q203j25788R2151K8287j15979r638P6039J742
2359A3832J9030Q9882k7500J5112p2669O9119M2848j1633j66971j6266n277J61444
2347A10951m4912j822m5491J1833n4820K7637k5352j7698O7661J2304J2191K4881
2335G7363m396j0425R053M9605L7570n6062l7183r3201J08889O9863P6926j56698
2323G1304L31J20736K5714j48684j709l6279q4768P2557J45906j1836o0150l2095
$$ y = [143115, 76208, 109189, -20362, 43265, 113447, 176827, 187319, 170469, 213111, 96893, 88966, 24816, -13239, 128338, 212506, 152414, 165531, 138424, 168689, 283581, 236869, 241047, 403876, 305205, 210999, 210278, 166921, 126098, 141623, 219414, 194533, 32227, -3941, 84250, 44022, 49597, 120231, 98654, 58815, 67018, -58770, 33381, 61668, -54311, -63949, 12090, 13832, 32862, 122744, 95244, 110356, 37687, 106806, 149654, 138021, -28950, -45216, -50493, 110951, 66039, 64217, 18726, 30559, -24261, 3376, -21976, -39674, 27987, 40291, 52482, 77363, 72967, 62542, 71595, 121200, 158770, 102708, 65525, -27676, 81213, 151076, 228002, 71304, 71635, 192371, 218085, 69401, 67692, 31413, -53355, 19202, 165108, 153272, 93122, 61027]
2311F1027O5303q287p2515k9432K8285L2232o3554N9841m2402J65162O9482k48245
2299A6897L7242R0166q5972R2562j4035M0173p1585j6742P1956o1601K1716J8666
2287A39443l8211k2114N1712K9793j5397O4840j9945J0060j2395K9180k2799Q035
2275B02202k0970j9910P3613K3658j9629n9558M5709r7293k2547m9138R6357J3831
2263A66325J324j19245o7011m238L3997R9681J2348j0074J44319J13802j00636
2252B70592p0704k8429J8670k2141L6356P1206k3828k0807n4032Q313m2516K1945
2240A64625O6167j40115L3246N1141J8233l1481n931J8382L8277K1172R7543J6103
2228C47362j04458L9953j04404l8653J14166Q2383l6622j6784K3813Q8276r9964
$$ y = [61027, 126330, 118043, 45528, 16096, 44381, 76613, 13059, 72900, 30498, 195660, 265142, 16897, 54139, 144305, 58333, 150895, 136860, 177033, 105448, 88706, 160662, 99061, 120777, 139443, 101232, 79118, 130830, 160623, 145226, 210066, 190121, 200181, 187786, 216966, 194167, 202202, 181232, 161322, 234935, 258593, 238964, 179406, 225115, 127822, 105275, 56137, 152494, 166325, 167649, 48404, -18607, -22845, 11152, 110833, 123181, 113107, 257426, 371228, 270592, 199888, 171459, 190129, 167988, 204344, 275550, 251722, 230915, 176883, 185196, 142680, 164625, 230792, 90677, 123923, 175064, 193297, 161816, 155885, 174267, 212544, 233716, 331259, 347362, 242904, 282857, 178453, 139800, 253966, 336349, 299727, 282943, 306756, 395032, 295068]
2217B95068o4305J09532m1223J42287O5433n8153n4607K8584R7056j6057o2959
2206D40656P265P5725l7377M8966m4996J9806M2441j9895J7837O4712J52404J0644
2194G78188m1493J18881o7380j2850k3961p287J09063m6619L7391P4531M8284
2183I66748J6623J4473O6463J09542M2980n1414M1500p702N1860M9312J2238j046
2171A311577k2848K7660O7864J774R8306R504j1454O4470O1226P8383j023q0924
2159A604515J41092J92312l8610J34594K15796O0979o9329J28022K70766J00237
2149B740374J55941K42689Q9338J26779K45484J72536K53481L14147J99280L18322
2139D858371M36359M66928N16977N33774O50738P33969P28241P22637O09710Q22702
$$ y = [295068, 230763, 340295, 299072, 441359, 506792, 448639, 394032, 422616, 519672, 503615, 440656, 447921, 523646, 486269, 535235, 490239, 510045, 552486, 532591, 550428, 615140, 767544, 778188, 736695, 855576, 788196, 775346, 751385, 744098, 853161, 806542, 843933, 918464, 966748, 983371, 997844, 1064307, 1173849, 1216829, 1165415, 1206915, 1199213, 1251073, 1300385, 1312623, 1311577, 1288729, 1316389, 1384253, 1386027, 1484333, 1493837, 1482383, 1546853, 1608079, 1686462, 1685439, 1604515, 1745607, 1937919, 1899309, 2033903, 2249699, 2310678, 2241349, 2369371, 2640137, 2740374, 2896315, 3139004, 3228342, 3355121, 3600605, 3773141, 4026622, 4340769, 4540049, 4858371, 5294730, 5761658, 6278635, 6812409, 7463147, 8197116, 8925357, 9647994, 10257704, 11080406]
2129A1080406R14422J231186J576034K086308K598284L301083M042921N095664
2121C1926308N546614O149378O051794K575196o530605j0949505p846388n255357
2113B1667435l687040k773588k059753j646453j295690j040298o85506n67597
2105G911510m77161j76355k32672m62204n62423m03539l67684l66662k27684k67541
2095D367585l31194j22585j67497q0412o4871k41084m1402j17646j38656j88340
2085B873898j05462j15732j02147j42013p7668o6578p4085o3974p9253j35544
2075A911442M6850L1614P725p3043j64893k04430k0233r3989j09747j7276K3161
2064A337181J5520k7619j01287r043R341p9441Oq163r1169o806l1720M9669O9010
$$ y = [11080406, 11994828, 13226014, 14802048, 16888356, 19486640, 22787723, 26830644, 31926308, 37472922, 43622300, 49674094, 52249290, 45718685, 34769180, 26922792, 21667435, 17980395, 15206807, 13147054, 11500601, 10204911, 9164613, 8479107, 7911510, 7434349, 7257994, 7025322, 6563118, 6000695, 5597156, 5229472, 4862810, 4635126, 4367585, 4036391, 3913806, 3746309, 3665897, 3601026, 3359942, 3318540, 3200894, 3062238, 2873898, 2768436, 2652704, 2550557, 2408544, 2330876, 2264298, 2190213, 2126239, 2046986, 1911442, 1958292, 1989906, 1997631, 1924588, 1759695, 1555265, 1535032, 1441043, 1331296, 1314020, 1337181, 1352701, 1325082, 1223795, 1214752, 1224093, 1144652, 1144658, 1136495, 1045326, 1038520, 1006800, 1056469, 1125479]
2051A125479q4760n5057N2905o1339l0295R2473p9592p6659m7252j39202o05N5999
2039G52095l7120K4092P6876r9186p7839q422K7251p817j5426l064K485q8910
2027E45015q2493J41622k3421j0198R8334r839j15686j8664j17185j6506J09529
2016E00508r256J4049j8763l6488l9332P7549k1618l9320j6318m9011L3075j1066
2004C84009m1779j8570P7713l739k0904J6346j09644Q1354n3665r816J7463r5421
1992B23347J25316R938O0372l0786n4102n1556J4967Q7761n490j9793J1660o3306
1980C08328o3186r2182M6622J72748M5481r0127j5230R502m4326J14052K2076
1969D13758l3489m8710L9920o8654r8419N9821p8035n273j0873M9562k174m3775
$$ y = [1125479, 1040719, 985662, 1038567, 977228, 946933, 1039406, 959814, 883155, 835903, 696701, 696096, 752095, 714975, 739067, 815943, 716757, 638918, 630496, 657747, 649930, 634504, 631440, 633925, 545015, 462522, 604144, 580723, 570525, 668859, 659020, 543334, 524670, 407485, 390979, 500508, 491252, 505301, 486538, 450050, 410718, 488267, 466649, 427329, 411011, 362000, 395075, 384009, 342230, 323660, 401373, 397634, 376730, 393076, 283432, 364786, 311121, 301305, 318768, 223347, 348663, 358601, 418973, 388187, 334085, 282529, 297496, 385257, 379767, 359974, 371634, 308328, 245142, 152960, 199582, 372330, 417811, 327684, 312454, 321956, 277630, 391682, 413758, 380269, 331559, 371479, 302825, 204406, 264227, 186192, 180919, 170046, 219608, 217434, 173659]
1957A73659m7365J9066N2688o3022R7574Q4047j22728j7126N7534J8116k192p4673
1945A75578o8102L8257N1083J5743q8167N4727K4046o0368k8872L1579j4356l2881
1933I8267n5440M4184K1818m7879r804M7176J9185K90L9936p7092L4002J1417
1921A26060l8108m9272J1485P1253O8488r4774p033K5369L1495l0135o004m8774
1909F0050o4349P1105K675m195l8421j0877k3916N6928q6601R717L1310J041J01022
1896A05489O154N5627m8381q4995M4775k05r2830J7652L1127o399m1354O2743
1884D9403O8172M623r204p069M3810J6184o0137P1544j575j8342r5959l7141L8346
1871F2655P155J9448l404O728K7202N5327j4018k1160J2531M6812r2184k35N8627
$$ y = [173659, 126294, 145360, 198048, 135026, 232600, 316647, 193919, 176793, 234327, 252443, 250251, 175578, 107476, 145733, 196816, 212559, 124392, 179119, 203165, 142797, 113925, 145504, 131148, 98267, 42827, 87011, 108829, 60950, 51146, 98322, 117507, 117797, 157733, 80641, 114643, 126060, 87952, 38680, 50165, 121418, 189906, 95132, 88099, 113468, 144963, 114828, 108824, 60050, -4299, 66806, 69481, 65286, 26865, 15988, -7928, 49000, -37601, -27884, 3426, 4467, 105489, 111643, 167270, 118889, 33894, 78669, 78464, -14366, 3286, 34413, 28014, -13340, 49403, 117575, 122198, 112994, 105925, 149735, 165919, 105782, 177326, 175751, 157409, 61450, 24309, 62655, 69810, 89258, 85854, 92582, 119784, 175111, 161093, 139933, 152464, 199276, 107092, 106857, 165484]
1858A65484l9585k1951n8554N2525M3062J0594M155N7891J12116j14845o9699
1847A41193M5144j3173o0504L2201O4819P9078j30831j57167P547k9058J1499
1836i252J32867j02689J3715j0024l5087K0870O3215O6013q9599N1802j3604O6397
1824A54624K4426l0688j12870M5431J7636k8249m3242k9547j5077L3120Q8482
1813A04046n3846j670l5986J4393j3800P5367n7448j7753j4696K8230L4126j7512
1801D3451j1402M0002n5207J2299J4422p0116o6172J1915J56235o3017o155k3293
1789a7038k8224O3213j1647k0334N09l7557M9533j18488J27464q82K5477M0461
1777G2487q543J03737n5503j22065M7079P241p2425J0141l6360q1203Q5674J31838
$$ y = [165484, 125899, 103948, 45394, 97919, 140981, 151575, 155730, 213621, 325737, 210892, 141193, 186337, 173164, 112660, 144861, 209680, 288758, 157927, 760, 8307, -20751, -9252, 123615, 20926, 34641, 24617, -10470, 10400, 73615, 139628, 50029, 101831, 88227, 154624, 179050, 148362, 35492, 80923, 98559, 70310, 27068, -2479, -17556, 15564, 104046, 50200, 48530, 12544, 26937, 13137, 88504, 31056, 13303, -1393, 26837, 60963, 43451, 32049, 72051, 16844, 29143, 43565, -26551, -92723, -80808, 75427, 12410, 6255, -17038, -45262, 17951, 6304, -14030, -13521, -51078, -1545, -120033, 7431, 6549, 32026, 72487, 63944, 167681, 112178, -9887, 37192, 44433, -27992, -17851, -54211, -135414, -49740, 82098]
1765H2098j22530n8185M7222P0509P1954k2811q8894M5548k2717K7731M1238o2192
1753H971O3746J4117m3499p5418K7248j6384J46865J1643j15503N5274o6792n257
1741E011K8229K4402J3289j1443j5429O384K016L0882r6166K1714j9357K0250
1729I782K6996M313r586m068L0040m3478j08702J6656O3604l8066l945j7510O575
1716f7389m9489O1366Q3850j0899l0682n8956O5534P2529p4747r6692P1569J22835
1704H8829r4487k0236l5094j04682j6917J39156p4024k644R8156O2384j7557L4157
1692E7041L7941p8066k5219m3213k1835J3732O1597K1655L2422J24838L090j49450
1680C4533m7442l4055J18815N3844k259q8067K959K3989n1397o4821k7242L7690
$$ y = [82098, -40432, -98617, -51395, 19114, 91068, 68257, -20637, 24911, 2194, 29925, 71163, 8971, 72717, 86834, 43335, -32083, -4835, -21219, 125646, 137289, 21786, 77060, 10268, 5011, 33240, 57642, 70931, 59488, 44059, 50443, 52459, 83341, -12825, 8889, -10468, 9782, 36778, 41091, 31505, 27437, 57477, 13999, -94703, -78047, -14443, -52509, -56454, -73964, -67389, -116878, -55512, 28338, 17439, -13243, -72199, -6665, 65864, -8883, -105575, -34006, 88829, -5658, -25894, -60988, -165670, -182587, -43431, -117455, -120099, -21943, 40441, 22884, 57041, 94982, 16916, -8303, -51516, -73351, -59619, 1978, 23633, 56055, 180893, 183983, 34533, -12909, -46964, 71851, 125695, 123436, 35369, 38328, 62317, 10920, -53901, -81143, -43453]
1668d3453l2840J4615q726k8681M9949L7734Q9291m5829n203n1445M8796K5642
1656D9850K86j064p3717j3005j1223J3144J01187L6696n3736m4467P7585J02679
1644A84215J2711j78429j13360J11849l0094m1512J54312K9695o7353j17605n026
1633f0597M2193J9581J35657j23271n5023l0370Q2549J16578K4287j19960N463
1622C7087k2373o7726Q0141M7593R1662J788j41829r9864J2084P2002r2514k0382
1610a02331O1281L8569L9995l6163P9238j14309j904k7819O5359r6466j4760N4936
1598e4374j02793J43541O7778n3515m7980M3496j2068L4553Q6497m5218j4118
1587D5799n7100l2298r334O4755O4318j49413l1576J6111L8817L2413j8549n3371
$$ y = [-43453, -76293, -61678, -70404, -99085, -49136, -11402, 77889, 32060, 26857, -24588, 24208, 49850, 50136, 49072, -24645, -37650, -48873, -35729, 65458, 102154, 48418, 3951, 81536, 184215, 196926, 18497, -94863, 16986, -13108, -54620, 99692, 129387, 62034, -55571, -60597, -18404, 1177, 136834, 13563, -41460, -71830, 10719, 127297, 151584, 31624, 37087, 14714, -53012, 27129, 74722, 166384, 168172, 26343, -73521, -61437, 10565, -81949, -102331, -41050, -2481, 37514, 1351, 80589, -33720, -35624, -63443, 1916, -94550, -109310, -54374, -157167, -13626, 54152, 637, -47343, -3847, -15915, 18638, 105135, 59917, 45799, -11301, -43599, -52933, 11822, 76140, -73273, -104849, -88738, -49921, -17508, -36057, -89428]
1575h9428L9579k6121J37728R5238n8736q5432K122j581j5300o4741J04758M7383
1563H5469j66328L162J42802j01704l3894J3903O1279j25106j8513N5686L2529
1552e0715l1385o4249N3640M3212m684n458N0684k0966p6376N3425M947r600K0740
1539c6785l8581K4315L8771K4068J5402l9606P5295k171q6048r555j9284J50475
1527I6296r321r032p8569l7660m2011O9334L3528k0443j9138m272L6119k1783
1515f952O6245m9795q31o639k8929N9557n309k9138Q8280n2940m6291k1170j05933
1502a39845L7043l4769J11363k1298j0216o472N2361l9256L017K331l5691P7407
1490d025M6733n0866O0458m0681n3633M548O598O6091j3682n2233K6876j0602
$$ y = [-89428, -49849, -75970, 61758, 156996, 98260, 12828, 14950, 13369, -1931, -66672, 38086, 85469, -80859, -77697, 65105, -36599, -70493, -56590, 4689, -120417, -138930, -83244, -50715, -82100, -146349, -92709, -49497, -54181, -59639, -8955, -29921, -106297, -52872, -47925, -57525, -36785, -75366, -51051, -12280, 11788, 27190, -12416, 62879, 60708, -25340, -34895, -54179, 96296, 86975, 77943, -626, -38286, -80297, -10963, 22565, 2122, -17016, -21288, 14831, -6952, 59293, 9498, 8667, 2028, -26901, 32656, 27347, -1791, 86489, 33549, -12742, -33912, -139845, -102802, -137571, -26208, -47506, -57722, -64194, -11833, -51089, -48072, -45741, -81432, -4025, 42708, -8158, 52300, 11619, -42014, -37466, -30868, 35223, 21541, -30692, -3816, -14418]
1478a4418P7634L3630q3829j6079K2901l9125L3707M7584l0423M3619m5669l2775
1466c243J18620j56646N9788L3246k6341m7539J0977R836m7266n6441l9108J01230
1454d2887m1026j2555Q7222o3113P5162K4133o9189n6071L139R0575j3180k0461
1442c8251o2716L5890k3980J15882j8113P1888N3827j8511j33526j10869J04073
1431b4406P4439j2390l520j24883P3549M4787k2444M744N3133K4862j5995J7596
1419H9472J7069p8291Q7964n2062q8481o1344J30655p8199m6951J65501q6325
1408i92j9049M745J1404M2474n409p1276L7109L1827l8969j7193q3916J698n0859
1395a58406r606N5649J6683L523j7456J963P6294R9468p4646k4119j6515J13734
$$ y = [-14418, 63216, 96846, 13017, -3062, 19839, -19286, 14421, 62005, 31582, 75201, 29532, -3243, 115377, -41269, 18519, 51765, 25424, -22115, -11138, -1302, -48568, -105009, -144117, -42887, -83913, -96468, -9246, -72359, 2803, 26936, -42253, -98324, -95185, -4610, -17790, -38251, -100967, -65077, -89057, 26825, 8712, 80600, 134427, 115916, -17610, -128479, -24406, 50033, 37643, 34123, -90760, -17211, 27576, 5132, 9876, 63009, 87871, 71876, 89472, 106541, 28250, 116214, 64152, -24329, -85673, 44982, -33217, -80168, 85333, -992, -20041, -15296, -3892, 38582, 33173, -38103, -994, 30833, -8136, -25329, -109245, -107547, -158406, -168012, -112363, -95680, -92157, -109613, -107650, -31356, 68112, -6534, -30653, -47168, 66566]
1383F6566n8140k1692P0101Q4531q766m2983l4544l5863N1752m0498l57Q389m4384
1370e888K2052o7842J7572m099Q7574L9544j04505J9384P854L6991L4057j10951
1358b8257n9721K2121L1085M9441j00208j4886J5864K3771O6943L4538o1074N001
1346a5382K5025n2557P253K0391J3702o286m1824P0396q373j10574J5281O9340
1334a3608l0222L2552K2065p2116r380K177N2175J8201p6414N9872M0626r1132
1322f5204J5728O2520J590n619j16705M6439J47919o0545j13608N1029K5368m707
1310a5795n480k5864l3307M6317K3744j37510R0585K9895O8334p3884n6282J00901
1298A1654N2271m6190o154n46J7987n0811n59m1444p4216Q9462N7004N1617j14404
$$ y = [66566, 8426, -13266, 56835, 141366, 132600, 89617, 55073, 19210, 70962, 30464, 30107, 38496, -5888, 16164, -51678, -34106, -38205, 49369, 88913, -15592, 3792, 11646, 48637, 82694, -28257, -87978, -65857, -34772, 14669, -85539, -100425, -84561, -60790, 6153, 40691, -20383, -15382, 9643, -42914, -35661, -15270, -1568, -7854, -49678, 20718, 12345, -98229, -82948, -13608, -43830, -11278, 10787, -61329, -70709, -68532, -16357, 1844, -74570, -14698, 25928, -65204, -49476, 13044, 14634, 9015, -107690, -61251, 86668, 26123, -87485, -36456, -11088, -15795, -21275, -47139, -80446, -34129, -10385, -147895, -57310, -27415, 40919, -32965, -89247, 11654, 63925, 17735, 11581, 11035, 29022, -21789, -22348, -63792, -138008, -48546, 8458, 60075, -54329]
1285e4329M9909K9252k6987q0705J11206M7678o4066K3744n4581j3568m1840J04177
1273B9890L9915k3369N841k2450M645M6329j08330p0973L327L8367L076K1961
1261c1771J6452n3557m5682O0219l1649l1347K1575J06011J03010o6282m6447
1250E32o9235j13953r436J70806L4507m9509J078J13882p0428l8557P6583k1224
1238B5046p4404m2697j8394M1415n13L2542Q4352n3446M5161q903j0920k8810
1226i571j4105m3258k6777J07053p8329L8132J52880j44659R11M4071k4656l8444
1214c6752N3540K2345k4454L0440N3538M19k0604r7352j1216m3340m7741o5452
1202a86629R2068J48611r9391J08057l6919p0452j3437m0577K854J09457o3734
$$ y = [-54329, -4420, 24832, -2155, -82860, 28346, 76024, 11958, 35702, -18879, -32447, -74287, 29890, 69805, 46436, 52277, 29827, 34472, 80801, -27529, -98502, -95175, -56808, -53732, -31771, -15319, -68876, -114558, -54339, -85988, -117335, -95760, 10251, 113261, 46979, 532, -68703, -182656, -192092, -21286, 13221, -36288, -35210, 78672, 8244, -30313, 46270, 25046, -49358, -92055, -110449, -69034, -69547, -37005, 47347, -6099, 39062, 30159, 19239, -9571, -23676, -66934, -93711, 13342, -64987, -26855, 126025, -18634, -17723, 26348, 1692, -36752, 16788, 39133, 14679, 45119, 98657, 99076, 78472, -18880, -30096, -73436, -121177, -186629, -94561, 54050, -45341, 62716, 25797, -44655, -58092, -98669, -95815, 13642, -50092]
1191e0092j24675N6999J0585L7974K0490N4087M4388j3187o0748k3384L2229M5022
1179B9688o1285l8238K9319J00488N3991o9986n3406q561L3020n9285m868J3749
1167c5374R5893k0645l4151p390m6536p1187L8344P295q130j3598R3185O4161
1155F1867q1663m2631l421n5765M4845o6440Q7363j8324L8456R8781J7552n4111
1143B6509o3882k2400K5711j723k3558J06687l1568q5034N521Q6980M9181m5319
1131B7105l373n8848j07068j2247J1836O9738p056J1006q9690M3360O9054N9717
$$ y = [-50092, -174767, -117768, -107183, -69209, -48719, 5368, 49756, 36569, -24179, -47563, -15334, 29688, -31597, -69835, -40516, 59972, 113963, 43977, -9429, -17990, 15030, -44255, -49123, -35374, 60519, 39874, 5723, -1667, -48203, -119390, -81046, -73751, -81881, -95479, -2294, 61867, -19796, -62427, -65848, -121613, -76768, -143208, -55845, -74169, -35713, 63068, 80620, 26509, -37373, -59773, -34062, -35785, -59343, 47344, 15776, -69258, -63737, 23243, 72424, 27105, 23732, -35116, -142184, -154431, -142595, -72857, -79913, -68907, -158597, -115237, -46183, 13534]
$$ [...]
##END NTUPLES=NMR SPECTRUM
##END=
