##TITLE=1H_TG-2341-B4
 CDCl3
 8 sc, 
 12.1.2022
##JCAMPDX= 6.0         $$ Bruker NMR JCAMP-DX V2.0
##DATA TYPE= NMR SPECTRUM
##DATA CLASS= NTUPLES
##ORIGIN= UXNMR, Bruker Analytische Messtechnik GmbH
##OWNER= root
$$ XWIN-NMR		Version 3.5
$$ Wed Jan 12 13:50:55 2022 Russian Standard Time (UT+4h)  she@DPX200
##.OBSERVE FREQUENCY= 200.131346
##.OBSERVE NUCLEUS= ^1H
##.ACQUISITION MODE= SIMULTANEOUS
##.ACQUISITION SCHEME= undefined
##.AVERAGES= 8
##.DIGITISER RES= 18
##SPECTROMETER/DATA SYSTEM= spect
##.PULSE SEQUENCE= zg30
##.SOLVENT NAME= D2O
##.SHIFT REFERENCE= (INTERNAL, D2O, 0, 15.7171)
##AUDIT TRAIL= $$ (NUMBER, WHEN, WHO, WHERE, WHAT)
$$ ##TITLE= Audit trail, XWIN-NMR		Version 3.5
$$ ##JCAMPDX= 5.01
$$ ##ORIGIN= Bruker BioSpin GmbH
$$ ##OWNER= she
$$ F:/spectra/data/she/nmr/H-F/1/pdata/1/auditp.txt
$$ ##AUDIT TRAIL=  $$ (NUMBER, WHEN, WHO, WHERE, WHAT)
(   1,<2022-01-12 13:48:41.14 +0400>,<she>,<DPX200>,
      <created by zg, POWCHK disabled, PULCHK disabled
       configuration hash MD5:
       00 E9 B6 7A A2 85 ED C7 34 08 36 98 17 FE 4E 26
       data hash MD5: 16K
       C5 6B 3A DE 26 2E 61 31 A8 C9 64 5D FD ED 15 94>)
(   2,<2022-01-12 13:50:00.48 +0400>,<she>,<DPX200>,
      <Start of raw data processing
       efp BC_mod = 2 LB = 0.24 FT_mod = 6 PKNL = 1 PHC0 = -15864.68 PHC1 = 8.60079 SI = 16K 
       data hash MD5: 16K
       CA 25 96 33 C9 C7 4E 34 AE FE 2B 54 0C 03 6F CA>)
$$ ##END=
$$ 
$$ hash MD5
$$ A3 72 AE 2E 1C A3 4E F1 B8 CB 19 CD F9 68 B7 8A
##$RELAX= 
##$RELAX= 
##$RELAX= 
##$RELAX= 
##$RELAX= 
##$RELAX= 
$$ Bruker specific parameters
$$ --------------------------
##$DU= <F:/spectra>
##$EXPNO= 1
##$NAME= <H-F>
##$PROCNO= 1
##$TYPE= <nmr>
##$USER= <she>
##$AMP= (0..31)
100 100 100 100 100 100 100 100 100 100 100 100 100 100 100 100 100 100 
100 100 100 100 100 100 100 100 100 100 100 100 100 100 
##$AQSEQ= 0
##$AQ_mod= 1
##$AUNM= <au_zg>
##$AUTOPOS= <>
##$BF1= 200.13
##$BF2= 200.13
##$BF3= 200.13
##$BF4= 200.13
##$BF5= 200.13
##$BF6= 200.13
##$BF7= 200.13
##$BF8= 200.13
##$BYTORDA= 1
##$CFDGTYP= 0
##$CFRGTYP= 5
##$CHEMSTR= <none>
##$CNST= (0..31)
1 1 145 1 1 1 1 1 1 1 1 1 1 1 1 1 1 1 1 1 1 1 1 1 1 1 1 1 1 1 1 1 
##$CPDPRG= <>
##$CPDPRG1= <>
##$CPDPRG2= <>
##$CPDPRG3= <>
##$CPDPRG4= <mlev>
##$CPDPRG5= <mlev>
##$CPDPRG6= <mlev>
##$CPDPRG7= <mlev>
##$CPDPRG8= <mlev>
##$CPDPRGB= <>
##$CPDPRGT= <>
##$D= (0..31)
0 1.2 0 0 0 0 0 0 0 0.06 0 0.03 0 0 0 0 0.0002 0 0 0 0 0 0 0 0 0 0 0 0 
0 0 0 
##$DATE= 1641980920
##$DBL= (0..7)
120 120 120 120 120 120 120 120 
##$DBP= (0..7)
150 150 150 150 150 150 150 150 
##$DBP07= 0
##$DBPNAM0= <>
##$DBPNAM1= <>
##$DBPNAM2= <>
##$DBPNAM3= <>
##$DBPNAM4= <>
##$DBPNAM5= <>
##$DBPNAM6= <>
##$DBPNAM7= <>
##$DBPOAL= (0..7)
0.5 0.5 0.5 0.5 0.5 0.5 0.5 0.5 
##$DBPOFFS= (0..7)
0 0 0 0 0 0 0 0 
##$DE= 6
##$DECBNUC= <off>
##$DECIM= 32
##$DECNUC= <off>
##$DECSTAT= 4
##$DIGMOD= 1
##$DIGTYP= 9
##$DL= (0..7)
0 120 120 120 120 120 120 120 
##$DP= (0..7)
150 150 150 150 150 150 150 150 
##$DP07= 0
##$DPNAME0= <>
$$ [...]
##$SUBNAM1= <"">
##$SUBNAM2= <"">
##$SUBNAM3= <"">
##$SUBNAM4= <"">
##$SUBNAM5= <"">
##$SUBNAM6= <"">
##$SUBNAM7= <"">
##$SUBNAM8= <"">
##$SUBNAM9= <"">
##$SW= 18.0517287032376
##$SWIBOX= (0..15)
0 0 2 0 0 0 0 0 0 0 0 0 0 0 0 0 
##$SW_h= 3612.71676300578
##$TD= 16384
##$TD0= 1
##$TE= 0
##$TE2= 300
##$TE3= 300
##$TEG= 300
##$TL= (0..7)
0 120 120 120 120 120 120 120 
##$TP= (0..7)
150 150 150 150 150 150 150 150 
##$TP07= 0
##$TPNAME0= <>
##$TPNAME1= <>
##$TPNAME2= <>
##$TPNAME3= <>
##$TPNAME4= <>
##$TPNAME5= <>
##$TPNAME6= <>
##$TPNAME7= <>
##$TPOAL= (0..7)
0.5 0.5 0.5 0.5 0.5 0.5 0.5 0.5 
##$TPOFFS= (0..7)
0 0 0 0 0 0 0 0 
##$TUNHIN= 0
##$TUNHOUT= 0
##$TUNXOUT= 0
##$USERA1= <user>
##$USERA2= <user>
##$USERA3= <user>
##$USERA4= <user>
##$USERA5= <user>
##$V9= 5
##$VALIST= <valist>
##$VCLIST= <CCCCCCCCCCCCCCC>
##$VD= 0
##$VDLIST= <DDDDDDDDDDDDDDD>
##$VPLIST= <PPPPPPPPPPPPPPP>
##$VTLIST= <TTTTTTTTTTTTTTT>
##$WBST= 1024
##$WBSW= 4
##$XGAIN= (0..3)
0 0 0 0 
##$XL= 0
##$YL= 0
##$YMAX_a= 265758
##$YMIN_a= -416607
##$ZGOPTNS= <>
##$ZL1= 120
##$ZL2= 120
##$ZL3= 120
##$ZL4= 120
##$ABSF1= 0
##$ABSF2= 0
##$ABSG= 0
##$ABSL= 0
##$ALPHA= 0
##$AQORDER= 0
##$ASSFAC= 0
##$ASSFACI= 0
##$ASSFACX= 0
##$ASSWID= 0
##$AUNMP= <proc_1d>
##$AZFE= 0.1
##$AZFW= 0.1
##$BCFW= 0
##$BC_mod= 2
##$BYTORDP= 0
##$COROFFS= 0
##$CY= -3
##$DATMOD= 1
##$DC= 0
##$DFILT= <>
##$DTYPP= 0
##$F1P= 0
##$F2P= 0
##$FCOR= 1
##$FTSIZE= 16384
##$FT_mod= 6
##$GAMMA= 0
##$GB= 0
##$INTBC= 1
##$INTSCL= 0
##$ISEN= 128
##$LB= 0.24
##$LEV0= 0
##$LPBIN= 0
##$MAXI= 10000
##$MC2= 0
##$MEAN= 0
##$ME_mod= 0
##$MI= 1.114404
##$NCOEF= 0
##$NC_proc= -6
##$NLEV= 6
##$NOISF1= 3.799351
##$NOISF2= 2.8
##$NSP= 0
##$NTH_PI= 0
##$NZP= 0
##$OFFSET= 15.71714
##$PC= 1
##$PHC0= -15864.68
##$PHC1= 8.60079
##$PH_mod= 1
##$PKNL= yes
##$PPARMOD= 0
##$PSCAL= 0
##$PSIGN= 0
##$REVERSE= no
##$SF= 200.130006886751
##$SI= 16384
##$SIGF1= 3
##$SIGF2= 2
##$SINO= 5.538805
##$SIOLD= 16384
##$SREGLST= <1H.CDCl3>
##$SSB= 0
##$STSI= 16384
##$STSR= 0
##$SW_p= 3612.71676300578
##$SYMM= 0
##$S_DEV= 0
##$TDeff= 16384
##$TDoff= 0
##$TI= <>
##$TILT= no
##$TM1= 0
##$TM2= 0
##$TOPLEV= 0
##$USERP1= <user>
##$USERP2= <user>
##$USERP3= <user>
##$USERP4= <user>
##$USERP5= <user>
##$WDW= 1
##$XDIM= 16384
##$YMAX_p= 286651313
##$YMIN_p= -825311
$$ End of Bruker specific parameters
$$ ---------------------------------
##NTUPLES= NMR SPECTRUM
##VAR_NAME=  FREQUENCY,     SPECTRUM/REAL,   SPECTRUM/IMAG
##SYMBOL=    X,             R,               I
##VAR_TYPE=  INDEPENDENT,   DEPENDENT,       DEPENDENT
##VAR_FORM=  AFFN,          ASDF,            ASDF
##VAR_DIM=   16384,         16384,           16384
##UNITS=     HZ,            ARBITRARY UNITS, ARBITRARY UNITS
##FACTOR=    0.220516191357247, 1,           1
##FIRST=     3145.47137601652, 0,            0
##LAST=      -467.24538698926, 0,            0
##MIN=       -467.24538698926, -825311,      0
##MAX=       3145.47137601652, 286651313,    0
$$ Real data points
##PAGE= N=1
##DATA TABLE= (X++(R..R)), XYDATA
$$ [...]
7216E67972j2564o868K0105K3300N4783K0569n8101O5409n496q2640J68294k2167
7204G32596j06392n1481L3588j4271j7689M1844j0273Q024P3625N5258k2031O9752
7192G92550m4089P8990l4859K2387M8417m7783n3153P357O9213m5656N0757K005
7180H46136O0077M8395P5162K5919J9178R3544R4969M0269K8909q2291Q7488L4910
7168A372665K9206l0391N71K5700J35141N0066J6221P2887L9926K1747K7878N119
7156A766736R2971R2260l1982n903J80775J58666R5974j4472Q7986J27368K5268
7145B575647N3504O2289Q4704Q2011P0901k4661P8198J28875m266Q9688J29595
7134C326485Q9935J05055N8588J41723N4983R7642J10601Q3144K03385J37698
$$ y = [567972, 555408, 548540, 568645, 591945, 646728, 667297, 609196, 674605, 669109, 586469, 754763, 732596, 626204, 574723, 608311, 594040, 576351, 618195, 607922, 615946, 689571, 744829, 722798, 792550, 748461, 827451, 792592, 814979, 863396, 815613, 762460, 769817, 839030, 793374, 844131, 846136, 906213, 954608, 1029770, 1055689, 1074867, 1168411, 1263380, 1303649, 1332558, 1250267, 1337755, 1372665, 1401871, 1371480, 1372051, 1397751, 1532892, 1582958, 1599179, 1672066, 1711992, 1733739, 1761617, 1766736, 1859707, 1951967, 1919985, 1914082, 2094857, 2253523, 2349497, 2335025, 2423011, 2550379, 2575647, 2629151, 2691440, 2776144, 2858155, 2929056, 2904395, 2982593, 3111468, 3107202, 3196890, 3326485, 3416420, 3521475, 3580063, 3721786, 3776769, 3874411, 3985012, 4068156, 4271541, 4409239]
7124D409239N4493J69330P8526J25060J04803L9607K30975J81242K67163K51563
7114E912001J83679J28157J57197L55045L06921L10328M04465L47233L60043L65669
7104H830738M04686N07208N45488M22635N01741N44297O73517O87783P46743R44173
7094A4809009J035058J042229J181735J362297J187802J240715J327550J363586
7086B4549981J563872J807198J962751K346984K732595L320542L870812M569810
7078D6724545N503188O477814P478007P522271O676393M444481Q82118l148336
7070H2560481o506389q816990r487508q727052p845682n982003m554956l589160
7062B7050741k722715k177335j851624j605530j344910j198548j137505r60784
$$ y = [4409239, 4463732, 4633062, 4711588, 4836648, 4941451, 4981058, 5212033, 5393275, 5660438, 5912001, 6095680, 6223837, 6381034, 6736079, 7043000, 7353328, 7757793, 8105026, 8465069, 8830738, 9235424, 9742632, 10288120, 10710755, 11212496, 11756793, 12430310, 13118093, 13864836, 14809009, 15844067, 16886296, 18068031, 19430328, 20618130, 21858845, 23186395, 24549981, 26113853, 27921051, 29883802, 32230786, 34963381, 38283923, 42154735, 46724545, 52227733, 58705547, 66183554, 73705825, 80382218, 84826699, 85708817, 82560481, 76054092, 67237102, 57749594, 49022542, 41176860, 35194857, 30639901, 27050741, 24328026, 22150691, 20299067, 18693537, 17348627, 16150079, 15012574, 14051790]
7054A4051790q35090q85096o41282l89681n00651k95519k91695l92077l19943
7045I500756l99002k45371l32986l15033j55652k77553k48119k41564j54374k90356
7035F840746k38633l02587k42763n2637j62269j81056j83973k14453q7677j17514
7025E057184p6952n5400j9262K0809l7997j79767j94657q8771l76131k11946j28908
7014C708202j52691k03519j51208J2727L3582k5306o9297n7928n0186m9502j625
7003B993249q8119p2801p6788j3472m12j5741o0365p1953k1096j3916k5887j52099
6991B380600l014j25514j69013J1394j00535k00014j7906L096R370j01683o5668
6980A621113J4455L09j09424O730N3178j39976J2994R030K7075M1831J06786L4421
$$ y = [14051790, 13216700, 12331604, 11690322, 11300641, 10799990, 10504471, 10212776, 9820699, 9500756, 9101754, 8856383, 8523397, 8208364, 8052712, 7775159, 7527040, 7285476, 7131102, 6840746, 6602113, 6299526, 6056763, 6004126, 5841857, 5660801, 5476828, 5262375, 5174698, 5057184, 4980232, 4924832, 4905570, 4926379, 4888382, 4708615, 4513958, 4425187, 4049056, 3837110, 3708202, 3555511, 3351992, 3200784, 3213511, 3247093, 3221787, 3152490, 3094562, 3044376, 2994874, 2993249, 2905130, 2832329, 2755541, 2742069, 2741657, 2725916, 2665551, 2593598, 2572502, 2558586, 2532699, 2380600, 2377586, 2252072, 2083059, 2094453, 1993918, 1793904, 1775998, 1779094, 1788464, 1686781, 1621113, 1635568, 1635877, 1526453, 1533183, 1586361, 1446385, 1459379, 1468409, 1495484, 1537315, 1644101, 1678522]
6968A678522L8514j03405o371p1920K0762o684q8755m6599j43399R4498n5634
6957A309529q3070m6609L0105K3962j62561m0679k3388j494Q9145j5004r5961
6946I83975J8822O6219l1723j10256Q4917l0836p9223K8858k0422j23320m4377
6935G42634R977k844j48840J02871q806m3237J3635J25205M2629L0772m5030j24402
6923F94564K9436m6435L3557k7048J332L4088k1306j2841K1643r9266l9698n564
6911E62462j9461l1379K5528K8770K960n8296R2340n1398j3383r0212J18243M7547
6899F13721o5563m2706N9775J34623q2688r2118J15163j6837m6655j9596n1567
6888E05552J0746J5324L1699O0034q0815R1467M9205k6771j00129M3451L2518
$$ y = [1678522, 1717036, 1613631, 1607260, 1535340, 1556102, 1549418, 1460663, 1414064, 1270665, 1365163, 1309529, 1226459, 1179850, 1209955, 1233917, 1071356, 1030677, 1007289, 1005795, 1094940, 1079936, 983975, 1002797, 1069016, 1037293, 927037, 1011954, 981118, 901895, 930753, 910331, 787011, 742634, 752611, 749767, 600927, 703798, 694992, 651755, 665390, 790595, 833224, 863996, 818966, 694564, 724000, 677565, 711122, 684074, 685406, 719494, 698188, 685347, 706990, 607724, 568026, 562462, 543001, 511622, 537150, 565920, 568880, 510584, 602924, 551526, 538143, 447931, 566174, 613721, 548158, 505452, 565227, 699850, 617162, 525044, 640207, 623370, 576715, 557119, 505552, 516298, 531622, 563321, 623355, 542540, 634007, 683212, 656441, 556312, 599763, 632281]
6877F32281p4888J8990k8597m299K0892K8466o045k1863J8696J4930r6502q928
6865D93133L064J1996R2719J87j73287M1731M8495R6857j0384m4636k0085P3934
6853F13724P625L9313q6306j8352p1259q213L5792k8921l1709l4974Q3329J1991
6841E12040l9711K5292o7176M7505p4359M8374K07871j6421o5148m2752p9496
6830D56019j9771P3330o133M934M570J0007q7387O2926Q7020q007O4833J7396
6818F59737j9050m7884r5311p3684L9840J6038k9058K6770l7611P320M0226q2514
6806D04819m862J26739j17842k0609Q5559J04929O376q5215M4017O4485j32717
6795D75679j5234J33824k1424p4568J2827p8356N1536q647q675k5808q581R6877
$$ y = [632281, 557393, 576383, 547786, 543487, 564379, 592845, 586800, 564937, 583633, 598563, 502061, 493133, 496197, 508193, 600912, 601099, 427812, 469543, 518038, 614895, 604511, 559875, 539790, 613724, 621349, 660662, 574356, 556004, 484745, 476532, 512324, 483403, 451694, 416720, 500049, 512040, 472329, 497621, 430445, 477950, 403591, 451965, 659836, 643415, 578267, 535515, 456019, 436248, 509578, 503445, 508379, 512949, 522956, 435569, 498495, 585515, 577508, 642341, 659737, 640687, 592803, 497492, 423808, 463648, 479686, 450628, 477398, 439787, 447107, 487333, 404819, 399957, 526696, 408854, 388245, 473804, 578733, 585109, 499894, 543911, 608396, 475679, 460445, 594269, 572845, 498277, 511104, 432748, 484284, 475637, 466962, 441154, 432573, 529450]
6783E29450L285J4518l8825p2230r177k4663o372L2128m421k2779R7768P3193
6771E71875j34485J2383j6917Q199M2306N0363l6907k3519j04139m2653q045J1588
6759C30049J8355j5128Q4218J3499n2416J00379N6244P152m5817n3735M6073O010
6747D94883L5248q2419l5552j15290M898O9267K8675M42M688k6694L1954K2689
6735D32789p9862R7840J9475j6243O6045N8875j9389J0561m4157k7296N7060N0993
6723F06691M6860j22295n3538j4693j9896L6370P1687m92l4796k8575M3077N7574
6711E87974n1788p4428L9755r0441N6830J6889q886N3502K9453n7891n7222l983
6699D39764N8705P6994j05736o1163N0980P1608q0336m6088J1032O5090q91k4061
$$ y = [529450, 532735, 547253, 508428, 436198, 427021, 402358, 395986, 428114, 423693, 400914, 498682, 571875, 437390, 449773, 432856, 441055, 483361, 533724, 496817, 473298, 369159, 326506, 318461, 330049, 348404, 333276, 417494, 430993, 378577, 478956, 535200, 542352, 496535, 442800, 488873, 494883, 530131, 447712, 412160, 296870, 301768, 371035, 399710, 400152, 404840, 378146, 410100, 432789, 352927, 450767, 470242, 453999, 520044, 578919, 559530, 570091, 525934, 498638, 555698, 606691, 653551, 531256, 477718, 463025, 443129, 479499, 551186, 550694, 515898, 487323, 530400, 587974, 536186, 461758, 501513, 411072, 467902, 484791, 475905, 529407, 558860, 500969, 443747, 439764, 498469, 575463, 469727, 408564, 459544, 531152, 450816, 404728, 415760, 480850, 479959, 455898]
6687D55898j6946P9337O6702J7407j4237k6264M5894j477J8710K2489M5839J57478
6675H50830L1418l0720J04145K4773q0893k0978J2588N7153k9777j38107r7205
6664F83227K7319m418O158P588n4321j4752J1643m6985K2018j108J4728k7609
6652F23488N3188n1415L2723L9799q3994k8091m9597L1671j5465n4656M430P1752
6640E73833K7863l7107n1331j24393L9181J32001J02291L851o9388N7144k3727
6629F30218j08567k5912Q9584N3626q4152j8596n7696o840N09J63021N6832n4634
6617F37393L7563N5488l2401k5486q7010L5460Q244j58950J12542o404O9654K9733
6605F75826R2450n0652m8291o3564r3733L2691o414N8814j03900j15923N0671
$$ y = [455898, 438952, 518289, 584991, 602398, 588161, 561897, 607791, 606314, 625024, 647513, 693352, 850830, 882248, 851528, 955673, 980446, 899553, 878575, 891163, 948316, 918539, 780432, 683227, 710546, 706128, 712286, 719874, 665553, 650801, 662444, 615459, 637477, 636369, 651097, 623488, 676676, 625261, 657984, 697783, 613789, 585698, 536101, 567772, 552307, 497651, 502081, 573833, 601696, 564589, 513258, 388865, 428046, 560047, 662338, 666189, 596801, 653945, 630218, 521651, 495739, 585323, 638949, 554797, 536201, 478505, 471665, 472174, 635195, 692027, 637393, 674956, 730444, 698043, 672557, 585547, 621007, 629251, 470301, 582843, 576439, 646093, 675826, 768276, 717624, 669333, 605769, 512036, 544727, 538313, 597127, 493227, 377304, 427975]
6594D27975K04241Q081k1778q1403J6171Q8337P2973n5147j22354J9915Q1274
6583F38285J0263j40674l0419P3214Q8276O3930K1474p6736j3651r5082R7378
6572F36258N82r6981o4771N2198J01832M5073j65526l5991p951R1405J4196M7455
6560F17779R8379o5997N3682m1320o5380N4494P2959L5462j26721k5804m9879
6549E57654P5627j6807k2572N0832K8554J06420J0305l4642j587j8689K8402K5723
6537G89220n4539q0121O9915j03565k3916L6818j5104N3484j45O2043r2716J6531
6525F57905j05P5347j9401m399P4448o8853j24141K4923j5271P3417j0317m4229
6513F19324J1182J0127J8096M5790N2964q4253r2600k1046O714N3910M8067L24
$$ y = [427975, 632216, 640297, 618519, 537116, 553287, 641624, 714597, 659450, 537096, 557011, 638285, 648548, 507874, 477455, 550669, 638945, 702875, 724349, 647613, 633962, 538880, 636258, 636840, 539859, 475088, 527286, 629118, 674191, 508665, 472674, 464723, 556128, 570324, 617779, 716158, 650161, 703843, 662523, 597143, 651637, 724596, 760058, 633337, 607533, 557654, 633281, 616474, 593902, 644734, 673288, 779708, 790013, 755371, 753784, 735095, 763497, 789220, 734681, 654560, 724475, 620910, 596994, 633812, 618708, 672192, 672047, 734090, 641374, 657905, 657800, 733147, 713746, 709347, 783795, 714942, 590801, 615724, 600453, 673870, 663553, 619324, 630506, 640633, 658729, 704519, 757483, 673230, 580630, 559584, 566298, 620208, 668275, 668599]
6501F68599o9393J4643j2536K2299L1570m1090Q8523M2971k77j6225O858j6544
6489G19398k4540j2278M7127K5533l6101p5830n3632N0251o7420J11922K8496
6478G12926J9939M450n3753p2190M2647p105m2196R4610r2434k741J07998k877
6466G09274J05437l2668L9609L1293j0145k529j4357K1618K7191p446q9415J2736
6454G90598O4758k3138P7742L9888k5878o4229K4766L3519k054p0896k5847N5357
6442H74586j32137p7582N9496L5316N6608j530K8255m9211L4569J21036k03094
6431G46312k3256J4593M8717K9022R8427O1734j9712Q3037r7331j4782M9072r8320
6419H77513L966Q6050j9100j1288K6519o3118j09283J33824J12439j14310P1968
$$ y = [668599, 599206, 613849, 601313, 623612, 655182, 614092, 702615, 745586, 745309, 729084, 735942, 719398, 694858, 682580, 729707, 755240, 719139, 643309, 589677, 639928, 572508, 684430, 712926, 732865, 737315, 683562, 611372, 654019, 646914, 604718, 699328, 606894, 604153, 712151, 709274, 814711, 782043, 821652, 852945, 842800, 840271, 825914, 847532, 874723, 867277, 777862, 790598, 855356, 832218, 909960, 949848, 923970, 859741, 884507, 918026, 915972, 845076, 819229, 874586, 742449, 664867, 724363, 759679, 816287, 814757, 843012, 793801, 828370, 949406, 746312, 723056, 737649, 786366, 815388, 913815, 975549, 955837, 1038874, 941543, 926761, 975833, 877513, 881479, 967529, 948429, 937141, 963660, 900542, 791259, 925083, 1037522, 923212, 995180]
6408I95180j0311k7881J00931o5857j12727K9548m9119j11465k8492M0214J25351
6397H85372J12546p8595J51241o4468p9357p290O8736k5006n2019m8791k1480
6386H40889r907k6379R651m0658R4942N593n7127N0212O4976l7242p3405J2783
6374H34328J603J470M388l0476J04758O7423q9568R908J6662k5078J4884p180
6362I03122o1418N0343M4157O883n1750P6777j26796N0266J26496l4422J544m6353
6350I38849R56J0857j7679k0010K2130M3076m9062O0194J18621j15266l9613j3523
6338I39530J774O3935P1466j00066K2845l2194J8553r7797J0237P5699l666K2289
6326I92605P2550l9971j05302O9705p5086K1180R7590o590Q3249o5165K9830L522
$$ y = [995180, 984869, 956988, 1057919, 992062, 879335, 908883, 859764, 748299, 719807, 760021, 885372, 997918, 919323, 1070564, 1006096, 926739, 919449, 988185, 963179, 911160, 862369, 840889, 830982, 804603, 814254, 773596, 868538, 874131, 817004, 867216, 932192, 894950, 821545, 834328, 835931, 837401, 841789, 811313, 916071, 983494, 893926, 903834, 920496, 895418, 910302, 903122, 841704, 892047, 936204, 943087, 891337, 968114, 841318, 891584, 1018080, 983658, 985202, 938849, 939805, 950662, 932983, 912973, 935103, 978179, 929117, 989311, 1107932, 992666, 953053, 939530, 941304, 1005239, 1076705, 976639, 999484, 967290, 985843, 888046, 898283, 973982, 970316, 992605, 1065155, 1025184, 919882, 989587, 914501, 935681, 1033271, 1026681, 1109930, 1044765, 1074595, 1078117]
6314A078117k7293K2864Q3812j02193j0422m311J9293N9432N9024m0399j54652
6303I83272J02865L9964l0664L107m7890K7739L4785N8914q3246r7972k5165J01371
6291A067080P7673k0785O9316k5204J34738K1454p8492J38608l7261l9266P601
6280A315462q41o3598j3197K4483p5101M4928k8661m5945m0895R4776K4045o1990
6268A173466N1246Q3506n992J1387k2103j2456N1181M7011o617n0972l9614L3894
6256A313937p0298p5187O1410J433P364l3428L560J08525M0262r484j00170k9443
6244A218481L4212J65815l4208j20240N4444l120j8999J8896J859J0870K941M9129
6232A380080Q7696k7204p1008M6724O2848M8893q760m6288j4243J11887P3431
$$ y = [1078117, 1050824, 1073688, 1157500, 1055307, 1044885, 1040574, 1059867, 1119299, 1178323, 1137924, 983272, 1086137, 1126101, 1095437, 1098544, 1050654, 1078393, 1113178, 1172092, 1088846, 990874, 965709, 1067080, 1144753, 1123968, 1193284, 1168080, 1302818, 1324272, 1245780, 1384388, 1347127, 1307861, 1315462, 1314621, 1251023, 1237826, 1262309, 1187208, 1232136, 1203475, 1157530, 1116635, 1211411, 1235456, 1173466, 1224712, 1308218, 1302226, 1313613, 1291510, 1279054, 1330235, 1377246, 1370629, 1319657, 1280043, 1313937, 1243639, 1168452, 1229862, 1231295, 1238659, 1205231, 1208791, 1317316, 1357578, 1348094, 1247924, 1218481, 1252693, 1418508, 1384300, 1264060, 1318504, 1315384, 1296385, 1315281, 1317140, 1328010, 1330951, 1380080, 1467776, 1440572, 1369564, 1416288, 1479136, 1528029, 1519269, 1472981, 1458738, 1570625, 1644056]
6221A644056p1982K4897R62j2526l5579M8085M8407M075j5910l4513o3602P9964
6209A616334J7364j36863p7478J10275N3771l8379j0488N5643O7491m7810M9023
6198A658883M3008k054P6140l100l5707M2687n1173j6501Q0795R0374n2748j001
6186A829603L078M2254m0424M1870N4275p4849o9891L9899k2138r0202Q4316P2970
6174A870761o7748O9597L4579O5489L8589n9457O0089m1487R0326k2497p4755
6163A963486J7103k4691k2016O9566Q13P8182J747l423k8154j00506N4795J706
6151B008608O308n8019L7378j1274J12877m441L052J5779l1706L6257o2601M7167
6139B099385M4997J3797N8593M2975n3524K3829P0424Q993l2496J2560j535k9797
$$ y = [1644056, 1572074, 1596971, 1597933, 1585407, 1549828, 1597913, 1646320, 1650395, 1634485, 1599972, 1536370, 1616334, 1633698, 1496835, 1419357, 1529632, 1583403, 1545024, 1534536, 1590179, 1657670, 1609860, 1658883, 1701891, 1699837, 1775977, 1772877, 1737170, 1779857, 1728684, 1712183, 1792978, 1883352, 1830604, 1829603, 1832681, 1874935, 1834511, 1876381, 1930656, 1855807, 1785916, 1825815, 1803677, 1713475, 1797791, 1870761, 1803013, 1872610, 1907189, 1972678, 2011267, 1951810, 2011899, 1970412, 2060738, 2038241, 1963486, 1980589, 1955898, 1933882, 2003448, 2004261, 2082443, 2084190, 2080767, 2052613, 1952107, 2006902, 2008608, 2014916, 1956897, 1994275, 1983001, 2095878, 2091437, 2094489, 2110268, 2078562, 2114819, 2052218, 2099385, 2144382, 2158179, 2216772, 2259747, 2206223, 2230052, 2300476, 2309469, 2276973, 2289533, 2287998, 2258201]
6127B258201J9145Q323m3300N8585l2437P2773k9672m5213r018l030N7279M5952
6115B357588K126Q3057L0158N580M5485m0070L4675M0205P567j4342J06407p706
6103B650730j971n5863J59372J18929j13110j4018m683M4002J40779n7305r4772
6092B772090M593L9836M54o6034L9174M3878O265J6893L2680J6264O955m9310
6080B863738O1974o7714m1233M1463J2445j5476N4304k1097L3470K4729O6791
6069C013394l425J32524J233m5646L4582O5856j8445M6238J10872O3849L821K8563
6057C433416l0900M0314M2759k0218O8373n7164J27044p098k9393J0806J22196
6046C700135q9581p7152p516J21897r3185o6950J18980K0960l379j4993L9600
$$ y = [2258201, 2277346, 2285669, 2242369, 2300954, 2268517, 2341290, 2311618, 2266405, 2257387, 2254357, 2311636, 2357588, 2359714, 2442771, 2472929, 2478509, 2523994, 2483924, 2518599, 2558804, 2566371, 2552029, 2658436, 2650730, 2648759, 2592896, 2752268, 2871197, 2758087, 2744069, 2739386, 2783388, 2924167, 2866862, 2772090, 2776683, 2816519, 2816973, 2750939, 2790113, 2833991, 2840256, 2857149, 2889829, 2906093, 2913048, 2863738, 2925712, 2857998, 2816765, 2858228, 2870673, 2855197, 2909501, 2888404, 2921874, 2946603, 3013394, 3009969, 3142493, 3143726, 3098080, 3132662, 3198518, 3180073, 3226311, 3337183, 3401032, 3404853, 3433416, 3402516, 3442830, 3485589, 3465371, 3533744, 3476580, 3603624, 3596526, 3567133, 3577939, 3700135, 3610554, 3533402, 3525886, 3647783, 3554598, 3487648, 3606628, 3627588, 3624209, 3609216, 3648816]
6035C648816R7409k8707r0799n1615j341M1249N8138J9703M8839n2505n2033K06
6023C637360P2970J55032J9971J076k8758n8984R2494o634J212j3349N4871J23888
6011D051149o9986m5726O2769r4091K6613P2492J4802N537r7250Q4131M6763M6108
5999D103311n5456l4570j14463N0605J27951J11573J29660L18l3226m7766R6636
5988D334573J26483n6738j4210j24528J59836P2830m8086l8580P4720P1374n8336
5977D499338Q4572k5169J5099J8331O3269K6939J3401R501K5573m5818R2221P8919
5965D856176J7848m1622J01950J38011L5717j0480L7745k249J9956J828Q6149
5954E241029o7444o538N1738o4444J13575N7338Q5999k4251K3342O3106k273Q5548
$$ y = [3648816, 3746225, 3717518, 3626719, 3575104, 3573763, 3615012, 3673150, 3692853, 3741692, 3689187, 3637154, 3637360, 3710330, 3865362, 3885333, 3886409, 3857651, 3798667, 3891161, 3884527, 3885739, 3872390, 3927261, 4051149, 3981163, 3935437, 3998206, 3904115, 3930728, 4003220, 4018022, 4023559, 3926309, 4010440, 4057203, 4103311, 4047855, 4013285, 3898822, 3949427, 4077378, 4188951, 4318611, 4318929, 4285703, 4237937, 4334573, 4461056, 4404318, 4390108, 4265580, 4425416, 4498246, 4450160, 4411580, 4486300, 4557674, 4499338, 4583910, 4558741, 4573840, 4592171, 4655440, 4682379, 4695780, 4705281, 4730854, 4685036, 4777257, 4856176, 4874024, 4832402, 4934352, 5072363, 5108080, 5097600, 5135345, 5133096, 5153052, 5154880, 5241029, 5173585, 5167047, 5218785, 5154341, 5267916, 5325254, 5411253, 5387002, 5410344, 5473450, 5471177, 5556725]
5942E556725L5849Q267N1635O0275Q601k9951j370M1392j0210K6076P279N2060
5930E806628N9895K5735P2622P6661O5722n0338M3892R0533P5138O8477l1822
5919F303143J7731K9197k3900J03890K2952k2768n7520O5283K63351M9185r4378
5908F656166N7606j6923J01254M9451K8055Q4951J9362M5951P3517P4129n5297
5897G118222J25091k8513P6234Q4622p3777J52683O4692r872l5422N2219M6059
5886G572238J33195k3830P7896K9508J04780R7333n4492k4669J44914N7528l4617
5875H079784N0395K571k3396R5962O1668J34751Q4090O043J23279K8024o6582
5864H576589J6905J14736J47446N0648p8652J32013J43914N8841R5635P9352J25643
$$ y = [5556725, 5592574, 5600841, 5652476, 5712751, 5721352, 5691401, 5690031, 5731423, 5721213, 5747289, 5754568, 5806628, 5866523, 5892258, 5964880, 6041541, 6107263, 6056925, 6100817, 6191350, 6266488, 6334965, 6303143, 6320874, 6350071, 6326171, 6430061, 6453013, 6430245, 6372725, 6438008, 6701359, 6750544, 6656166, 6713772, 6696849, 6798103, 6847554, 6875609, 6960560, 6979922, 7025873, 7099390, 7173519, 7118222, 7243313, 7214800, 7291034, 7375656, 7301879, 7454562, 7519254, 7509382, 7473960, 7526179, 7572238, 7705433, 7681603, 7759499, 7789007, 7893787, 7991120, 7936628, 7911959, 8056873, 8114401, 8079784, 8130179, 8132750, 8109354, 8205316, 8266984, 8401735, 8485825, 8491868, 8615147, 8643171, 8576589, 8593494, 8708230, 8855676, 8906324, 8827672, 8959685, 9103599, 9162440, 9258075, 9337427, 9463070]
5853I463070q059Q327J71285J02934N7476P7812J46525J42640J60991J29739M1777
5842A0494517R6604K35253J13750J27028K03242J85844J01094J84860R4955J45292
5832A1982439J55875K64166K39394K90288K63141K71837L89403L18250K72969
5823A4447762L81724M48807M38640M41204M18303L55217K19041L60315K13408
5814A7724421K70544M79721K47570K36405N7064k19609k98313j00162j13672J87624
5804A8471593L73655L18227M57330N80907N80400N56985N37865K78832K05580
5795B2361374N7685J0210j50379j91365O2622M2563J06510K00338K95906L29142
5785B3124606L52525O01155P15115Q29276R31337J006184R83059J094643J114155
$$ y = [9463070, 9455011, 9463338, 9634623, 9737557, 9795033, 9872845, 10019370, 10162010, 10323001, 10452740, 10494517, 10591121, 10826374, 10940124, 11067152, 11270394, 11456238, 11557332, 11742192, 11837147, 11982439, 12138314, 12402480, 12641874, 12932162, 13195303, 13467140, 13856543, 14174793, 14447762, 14829486, 15278293, 15716933, 16158137, 16576440, 16931657, 17150698, 17511013, 17724421, 17994965, 18474686, 18722256, 18958661, 19015725, 18796116, 18497803, 18397641, 18283969, 18471593, 18845248, 19163475, 19620805, 20201712, 20782112, 21339097, 21876962, 22155794, 22361374, 22419059, 22429269, 22278890, 22087525, 22150147, 22192710, 22299220, 22499558, 22795464, 23124606, 23477131, 24078286, 24793401, 25622677, 26554014, 27560198, 28543257, 29637900, 30752055]
5776C0752055Q80560N68122K62328P2975k72996l32902n07338k40346k16273q4437
5766C0881748K74969L44040M36849M71837O62806P26423P28119P26920O91198
5757C5944909P29695O11226L63650K54407m4284j72015l17967l89931m69483m26387
5747C6083820l91576l11738o2332J24173J35020K67010M49477N63313O58989Q27251
5737C8343407R13040J034331J016866R34791O99325O50567M51516J31765J93396
5728D4369004J00670K44764M07460N58492P37864P79539Q36980J015835J106755
5719E0157363J053053J172029J162716J214990J157476O83254L33311k5701m29557
5710E6478934o73987q84814r64319o87908l84714J1658K89459O05870R33206Q98599
$$ y = [30752055, 31632615, 32200737, 32463065, 32536040, 32263044, 31930142, 31422804, 31182458, 30966185, 30881748, 31156717, 31500757, 31937606, 32409443, 33072249, 33798672, 34526791, 35253711, 35944909, 36674604, 37285830, 37649480, 37903887, 37859603, 37687588, 37369621, 36979690, 36510207, 36083820, 35692244, 35380506, 35318174, 35442347, 35577367, 35844377, 36293854, 36857167, 37516156, 38343407, 39256447, 40290778, 41307644, 42242435, 42941760, 43592327, 44043843, 44175608, 44369004, 44469674, 44714438, 45121898, 45680390, 46418254, 47197793, 48034773, 49050608, 50157363, 51210416, 52382445, 53545161, 54760151, 55917627, 56600881, 56934192, 56908491, 56478934, 55804947, 54920133, 53955814, 53267906, 52883192, 52894850, 53184309, 53790179, 54723385, 55621984]
5700E5621984J039271R37453O71337K22689k20248p11605j284832j627889j743537
5691E2904623j624116j477022j401258j114535r56309o45758m79829l06215j70574
5682D4729007Q35K2512K16858J87919J87424L92780J21126J82986J19697j43053
5672D6018091k62615m60614p60869r14387r69511j202174j350997j077502r64032
5663C8055390q67185q18821m95187n91180l79462j25212k02169j02343k8630p9261
5653C4365940j00347o1980k02950n9535k48375k93055k82308l38886l15048m03188
5643C2060268l66737k80605j75999k07830k52270r9809o7750n7321k1497N0925
5633C0581375J1456q9297L1542m4229k07955j54899k65282m30247m29115l89856
$$ y = [55621984, 56661255, 57598708, 58270045, 58492734, 58272486, 57560881, 56276049, 54648160, 52904623, 51280507, 49803485, 48402227, 47287692, 46331383, 45685625, 45205796, 44899581, 44729007, 44729842, 44752354, 44969212, 45157131, 45344555, 45737335, 45858461, 46041447, 46161144, 46018091, 45755476, 45294862, 44533993, 43619606, 42650095, 41447921, 40096924, 39019422, 38055390, 37188205, 36369384, 35874197, 35283017, 34903555, 34778343, 34576174, 34473831, 34445201, 34365940, 34265593, 34203613, 34000663, 33941128, 33692753, 33399698, 33117390, 32778504, 32463456, 32060268, 31693531, 31412926, 31236927, 31029097, 30776827, 30677018, 30609268, 30551947, 30530450, 30581375, 30592831, 30503534, 30535076, 30490847, 30282892, 30127993, 29862711, 29432464, 29003349, 28613493]
5623B8613493l80075m80850m39727k90016k85336l15519k68408j97205j98661
5614B5757696j74939k62943l08096m55711m63205m41935n62074n79541o57741
5605B1851511m41065n35221m26328n61960n94491k88712l25132m70961l38330
5596A7869311l31167k39046l11644k97537k33679k13488k47908l47755m36683
5587A5210404l12671k39459l36291k47642k26092l27216k52185k03524j15320
5578A2950004k04111j76411j08736k47864j07630J4321l6725l2834R9269j9116
5568A2130167k297O8466J97681L13701K99122M58150M94020M03899j8329m66571
5558A3878009p21458p15976n37247m20504l38580k33438L4606r7599j44511k1956
$$ y = [28613493, 28233418, 27752568, 27312841, 27022825, 26737489, 26421970, 26153562, 25956357, 25757696, 25582757, 25319814, 25011718, 24556007, 24092802, 23650867, 23088793, 22509252, 21851511, 21410446, 20875225, 20448897, 19886937, 19292446, 19003734, 18678602, 18207641, 17869311, 17538144, 17299098, 16987454, 16689917, 16456238, 16242750, 15994842, 15647087, 15210404, 14897733, 14658274, 14321983, 14074341, 13848249, 13521033, 13268848, 13065324, 12950004, 12745893, 12569482, 12460746, 12212882, 12105252, 12119573, 12082848, 12050014, 12149283, 12130167, 12127870, 12196336, 12394017, 12707718, 13006840, 13464990, 13959010, 14362909, 14344580, 13878009, 13156551, 12440575, 11903328, 11482824, 11144244, 10910806, 10945412, 10847813, 10703302, 10681346]
5548A0681346j76803l9886m1162j06358j18818p1004q3012j02116L2288o3166
5538I911309O1019j3941N6754r5735O742K3822r9365j33160j7644j14842q1024
5527I503935q1556l380j2533j4796n6901o7453J11411M631L0244N3076O4976R4714
5515I626368M5544r7145j64356j30343r3358j23067r59O3123j6821j06120j69386
5504H833480j51655Q6561o6543j55979L6989L52m3530q1410m8108n3529m6313
5493H310315j64529j18639j13564q2248n1592J9469l2362o4211n3509J0821n0429
5482G609522n6221n5701r8105l056j28185p7242Q7916N8134J7475j5891J35905
5471G474551J94712J27518j00923O5219J15964j27514j61014j86001j31958l28357
$$ y = [10681346, 10504543, 10464657, 10423495, 10317137, 10198319, 10127315, 10044303, 9942187, 9974475, 9911309, 9972328, 9958387, 10015141, 9919406, 9926148, 9949970, 9850605, 9717445, 9699801, 9584959, 9503935, 9422379, 9418999, 9406466, 9391670, 9334769, 9267316, 9378727, 9383358, 9413602, 9466678, 9531654, 9626368, 9671912, 9574767, 9410411, 9280068, 9186710, 9063643, 9062684, 9125807, 9108986, 9002866, 8833480, 8681825, 8768386, 8701843, 8545864, 8582853, 8583205, 8539675, 8458265, 8410157, 8356628, 8310315, 8145786, 8027147, 7913583, 7831335, 7779743, 7799212, 7766850, 7702639, 7649130, 7659951, 7609522, 7553301, 7497600, 7399495, 7396439, 7268254, 7191012, 7278928, 7337062, 7354537, 7338646, 7474551, 7669263, 7796781, 7695858, 7761077, 7877041, 7749527, 7588513, 7402512, 7270554, 6942197]
5461F942197k64805j77051j40046j64442j29758p8415L4419p4213l1539m6212
5451E870135o5262j5158l5070j03191k5928r9848J0809L1783N0567k8749K6571
5440E616659M1241m580j4242P8484M0926P4024J05674p1712j32430k12963k27084
5429E293997k14451j12450l4090p7572k22720k7505j9508q1379j21114M5606K6212
5418D455026p5822j1219m0128q6450o1454P9450l5229l4952J1572o298J8203Q0987
5406D293686J48218n6472m2723N8878K6066j10273j32457m2020r1654J1113Q8993
5395D151355k16559r8668R3754q109p5670Q7961m6688n0609m9398O3185r0172
5384C760382q9240J32340j2893J3841k21973o8269l1905K5374P1807q4351q3732
$$ y = [6942197, 6677392, 6500341, 6360295, 6195853, 6066095, 5987680, 6022099, 5947886, 5916347, 5870135, 5804873, 5789715, 5754645, 5651454, 5625526, 5525678, 5536487, 5568270, 5618837, 5590088, 5616659, 5657900, 5653320, 5639078, 5717562, 5758488, 5832512, 5938186, 5866474, 5734044, 5521081, 5293997, 5079546, 4967096, 4933006, 4855434, 4632714, 4605209, 4585701, 4504322, 4383208, 4428814, 4455026, 4379204, 4367985, 4327857, 4241407, 4179953, 4259403, 4224174, 4189222, 4200794, 4194496, 4212699, 4293686, 4441904, 4385432, 4342709, 4401587, 4427653, 4317380, 4184923, 4142903, 4051249, 4062362, 4151355, 3934796, 3836128, 3929882, 3921773, 3846103, 3934064, 3887376, 3836767, 3787369, 3850554, 3760382, 3671142, 3803482, 3790589, 3804430, 3582457, 3514188, 3482283, 3507657, 3579464, 3495113, 3411381]
5373C411381J8218J9704m7510j07244K8181o1376p3913o509J5919M1266p1830
5362C166287P741l7585p3273l567o8323m4507J02105K7500J2930k2281j373j63703
5350B901951J6613L1784o7341O7102k8600K9419j26824n948O8560l092j20306
5339B763318J0335p3921k0467n145L3283J2142J1692M4045m1606k0167o892K1235
5327B727852j8509k6778J5423l9979r1128j4226K3896K5227q1237P5751M0360
5316B636652p4944J734J6844q2953O1771J994j46519o0551J3812M1117L5161j7282
5304B426836k5239k6017k8074J4342J5953j9273j553l4898K794j0367q6998l1792
5292B195714J22497l9498m9834Q4114l1984q9754o8843r0377J83793O217p4919
$$ y = [3411381, 3429599, 3449303, 3401793, 3294549, 3322730, 3261354, 3187441, 3180932, 3196851, 3238117, 3166287, 3174028, 3136443, 3063170, 3059603, 2991280, 2946773, 3048878, 3076378, 3089308, 3067027, 3065654, 2901951, 2918564, 2950348, 2883007, 2950109, 2921509, 2950928, 2824104, 2818156, 2886716, 2883624, 2763318, 2773653, 2699732, 2679265, 2674120, 2707403, 2719545, 2731237, 2775282, 2733676, 2713509, 2706617, 2727852, 2709343, 2682565, 2697988, 2658009, 2566881, 2552655, 2576551, 2601778, 2520541, 2596292, 2636652, 2561708, 2563442, 2580286, 2497333, 2559104, 2561098, 2414579, 2354028, 2367840, 2408957, 2444118, 2426836, 2401597, 2375580, 2347506, 2361848, 2377801, 2358528, 2356975, 2322077, 2324871, 2314504, 2227506, 2195714, 2318211, 2278713, 2228879, 2312993, 2281009, 2191255, 2122412, 2032035, 2215828, 2222045, 2147126]
5281B147126j7662n0111O3975l3954n2693j07584j07485P543L8644J9076J3278
5270A920153Q5392o2327K369R887L9521o2620p8045r5626l5551J31747m0341P5246
5258A889805j6535O0921k0033j9956Q860r30K9608k5563J09235J03242R2676J25595
5246B336925J4597J93634q6034j42839j32166j15742o7612j31659r3925l6094
5236A739085M870m6872J22183N2723n007n861j7627j0231k287m6540p4131J01202
5224A811507J3597n6440M7825r1063l3648J736M7854j6266K6113o2297p033P6902
5212A758787m6996l7370Q4983L526n6011j092P922L1k640P816L9291N6277m5272
5199A769252J00606n2722l5169J2265r8578o1283l7938P8092J37777q1644M0099
$$ y = [2147126, 2129464, 2079353, 2143328, 2109374, 2056681, 1949097, 1841612, 1849155, 1887799, 1906875, 1920153, 2005545, 1943218, 1945587, 1955474, 1994995, 1932375, 1854330, 1758704, 1723153, 1854900, 1814559, 1889805, 1873270, 1934191, 1914158, 1894202, 1903062, 1902132, 1931740, 1906177, 2015412, 2118654, 2211330, 2336925, 2351522, 2545156, 2459122, 2316283, 2184117, 2068375, 2000763, 1869104, 1775179, 1739085, 1743955, 1697083, 1819266, 1871989, 1866982, 1861121, 1843494, 1833263, 1830976, 1784436, 1710305, 1811507, 1825104, 1768664, 1816489, 1725426, 1691778, 1693514, 1741368, 1725102, 1751215, 1688918, 1681885, 1758787, 1711791, 1674421, 1759404, 1762930, 1706919, 1705827, 1713749, 1713780, 1711140, 1718956, 1758247, 1814524, 1769252, 1869858, 1817136, 1781967, 1794232, 1695654, 1634371, 1596433, 1674525, 1812302, 1730658, 1770757]
5188A770757q4464n1796K2978l9460P054l0052M0374M7663R4558l1168M7624o2730
5176A731338Q8659R9684j8099l281o2705k2789M2202J25174K3034k2904R7678
5165B077991O5118j19611L1144L8559P4129J6020k1180K0521N9405L2729k6769
5154B248056q4149Q6248M0237n5259k2455M65m2918O7412k6128M5360M8618n5536
5142B249951p0542K136O3410J01371P1741o3695R228j15158Q4418J0862L7383
5131B381105N1278P5242K1497k8729l3688O4343J51131K4815n770J29884Q0657
5120B911765K9304j27998L1185O7099R6557J02333N7937j1384N5029o094O6983
5109C272716N2353r5812r0220P7676J70919k7551L3461n6280M3558j6914J00577
$$ y = [1770757, 1686293, 1634497, 1657475, 1618015, 1625069, 1595017, 1635391, 1683054, 1777612, 1746444, 1794068, 1731338, 1819997, 1919681, 1901582, 1898301, 1835596, 1812807, 1855009, 1980183, 2003217, 1980313, 2077991, 2143109, 2023498, 2054642, 2093201, 2167330, 2183350, 2162170, 2182691, 2242096, 2274825, 2248056, 2163907, 2250155, 2290392, 2235133, 2212678, 2213143, 2170225, 2237637, 2211509, 2256869, 2305487, 2249951, 2179409, 2181545, 2244955, 2346326, 2418067, 2354372, 2363600, 2248442, 2332860, 2343722, 2381105, 2432383, 2507625, 2529122, 2500393, 2466705, 2531048, 2682179, 2706994, 2701224, 2831108, 2911765, 2941069, 2813071, 2844256, 2911355, 3007912, 3110245, 3168182, 3156798, 3211827, 3205733, 3272716, 3325069, 3229257, 3139037, 3216713, 3387632, 3360081, 3393542, 3337262, 3380820, 3363906, 3464483]
5098C464483R5486K6129M2631r817J3900L7805N7795K0168L5598J24029K047O6322
5086C976576r0537m2980N3058l2390j09985j69816r6647n6295R2567p1846n4014
5075C397691l2144k2549p2720r0972j0325L599R0258k5296M5512j8258m4358Q2413
5063C302851J07447N9679j61K1389l8722n9226p3504j26736K7305r3971O3719
5052C190070q5464o0470n2344k5615l712j5289j8227J17997J34429j4471l8311
5041C128593l3937Q6812n07L9691p3731Q3062k7237k8413j17040O4144M9028p188
5029C163277m7666J7460N4305p0335n3904M2114J16181m1080m5328j299J03618
5018C237343J8680l2840Q0575l6809n4852j5039l1246M1791J00829j43475q2484
$$ y = [3464483, 3559969, 3586098, 3628729, 3618912, 3632812, 3670617, 3728412, 3748580, 3784178, 3908207, 3910254, 3976576, 3886039, 3843059, 3896117, 3863727, 3753742, 3583926, 3487279, 3430984, 3523551, 3451705, 3397691, 3365547, 3342998, 3270278, 3179306, 3168981, 3172580, 3262838, 3237542, 3283054, 3264796, 3220438, 3302851, 3410298, 3469977, 3469816, 3491205, 3452483, 3393257, 3319753, 3193017, 3220322, 3126351, 3190070, 3104606, 3044136, 2991792, 2966177, 2962465, 2947176, 2928949, 3046946, 3181375, 3166904, 3128593, 3094656, 3181468, 3180961, 3220652, 3146921, 3229983, 3202746, 3174333, 3057293, 3121437, 3170465, 3163277, 3115611, 3133071, 3187376, 3117041, 3063137, 3105251, 3221432, 3180352, 3135024, 3133725, 3237343, 3256023, 3223183, 3303758, 3266949, 3212097, 3197058, 3165812, 3207603, 3308432, 3164957, 3082473]
5007C082473R4890Q6801J7296K7029J08659n3608l4440N9141Q405j05202J7346
4996C308790Q6634K8147R8026J47085k8630p59J89368p5892N6227J1164k8879
4985C791281N8083J11195N4884N8192L6205R8987M7654j30352k9738N5728O2898
4974D215017k1829l3877K4932P8227J912M4372j20779Q5384J71778J30672Q2862
4963D658671n5180J33370J19617J79922j6945M4743J66136N3475o014J16594N4413
4952E448802L0988N5525L2633O6622Q0975K16379J26887K29513J24448K07418
4942F620190K03375K70960K50663K74183K54855L44110K61116K47475K72949J04417
4932I104293q6482m2627p096m9357r6260j3768K3701j6469j16M051k4161J14566
$$ y = [3082473, 3177363, 3264164, 3281460, 3308489, 3417148, 3363540, 3329100, 3388241, 3396646, 3291444, 3308790, 3395424, 3423571, 3521597, 3668682, 3640052, 3639293, 3828661, 3752769, 3808996, 3820160, 3791281, 3849364, 3960559, 4015443, 4073635, 4109840, 4208827, 4256481, 4126129, 4096391, 4152119, 4215017, 4193188, 4159311, 4184243, 4262470, 4264382, 4308754, 4187975, 4273359, 4445137, 4575809, 4658671, 4603491, 4736861, 4856478, 5036400, 5019455, 5064198, 5230334, 5283809, 5277795, 5394389, 5448802, 5479790, 5535315, 5567948, 5634570, 5715545, 5931924, 6058811, 6288324, 6412772, 6620190, 6823565, 7094525, 7345188, 7619371, 7874226, 8218336, 8479452, 8726927, 8999876, 9104293, 9017811, 8975184, 8968088, 8918731, 8822471, 8808703, 8832404, 8815935, 8815819, 8819870, 8795709, 8910275]
4920H910275p4451j31529j7282r0469r7540j65986k66957k23392l59545k30497
4910G252627j83169j37007j36271k11691j39817j89717o4399q5425j4484n3577
4900F037070J5845o8387j15587m4249L9490q7438l0434L8399J53k0068J2697N7315
4888E834806l0597O0219J06736O7502J28991O8920J07947J94839J33083P8552
4878F750998J02617K14090K59425K25076K78333L27621K97402K53929L14664K62669
4868I286824J97932L13486J04581J08131J52198q5166K8793q8968j26041j37844
4858I753926q9539p1935l4098j83407q9056j56679j41781j85230k18372k60748
4848H323081k86872l25293m02191l17727l10824k25857k95088j88055j95038k25964
$$ y = [8910275, 8835824, 8704295, 8687013, 8596544, 8499004, 8333018, 8066061, 7842669, 7483124, 7252627, 7069458, 6932451, 6796180, 6584489, 6444672, 6254955, 6190556, 6105131, 6090647, 6037070, 6052915, 5984528, 5868941, 5824692, 5864182, 5776744, 5746310, 5784709, 5784862, 5764794, 5777491, 5834806, 5804209, 5864428, 5971164, 6038666, 6167657, 6236577, 6344524, 6539363, 6672446, 6750998, 6853615, 7067705, 7327130, 7552206, 7830539, 8158160, 8455562, 8709491, 9024155, 9286824, 9484756, 9798242, 9902823, 10010954, 10163152, 10077986, 10106779, 10017811, 9891770, 9753926, 9664387, 9592452, 9558354, 9374947, 9285891, 9129212, 8987431, 8802201, 8583829, 8323081, 8036209, 7710916, 7308725, 6990998, 6680174, 6454317, 6159229, 5971174, 5776136, 5550172]
4838E550172j15258k20919k47120r1435o0926m7693l4817m5235j36605q1855m6228
4827D422081o2586m9673j48120n8239p7388p5415N4309l5806l3245q5157M4786
4816C895547j74286J5952l8313j2672k0558j82312o045n850o9011p953J5860j30852
4804C279507j05911q9953j0953k9251P9388l5337n4834j14680J21686P9558r0791
4793C028429K5595r297l2367N6313r388M3914m175Q012j934L0516R0316L1707
4781C257641Q0980j95212k0305Q7154P8820j536j0268n130J292O114O5260Q9591
4769C434401n2136L9046m3615J7612J04647o8302q0264J1611J06123J3312N6465
4758C538900k9993M5595M7548L0021J33444m2398L2407N3004r3005L4887p8477
$$ y = [5550172, 5434914, 5213995, 4966875, 4875440, 4814514, 4766821, 4732004, 4686769, 4550164, 4468309, 4422081, 4359495, 4309822, 4161702, 4103463, 4026075, 3950660, 4004969, 3969163, 3935918, 3850761, 3895547, 3721261, 3737213, 3698900, 3686228, 3665670, 3483358, 3477313, 3471463, 3402452, 3394499, 3410359, 3279507, 3173596, 3083643, 3072690, 3043439, 3122827, 3087490, 3032656, 2917976, 3039662, 3119220, 3028429, 3054024, 3044727, 3012360, 3068673, 3059285, 3103199, 3099024, 3107036, 3105102, 3135618, 3225934, 3257641, 3338621, 3143409, 3123104, 3210258, 3289078, 3287542, 3277274, 3272144, 3273436, 3279550, 3344810, 3434401, 3382265, 3421311, 3377696, 3395308, 3499955, 3431653, 3351389, 3363000, 3469123, 3482435, 3538900, 3508907, 3554502, 3602050, 3632071, 3765515, 3723117, 3755524, 3808528, 3715523, 3750410, 3671933]
4747C671933J4951O9831N8560N8339J5896L3127N2400j0269Q7509J88270J2723
4736D253270j8819N0609O0846o750l7K572P0148J86267P0409K7859J00339M1719
4724D838432M6377Q1862Q6219j14499J0808P7128J14665J70883J00542R7865J55257
4713E665539M180Q2260J16299J26069J08505k2188J35675K10957J50492K48178
4703F825966K41594J99872L06028K42713K05603L29704K67962L31643K36108L67176
4693I554369M71647L91268M74905M51295M07765L20271L27031J07397J23443J1183
4683A2640574p1126M2737M3103J16595J01894K20155M1173J5289P1458j01997
4673A3119855l9116j35885k71721l51849l66312n37961l88535l83478l47378j71419
$$ y = [3671933, 3686884, 3756715, 3815275, 3873614, 3889510, 3922637, 3975037, 3964768, 4052277, 4240547, 4253270, 4234451, 4285060, 4345906, 4339156, 4339119, 4341691, 4411839, 4598106, 4668515, 4696374, 4796713, 4838432, 4884809, 4966671, 5052890, 4938391, 4949199, 5026327, 5140992, 5311875, 5412417, 5510282, 5665539, 5669719, 5751979, 5868278, 5994347, 6102852, 6080664, 6216339, 6427296, 6577788, 6825966, 7067560, 7267432, 7573460, 7816173, 8021776, 8351480, 8619442, 8951085, 9187193, 9554369, 10026016, 10417284, 10892189, 11343484, 11751249, 12071520, 12398551, 12505948, 12629391, 12640574, 12569448, 12612185, 12655288, 12771883, 12873777, 13093932, 13135105, 13150394, 13221852, 13119855, 13080739, 12944854, 12673133, 12321284, 11954972, 11417011, 11028476, 10644998, 10297620, 10126201]
4663A0126201k06505k28049k78035o6575o5862n3415j4987q6518l0518J291Q2392
4652I179420Q5512J6830j8853M2899J22927J93075J60043Q3757K31658K04905
4642A0302173K49277L57284K35080K47145L17231M32935M27444M96469L48372
4633A3413410N27592O13377N70002O83678O18564Q50547P38194P14146P72627
4624A9502137P19173N11287M38981L82414K57038J25965M5411k1079o9704j39302
4614B1752321k40906j92992k70795k53806m44230n01093n85542p71810o79037
4605A7812110p98527p35855o39250p22451p09135o18797n68012n90873m48989
4596A1980221l48015k79512l11262j98882k79072l27870k65365k15875q9849j96951
$$ y = [10126201, 9919696, 9691647, 9413612, 9347037, 9281175, 9227760, 9212773, 9126255, 9095737, 9097028, 9179420, 9264932, 9281762, 9262909, 9305808, 9428735, 9621810, 9781853, 9865610, 10097268, 10302173, 10551450, 10908734, 11143814, 11390959, 11708190, 12141125, 12568569, 13065038, 13413410, 13941002, 14554379, 15124381, 15808059, 16426623, 17277170, 18015364, 18729510, 19502137, 20221310, 20732597, 21171578, 21553992, 21811030, 21936995, 21982406, 21961327, 21891623, 21752321, 21511415, 21318423, 21047628, 20793822, 20349592, 19848499, 19262957, 18491147, 17812110, 17013583, 16277728, 15638478, 14916027, 14206892, 13588095, 13020083, 12429210, 11980221, 11632206, 11352694, 11041432, 10842550, 10563478, 10235608, 9970243, 9754368, 9664519, 9467568]
4586I467568j70504j103k9508n4749m1345n6542r7357m384j7330M3157N4166L0151
4574I122220J41856J2101j4759l8192l3094N6265j9201O9387k9890q398Q7063
4563I345358r679Q9989L3824O3845J7225P5486L3384m0008J33576O8601Q4772
4552I896373J47793Q9176J55997J869K3828P6662M4692J38881j12034k957J95656
4541A0655936N5084K5489L7437M8430P5502K31099J83812J26626K34301K32021
4531A1905737K87832L42640L56495M83689M52130L45840M21088N07105N82501
4522A5685057N81817M14310L13935K60544L31285J17740q2706k80001k79594m85382
4512A6577005n29120m79676m22008l15572m23734l61075k52686l34304k01890
$$ y = [9467568, 9297064, 9295961, 9266453, 9211704, 9170359, 9113817, 9016460, 9012076, 8994746, 9037903, 9092069, 9122220, 9264076, 9276177, 9261418, 9223226, 9190132, 9246397, 9227196, 9296583, 9266693, 9258295, 9345358, 9335679, 9425668, 9459492, 9523337, 9540562, 9616048, 9649432, 9609424, 9743000, 9811601, 9896373, 10044166, 10133342, 10289339, 10291208, 10315036, 10391698, 10436390, 10575271, 10463237, 10460280, 10655936, 10711020, 10736509, 10773946, 10822376, 10897878, 11128977, 11312789, 11439415, 11673716, 11905737, 12193569, 12536209, 12892704, 13376393, 13828523, 14174363, 14595451, 15102556, 15685057, 16266874, 16681184, 16995119, 17255663, 17586948, 17704688, 17621982, 17341981, 17062387, 16577005, 16047885, 15568209, 15146201, 14830629, 14406895, 14045820, 13793134, 13458830, 13256940]
4503A3256940j48660k40466j48184j24671j14522o4110j0193R7318l2277M4790
4493A2515965J32772P1075J88267K41087J80707L98186K73075L91564M30297L36550
4483A5159545M64208M63886M43848L56497L38542L41156L01465J8836j64209q9166
4473A7634608k16737l27036l55533l73301l87110l10221j67440k52985m8634m4877
4463A5150734k9694r2058N8945J24705J39214J29331J73513L8584j3136j63988
4453A5516150j60837k64614k02906l27640l35361l78482k33542k66041l20982
4444A3025745k54610k13946k83252l02231j15516j05416j86625j25662l7689K4440
4434A1425238p4351j3738J4491R5552J07503J26484K02500J77778K29712K31778
$$ y = [13256940, 13108280, 12867814, 12719630, 12594959, 12480437, 12416327, 12406134, 12503452, 12471175, 12515965, 12648737, 12719812, 12908079, 13149166, 13329873, 13728059, 14001134, 14392698, 14822995, 15159545, 15623753, 16087639, 16531487, 16887984, 17226526, 17567682, 17869147, 17887983, 17723774, 17634608, 17417871, 17090835, 16735302, 16362001, 15974891, 15664670, 15497230, 15244245, 15195611, 15150734, 15121040, 15028982, 15087927, 15212632, 15351846, 15481177, 15654690, 15693274, 15680138, 15516150, 15355313, 15090699, 14887793, 14560153, 14224792, 13846310, 13612768, 13346727, 13025745, 12771135, 12557189, 12273937, 11971706, 11856190, 11750774, 11564149, 11438487, 11400798, 11425238, 11350887, 11337149, 11351640, 11447192, 11554695, 11681179, 11883679, 12061457, 12291169, 12522947]
4424A2522947K31170K78698K43743L73522M26524L30884L93796L68545M28677
4415A5598506M47700K58998J21934J70334l5409j78073k32298l68029m15968l87651
4405A4980044l88461m65965n14318k62249m56792k96790l23626j69189r6215j80697
4395A1825742j55231j66551j08710R600r535p2737P516M1827N0237k2257R3756
4384A1493657Q9068J27459Q6220Q9030J57408K17053J03347J71409J55438J00997
4374A2791086J83363l7606q31l9296j3772m8735j62002k65235j42746j05279j52289
4363A2006658k29572j30617j45827j16695p5303K357O7555J0446J07388M6306
4353A1542696q7314N1169M0427J52687O2354O607N7649J728q1061J8744j3762
$$ y = [12522947, 12754117, 13032815, 13276558, 13650080, 14076604, 14407488, 14801284, 15169829, 15598506, 16046206, 16305204, 16427138, 16597472, 16562063, 16383990, 16151692, 15783663, 15367695, 14980044, 14591583, 14125618, 13611300, 13349051, 12892259, 12595469, 12271843, 12102654, 12006439, 11825742, 11670511, 11503960, 11395250, 11404850, 11395315, 11322578, 11330094, 11371921, 11422158, 11399901, 11493657, 11582725, 11710184, 11796404, 11885434, 12042842, 12259895, 12363242, 12534651, 12690089, 12791086, 12974449, 12936843, 12936012, 12896716, 12882944, 12834209, 12672207, 12406972, 12264226, 12158947, 12006658, 11777086, 11646469, 11500642, 11383947, 11308644, 11311001, 11378556, 11389002, 11496390, 11542696, 11455382, 11506551, 11546978, 11699665, 11762019, 11768626, 11826275, 11828003, 11746942, 11765686, 11751924]
4342A1751924j15510k9622j08608l59083j82975o9294j52726j71800p7868k14698
4332A0269740j92498j20856n6332k188j29691P0181j14092o4736K6637K366P9768
4321I768299O7834M8865P4341P8815K053J75630J36484j14096J15396J05579O9891
4310A0529091Q1377R3964K7967m7365m5719j88585j68611j84318r6238j07070
4300I894493j80965k54798k61464k16055j34504j14301p7680m2377q9532m4626
4290H478191r0377k245n7048l2234n115O03m1056k0065K3430J5679L8140Q0148
4278H388051m8813K3081q4745O5998M8806M40n321N9114N6989J53966J19286L8165
4266H815017M2259M5525J71313J30523K9624R8205R2983K9838J58938K12373J26342
$$ y = [11751924, 11636414, 11606792, 11498184, 11139101, 10956126, 10886832, 10734106, 10562306, 10484438, 10269740, 10077242, 9956386, 9900054, 9897866, 9768175, 9838356, 9724264, 9659528, 9686165, 9688531, 9768299, 9836133, 9884998, 9959339, 10038154, 10040207, 10215837, 10352321, 10238225, 10353621, 10459200, 10529091, 10610468, 10704432, 10732399, 10685034, 10639315, 10450730, 10282119, 10097801, 10001563, 9894493, 9713528, 9458730, 9197266, 8981211, 8846707, 8732406, 8654726, 8612349, 8522817, 8478191, 8387814, 8385569, 8328521, 8296287, 8291172, 8291775, 8250719, 8230654, 8254084, 8269763, 8307903, 8388051, 8339238, 8362319, 8277574, 8343572, 8392378, 8392818, 8387497, 8446611, 8503600, 8657566, 8776852, 8815017, 8857276, 8902801, 9074114, 9204637, 9234261, 9332466, 9425449, 9455287, 9614225, 9826598, 9952940]
4255I952940J96428J57924Q4664J37033K16443J66187R2846J17030L1642L0013
4245A1183150J30380L06566J39538J20386O8141J56927J72788J62941J06042J21363
4235A2668222L23982L33558K14574J45449K20138K70415K57362J93053L12528
4226A4939281J68076L15008K46938K45157K65107K26282L45900L94218L36126
4217A7482093L23195L45913M13737L90927M30667N23100N80230N08864O13773
4208B1612499N76181O64541P48373P53625P74891Q01613R48352R51874J048277
4199B8880226J006647J051058J312990J251998J153356J197640J238375J545593
4191C8637883J709101J860628K189446K451470K679204L188008L698209M192634
$$ y = [9952940, 10149368, 10307292, 10391956, 10528989, 10745432, 10911619, 11004465, 11121495, 11153137, 11183150, 11313530, 11620096, 11759634, 11880020, 11948161, 12105088, 12277876, 12440817, 12546859, 12668222, 12992204, 13325762, 13540336, 13685785, 13905923, 14176338, 14433700, 14626753, 14939281, 15107357, 15422365, 15669303, 15914460, 16179567, 16405849, 16751749, 17145967, 17482093, 17805288, 18151201, 18564938, 18955865, 19386532, 19909632, 20489862, 20998726, 21612499, 22188680, 22853221, 23601594, 24355219, 25130110, 25931723, 26880075, 27831949, 28880226, 29886873, 30937931, 32250921, 33502919, 34656275, 35853915, 37092290, 38637883, 40346984, 42207612, 44397058, 46848528, 49527732, 52715740, 56413949, 60606583]
4183F0606583M877898N854696O705603P780034Q972079J0647286J2559433J5038385
4175A33041997J7921813K1523759K4832612K7347376K7332409K2906628J1744719
4168B86651313m034087j9212665k8294812k9725269k6219533k1229481j6879215
4161A41056251j3816338j1490264r607947q086976o754448n537942m688385l967739
4153G7106212l357543k947356k263904j923320j662741j529979j434649j639976
4145F0346744j951253k112072k099772j882386j506194j158251j005931j104444
4137D7526441j101772j302207j227896j260161j113170p81818q10917q39400q53381
4128C8235719j058930j186464j243057j199691j205715j150093j386944j571181
$$ y = [60606583, 65484481, 71339177, 78044780, 85824814, 94796893, 105444179, 118003612, 133041997, 150963810, 172487569, 197320181, 224667557, 251999966, 274906594, 286651313, 282617226, 263404561, 235109749, 205384480, 179164947, 157935466, 141056251, 127239913, 115749649, 106141702, 98054726, 91300278, 85762336, 81073951, 77106212, 73748669, 70801313, 68537409, 66614089, 64951348, 63421369, 61986720, 60346744, 58395491, 56283419, 54183647, 52301261, 50795067, 49636816, 48630885, 47526441, 46424669, 45122462, 43894566, 42634405, 41521235, 40739417, 39928500, 39089100, 38235719, 37176789, 35990325, 34747268, 33547577, 32341862, 31191769, 29804825, 28233644]
4120B8233644j401220j335390j307281j080293j008763q13716o80997p57765n48788
4111A9299431l82333n30452l66386m04469l85089m65927m54259n39692n25586
4102A5245238l61384l24787k52670l70769k47445j78725l16746k07905k02856
4093A2781951k62299j36149l18862p0776j34685j12183p6624j67162j23076m7578
4083A1332557K2494j52523j01691Q123r4432j38534l80521l40590k57652j78693
4073I718538l1120q1195p4067j05564L536j52863O0132p8415k9095K8419O6299
4062I324605m5240M270j3440m5752J9949K717k7030L2757N1842N181N7661p6926
4050I290594l1764J15804M6861n5505R3360o313J08400K866J07454J47457J31594
$$ y = [28233644, 26832424, 25497034, 24189753, 23109460, 22100697, 21286981, 20605984, 19848219, 19299431, 18917098, 18386646, 18020260, 17615791, 17230702, 16764775, 16310516, 15770824, 15245238, 14883854, 14559067, 14306397, 13935628, 13688183, 13509458, 13192712, 12984807, 12781951, 12519652, 12383503, 12064641, 11993865, 11859180, 11746997, 11670373, 11503211, 11380135, 11332557, 11355051, 11202528, 11100837, 11108960, 11014528, 10875994, 10495473, 10154883, 9897231, 9718538, 9687418, 9606223, 9532156, 9426592, 9430128, 9277265, 9337397, 9258982, 9229887, 9258306, 9324605, 9279365, 9283635, 9270195, 9224443, 9244392, 9247109, 9220079, 9252836, 9304678, 9309859, 9367520, 9290594, 9258830, 9374634, 9421495, 9365990, 9459350, 9453037, 9561437, 9564303, 9671757, 9819214, 9950808]
4039I950808O5376Q6936O1824R2017P6013J32515P0988R5272K77753J31297J20597
4028A1161396K66324K19639K02298L21933K63195K33221K90770K97953K53010
4019A3509739L16941L23053K90309L54760M70020M45207L58149L98840M58850
4010A6925868M23848M92347N05254N13312O09727P09126P48025O91175O21218
4001B2239900Q72412Q79713P07995Q51282Q81932R48037R90817J084085J114315
3992C0570488J025537J102498J099584J087744J225914J149933J274730J163479
3984C9699907J289150J392943J214752J246210J252871J278016J184774J243274
3976D9801897J166574J119688J055899J102017R40501R74573R55507Q35614P57644
$$ y = [9950808, 10016184, 10103120, 10164944, 10256961, 10332974, 10465489, 10536477, 10631749, 10909502, 11040799, 11161396, 11427720, 11647359, 11849657, 12171590, 12434785, 12668006, 12958776, 13256729, 13509739, 13826680, 14149733, 14440042, 14794802, 15264822, 15710029, 16068178, 16467018, 16925868, 17349716, 17842063, 18347317, 18860629, 19470356, 20179482, 20927507, 21618682, 22239900, 23112312, 23992025, 24700020, 25551302, 26433234, 27381271, 28372088, 29456173, 30570488, 31596025, 32698523, 33798107, 34885851, 36111765, 37261698, 38536428, 39699907, 40989057, 42382000, 43596752, 44842962, 46095833, 47373849, 48558623, 49801897, 50968471, 52088159, 53144058, 54246075, 55186576, 56161149, 57116656, 57952270, 58709914]
3967E8709914P01272O13027L40325M37259L64152J84356J48066k4835j87497k00725
3957F1085314l53189m79931m73500n42198o92242q10374q89084q25141r37315
3948E5082340j215583j140258j153116j221805j253790j299689j435666j342865
3940D5019568j249996j340352j381960j341155j435280j269900j373218j372715
3932C4254992j241036j315467j154558j252648j250127j132135j086045r36220
3924B4886756r83347r57985r41336q55057q41165q38656p36447o93630o74143
3915A7364990n66280n55360o90547n61255n60687m57473m39773k98009m02791
3906A2832815m01858k54922l92699m11624k15930l17805k20057l20683k48912
$$ y = [58709914, 59411186, 60024213, 60364538, 60801797, 61165949, 61350305, 61498371, 61473536, 61286039, 61085314, 60732125, 60252194, 59778694, 59236496, 58544254, 57733880, 56844796, 56019655, 55082340, 53866757, 52726499, 51573383, 50351578, 49097788, 47798099, 46362433, 45019568, 43769572, 42429220, 41047260, 39706105, 38270825, 37000925, 35627707, 34254992, 33013956, 31698489, 30543931, 29291283, 28041156, 26909021, 25822976, 24886756, 23903409, 22945424, 22004088, 21149031, 20307866, 19469210, 18732763, 18039133, 17364990, 16798710, 16243350, 15552803, 14991548, 14430861, 13973388, 13533615, 13235606, 12832815, 12430957, 12176035, 11783336, 11371712, 11155782, 10837977, 10617920, 10297237, 10048325]
3897A0048325j27073j55550j73978k15375n9594o9362k52831l5319o6042l937
3887H889264n0649j29929j28396m6651Q535J6693J24424k6878o6341M7065j2899
3876H624238j15827l74389l28482j95502k36127k00203j56571j03237p4765j66278
3866F672857j47860j6139K4493j74727p5672j23123k16670K2997j20117J2874
3856E858913q2928p8214J9518o681j36917l9209k7241n1949m3532L2790p6963
3845E367587j26451o8185n1644j24487J214J5676j00728L642l2278r8782P8855
3834D864419R5817q0825j49646j31864O7783J42760k6874j06283j20005N8834
3824D614116j12620r2660M1117Q065J1067j5392o2030O9468R0410j01969m1626
$$ y = [10048325, 9921252, 9765702, 9591724, 9376349, 9316755, 9247393, 8994562, 8959243, 8893201, 8889264, 8838615, 8708686, 8580290, 8533639, 8542174, 8558867, 8683291, 8656413, 8590072, 8637137, 8624238, 8508411, 8134022, 7805540, 7610038, 7373911, 7173708, 7017137, 6913900, 6839135, 6672857, 6524997, 6508858, 6533351, 6358624, 6282952, 6159829, 5943159, 5966156, 5846039, 5858913, 5775985, 5697771, 5717289, 5710608, 5573691, 5534482, 5507241, 5455292, 5411760, 5444550, 5367587, 5241136, 5172951, 5121307, 4996820, 4998034, 5013710, 4912982, 4916624, 4884346, 4785564, 4864419, 4960236, 4879411, 4729765, 4597901, 4665684, 4808444, 4781570, 4675287, 4555282, 4614116, 4501496, 4408836, 4449953, 4458018, 4469085, 4453693, 4391663, 4461131, 4551541, 4449572, 4407946]
3813D407946O2755l7051m2008Q0072L7368r0702K0667j510M028q719j2928K2788
3801D442706M9255K1337J8663k8009Q3584L4210j3613m5382l5410k1377l0618
3790D475346L2890J13165K5906q8772j4256M1173N6118l724N0130L9957M6679
3779D774612m204k3821O2271P4928m6729J13568K8184M9691J04348k9132k1498
3768E082218q463O4685J07998J5758k1665P7834O1263k335J41475N7154k5661
3757E550261p4170J14047l964q8306P9344J32389M0904M096R3337M0208l4603
3746E853543J52382K1421J12766O8647O0109O2590J53152R9616l8002J38979L3485
3735F718688P1175L7658N0525J74064Q5227J05703J07195J62866J67119Q7634
$$ y = [4407946, 4470701, 4433650, 4391642, 4471714, 4509082, 4418380, 4439047, 4437537, 4441565, 4432846, 4419918, 4442706, 4491961, 4513298, 4531961, 4503952, 4587536, 4621746, 4608133, 4562751, 4527341, 4505964, 4475346, 4508236, 4621401, 4647307, 4558535, 4544279, 4585452, 4641570, 4637846, 4687976, 4727933, 4774612, 4770408, 4746587, 4808858, 4883786, 4837057, 4950625, 4978809, 5028500, 5132848, 5103716, 5082218, 5073755, 5138440, 5246438, 5262196, 5240531, 5318365, 5379628, 5377293, 5518768, 5575922, 5550261, 5476091, 5590138, 5586174, 5497868, 5577212, 5709601, 5750505, 5754601, 5847938, 5888146, 5853543, 6005925, 6027346, 6140112, 6208759, 6268868, 6331458, 6484610, 6584226, 6546224, 6685203, 6718688, 6789863, 6827521, 6878046, 7052110, 7137337, 7243040, 7350235, 7513101, 7680220, 7767854]
3725G767854Q4369K41291J74967J13974K38433J79826R1613J5984J55156O9181
3715I132648K42847L25338K32627O8661N7425J35604R9254K90878L34616K29121
3705A1149019J33227J25933K69798J18998J88709K00032J42400J48332K47220
3696A2723668L73158K24582K22519L24717K79267L14364K77367L70044M71310
3687A5580996L34027L49964L33809N07121O52719N31209M38132N54462N98704
3678A9881143O78907M70099N52207P21649O10309N90833O76558N61425N59153
3669B5302283O92584P02922N53670N81302O19315N35751M78933N35283N48851
3660C0550894M50206N48144M49802M19392L18791L57969L69615M30787L66785
$$ y = [7767854, 7852223, 8093514, 8268481, 8382455, 8620888, 8800714, 8892327, 8908311, 9063467, 9132648, 9375495, 9700833, 9933460, 10002121, 10059546, 10195150, 10294404, 10585282, 10919898, 11149019, 11282246, 11408179, 11677977, 11796975, 11985684, 12185716, 12328116, 12476448, 12723668, 13096826, 13321408, 13543927, 13868644, 14147911, 14462275, 14739642, 15109686, 15580996, 15915023, 16264987, 16598796, 17105917, 17758636, 18289845, 18727977, 19282439, 19881143, 20560050, 21030149, 21582356, 22304005, 22914314, 23505147, 24181705, 24743130, 25302283, 25994867, 26697789, 27251459, 27832761, 28452076, 28987827, 29466760, 30002043, 30550894, 31001100, 31549244, 31999046, 32418438, 32737229, 33095198, 33464813, 33895600, 34262385]
3651C4262385M31229M33353M87439N23270M89458M52872N23071N63615N50434
3642C8717126O05553N83634O75815Q25966Q80870Q01851Q26330R60714R83490
3633D5861349R37812R28789J157649J223831J079523J167273J243810J264531
3625E4864567J137826J000334R98220J069221R33073R94171R78558P35752P97199
3616F3508921Q42626N63789M95887N21688M79512L46465L31662K33256J50828
3607F7474634J80566J53445Q1139M3627k9952m3262J41262J20887K28934K31683
3597F8582963J23946J68164L89874N00703N58783O11058O79658Q76434J017659
3588G3509242R94724J027405J181743J159612J162238J406662J348717J326133
$$ y = [34262385, 34693614, 35126967, 35614406, 36137676, 36627134, 37080006, 37603077, 38166692, 38717126, 39322679, 39906313, 40582128, 41408094, 42288964, 43090815, 43917145, 44877859, 45861349, 46799161, 47727950, 48885599, 50109430, 51188953, 52356226, 53600036, 54864567, 56002393, 57002727, 58000947, 59070168, 60003241, 60997412, 61975970, 62711722, 63508921, 64351547, 64915336, 65411223, 65932911, 66412423, 66758888, 67090550, 67323806, 67474634, 67655200, 67808645, 67889784, 67933411, 67903459, 67860197, 68001459, 68122346, 68351280, 68582963, 68706909, 68875073, 69264947, 69765650, 70324433, 70935491, 71615149, 72491583, 73509242, 74503966, 75531371, 76713114, 77872726, 79034964, 80441626, 81790343, 83116476]
3580H3116476J269273J292268J345045J290364J268870J211008J086073J054799
3572I2934176J064751Q46465Q66624Q51469O36392N20876N30567L34067K92531
3563I8877918M22149J47893J87904L68088K90210K28192L62619M34706L56770
3554A01676449J96574L35339L56417K38242P3333N9164P161l37358k92798l17678
3544A01994845m70815n69853m35426n33372o36139m85466n21035o85904n36379
3535I7120456o05355p35710p60912p19104p47486q78152p49371o75040p34634
3526I0514692n83055n37565l24260k36828j54858q3437l0301J23005J37345J99821
3516H9024559J40574K17029K10396J53435J99777K29627P2836J46376o8112l4921
$$ y = [83116476, 84385749, 85678017, 87023062, 88313426, 89582296, 90793304, 91879377, 92934176, 93998927, 94845392, 95712016, 96563485, 97199877, 97720753, 98251320, 98585387, 98877918, 99300067, 99447960, 99635864, 100003952, 100294162, 100522354, 100884973, 101319679, 101676449, 101873023, 102208362, 102564779, 102803021, 102876354, 102935518, 102942679, 102605321, 102312523, 101994845, 101524030, 100954177, 100518751, 99985379, 99349240, 98863774, 98342739, 97656835, 97120456, 96515101, 95779391, 95018479, 94299375, 93551889, 92673737, 91924366, 91249326, 90514692, 89931637, 89394072, 89069812, 88832984, 88678126, 88594689, 88564388, 88687393, 88824738, 89024559, 89165133, 89382162, 89592558, 89745993, 89945770, 90175397, 90248233, 90394609, 90326497, 90291576]
3506I0291576k0524l17700l42863l46723m21520m03451o57432o97071p47895q42474
3496H5493923q51059j018362j026689j153794j227441j323650j286001j238821
3488G6368106j328129j418314j392703j357977j355434j314675j462064j352426
3480F5386384j252871j272240j257415j184171j097159j184348j068671r20047
3472E6149462r75577q93604r12487q37316o84481p10863n37328o13412m77680
3463D9506714n49189l74762l81546l96462l51807l36245m26304l66209l53836
3454D5970354l51408l41832m27064m39468m68357l22187m84773o09924l57912
3445D2167429n79434n76812o40405o63756o82255o50125o91248p94013r43173
$$ y = [90291576, 90271052, 89953352, 89610489, 89263766, 88842246, 88438795, 87781363, 87084292, 86336397, 85493923, 84642864, 83624502, 82597813, 81444019, 80216578, 78892928, 77606927, 76368106, 75039977, 73621663, 72228960, 70870983, 69515549, 68200874, 66738810, 65386384, 64133513, 62861273, 61603858, 60419687, 59322528, 58138180, 57069509, 56149462, 55173885, 54280281, 53367794, 52530478, 51845997, 51135134, 50597806, 49984394, 49506714, 48957525, 48582763, 48201217, 47804755, 47452948, 47116703, 46690399, 46324190, 45970354, 45618946, 45277114, 44850050, 44410582, 43942225, 43620038, 43135265, 42525341, 42167429, 41587995, 41011183, 40370778, 39707022, 39024767, 38374642, 37683394, 36889381, 35946208]
3436C5946208q51451o89496p88755q20326q46119p37522r59685q77288q81415
3427B8494151q07392p15311q52051q69218q53960r22148q10945q10325p36486
3418B1116315o84806o37690p28435p36627o41199o06546o01906n98647n83900
3409A5296559m02732m72757m66386m35814l62153l73823l79292l94073k74674
3400A1734855j87142k67171k62048k91750l00499k69138l12797l01819m0898k34399
3390I267194k41570j81350q2364j41538k43229r5445j31156j95960j26255p2794
3380G755533k20439q2251j55352n337O48k93324j51582p3974j53413j78473j8400
3369F423636m8613o9418q9730J6579o6102k60478m6814j64893q1278j36921p7232
$$ y = [35946208, 35094757, 34405261, 33616506, 32796180, 31950061, 31212539, 30252854, 29375566, 28494151, 27686759, 26971448, 26119397, 25250179, 24396219, 23474071, 22663126, 21852801, 21116315, 20431509, 19793819, 19065384, 18328757, 17687558, 17081012, 16479106, 15880459, 15296559, 14893827, 14421070, 13954684, 13518870, 13156717, 12782894, 12403602, 12009529, 11734855, 11547713, 11280542, 11018494, 10726744, 10426245, 10157107, 9844310, 9542491, 9501593, 9267194, 9025624, 8844274, 8761910, 8620372, 8377143, 8281698, 8150542, 7954582, 7828327, 7755533, 7535094, 7452843, 7297491, 7292154, 7292802, 6999478, 6847896, 6773922, 6620509, 6442036, 6423636, 6375023, 6305605, 6215875, 6232454, 6166352, 5905874, 5859060, 5694167, 5612889, 5475968, 5398736]
3358E398736k9218l4162j00104p2803o8287j04504n6159p5610p9693j8312p2585
3347D687299J9685o9340j08498k3389n9589j4558J3657j92315K2419p4764q8507
3336D112100K9837n5270j7452l4500O2882l4843m6383J1942l2314q7072K5807
3325C934734j03801L6943m8963J9236K7753j21838m7383Q0151j7780k730k574
3314C753748N9439O976l4950j9670l6p6899r5691j4480L8380m5103M8692Q2116
3302C702522m6309j5480l7703Q8563o4223j24841k4237o3235o064J05847Q5176
3291C600016M0509o2974k6687m6221j2386J26704j9227l0985K7092p4767O6592
3280C587666L7212j13199J62071Q1829l4765k4235J23914N13J23810j38042n301
$$ y = [5398736, 5369518, 5335356, 5235252, 5162449, 5094162, 4989658, 4933499, 4857889, 4778196, 4759884, 4687299, 4706984, 4637644, 4529146, 4505757, 4446168, 4431610, 4445267, 4252952, 4275371, 4200607, 4112100, 4141937, 4086667, 4069215, 4034715, 4097597, 4062754, 4016371, 4028313, 3995999, 3908927, 3934734, 3830933, 3867876, 3818913, 3838149, 3865902, 3744064, 3696681, 3776832, 3759052, 3756322, 3753748, 3813187, 3820163, 3785213, 3765543, 3765507, 3688608, 3592917, 3578437, 3616817, 3571714, 3620406, 3702522, 3656213, 3640733, 3603030, 3691593, 3627370, 3502529, 3478292, 3415057, 3408993, 3514840, 3600016, 3640525, 3577551, 3550864, 3504643, 3492257, 3618961, 3599734, 3568749, 3595841, 3521074, 3587666, 3624878, 3511679, 3673750, 3755579, 3720814, 3696579, 3820493, 3821006, 3944816, 3806774, 3801473]
3269C801473m1015L8187R3399K8164N5570o4243L0938o9831R8877J30153j5840
3258D085832L5715J651m7710j9424j0540J07260n4811n9260J1440q911J15311
3247D156553j16509L1172K60789O2976O1540j04610O3815j644r8256k42686k76790
3236C796350k12220j22646k7356j32832j23382l1613J1864J9720m1174q8115l9248
3225C009348j9902K6828J51735m221l6469J24612K129P2200Q2614L8951J05546
3214C553371K07882K43045L58282K43727J09407J12671r9317l85001m82477l78285
3204C483305k96972q5159n9830q6701o2265q9050o2542L140m0804m401j81667
3193B517054r2773M222j2094L1933J5006P2297M4998J5460K7487l2142K578J13738
$$ y = [3801473, 3760458, 3798645, 3892044, 3920208, 3975778, 3911535, 3942473, 3872642, 3971519, 4101672, 4085832, 4121547, 4123198, 4075488, 4056064, 4045524, 4152784, 4097973, 4038713, 4050153, 4041242, 4156553, 4040044, 4071216, 4332005, 4394981, 4456521, 4351911, 4415726, 4414082, 4315826, 4073140, 3796350, 3584130, 3461484, 3434128, 3301296, 3177914, 3146301, 3158165, 3177885, 3136711, 3048596, 3009348, 2989446, 3016274, 3168009, 3163788, 3127319, 3251931, 3254060, 3326260, 3408874, 3447825, 3553371, 3761253, 4004298, 4362580, 4606307, 4715714, 4828385, 4729068, 4344067, 3861590, 3483305, 3186333, 3101174, 3041344, 2954643, 2892378, 2803328, 2740786, 2743926, 2703122, 2698721, 2517054, 2424281, 2428503, 2416409, 2448342, 2463348, 2535645, 2580643, 2596103, 2623590, 2591448, 2594026, 2707764]
3181B707764J35311J61505P4120J0840L441r4942r1872k38491j64121k32933o5599
3170B205023r8188q093o8950m5220J6858m5483n0019j23498l7173J02186r6611
3159A750832j3607J8361j40540r032M0175o1938l6121L4974J7515j6353o7021
3148A517245Q5874r534L4496n0914k2378p7232J6723M421j22864J7006M1955j5264
3136A419534l0269k9156J0280j49660l1955N0536J7877k1431n7620j2185p1844
3125A094107M0399J8288k7114L7351m3314p8705n425N2980M1525j1599K0417R379
3113A148289n9398j03858Q253R8022o8735j06817O2913L8001j01559q6517P1917
3102I00511O7095p7545p3645K1694m2922L9936L7676p462n4341p2611J02162l0109
$$ y = [2707764, 2843075, 3004580, 3078700, 3089540, 3092981, 2998039, 2906167, 2667676, 2503555, 2270622, 2205023, 2106835, 2098742, 2029792, 1984572, 2001430, 1955947, 1905928, 1782430, 1745257, 1847443, 1750832, 1737225, 1755586, 1615046, 1606014, 1646189, 1584251, 1548130, 1583104, 1600619, 1584266, 1517245, 1603119, 1593585, 1628081, 1577167, 1554789, 1477557, 1494280, 1498701, 1375837, 1392843, 1434798, 1419534, 1389265, 1360109, 1370389, 1220729, 1188774, 1239310, 1257187, 1235756, 1178136, 1165951, 1094107, 1134506, 1152794, 1125680, 1163031, 1119717, 1041012, 1035587, 1088567, 1130092, 1118493, 1138910, 1148289, 1088891, 985033, 993286, 1091308, 1022573, 915756, 978669, 1016670, 915111, 828594, 900511, 967606, 890061, 816416, 838110, 795188, 835124, 872800, 865338, 810997, 738386, 840548, 810439]
3090H10439m664j2404M0049k5558O2401N2251r9231l6561N6229K952r258j46305
3078F90340J0484P3003p6703n7278J76346l2386k0346m1421m3238K362L3186Q1714
3066G96063p6534p3343n4047m0963r518Q1605J3620P1112p5828k4677N7002n6568
3054F07924L8269L7515l1954l114l9621m2919N4274n0006r2633J6897j1118J8296
3042E01810N2064R012o2690K6563Q6988m7963o0126n0942m3266L2703l3880n4935
3030C55338R657m7515J98299Q604p2385K6947O9557k8582r4884J2018L3120L3621
3018E03795k6502M8573r9337L214j4091K6005k071K1820j7695N674L1942r009
3006D72318k2101k0385K7637r4202j3505J86022q6340j2357o3244k3156N3230
$$ y = [810439, 805775, 793371, 833420, 807862, 870263, 922514, 823283, 786722, 842951, 845903, 836645, 690340, 700824, 773827, 697124, 639846, 816192, 783806, 763460, 722039, 678801, 681163, 714349, 796063, 719529, 646186, 592139, 551176, 541658, 623263, 636883, 707995, 632167, 607490, 664492, 607924, 646193, 683708, 651754, 648640, 609019, 566100, 620374, 570368, 477735, 494632, 483514, 501810, 553874, 562886, 500196, 526759, 613747, 565784, 505658, 454716, 411450, 444153, 410273, 355338, 364995, 317480, 515779, 524383, 451998, 478945, 548502, 519920, 425036, 437054, 470174, 503795, 477293, 525866, 426529, 429743, 415652, 441657, 439586, 461406, 443711, 449385, 481327, 472318, 450217, 429832, 457469, 363267, 349762, 535784, 449444, 437087, 373843, 350687, 403917]
2995D03917j227o6732l4952L7179P1307K9785q0853N0113k5704O5844j255r3856
2983C53566J5242Q615J3220P9986M2627j15182l5233L3636p5155k5648M0129l5780
2971C00023q8359Q3752O6180l3678L1674q5665L9506M0149p316J3172K0841j13372
2959B66907Q9234L8433K4500m6470o4210P3735j5761k0922K1370j1323Q2772J47557
2947E85822m6660l9887K2355p7773r9763R739J51623n4289k5575j3693o4093r3702
2935B54104o5046J23528N28K6144l1596l0745N6304O0277N6101J2971k7695q4950
2923C49925Q9733r15n3548Q8139q7086N1935K4330p399K467J1384q7711L6020
2911D17274k7539K6011K6808m9633k4725J5602o5660p3824k4588J24920P9272
$$ y = [403917, 402690, 335958, 301006, 338185, 409492, 439277, 358424, 408537, 382833, 448677, 447422, 353566, 368808, 377423, 390643, 470629, 513256, 398074, 362841, 396477, 321322, 295674, 335803, 300023, 211664, 295416, 361596, 327918, 359592, 273927, 313433, 353582, 346266, 359438, 380279, 266907, 356141, 394574, 419074, 372604, 308394, 382129, 366368, 345446, 366816, 355493, 438265, 585822, 539162, 499275, 521630, 443857, 344094, 353833, 505456, 451167, 425592, 411899, 347806, 254104, 189058, 312586, 313114, 339258, 307662, 276917, 333221, 393498, 449599, 462570, 434875, 349925, 439658, 438743, 385195, 473334, 386248, 438183, 462513, 455114, 457581, 468965, 381254, 417274, 389735, 415746, 442554, 392921, 368196, 383798, 318138, 244314, 219726, 344646, 423918]
2900D23918o5519O4150l6373O176R543P1937l7923q2503J17695l887N8407k2703
2888E02918j30351p7726J14855R4673j2369o8901n9164J0468O194q6901o6540
2877B27156L1884P9104O912M306j4493p1933l98n8786P6631J46094q4087j9359
2865C23031p5015K4665k1603J9170P9636M2363j4921p904k9276n489j09426k2860
2853B02371J97667j10448n8640O7706K6091L9436o8426n22p3501m771N8233O3151
2841C38347j10329j9636N1755p3001m813L4368M382j47479j0390J22665Q4141
2830B70010K781M2184l8316q5554q2697M2900J26332r4498K1062P9672j06786
2819A77090l7303K7199P0017j984Q9509o945k3560n6982L310q0065L0119l0841
$$ y = [423918, 358399, 422549, 386176, 392352, 401895, 473832, 435909, 353406, 471101, 467214, 525621, 502918, 372567, 294841, 409696, 504369, 492000, 423099, 363935, 374403, 380597, 293696, 227156, 259040, 338144, 345056, 349362, 334869, 262936, 262538, 203752, 280383, 426477, 342390, 323031, 248016, 272681, 251078, 270248, 349884, 392247, 377326, 369422, 340146, 334657, 225231, 202371, 400038, 289590, 230950, 298656, 324747, 364183, 295757, 295235, 221734, 216963, 275196, 338347, 228018, 208382, 260137, 187136, 182323, 216691, 221073, 73594, 63204, 185869, 270010, 272791, 314975, 276659, 191105, 108408, 151308, 277640, 183142, 204204, 283876, 177090, 139787, 166986, 237003, 235019, 324528, 317583, 294023, 237041, 240351, 160286, 190405, 159564]
2807A59564L3494o6185N4883O7627m5612K9714r453K1702N904n8182l5074R6748
2795B55130M0910j210o8562r9760L5267r5461K7079L3164J14354j13451m2273
2784H5187q1615P8384O0803j3843j4328j2720O5519q2139r832J08161O8775l9549
2772B12803N6474P302m1123o6290N2491o5469o877K5393n7158m019J9800Q4437
2760B17764M845m9549m548p3752J3812J4699M199L0168P308k4640n5983n4560
2748B9763J9888J43870n18O798J08484j66146p21L4719M5038q2375J09983o4220
2736A84563n0148k395L0576m3347N691N5232l7317N8473l5733L3246k4330j6836
2724A57675j1298N3730j2079p1537m3760p7692J11828K1072k7987Q7425r5266
$$ y = [159564, 193058, 126873, 181756, 249383, 203771, 233485, 224032, 245734, 251638, 193456, 158382, 255130, 296040, 294830, 226268, 126508, 161775, 66314, 93393, 126557, 240911, 127460, 85187, 3572, 81956, 142759, 128916, 114588, 101868, 167387, 85248, 75416, 183577, 252352, 212803, 269277, 276579, 235456, 169166, 221657, 156188, 149311, 174704, 117546, 113527, 133327, 217764, 222609, 173060, 168512, 94760, 108572, 123271, 127470, 157638, 164946, 140306, 84323, 29763, 49651, 193521, 193003, 199801, 308285, 142139, 141418, 176137, 221175, 138800, 248783, 184563, 134415, 132020, 162596, 119249, 124940, 180172, 142855, 201328, 165595, 198841, 174511, 157675, 146377, 200107, 188028, 116491, 72731, -4961, 106867, 127939, 99952, 187377, 92111]
2713I2111n7327L7767l4293n8630M1442Q9639K9743O7839J6137N6209o6330r7403
2701A16904Q8046k3151p0250p604l6070J0782j0674K5311k9894N599J79039n7912
2689A90126j02161k8089k285n3590M8620K7076j7166Q1484K65M8151K1005n2380
2677A61056q2579K4319q747m2430P440j5314O4076r7450M4240l991M3595j5718
2665G8497j03859Q7935k4401N9440L1676r8300k8774O3910K6142L0569l5720r614
2653G7501n9725r596M1244k1821J6363L1069n0081o1664Q2121O3322j1979M5763
2641A42517r01J112k0879m8707r2022M8972Q9850q3297q4799Q1307O3083O5796
2629A62032j0672l9463M0310n8785k8239k520K8836J8555k9046l600p5449j5137
$$ y = [92111, 34784, 72551, 38258, -20372, 21070, 110709, 140452, 208291, 224428, 280637, 214307, 116904, 204950, 181799, 111549, 103945, 67875, 78657, 67983, 93294, 63400, 68999, 248038, 190126, 87965, 59876, 57591, 4001, 52621, 79697, 62531, 144015, 144280, 192431, 213436, 161056, 78477, 102796, 94049, 51619, 59059, 43745, 107821, 10371, 54611, 50620, 94215, 78497, -25362, 62573, 38172, 97612, 129288, 30988, 2214, 66124, 92266, 122835, 87115, 77501, 17776, 8180, 49424, 27603, 43966, 75035, 24954, -36710, 45411, 108733, 96754, 142517, 141616, 142728, 121849, 73142, -18880, 30092, 119942, 36645, -48154, 33153, 96236, 162032, 151360, 111897, 152207, 93422, 65183, 62663, 91499, 110054, 81008, 77408, 1959, -13178]
2617a3178M3398j04010P020L1006R6127j09020P9082q442L9381R2784l9991n5572
2605E8585j13546J1385R524N1519L1483k0861k7107J07499j345O2237l5059l0429
2593A03885J9813n4209N662l901j11573O4856L4872N1050P9287p5933M938M1121
2581A59868j3190k447P3805k00701j9940M1266j3853Q46n374k6121j5730j1097
2569c2668L9103J12646J399l8695J37850j92976k3581R7682N6193j28436k550
2558B5967K8501P9456J6756o2976P9247l0561M1949j05147k277l5327k2544M5133
2546E8177R0007n0274j2411J206K8154l3024m3377l1746j13767M730J38488O7127
2534A03290r5358j0604J26657n1992p5512M6193K9867m3954k6842k170J6999m5197
$$ y = [-13178, 30220, -73790, -66770, -35764, 60363, -48657, 30425, 21983, 61364, 154148, 114157, 58585, -54961, -43576, -34052, 17467, 48950, 28089, 982, 108481, 107136, 169373, 134314, 103885, 123698, 69489, 75151, 71250, -40323, 24533, 59405, 110455, 189742, 113809, 118747, 159868, 146678, 144231, 218036, 17335, -2605, 38661, 24808, 25654, 20280, -5841, -21571, -32668, 6435, 119081, 120480, 81785, 219635, 26659, 3078, 100760, 156953, 28517, 25967, 54468, 133924, 150680, 87704, 166951, 136390, 178339, 73192, 70915, 35588, 13044, 58177, 148184, 97910, 85499, 86705, 114859, 81835, 38458, 6712, -107055, -102325, 36163, 103290, 7932, -2672, 123985, 71993, -3519, 42674, 72541, 28587, 1745, -425, 16574, -28623]
2522b8623Q2495j1934k5103N864m3184L6486j5647Q0541J02163j37656n0475m1387
2510d6460L9569M4231J4109N5660m1124K7403O8677k6061k5446M3225o7359n6872
2498B9552M2791J8667k541j14197l6723O852k394p0931p964J45714r6369R8074
2486A0531J18159K2680l6602K4040o6403Q1M1312k3419L5791k5826q6758r3212
2474g9626l9478j5767R0870M2541M8090q5649J54226n3801m2810L9959o6324J1974
2462D205n7829Q7487J5176Q1891m6889r5365K6764J15460o8015n2339Q6471n3789
2450D3228Q5150p2367q024J6996M8751j01161j1139N3242m0718P2272m5780O4032
2438A04482o1890R3107J06917p4765p4813j8687L8615J123l7837N5224o0661l1542
$$ y = [-28623, 53872, 41938, 16835, 22699, -20485, 16001, 354, 80895, 183058, 45402, -5073, -46460, -6891, 37340, 51449, 107109, 65985, 93388, 162065, 136004, 110558, 153783, 86424, 29552, 72343, 91010, 88469, -25728, -62451, -55599, -57993, -128924, -136888, 8826, -87543, 10531, 128690, 151370, 114768, 138808, 72405, 72486, 113798, 90379, 126170, 100344, 13586, -79626, -119104, -134871, -44001, -1460, 46630, -39019, 115207, 61406, 18596, 58555, -7769, 4205, -53624, 33863, 49039, 130930, 84041, -11324, 15440, 130900, 62885, 10546, 97017, 43228, 128378, 56011, 47987, 64983, 113734, 12573, 1434, 54676, 13958, 86230, 40450, 104482, 42592, 135699, 242616, 167851, 93038, 74351, 112966, 114089, 76252, 131476, 70815, 39273]
2426C9273j7372R5918M6762o9841j6794j17770j0371k6580j2353O0070J17420
2415H8362N3029p1166n3969N2437o042K6355Q1322n0019j67622N600j7781K7084
2403c2410L7976M8283n2992k5262J15241p9871m2649M4476J38005K1248r2866
2392G9179O972R5476L3261R8493M1661q7555P958L8068o0799j06581L00k5096
2380A21337p9674M8839J41814O1783l6018K2405j7864j56303q5388Q129R0942
2369A20002L7358k7481m7040j0183O0567P272j17688o607J18959M8359o254j28916
2357D8348J6573n0967K8738O5890J3845P8365J8197p1802q880L1248N0493j04011
2345A16037k7926N0231J1918q8763j2382K4017o4963R316N2929Q6632L0109j69808
$$ y = [39273, 21901, 117819, 164581, 94740, 77946, -39824, -50195, -76775, -89128, -29058, 88362, 141391, 70225, 16256, 68693, 62651, 89006, 170328, 120309, -47313, -41713, -59494, -32410, 5566, 53849, 857, -24405, 90836, 10965, -31684, 12792, 150797, 172045, 79179, 86151, 181627, 214888, 313381, 355042, 267487, 275445, 313513, 252714, 146133, 146433, 121337, 41663, 90502, 232316, 294099, 258081, 280486, 262622, 106319, 20931, 29060, 120002, 157360, 129879, 82839, 72656, 133223, 140495, 22807, 16200, 135159, 183518, 177264, 48348, 64921, 13954, 42692, 108582, 122427, 200792, 218989, 147187, 138307, 169555, 220048, 116037, 88111, 138342, 150260, 61497, 49115, 73132, 8169, 17485, 70414, 157046, 187155, 17347]
2333A7347j4832K6379m1118P322J51185m3873m9435R1620K7208j17643J34500
2322A88660J1435j44853j05340p0190L0558J06836J01314j33014J8317L5943Q4323
2311A23989o4232K44295k9735j41236l7662p5852P8927j1337J9881Q2948j15656
2300G4330l0421K8338J01533Q002K2737J04594M515j26164J0775l7579M8823O3432
2288B72915j5655j4959l3996M4254L2588k6273n1229J8390l2374N95K6861O633
2276B27750L368J6217k0601Q231o1805m202J38187j7074K6647r8738p6544M7859
2264A89295P9818q3654K6983J70834j1606r004q8472J1899r788o1156L8206j53989
2252I9366O788O6606l0297O8980j0471l3720K2686M6625n8064M4098J18788l7693
$$ y = [17347, 2515, 28894, -12224, -4902, 146283, 102410, 52975, 144595, 171803, 54160, 188660, 200095, 55242, -50098, -120288, -89730, 17106, 118420, -14594, 3723, 39666, 123989, 59757, 304052, 274317, 133081, 95419, 19567, 98494, 87157, 107038, 189986, 74330, 43909, 72247, 173780, 181782, 204519, 309113, 313628, 187464, 198239, 160660, 209483, 272915, 257260, 242301, 208305, 252559, 285147, 258874, 207645, 226035, 193661, 194256, 221117, 227750, 231118, 247335, 226734, 234965, 173160, 168958, 307145, 290071, 316718, 217980, 141436, 189295, 269113, 185459, 212442, 383276, 371670, 362666, 274194, 286093, 276305, 215149, 253355, 99366, 106154, 172760, 142463, 211443, 200972, 167252, 189938, 236563, 178499, 222597, 341385, 303692]
2240C03692m2579P2182m5285L4586M5511m8174J0177q3544n0439n0212N9937R6161
2228C02013N1632N1220n1447N9855j4759L3551n2066M3613n008q89N2517n4111
2216D16121N2045j961Q7577M5145j4726P6015m4158m8012l5918L2771M3642J09557
2204G18098K5962O9256n6890n953N2226l6421N3380m7947m2533j4903L3396J62879
2192I10550N3562j1956J24286r1628M6523N9048r9015R282M6504P9284k2086n9770
2180A044584J47398J27412j01951P8077J1262l0680P4222Q8501K546k4349R1637
2169A508659P2586o5358K7856J66495P6654k6915J05061K00172l6044O5460J70424
2158B265050N8344K3665J35851O5171J50360J73208J15484O3956J7714K44119
$$ y = [303692, 261113, 333295, 288010, 322596, 368107, 319933, 330110, 246566, 196127, 145915, 205852, 302013, 353645, 404865, 353418, 413273, 398514, 432065, 379999, 423612, 418604, 417715, 470232, 416121, 468166, 466205, 553782, 598927, 584201, 660216, 616058, 568046, 532128, 564899, 608541, 718098, 744060, 813316, 756426, 750473, 802699, 766278, 819658, 771711, 729178, 714275, 747671, 910550, 964112, 952156, 1076442, 984814, 1031337, 1090385, 991370, 1000652, 1047156, 1126440, 1104354, 1044584, 1191982, 1319394, 1217443, 1295520, 1306782, 1276102, 1350324, 1438825, 1441371, 1417022, 1508659, 1581245, 1515887, 1543743, 1710238, 1786892, 1759977, 1865038, 2065210, 2029166, 2094626, 2265050, 2323394, 2347059, 2482910, 2548081, 2698441, 2871649, 2987133, 3051089, 3068803, 3312922]
2148C312922K27309K18278J58893J86745Q6682J48089K22451J99568K75655L39055
2138E375647M05013M27040N19580P11844O53867N70321M89133P45473Q80912J210165
2128A1988995J341159J785925K387891K927760L797849M885759N921205O934199
2120D1970742Q321076P246318j036946j1388151j1589500p620178n035086l338660
2112A7529615k335235k014108j401981r59956q66034p74500n78724l37740l40133
2103G921204l94283q48333o47308m64765n01314k90109j97443k69420j86975k63617
2093C857637j80224j38482l00009p1958r030j14381k27128q1304j01687j49321
2083B484113j07540j52202J6314r8160j8249j20784j12657n9923n1825l0321j19426
$$ y = [3312922, 3540231, 3758509, 3917402, 4104147, 4190829, 4338918, 4561369, 4760937, 5036592, 5375647, 5780660, 6207700, 6727280, 7439124, 8092991, 8663312, 9152445, 9897918, 10778830, 11988995, 13330154, 15116079, 17503970, 20431730, 24229579, 29115338, 35036543, 41970742, 50291818, 57538136, 56501190, 45113039, 33523539, 25903361, 20868275, 17529615, 15194380, 13180272, 11778291, 10818335, 9952301, 9177801, 8599077, 8261337, 7921204, 7526921, 6678588, 6031280, 5566515, 5065201, 4775092, 4577649, 4308229, 4121254, 3857637, 3677413, 3538931, 3238922, 3166964, 3157934, 3043553, 2816425, 2735121, 2633434, 2484113, 2376573, 2224371, 2240685, 2142525, 2124276, 2003492, 1890835, 1830912, 1779087, 1748766, 1629340]
2072A629340j75481O328M5664n4159j09308k087r0992N9130j2173m8578j07905
2061A139779q2380P309M6084K0741r152o524j05105k1265j21474j7249K5764Q4380
2049I60908M2250o9849j5989p378o303j06402O5781R003m5689o9211k1862L0659
2037G65918j3982r4182q0813K0618K2456k2937N7244m3077r748N4566j26318N5630
2025E85375l3847o2664m6232L4960L9285P1084L4642j45633m8153M3182M7253
2014E19252l542l6008J1216k04375r34M4928L4062J1474l5640j0013N0320n7055
2002C23685l4436K749J20371N0368J5294p0334o2920M7999j4964M803o6774k1916
1990B93925p2380O5294L7161j5807k5480k318q3479p1426M1081O5079l4741p6018
$$ y = [1629340, 1453859, 1460187, 1505851, 1451692, 1342384, 1340297, 1249305, 1308435, 1296262, 1247684, 1139779, 1057399, 1064708, 1110792, 1131533, 1122381, 1115857, 1010752, 989487, 868013, 850764, 876528, 960908, 1003158, 933309, 917320, 909942, 903639, 797237, 863018, 872021, 826332, 757121, 735259, 765918, 751936, 657754, 576941, 597559, 620015, 597078, 654322, 611245, 601497, 656063, 529745, 585375, 551528, 488864, 442632, 477592, 516877, 587961, 622603, 476970, 428817, 471999, 519252, 515710, 479702, 490918, 286543, 285609, 330537, 364599, 376073, 340433, 330420, 380740, 323685, 289249, 291998, 412369, 462737, 478031, 407697, 344777, 392776, 377812, 382615, 315841, 293925, 221545, 286839, 324000, 308193, 282713, 280395, 196916, 125490, 166571, 231650, 196909, 120891]
1978A20891o5147J32181M8640K1602r4930K3027o5977k4538J6281l2434M0321
1967A19917k0335M7773j886j25207R5761N1711p1471J24397m497j71803n6885
1956a2525L7420k4840O9402k362j35913N5178N2227N603P7275n7183J2738k6482
1944E0538j4849K4755k1012l6283M6410J790M1854m5599m6217J3621J7014Q856
1932D0878K3882M0764L0479l0896P5032j13468l9038k2796P5526J5203j30718
1921c5152K6569K8910J38925J286j1271n6463Q2409q7060l3758M5409J1834R345
1909A20983J9495p0604m0564J8948Q0571o029K3134k3768j29284o788k1553q273
1897d3732r910r581J99598M6018q2283N7687o3726n4020J1324k7567K2970O7936
$$ y = [120891, 55744, 187925, 236565, 258167, 163237, 186264, 120287, 95749, 112030, 79596, 119917, 99582, 147355, 145469, 20262, 116023, 167734, 96263, 220660, 216163, 44360, -12525, 24895, 55, 69457, 67095, -68818, -13640, 38587, 44190, 121465, 64282, 77020, 50538, 35689, 60444, 39432, 3149, 49559, 51349, 93203, 47604, 1387, 15008, 32022, 40878, 64760, 105524, 136003, 105107, 180139, 66671, 27633, 4837, 80363, 95566, -35152, -8583, 20327, 159252, 160538, 149267, 92804, 175213, 88153, 54395, 99804, 111638, 120983, 140478, 69874, 29310, 48258, 128829, 122800, 145934, 122166, -7118, -13906, -35459, -43732, -53642, -63223, 136375, 182393, 100110, 157797, 94071, 40051, 51375, 23808, 46778, 114714]
1885A14714j31557R962k0240J12141J0976J932j61450N084J18850K2650o8188
1874A4874k8958m4805m8736P8545N2583J03449J5153n929j0109k1352l4167l536
1862F7012J45067j13855r5049J06567M7816L7754L8648M2072l3632m0792P0735
1851B72343Q0718k607K834r2370p148r14k572p5687p2501J456n1262J7579j5650
1838E4219J1380j8753k4894P924K5025P8734n3172N9074j16306J4611J00291N054
1826A43187j30423j3542R4090m1585N6045o7192l1L4445j4320j1289n8955P3901
1814F4331J6636L6599Q4772l396j65207l0746l7564Q2463j4798R013q6214J25523
1802H1412N0164l5170K961n5527Q805L799j05325o7853N9271Q4304O69m0858M8081
$$ y = [114714, -16843, -6881, -27121, 85020, 95996, 97928, -63522, -58438, 60412, 83062, 14874, -14084, -58889, -107625, -29080, 23503, 126952, 142105, 136176, 126067, 104715, 70548, 67012, 212079, 98224, 3175, 109742, 157558, 195312, 233960, 276032, 242400, 201608, 272343, 353061, 350454, 353288, 260918, 253770, 252856, 250284, 174597, 102096, 103552, 52290, 69869, 54219, 65599, 46846, 21952, 29876, 54901, 133635, 80463, 139537, 23231, 37842, 138133, 143187, 12764, -778, 93312, 51727, 107772, 40580, 40549, 74994, 60674, 49385, -9570, 64331, 80967, 117566, 202338, 198942, 33735, 2989, -34575, 47888, 33090, 42103, -44111, 81412, 131576, 96406, 99367, 43840, 52645, 56444, -48881, -116734, -57463, 26841, 27510, -13348, 34733]
1789C4733k6189p1873j8274J15491o513o5439m6493L1024j5469P5490n8916K7782
1777b4646Q9560Q3143j36850k1087j5083q520L9941n9223M5993k0002R8324n077
1765F6473n5755j1681K8957L3417N1737j11094j18933L1783M097j5532l0430J6270
1753a10691o537p291J03775J29001l7935j14355n982Q6836k6274O9680m6803J2385
1741D5809r7564K8961M8922N8877m5272j50054n8022K9857k6739J24176L0280
1730a0769j1281r7081K3147Q8004j501M9087m9787k8721r072j8757l8002J25580
1718B0847O5625q6508K8873L1696p2525P7791M8356p1150j15232o3181J0527L971
1706a20910J08262j9843P744M6194o7188J2944O166P2808R171R8586j7217n9607
$$ y = [34733, 8544, -63329, -81603, 33888, 27375, -38064, -84557, -53533, -69002, 6488, -52428, -24646, 64914, 148057, 11207, -9880, -24963, -33483, 6458, -52765, -6772, -26774, 71550, 66473, 10718, -963, 27994, 61411, 113148, 2054, -116879, -85096, -80999, -96531, -126961, -110691, -117228, -124519, -20744, 108257, 70322, -44033, -50015, 36821, 10547, 80227, 33424, 45809, -51755, -22794, 26128, 85005, 39733, -110321, -168343, -138486, -165225, -41049, -10769, -22050, -119131, -95984, -7980, -9481, 39606, -10181, -38902, -47974, -66731, -104733, 20847, 86472, -36, 28837, 60533, -11992, 65799, 114155, 43005, -72227, -135408, -124881, -120910, -12648, -32491, -24747, 21447, -45741, -32797, -26631, 46177, 55348, 153934, 136717, 77110]
1694G7110n6411j1652j17130K6949J06245j9156k9159N3806n1980K3339J6996
1683A8957J3527j7191q9527J2731R33k573n4281k9673K6428K009J02719M3360
1671B7419r398l9470o3835J45557M5030m7889r7005o1639m8855K0937O3645k7106
1659i2609J7924J2827L2696l8409O9177J03014k9731k8571k1351k5459J6227n0789
1647c5054l6014Q597l329j09290L1191J9716K3365N3847L4587n8935J06028J8898
1635E3607m9715q5794M0395O1310j30543N2424N1556K5049K1888k6813J7860p2893
1623d1669J790k7258l6741L4835L1235j8293q5810J00413J8086J7103r1687P4782
1611b3214r1237J9394J47658k0955l0566R486m4025J81K6180k6789p7641P975
$$ y = [77110, 20699, 9047, -108083, -81134, 25111, 5955, -23204, 30602, -21378, 1961, 18957, 32484, 15293, -74234, -61503, -60570, -63143, -117424, -147097, -120669, -118660, -15941, 27419, 18021, -21449, -85284, 60273, 105303, 57414, -39591, -101230, -150085, -129148, -65503, -92609, -74685, -61858, -29162, -67571, 1606, 104620, 74889, 46318, 24967, -492, 15735, -35054, -71068, -62471, -65800, -175090, -143899, -124183, -100818, -46971, -12384, -71319, 34709, 53607, 3892, -81902, -41507, 19803, -110740, -58316, -6760, 18289, 40177, 13364, 31224, -41669, -39879, -67137, -103878, -69043, -37808, -56101, -141911, -41498, -23412, -6309, -97996, -23214, -114451, -95057, 52601, 31646, 1080, 10566, -33459, -33278, -7098, -33887, -111528, -103553]
1599a03553Q032P3456l848m4078K9557l2835l7767O9614N0477J1476k5707j5817
1587b0993N9657K824l5622J10377j04545o6378j1908l623q941m8427M5994L8339
1575d3246J06314j9075j11538n0919n0729O6823J43204K8788M2519o0022m3103
1564I016l9778N2266N5326o2465l826R607l0410o1235l4950m311j6695M3716k3126
1551a06865L9873n8237l4758k0172m58J69559j779j4072L0847o436N6948j16133
1539f1683K4101J4270l3330K12092k1259j44693K6390J6005L0520l8779l195n423
1527A5016q9473J1206l2305Q8564J9554Q9576j05043m9721K6417K6508l6500o0892
1515i7093J13242m5691R1833o9786J0825O1824j63515k5575J7837L7049R0590
$$ y = [-103553, -95521, -22065, -25913, -69991, -40434, -73269, -111036, -41422, 9055, 20531, -5176, -20993, 38664, 41488, 5866, 116243, 11698, -54680, -66588, -70211, -79152, -127579, -81585, -43246, 63068, 43993, -67545, -118464, -169193, -102370, 40834, 69622, 112141, 52119, 9016, -30762, 21504, 76830, 14365, 10539, 20146, -10264, -71499, -106449, -110760, -127455, -83739, -106865, -66992, -125229, -159987, -180159, -180617, -11058, -12837, -26909, 3938, -2498, 54450, -61683, -37582, -23312, -56642, 155450, 134191, -10502, 15888, 31893, 62413, 23634, 20439, 15016, -74457, -63251, -95556, -6992, 12562, 102138, -2905, -52626, -26209, 299, -36201, -97093, 16149, -29542, 62291, -7495, 3330, 65154, -98361, -123936, -106099, -69050, 21540]
1504B1540k5898N905l5099l7591m279k8006q9691P7807J4242Q7472m6634J9264
1492d0968n9889J0307L8637p8729J43104J506o2153q652N5493P702k0843l7336
1480e1821m7168O9432k141M4589L0742j70523J43095l1115l8513K5372m5065M28
1468g2688M0513K0226P4179K305o6821p5372k8452P6225O8801k9075j43005P4643
1456e8521K4972J9012P4874k8117p1324M3075m5614l551K8843l6239M163p8118
1444a26545L460L2458O6947o2075k8668Q0404P1558M5093j46710J6052l8915M7137
1432c9804K1148m2287J16164j17260N1980J0124K7519k2097l3564L8488M4019
1421E4430J5810l8738j5229o946m714n8625r7071o6512P3385J0209J0278N7232
$$ y = [21540, -4358, 1547, -33552, -71143, -75422, -103428, -193119, -115312, -101070, -13598, -60232, -40968, -100857, -90550, -51913, -130642, 12462, 13968, -48185, -56837, -1344, 6358, -14485, -51821, -98989, -29557, -31698, 12891, 43633, -126890, 16205, -14910, -53423, -28051, -73116, -72688, -32175, -11949, 62230, 64535, -2286, -77658, -106110, -29885, 38916, 9841, -133164, -58521, -33549, -14537, 60337, 32220, -39104, 3971, -41643, -45194, -16351, -52590, -48427, -126545, -123085, -90627, -23680, -85755, -114423, -34019, 37539, 82632, -64078, -48026, -86941, -39804, -18656, -60943, 55221, -62039, -10059, 65, 27584, 5487, -28077, 10411, 54430, 70240, 31502, 16273, 9327, 4613, -54012, -151083, -217595, -144210, -134001, -123723, -66491]
1409f6491L1214K1410k9459L0716n4656n8978n1720M7285J22146r952p156k5162
1397e0803P4653j16797j0086R3844o1260M3455M8207j2187q44J4293k1888k652
1385b065j06496N6974Q902p16K04Q6952n6105j909J04193q5598j1548Q975J45699
1372A47462j22133o6314L7318l8811K5440j1133M2661p1052l9758K6255K9629
1361d0436J6691J6557n2967q7502n9884N4502p6094j3534J08164N8305L5419Q029
1349c2750p2826r0607R2619n6884N2580l5489J0141M2742J19554N4755k9930j90489
1337a36584l4526r502j1811R5014j3554J4288j2750N0551O7334L7151p3781m3049
1325g1219n0657o5885O8499L0457J3402J3301k8539K6984M206k07J06621p2959
$$ y = [-66491, -35277, -13867, -43326, -12610, -67266, -126244, -177964, -130679, -8533, -18485, -25641, -50803, 23850, -92947, -103033, -9189, -70449, -26994, 21213, 9026, 8182, 22475, 587, -2065, -108561, -51587, -42685, -43401, -43197, 43755, -12350, -14259, 89934, 4336, -7212, 1763, 147462, 25329, -40985, -3667, -42478, -17038, -28171, 14490, -56562, -96320, -70065, -40436, -23745, -7188, -60155, -147657, -207541, -153039, -229133, -242667, -134503, -76198, -40779, -32750, -105576, -196183, -103564, -160448, -107868, -143357, -133216, -90474, 29080, 83835, 53905, -136584, -171110, -180612, -192423, -97409, -110963, -96675, -109425, -58874, 8460, 45611, -28170, -71219, -121876, -187761, -119262, -88805, -75403, -62102, -90641, -63657, -59451, -59658, 46963, -25996]
1313b5996J10103j10400r9468N0303l8186k0782L2621l3175J01643j7055K5707
1302b4685k0272k3386j3584m0652P3320j00839N2520J23556m1660j14872N2580
1291g7974p0267O3027r8376k7827J07219M5214q201L3385n1492K8671m7021q250
1279a11892n2464J5088K4292J5250l6014N8478R952o1365J16496K4584k357j14436
1267a14388k1029O8500k8356n2212O42k8136l1171n5335J21952R5041R3880l2742
1255A6646j20193n635K6696m0705K3827M7344q2255L3114L375j8722M7120J48449
1243G9061o2598r0928O1424r8762m0506J97572L866j848j8030n6455k9103Q382
1231d7925K0394K3282L4585M3000l9548r152j06690R3554n6043o2203O5172L5838
$$ y = [-25996, 84107, -26293, -125761, -75458, -113644, -134426, -101805, -134980, -33337, -50392, -24685, -44957, -68343, -81927, -122579, -49259, -150098, -97578, 25978, -15682, -130554, -77974, -148241, -85214, -183590, -211417, -104198, -58984, -67185, -33800, -85292, -56621, -103642, -111892, -164356, -149268, -124976, -109726, -145740, -87262, -77310, -138675, -22179, 2405, 48, -114388, -135417, -66917, -95273, -147485, -146843, -174979, -206150, -261485, -139533, -44492, 49388, 16646, -103547, -109182, -82486, -123191, -99364, -52020, -134275, -101161, -97786, -116508, -69388, 79061, 16463, -74465, -13041, -111803, -152309, 45263, 49129, 47281, 29251, -27204, -56307, -47925, -27531, -4249, 30336, 73336, 33788, 24636, -82054, 11500, -44543, -106746, -41574, -5736]
1219e736r4915r4058L832N2311J0368L0199L0525K9708l959o5981M9203o0627
1207a19130n3803K0329J8171K6276O4761J26352k034j16648o403P8186R0799j66747
1195c9891j48568L5951O7652o1945l0889k0492P4726M7358l4686k3348k7830m4433
1183b06395P1206l97O5895N2032j9212J7470J2770p7227k7967k9147p1982J03443
1171a09511J93123j32393L8509K4243K0878n1677p448K8360k3617O6311r6239
1160d9461K1818P1216J0281r3387M4264M9653k02131J89600L7784j30236j75398
1149b25997M8266P3293L3836j7778J21728J6333p4795m6617n1174M2780P6833
1138c292J7736p5984K7603O1667m1695J9780n335n9042m1942N4780N9836K155
$$ y = [-5736, -100651, -194709, -190877, -138566, -128198, -97999, -67474, -37766, -41725, -107706, -58503, -119130, -172933, -152604, -134433, -108157, -43396, 82956, 80922, -35726, -42129, 36057, 126856, -39891, -188459, -152508, -84856, -146801, -177690, -198182, -123456, -76098, -110784, -134132, -161962, -206395, -135189, -135586, -69691, -17659, -36871, -19401, -6631, -83858, -111825, -140972, -212954, -109511, 83612, -48781, -10272, 13971, 34849, -16828, -24276, 4084, -19533, 46778, -49461, -27643, 43573, 53854, -39533, 4731, 54384, -147747, 41853, 79637, -50599, -225997, -177731, -104438, -70602, -88380, 33348, 49681, -25114, -71731, -122905, -80125, -3292, 14444, -61540, -33937, 27730, -13965, 5815, 480, -58562, -100504, -45724, 14112, 16267]
1126A6267p7946p0377Q7983J796K6042n8182J1160R232k5105n6660k0133J09702
1114d6221m607r3834J58456k6918r372l5917L4959N0501j4126k723l946M4446
1102E0698L5847l295j85240l7799O4250k6227L7972l1637j3845N930J53915m9841
1090G28j3609k6499k0586n0810O3178N9691l7711q3312J8810N9420Q2432r1427
1078c9695j03402j26525Q6372J5105P1469M9659J0570K0635p9606N0314M7627
1067B523L677m0267l838Q6462l0509n1510o4203O4701L1110q5136m4191M5213
$$ y = [16267, -61679, -132056, -44073, -42277, -16235, -74417, -63257, -54025, -79130, -135790, -155923, -46221, -50828, -144662, 13794, -13124, -22496, -58413, -23454, 27047, 12921, 10198, 6252, 50698, 86545, 83250, -101990, -139789, -75539, -101766, -63794, -95431, -109276, -103346, 50569, 728, -12881, -39380, -59966, -110776, -47598, 12093, -25618, -108930, -90120, -30700, 51732, -39695, -143097, -269622, -183250, -168145, -96676, -47017, -36447, -15812, -95418, -45104, 2523, 6200, -34067, -37905, 48557, 18048, -33462, -97665, -32964, -1854, -86990, -131181, -85968]
$$ [...]
##END NTUPLES=NMR SPECTRUM
##END=
