##TITLE=1H_TG-2341-B32
 CDCl3
 8 sc, 
 14.1.2022
##JCAMPDX= 6.0         $$ Bruker NMR JCAMP-DX V2.0
##DATA TYPE= NMR SPECTRUM
##DATA CLASS= NTUPLES
##ORIGIN= UXNMR, Bruker Analytische Messtechnik GmbH
##OWNER= root
$$ XWIN-NMR		Version 3.5
$$ Fri Jan 14 14:15:17 2022 Russian Standard Time (UT+4h)  she@DPX200
##.OBSERVE FREQUENCY= 200.131346
##.OBSERVE NUCLEUS= ^1H
##.ACQUISITION MODE= SIMULTANEOUS
##.ACQUISITION SCHEME= undefined
##.AVERAGES= 8
##.DIGITISER RES= 18
##SPECTROMETER/DATA SYSTEM= spect
##.PULSE SEQUENCE= zg30
##.SOLVENT NAME= CDCl3
##.SHIFT REFERENCE= (INTERNAL, CDCl3, 0, 15.7226)
##AUDIT TRAIL= $$ (NUMBER, WHEN, WHO, WHERE, WHAT)
$$ ##TITLE= Audit trail, XWIN-NMR		Version 3.5
$$ ##JCAMPDX= 5.01
$$ ##ORIGIN= Bruker BioSpin GmbH
$$ ##OWNER= she
$$ F:/spectra/data/she/nmr/H-F/1/pdata/1/auditp.txt
$$ ##AUDIT TRAIL=  $$ (NUMBER, WHEN, WHO, WHERE, WHAT)
(   1,<2022-01-14 14:14:15.64 +0400>,<she>,<DPX200>,
      <created by zg, POWCHK disabled, PULCHK disabled
       configuration hash MD5:
       00 E9 B6 7A A2 85 ED C7 34 08 36 98 17 FE 4E 26
       data hash MD5: 16K
       F8 82 05 78 A8 B7 0E 31 F0 20 EA 58 7B B8 73 AE>)
(   2,<2022-01-14 14:14:17.92 +0400>,<she>,<DPX200>,
      <Start of raw data processing
       efp BC_mod = 2 LB = 0.24 FT_mod = 6 PKNL = 1 PHC0 = -15868.44 PHC1 = 13.00078 SI = 16K 
       data hash MD5: 16K
       5B 4B 60 DC 01 DD FA 36 66 5E CA 44 9E 00 BA 51>)
(   3,<2022-01-14 14:14:30.51 +0400>,<she>,<DPX200>,
      <pk PHC0 = -2.161905 PHC1 = 1.6 
       data hash MD5: 16K
       BE 0D 31 7E F4 F6 3C 22 D6 A0 9D 06 4A 3A 18 0E>)
(   4,<2022-01-14 14:14:33.78 +0400>,<she>,<DPX200>,
      <abs ABSG = 5 
       data hash MD5: 16K
       78 BB C3 5B 80 C2 1A 38 05 6C BA 58 F8 10 1A E0>)
$$ ##END=
$$ 
$$ hash MD5
$$ F2 27 20 E9 32 AE FB 27 93 8A A1 B9 7F 25 A8 B5
##$RELAX= 
##$RELAX= 
##$RELAX= 
##$RELAX= 
##$RELAX= 
##$RELAX= 
$$ Bruker specific parameters
$$ --------------------------
##$DU= <F:/spectra>
##$EXPNO= 1
##$NAME= <H-F>
##$PROCNO= 1
##$TYPE= <nmr>
##$USER= <she>
##$AMP= (0..31)
100 100 100 100 100 100 100 100 100 100 100 100 100 100 100 100 100 100 
100 100 100 100 100 100 100 100 100 100 100 100 100 100 
##$AQSEQ= 0
##$AQ_mod= 1
##$AUNM= <au_zg>
##$AUTOPOS= <>
##$BF1= 200.13
##$BF2= 200.13
##$BF3= 200.13
##$BF4= 200.13
##$BF5= 200.13
##$BF6= 200.13
##$BF7= 200.13
##$BF8= 200.13
##$BYTORDA= 1
##$CFDGTYP= 0
##$CFRGTYP= 5
##$CHEMSTR= <none>
##$CNST= (0..31)
1 1 145 1 1 1 1 1 1 1 1 1 1 1 1 1 1 1 1 1 1 1 1 1 1 1 1 1 1 1 1 1 
##$CPDPRG= <>
##$CPDPRG1= <>
##$CPDPRG2= <>
##$CPDPRG3= <>
##$CPDPRG4= <mlev>
##$CPDPRG5= <mlev>
##$CPDPRG6= <mlev>
##$CPDPRG7= <mlev>
##$CPDPRG8= <mlev>
##$CPDPRGB= <>
##$CPDPRGT= <>
##$D= (0..31)
0 1.2 0 0 0 0 0 0 0 0.06 0 0.03 0 0 0 0 0.0002 0 0 0 0 0 0 0 0 0 0 0 0 
0 0 0 
##$DATE= 1642155255
##$DBL= (0..7)
120 120 120 120 120 120 120 120 
##$DBP= (0..7)
150 150 150 150 150 150 150 150 
##$DBP07= 0
##$DBPNAM0= <>
##$DBPNAM1= <>
##$DBPNAM2= <>
##$DBPNAM3= <>
##$DBPNAM4= <>
$$ [...]
##$SUBNAM2= <"">
##$SUBNAM3= <"">
##$SUBNAM4= <"">
##$SUBNAM5= <"">
##$SUBNAM6= <"">
##$SUBNAM7= <"">
##$SUBNAM8= <"">
##$SUBNAM9= <"">
##$SW= 18.0517287032376
##$SWIBOX= (0..15)
0 0 2 0 0 0 0 0 0 0 0 0 0 0 0 0 
##$SW_h= 3612.71676300578
##$TD= 16384
##$TD0= 1
##$TE= 0
##$TE2= 300
##$TE3= 300
##$TEG= 300
##$TL= (0..7)
0 120 120 120 120 120 120 120 
##$TP= (0..7)
150 150 150 150 150 150 150 150 
##$TP07= 0
##$TPNAME0= <>
##$TPNAME1= <>
##$TPNAME2= <>
##$TPNAME3= <>
##$TPNAME4= <>
##$TPNAME5= <>
##$TPNAME6= <>
##$TPNAME7= <>
##$TPOAL= (0..7)
0.5 0.5 0.5 0.5 0.5 0.5 0.5 0.5 
##$TPOFFS= (0..7)
0 0 0 0 0 0 0 0 
##$TUNHIN= 0
##$TUNHOUT= 0
##$TUNXOUT= 0
##$USERA1= <user>
##$USERA2= <user>
##$USERA3= <user>
##$USERA4= <user>
##$USERA5= <user>
##$V9= 5
##$VALIST= <valist>
##$VCLIST= <CCCCCCCCCCCCCCC>
##$VD= 0
##$VDLIST= <DDDDDDDDDDDDDDD>
##$VPLIST= <PPPPPPPPPPPPPPP>
##$VTLIST= <TTTTTTTTTTTTTTT>
##$WBST= 1024
##$WBSW= 4
##$XGAIN= (0..3)
0 0 0 0 
##$XL= 0
##$YL= 0
##$YMAX_a= 201180
##$YMIN_a= -317830
##$ZGOPTNS= <>
##$ZL1= 120
##$ZL2= 120
##$ZL3= 120
##$ZL4= 120
##$ABSF1= 15.71493
##$ABSF2= -2.33692
##$ABSG= 5
##$ABSL= 3
##$ALPHA= 0
##$AQORDER= 0
##$ASSFAC= 0
##$ASSFACI= 0
##$ASSFACX= 0
##$ASSWID= 0
##$AUNMP= <proc_1d>
##$AZFE= 0.1
##$AZFW= 0.1
##$BCFW= 0
##$BC_mod= 2
##$BYTORDP= 0
##$COROFFS= 0
##$CY= -3
##$DATMOD= 1
##$DC= 0
##$DFILT= <>
##$DTYPP= 0
##$F1P= 0
##$F2P= 0
##$FCOR= 1
##$FTSIZE= 16384
##$FT_mod= 6
##$GAMMA= 0
##$GB= 0
##$INTBC= 1
##$INTSCL= 0
##$ISEN= 128
##$LB= 0.24
##$LEV0= 0
##$LPBIN= 0
##$MAXI= 10000
##$MC2= 0
##$MEAN= 0
##$ME_mod= 0
##$MI= 1.114404
##$NCOEF= 0
##$NC_proc= -7
##$NLEV= 6
##$NOISF1= 3.799351
##$NOISF2= 2.8
##$NSP= 0
##$NTH_PI= 0
##$NZP= 0
##$OFFSET= 15.72265
##$PC= 1
##$PHC0= -15870.6
##$PHC1= 14.60078
##$PH_mod= 1
##$PKNL= yes
##$PPARMOD= 0
##$PSCAL= 0
##$PSIGN= 0
##$REVERSE= no
##$SF= 200.130005783599
##$SI= 16384
##$SIGF1= 3
##$SIGF2= 2
##$SINO= 5.538805
##$SIOLD= 16384
##$SREGLST= <1H.CDCl3>
##$SSB= 0
##$STSI= 16384
##$STSR= 0
##$SW_p= 3612.71676300578
##$SYMM= 0
##$S_DEV= 0
##$TDeff= 16384
##$TDoff= 0
##$TI= <>
##$TILT= no
##$TM1= 0
##$TM2= 0
##$TOPLEV= 0
##$USERP1= <user>
##$USERP2= <user>
##$USERP3= <user>
##$USERP4= <user>
##$USERP5= <user>
##$WDW= 1
##$XDIM= 16384
##$YMAX_p= 450657368
##$YMIN_p= -906638
$$ End of Bruker specific parameters
$$ ---------------------------------
##NTUPLES= NMR SPECTRUM
##VAR_NAME=  FREQUENCY,     SPECTRUM/REAL,   SPECTRUM/IMAG
##SYMBOL=    X,             R,               I
##VAR_TYPE=  INDEPENDENT,   DEPENDENT,       DEPENDENT
##VAR_FORM=  AFFN,          ASDF,            ASDF
##VAR_DIM=   16384,         16384,           16384
##UNITS=     HZ,            ARBITRARY UNITS, ARBITRARY UNITS
##FACTOR=    0.220516191357247, 1,           1
##FIRST=     3146.57395023411, 0,            0
##LAST=      -466.142812771667, 0,           0
##MIN=       -466.142812771667, -906638,     0
##MAX=       3146.57395023411, 450657368,    0
$$ Real data points
##PAGE= N=1
##DATA TABLE= (X++(R..R)), XYDATA
$$ [...]
7054A1694859m35784m35862l79540l66875n07734l83490j72641l03047m31816
7045H278070l67157l50658l49342l74670k00039j69318l11491j07449j55261l29226
7035E563459k65797j43754m5545k97992k29679j60463k2752r7698j71541j33303
7025C994935j96425q8458J61113k91346Q725j60449o7594k530k49252l8670j78910
7014B891139J17899J17446j29431L7540L1471r0229k60362j67941q7219j9095
7004B441218L2525j63312O2860n9601k45144L1253j39439J27932Q2164j17296
6994B053160j62212k41559J6675L14622p3883k50756K0249J8729M023m5057L6083
6983A690074O4503l27137J21141Q667p0774j08366K18777j67643j39226J54174
$$ y = [11694859, 11259075, 10823213, 10443673, 10076798, 9569064, 9185574, 9012933, 8709886, 8278070, 7910913, 7560255, 7210913, 6836243, 6636204, 6466886, 6155395, 6047946, 5892685, 5563459, 5297662, 5153908, 5108363, 4810371, 4580692, 4420229, 4397477, 4299779, 4128238, 3994935, 3798510, 3710052, 3871165, 3579819, 3588544, 3428095, 3360501, 3357971, 3108719, 3070049, 2891139, 3009038, 3126484, 2997053, 3034593, 3066064, 2975835, 2715473, 2547532, 2460313, 2441218, 2473743, 2310431, 2373291, 2313690, 2068546, 2099799, 1960360, 2088292, 2170456, 2053160, 1890948, 1649389, 1666064, 1980686, 1906803, 1656047, 1676296, 1695025, 1699048, 1653991, 1690074, 1754577, 1427440, 1548581, 1557248, 1486474, 1378108, 1596885, 1429242, 1290016, 1444190]
6973A444190K51138k5343j30143J792M8199j44705k03078O3276r871O3620j0078
6962A348997l8358N1005l0570j17526j02301O4649K1893k52773p3562J4414J8248
6951I04116J49376j9650J5448k94860r6051M6861j12059M86479J19582k41423
6941I57819k16931j8644Q7893j7996k03584J57083J46442j49637j00387K9061
6931F71119J29795m5030k82964J06417J45968J52904o9094o7782j06987n3364
6921E80982N5921K76682j86965k21158N8153N546Q2112J4557m5426j63637J46943
6910F03710o0564j14811J10780M315J61442l9385j96395Q3132O4852l37025M3552
6899C23603J18688r532J32238o0558K8272j34921J16849l3877j29745j0550P6236
$$ y = [1444190, 1695328, 1669985, 1539842, 1541634, 1589833, 1445128, 1242050, 1305326, 1295455, 1359075, 1348997, 1310639, 1361644, 1331074, 1213548, 1111247, 1175896, 1197789, 945016, 871454, 885868, 904116, 1053492, 1033842, 1049290, 754430, 658379, 705240, 593181, 1079660, 1199242, 957819, 740888, 722244, 810137, 792141, 588557, 745640, 892082, 742445, 642058, 671119, 800914, 755884, 472920, 579337, 725305, 878209, 809115, 741333, 634346, 580982, 636903, 913585, 726620, 505462, 563615, 569161, 651273, 665830, 620404, 456767, 603710, 543146, 428335, 539115, 543430, 704872, 665487, 469092, 552224, 617076, 280051, 323603, 442291, 432759, 564997, 504439, 532711, 397790, 514639, 480762, 351017, 340467, 416703]
6888D16703o3024M6911K20462m028l57462j77675Q9638J24073K20375j7396k41784
6877B56793j59733L21956M2611P6764m1854P0840k61510k41222J46129o3799o6925
6866H0050j0886M0167L38700k1136j00624J31343j12913j02993O6750M4604J24979
6855D78041p6765j02689L181o4494m8765K6332L05456l3399j04893k09156J10062
6844B82911o7738k18382K39025p266j48387p4996K7754q279R9530J6675n5657
6833H5190J08992j19445k8719j38197R6053L46781K24698L1991j07874o3561k76081
6822A59828L1880j29m0942Q7563N8374m8465m4220R6749j00903l952l6594K1091
6810A80280O1689Q5950J88732k2122m03036O410J36748Q1509m4269j33465J21379
$$ y = [416703, 353679, 400590, 621052, 617024, 259562, 81887, 171525, 295598, 515973, 498577, 256793, 97060, 419016, 461627, 538391, 496537, 567377, 305867, 64645, 210774, 146975, 80050, 69164, 109331, 448031, 426895, 326271, 457614, 344701, 241708, 308458, 353062, 478041, 401276, 298587, 301768, 237274, 188509, 214841, 520297, 486898, 382005, 172849, 282911, 215173, -3209, 235816, 228550, 80163, 5167, 32921, 24642, 124172, 140847, 85190, 194182, 74737, 46018, -92179, 3874, 350655, 575353, 607344, 499470, 435909, 159828, 191708, 191579, 150637, 238200, 296574, 248109, 203889, 300638, 199735, 195783, 159189, 180280, 241969, 327919, 516651, 494529, 91493, 97903, 234651, 316160, 271891, 138426, 259805]
6799B59805P2220R4985o5562n4733O7854k8398K22603J03859k15149p6598J0692
6788C91578K9746k93621q3834O5710J08693K57120m2848o1649o8643K757n236
6777B99773j66865K6706k9184Q7476R6540r9290J70412J56822j29419j37510M5066
6766C20527j01777J8259Q6342o3472J97816O648j6244o1887j25647k9162P497
6755B38900K1077K9884J98070M5962J55950l33205q1172J48480m2141o9586J10911
6744D23130j02728N9382J48617j35859j8028J56640R1650N8196j8381j59094m6617
6733D56908O8167J11571o6029q1724P4302M7203m0400o9999N899J39664p8488
6722E67074J04070j81968l8890j73230M8296K21042J00652r764J3965J23085q738
$$ y = [259805, 332025, 427010, 361448, 306715, 374569, 346171, 568774, 672633, 457484, 380886, 391578, 421324, 127703, 43869, 109579, 218272, 475392, 432544, 370895, 302252, 305009, 299773, 132908, 159614, 130430, 217906, 314446, 215156, 385568, 542390, 412971, 275461, 320527, 218750, 237009, 323351, 259879, 457695, 464343, 448099, 386212, 260565, 231403, 238900, 259977, 289861, 487931, 533893, 689843, 356638, 275466, 423946, 381805, 312219, 423130, 320402, 379784, 528401, 392542, 374514, 531154, 622804, 681000, 662619, 503525, 456908, 525075, 636646, 570617, 488893, 563195, 610398, 569998, 499999, 505898, 645562, 567074, 671144, 489176, 450286, 277056, 325352, 546394, 647046, 637282, 651247, 774332, 765594]
6711G65594k3011K8151J03257j55536P6903k8872R3358n7061J46218l6084J22099
6700A035016L8247L5491J5847j68038L75402L9260J81684j37032M5842J06795
6690A568514j0329K6546J70792R4166l8526R0626P0562l5744L5421q8836J77601
6679B060793N7065k56456k2644p4943Q9131L70570L02614p2539Q985J08416r9985
6668B471007N2027M1148n7567p0843k9154k18982j97925J89455o376K28984J28556
6657B530330j28641J6133J95829k14903j50763j3083O8109K02754K77418N6718
6647B839901L17092Q6112p8246r7157j65250j85101k50704l2297j12405p0491
6637B251454p4320L12628L15488n2766j7046L84611J31163J5927m44044O77J06607
$$ y = [765594, 742583, 770734, 873991, 718455, 795358, 766486, 859844, 802783, 949001, 912917, 1035016, 1073263, 1108754, 1124601, 956563, 1331965, 1371225, 1552909, 1415877, 1461719, 1568514, 1558185, 1584731, 1755523, 1849689, 1811163, 1901789, 1972351, 1936607, 1972028, 1883192, 2060793, 2117858, 1861402, 1838758, 1763815, 1852946, 2223516, 2526130, 2453591, 2462576, 2570992, 2471007, 2523034, 2564182, 2506615, 2435772, 2406618, 2187636, 1989711, 2179166, 2172790, 2401774, 2530330, 2401689, 2417822, 2613651, 2398748, 2247985, 2234902, 2303011, 2505765, 2783183, 2839901, 3156993, 3243105, 3164859, 3067702, 2902452, 2717351, 2466647, 2434350, 2321945, 2251454, 2177134, 2489762, 2805250, 2752484, 2735438, 3120049, 3251212, 3267139, 2823095, 2823772, 2930379]
6626B930379k43153j41450J26341p2677k7582m6826o2346K17199j1568k08392
6616B459925j77110l6649k09818O1951O7377J02669j14911J03872K00257j6606
6606B440957L0606L019j24932m6958j09961k97239k68850O6559r5310j62533J6712
6595A452070k3400J5683j88560K94592J40823q1762p0409j08518N2912l075k47896
6584A232460p272r3415j88880r6157O3402J54739j66574p5254Q9688k68621j32103
6573E12013j15282O2724J11966r510J33632K73396k4385n3080k39606n6195J0686
6562F06359L3739P5692j45626K17923o9023l5616R7976o9949j77027m7611j6427
6551D70410J28713j00806K72277J05184k28028M032j26575M9789K29080j94785
$$ y = [2930379, 2687226, 2545776, 2672117, 2599440, 2571858, 2525032, 2462686, 2679885, 2668317, 2459925, 2282815, 2246166, 2036348, 2098299, 2165676, 2268345, 2153434, 2257306, 2457563, 2440957, 2471563, 2474582, 2349650, 2302692, 2192731, 1895492, 1626642, 1693201, 1597891, 1435358, 1452070, 1428670, 1444353, 1255793, 1550385, 1691208, 1609446, 1539037, 1430519, 1483431, 1480356, 1232460, 1225188, 1131773, 942893, 846736, 910138, 1064877, 898303, 823049, 912737, 644116, 512013, 396731, 459455, 571421, 561911, 695543, 968939, 944554, 891474, 651868, 595673, 606359, 640098, 715790, 570164, 788087, 719064, 683448, 781424, 711475, 534448, 486837, 470410, 599123, 498317, 770594, 875778, 647750, 651782, 525207, 574996, 804076, 609291]
6541F09291n7543J47011R6726P6393l1616m7622k36045J31868o1491m5736M2535
6530F23771n7538n0208j26869n338o963N4574L668J77774j21300O8049N4429j71288
6518D42761l0365K62996J7440j1662j75226J97844j5712N7964K6936o4620k75397
6507D32959q5320J11086N5089M3317l31588J73483K38379p5003l13054J63806
6497D13154N9687j07197O0779J84660R895j54657q6729m2236n276O2695J55845
6486E50620j10135j7074L10053n8005L2777M115j15397J41616J78464j76784j86837
6475E53413q0443M6864R2931Q6286J26088k56215m1168O5797J47858p365k30253
6464E03793m133Q0775J04064p3534J22878J75265k95438J71254R8437j93492P9852
$$ y = [609291, 551748, 698759, 795485, 871878, 840262, 792640, 556595, 688463, 626972, 581236, 623771, 566233, 516025, 389156, 383818, 376855, 431429, 435097, 612871, 491571, 559620, 614049, 442761, 412396, 675392, 692832, 681170, 505944, 703788, 688076, 746040, 772976, 708356, 432959, 347639, 458725, 513814, 557131, 225543, 399026, 637405, 562402, 249348, 413154, 472841, 365644, 426423, 611083, 620978, 466321, 379592, 337356, 332080, 394775, 550620, 440485, 423411, 733464, 675459, 708236, 712351, 596954, 738570, 917034, 740250, 553413, 472970, 519834, 612765, 699051, 825139, 568924, 527756, 593553, 741411, 734046, 503793, 499660, 580435, 684499, 610965, 733843, 909108, 613670, 784924, 883361, 689869, 769721]
6453G69721j12165J29014q3014K2188o3861j1502O4359R4571j41050J20229P7848
6442H66338k02975n5218J51527J00687j82685J21397q6887p5010L24689J56128
6432A117991N9810j00292R114j91193o0154K29001l6287P6600k49562J59347J72907
6421A187282j23286K7445K9274K171Q545m7798J07640L6543j63927M241r0462
6410I77668L06979k29799j0874L22458r1864r0679r2609J44031r1921j67070J36491
6399A112811N8685m2738J52742R3827j26173J2955j57182j20771k1187P0581O2401
6388A095951J1899L57624j55882m8863q2126j66238q386M5099l6728L68873m6495
6377A334728q4967J15580m821l0562p2994P3381j04458K6236M1049J26250R807
$$ y = [769721, 657556, 786570, 703556, 725744, 661883, 650381, 714740, 809311, 668261, 788490, 866338, 663363, 608145, 759672, 860359, 677674, 799071, 712184, 637174, 961863, 1117991, 1177801, 1077509, 1086623, 895430, 835276, 1064277, 1027990, 1104590, 855028, 1014375, 1187282, 1063996, 1091441, 1120715, 1122886, 1131431, 1083633, 1191273, 1227816, 1063889, 1068130, 977668, 1284647, 1054848, 1043974, 1366432, 1274568, 1183889, 1091280, 1235311, 1143390, 976320, 1112811, 1171496, 1128758, 1281500, 1375327, 1249154, 1262109, 1104927, 984156, 962969, 1033550, 1095951, 1107850, 1465474, 1309592, 1260729, 1178603, 1012365, 1003979, 1049078, 1012350, 1381223, 1334728, 1249761, 1365341, 1360520, 1329958, 1256964, 1330345, 1225887, 1252123, 1293172, 1419422, 1429229]
6366A429229j55945m9974j4122q8650k53381j72912J74180J45141K10676n1411
6356A172831j12546l1968j00045k9249K1518O4684O7003J33561J44591r6815L7900
6345A271465J68690k09055j6243J98936n8742j98653j07687J59717P0473j94763
6335A084138Q596L8565j52056Q9423J03054r7874o0657M6508Q1618P1795m4392
6324A168718j37565J17074O908p9543J07253k29345j14766J75952P1695k23223
6314H63158M748J40412m1870k5372L23597n5579K0473K0947k2106j26794j49927
6303I51687J83252K00045l1226k23551K82245J69301j93749j7466J10599J607
6293A432744J07142n7480k39156J04696K01689J48458P9599m9193n0585K06402
$$ y = [1429229, 1273284, 1223310, 1209188, 1120538, 867157, 694245, 868425, 1013566, 1224242, 1172831, 1060285, 1028317, 928272, 899023, 920541, 985225, 1052228, 1185789, 1330380, 1233565, 1271465, 1440155, 1231100, 1214857, 1413793, 1355051, 1156398, 1048711, 1208428, 1278901, 1084138, 1092734, 1131299, 979243, 1068666, 1171720, 1073846, 1013189, 1059697, 1141315, 1213110, 1168718, 1031153, 1148227, 1155135, 1075592, 1182845, 953500, 838734, 1014686, 1086381, 863158, 867906, 1008318, 966448, 941076, 1264673, 1209094, 1229567, 1250514, 1228408, 1101614, 951687, 1134939, 1334984, 1303758, 1080207, 1362452, 1531753, 1338004, 1320538, 1431137, 1432744, 1539886, 1482406, 1243250, 1347946, 1549635, 1698093, 1777692, 1728499, 1677914, 1884316]
6283A884316K9083k00378K94378K63865M06847K16081O3022K19985L06504l1772
6273C451931N6268l73566j06483k49681m27521k3930P4489j38980M4252k79525
6263B027254L5750J13331K7372k1768j97857K8680r6924J00790J55849J2674j36771
6252B048380N5644J90433J93069r8226k0229J06372K90017J20359J64075R4818
6242C144712N51770M05858K49729O67028P75406O40664M16357K69897k64368n41816
6232F315237o87131q38535p38704l92751k47072j59219n9610j03189j35764j73016
6222B780246n3469o42k1201k10779p5683J13315k05912O7120K49053J57955k3841
6211B776162k42557J81407L15377O8949J49365J08104J45765J73004L68258M80669
$$ y = [1884316, 1913399, 1713021, 2007399, 2271264, 2678111, 2894192, 2957214, 3177199, 3483703, 3451931, 3508199, 3134633, 3028150, 2778469, 2350948, 2327018, 2401507, 2262527, 2306779, 2027254, 2063004, 2176335, 2203707, 2181939, 1984082, 2012762, 1915838, 2016628, 2172477, 2185151, 2048380, 2104024, 2294457, 2487526, 2389300, 2369071, 2475443, 2765460, 2885819, 3049894, 3144712, 3696482, 4102340, 4352069, 5019097, 5794503, 6435167, 6851524, 7121421, 6857053, 6315237, 5628106, 4789571, 4050867, 3658116, 3411044, 3251825, 3192215, 3089026, 2953262, 2780246, 2726777, 2726135, 2704934, 2494155, 2418472, 2531787, 2325875, 2392995, 2642048, 2800003, 2776162, 2533605, 2715012, 3030389, 3099338, 3248703, 3356807, 3502572, 3675576, 4043834, 4524503]
6201D524503L2818L89774L80793K12486J52834m2598k80496m86052n75492n29000
6191C779570j43500m9079n3165k43059o9707M1925r1334p311k02042k25931j9153
6180B717214J08201j59105p8518J36750O0805K10127j37504P3452Q8503K84960
6170C304885j9221J07967J93606J58359K31713J08648R4579l39198r7028k93254
6160C451056q8247l65464J45381o8900R1740j39313j7941K2940Q9224n4235J52583
6149C218824j36110J20073J54433J65792P7058k65251k3262J33767K85924K2248
6139C753496j23369K7554q556J16115K45338k504J77513j0083K58813K14564L54721
6128E003602O1733K69940K70626K58488K47394L64056N80605K98601L2087o8054
$$ y = [4524503, 4557321, 4947095, 5327888, 5540374, 5693208, 5650610, 5370114, 4884062, 4308570, 3779570, 3636070, 3586991, 3533826, 3290767, 3221060, 3262985, 3171651, 3164340, 2962298, 2736367, 2717214, 2825415, 2666310, 2587792, 2724542, 2785347, 2995474, 2857970, 2931422, 3019925, 3304885, 3285664, 3393631, 3587237, 3745596, 3977309, 4085957, 4180536, 3841338, 3744310, 3451056, 3362809, 2997345, 3142726, 3073826, 3165566, 3026253, 3008312, 3031252, 3120476, 3066241, 3218824, 3082714, 3202787, 3357220, 3523012, 3600070, 3334819, 3311557, 3445324, 3731248, 3753496, 3630127, 3657681, 3649125, 3765240, 4010578, 4008074, 4185587, 4175504, 4434317, 4648881, 5003602, 5065335, 5335275, 5605901, 5864389, 6111783, 6475839, 7056444, 7355045, 7387132, 7319078]
6118G319078j86721n25106m18829m64380n47302L1860p4997K43237j59030j30351
6108E087459j7808P265l8304J94769K45576O1780P6948L70485K76382L78474L82662
6097G025688L35404N15675M94422j27434k7935k8893l07774l75378j09538N4004
6087G448241L41987k7686J10004M30417M63011N01711K36457K02431j07951k88015
6077I310607l79745j13632k49735n8846j28893K2529O9226K45687K69736M61921
6067I448855K45091M11036O57445O38320M64951N65883M23546J41610O15401N89884
6057A4202022M18695M40890O331J44657o3361J77243J13704K3697J34466l80211
6047A5218133n31051p89408q10247p96425o64664l69800m31694k32277n6759k53809
$$ y = [7319078, 7132357, 6607251, 6188422, 5724042, 5176740, 5208600, 5133603, 5376840, 5217810, 5087459, 5069651, 5076916, 5038612, 5233381, 5478957, 5540737, 5617685, 5988170, 6264552, 6643026, 7025688, 7361092, 7876767, 8371189, 8243755, 8215820, 8186927, 7879153, 7503775, 7394237, 7448241, 7790228, 7762542, 7872546, 8302963, 8765974, 9267685, 9504142, 9706573, 9598622, 9310607, 8930862, 8817230, 8567495, 8508649, 8379756, 8402285, 8471511, 8717198, 8986934, 9448855, 9693946, 10104982, 10762427, 11400747, 11865698, 12431581, 12855127, 12996737, 13612138, 14202022, 14620717, 15061607, 15067938, 15212595, 15149234, 15326477, 15440181, 15463878, 15598344, 15218133, 14687082, 13897674, 13087427, 12291002, 11626338, 11256538, 10824844, 10592567, 10535808, 10281999]
6037A0281999n4416J01208J87365N4108K64989J13035M17620O29886K53733O6269
6027A2315796p6079m65962m09912k61342n76856k87168r1696N6617M8728l4443
6017A0217683K80474L07816M16889J15088m39110j47845k70247p43743o69911
6008I067094m08487l12338j19999r042J5208q6223j15074j0579l4422M1446j45934
5997G881650N6035l5820k1950K01552L3j09561j77277J02029K59994J15456k66239
5986H005902p9638n6364K42268R853R0965l328j07690J75208l3646L2846K07500
5975H483876p4554O0375R6987j88388p6855K4134J06353P3123J50667K67487J08930
5964I032135m2941J60218M2061J30945l7566l9048K22586J5789j30943N2297J12627
$$ y = [10281999, 10227583, 10328791, 10516156, 10570264, 10835253, 10948288, 11365908, 11995794, 12249527, 12315796, 12239717, 11773755, 11363843, 11102501, 10525645, 10238477, 10146781, 10203398, 10252126, 10217683, 10498157, 10805973, 11222862, 11337950, 10898840, 10750995, 10480748, 9737005, 9067094, 8658607, 8346269, 8226270, 8217228, 8232436, 8146213, 8031139, 8020560, 7986138, 8027584, 7881650, 7937685, 7901865, 7879915, 8081467, 8081500, 7971939, 7794662, 7896691, 8156685, 8272141, 8005902, 7926264, 7869900, 8112168, 8122021, 8212986, 8209658, 8101968, 8277176, 8243530, 8276376, 8483876, 8409322, 8469697, 8566684, 8378296, 8301441, 8325575, 8431928, 8505051, 8655718, 8923205, 9032135, 8989194, 9149412, 9191473, 9322418, 9284852, 9245804, 9468390, 9484179, 9353236, 9405533, 9518160]
5953I518160N4722K06267J04243K95367J35551m4619M821k7569M9823k4735O6957
5942A0338988n0558J29176J30491J91123K21821o9438Q2456L77996j1532K25825
5932A1566348J56409J97637L15506K44891L98512M77244M01692L29533O37352
5923A4725124K40128J04331l8412l7804m01084m10344k18093L8613P9268J20437
5913A4202164L09700J74899M22038L76742O83519M45726K41056K0312o7746l69027
5903A6439383n63008l94001l59504j82951l81614J0124k06725m2088L38108J03040
5893A4760764j42282J10988M527L03383L79260Q7898K20071K54151M35561M69425
5883A6883746N13148N42295L28483K34592K39062Q1879Q0541L28412L43427K76860
$$ y = [9518160, 9572882, 9779149, 9883392, 10178759, 10314310, 10269691, 10274512, 10246943, 10296766, 10272031, 10338988, 10288430, 10417606, 10548097, 10739220, 10961041, 10891603, 10974059, 11352055, 11340523, 11566348, 11722757, 11920394, 12235900, 12480791, 12879303, 13356547, 13758239, 14087772, 14725124, 14965252, 15069583, 15031171, 14993367, 14592283, 14181939, 13963846, 14002459, 14081727, 14202164, 14511864, 14686763, 15108801, 15485543, 16169062, 16614788, 16855844, 16876156, 16808410, 16439383, 15876375, 15482374, 15122870, 14939919, 14558305, 14568429, 14361704, 14319616, 14657724, 14760764, 14618482, 14729470, 14733997, 15037380, 15416640, 15504538, 15724609, 15978760, 16414321, 16883746, 17396894, 17939189, 18267672, 18502264, 18741326, 18823205, 18903746, 19232158, 19575585, 19852445]
5873A9852445K36949J25417N6477N869k16437k53892M0871J38243K29931K15376
5863B0431249M43437M31818J08335J07382J53617o1327j09850k34680j95914l38231
5853B0735836j90613l59515k87562l9120Q3623o9142K0180K22768K18302K99798
5843B0634555M29806M04291N17695N72246M64493K49810L19756M9939k98802n94143
5833B2749646k50910l38688l16552j66359P992R4500k36684m4396J4988j52551
5823B1360986r9451k34369k42828o5494j32781J06772J59244Q5199K83854L33358
5813B1554490K92899N48930M83774M83969L80918N24396M23445K42717j08501
5804B4827037k00940k09180j58190j97739N1308J33168Q4153R2924J56649J99153
$$ y = [19852445, 20089394, 20214811, 20271288, 20277157, 20060720, 19806828, 19847699, 19985942, 20215873, 20431249, 20874686, 21306504, 21414839, 21522221, 21675838, 21614511, 21504661, 21269981, 21074067, 20735836, 20545223, 20185708, 19898146, 19859026, 19942649, 19873507, 19893687, 20116455, 20334757, 20634555, 21064361, 21468652, 21986347, 22558593, 23023086, 23272896, 23592652, 23642591, 23343789, 22749646, 22498736, 22160048, 21843496, 21677137, 21685129, 21779629, 21542945, 21498549, 21513537, 21360986, 21261535, 21027166, 20784338, 20718844, 20586063, 20692835, 20852079, 20937278, 21221132, 21554490, 21847389, 22396319, 22880093, 23364062, 23744980, 24269376, 24692821, 24935538, 24827037, 24626097, 24416917, 24258727, 24060988, 24112296, 24245464, 24329617, 24422541, 24579190, 24778343]
5794B4778343M60761O05219O08371R11657R63724J068775J239337N65912O76631
5785C1878730Q73592K62817j56015r4701j77932l35272n89756m13001K74869J75887
5775C1699218L36870M40291O00014N11021M77220R71079J109178J096128R78136
5766C8219155O83916P55040O38756R3560Q976j04878j23583j22838n412J99043
5756D0241735M32820N02899O29040R59674R37173J221723J678787J473139J729579
5747D9806569K111649K286640K049823K120690K217782J888635K172945K207896
5739F6862629K423115K068650J836966J684852J612071J368614J090162J079380
5731H0026439N83275K78237J29029K5004r9378M40359O56769P13524Q73606R91367
$$ y = [24778343, 25239104, 25844323, 26452694, 27364351, 28328075, 29396850, 30636187, 31202099, 31878730, 32752322, 33015139, 32859124, 32764423, 32586491, 32251219, 31661463, 31248462, 31523331, 31699218, 32036088, 32476379, 33076393, 33587414, 34064634, 35035713, 36144891, 37241019, 38219155, 38903071, 39658111, 40296867, 40390427, 40399403, 40294525, 40170942, 40048104, 40042692, 40241735, 40674555, 41177454, 41806494, 42766168, 43703341, 44925064, 46603851, 48076990, 49806569, 51918218, 54204858, 56254681, 58375371, 60593153, 62481788, 64654733, 66862629, 69285744, 71354394, 73191360, 74876212, 76488283, 77856897, 78947059, 80026439, 80609714, 80887951, 81016980, 81041984, 80942606, 81382965, 82039734, 82753258, 83626864, 84618231]
5721H4618231J275589J739074K239247L024976L891433M431643M506007L884015
5713A09610215L107779J050870j142104l159995m760478o020785o323804o504783
5705H5856915n804150m542577l938508l466983l074714k265032j866414j533389
5697E9365148j435797j039733q19049q32508p64752m20081l66191k7158J58111
5688E3817990n0845J66978L56669J08496K0576N8736l576m72588p96215r84991
5678E2221230j255825j413360j426891j336395j015495q69448r21096o04693m39796
5669D2938231n0788l28910l9919K54422L30096L27190K06260J12777J53341O7534
5659D3970234Q8093n8546j43652P0521k42555m87080m84901n52689m72617p35490
$$ y = [84618231, 85893820, 87632894, 89872141, 92897117, 96788550, 101220193, 105726200, 109610215, 112717994, 113768864, 112626760, 109466765, 104706287, 98685502, 92361698, 85856915, 80052765, 75510188, 71571680, 68104697, 65029983, 62764951, 60898537, 59365148, 57929351, 56889618, 56070569, 55238061, 54473309, 54053228, 53687037, 53659879, 53817990, 53767145, 53934123, 54290792, 54399288, 54419864, 54478600, 54475024, 54002436, 53206221, 52221230, 50965405, 49552045, 48125154, 46788759, 45773264, 44903816, 43982720, 43378027, 42938231, 42887443, 42558533, 42518614, 42773036, 43103132, 43430322, 43636582, 43749359, 43902700, 43970234, 44058327, 43999781, 43856129, 43926650, 43684095, 43197015, 42712114, 42159425, 41686808, 40951318]
5649D0951318o05344l27348m85438k23866J4398j21668K62054J10554p6788K625
5639C9500497r7548j86908k41050m21158m44343l67711n43294o83449p59194n14278
5629C5241564n97411p16386m93160m68263n12956n70857m79239k27429l08940
5620C0866923l07086p16332o62187n19706o16765m86498o34719p00895n18259
5611B5704476q89593m16828p88410o38376k58963n24822l26413m7193l8610q4941
5601B1690327j75757k60137k4999j7974l26809m12536m95193l82995n08119m46300
5591A8639508n33431n87520l30385k75052k98109m94679m09196k63703j92702
5582A5254731k20582j67922j91726l09540k66128l27822j99845l01230k52926
$$ y = [40951318, 40345974, 40018626, 39533188, 39309322, 39323720, 39202052, 39464106, 39574660, 39497872, 39500497, 39402949, 39216041, 38974991, 38553833, 38109490, 37741779, 37198485, 36515036, 35755842, 35241564, 34644153, 33927767, 33434607, 32966344, 32453388, 31882531, 31403292, 31175863, 30866923, 30559837, 29843505, 29181318, 28661612, 28044847, 27558349, 26923630, 26222735, 25704476, 24814883, 24398055, 23609645, 22971269, 22712306, 22187484, 21861071, 21813878, 21775268, 21690327, 21514570, 21254433, 21229434, 21211460, 20884651, 20472115, 19976922, 19593927, 19085808, 18639508, 18106077, 17518557, 17188172, 16913120, 16615011, 16120332, 15711136, 15447433, 15254731, 15034149, 14866227, 14674501, 14364961, 14098833, 13771011, 13571166, 13269936, 13017010]
5573A3017010j88807l40827k41149m34920l75028l71126r5142j54896J0710r8484
5563A0727341k81157j25167j11712j73943l87201m78588n3292J35657K6341j67811
5553I110468j69791k54164p0692N2197J42017k51822j30301p2469J9989j38216
5543H237216K6556o9756r6136j18255K08159m5043n4111j7818k99301k77513k44525
5532G249473L9765J72375J9027j99644k466J40422o1323j48168M4832j33643m4195
5521G076455L4597l0822n0095j70095l26675j2822l18749j99382J10733J41109
5511F254254R3406n7220k01928j29332k03354N6486j56483l6669k456J12766N549
5500E735019j342j75135l6439p0208j79587k13354O2216q3576j78395l6276K3244
$$ y = [13017010, 12828203, 12487376, 12246227, 11811307, 11436279, 11065153, 10970011, 10815115, 10825825, 10727341, 10446184, 10321017, 10209305, 10035362, 9648161, 9169573, 9116281, 9251938, 9278279, 9110468, 8940677, 8686513, 8615821, 8668018, 8810035, 8558213, 8427912, 8355443, 8375432, 8237216, 8263772, 8194016, 8097880, 7979625, 8187784, 8142741, 8088630, 8070812, 7771511, 7493998, 7249473, 7289238, 7461613, 7480640, 7280996, 7278530, 7418952, 7357629, 7209461, 7254293, 7120650, 7076455, 7111052, 7080230, 7030135, 6860040, 6533365, 6520543, 6201794, 6002412, 6113145, 6254254, 6347660, 6290440, 6088512, 5959180, 5755826, 5812312, 5655829, 5619160, 5616704, 5729470, 5735019, 5733677, 5558542, 5522103, 5451895, 5272308, 5058954, 5121170, 5037594, 4859199, 4822923, 4846167]
5489D846167K35230r9488l604l7940J33406M9760r2995Q1311P691j28466k6561
5478D964511k2971j94815M1242o5418r2781j0861j16719n8115L9196j40951j46056
5467D196262J86972P2372k98495o6618j2782k9608Q4300L6839j80375L3012Q7057
5456D108936m4613k0364p8305j25679K2465J12205K5373K15834o18r8057R6294
5445D213471k37603j63544K05979j793k99134R3699J40992l4056N260o4376M5410
5434C904305J04674P5439j25596l1595R0204J85568Q1848J57452O4063K43049
5424D749411l3552j19398J01484j53393p1278K87010j93801K6152J25946q6924
5414D631657J28934J22710q7412k3440J27282J7954p3406j30660N6483K15359
$$ y = [4846167, 5081397, 4981909, 4978305, 4940365, 5073771, 5123531, 5030536, 5111847, 5119538, 4991072, 4964511, 4941540, 4746725, 4787967, 4722549, 4629768, 4618907, 4502188, 4444073, 4483269, 4342318, 4196262, 4383234, 4455606, 4157111, 4090493, 4077711, 4048103, 4132403, 4169242, 3988867, 4021879, 4108936, 4064323, 4043959, 3965654, 3839975, 3862440, 3974645, 4000018, 4215852, 4215234, 4117177, 4213471, 3975868, 3812324, 4018303, 4016510, 3717376, 3811075, 3952067, 3918011, 3923271, 3858895, 3904305, 4008979, 4084418, 3958822, 3927227, 4017431, 4202999, 4284847, 4442299, 4506362, 4749411, 4715859, 4596461, 4697945, 4544552, 4473274, 4760284, 4566483, 4592635, 4718581, 4631657, 4760591, 4883301, 4795889, 4772449, 4899731, 4917685, 4844279, 4713619, 4770102, 4985461]
5404D985461r1477m4264O7053J27824K2384k43202j64428m4576n1941j06555m389
5393D451890N8391L1173r9709j21676p6583l14847L0650P8383j96869n5526p0077
5382C715200R2961m4686j98977J13620l3186j19074L9557J47350N3742J15320
5372C881827L8061r1002M1873n5835j33360j13761Q9686m9087r2317r6438j05687
5361C313960Q6178k9711p1033l9611j21779O2244J98478J34857n0541O3738l7610
5350C509170j80568N752j17700K14729L0244k62127r6189K8435J60210N4192J45757
5339C491905j517j92569J18843N2038j05833n4367K3454l0269J47443k2804l8169
5328C388155P404l74K04203o8822N0478p471o6938j7831J49k9715N4078Q3702
$$ y = [4985461, 4893984, 4849720, 4916773, 5044597, 5066981, 4823779, 4659351, 4614775, 4562834, 4456279, 4451890, 4510281, 4541454, 4441745, 4320069, 4243486, 3928639, 3959289, 4037672, 3840803, 3785277, 3715200, 3808161, 3763475, 3564498, 3678118, 3644932, 3525858, 3565415, 3712765, 3766507, 3881827, 3919888, 3828886, 3870759, 3814924, 3681564, 3567803, 3657489, 3608402, 3516085, 3419647, 3313960, 3400138, 3370427, 3299394, 3259783, 3138004, 3200248, 3398726, 3533583, 3483042, 3546780, 3509170, 3328602, 3334354, 3216654, 3431383, 3461627, 3199500, 3103311, 3131746, 3291956, 3346148, 3491905, 3490388, 3297819, 3416662, 3468700, 3362867, 3308500, 3331954, 3301685, 3449128, 3426324, 3388155, 3395559, 3395185, 3599388, 3530566, 3581044, 3573573, 3506635, 3488804, 3488953, 3459238, 3513316, 3597018]
5316C597018R5317l0125K03474J26374j16512j25067L3746j11311j53461J38915
5306C658368k6944J03130J26024j15814L3602J06253j44886P1967J55329J5102
5296C982131p1618J26836N1874j84707J38020p4840j73650J37301j21545j74580
5286C635222J27914o4431j39698L4659J03428k8519J46807p9041j71311O2983
5276C628013r789P6545R7307k27805r5488l5898J97147j06574k05270J03536k27916
5265C193808p7839j47800O5133j35088M8554n5899j20p7767j87457J51604K20129
5254B997258J14504m8346j36834j94940J63795p9145k45648r0969K31232J05086
5244B815993M5640k15710J4217j21536M9050J03186O7936J12269p4117j02170
$$ y = [3597018, 3692335, 3662210, 3865684, 3992058, 3875546, 3750479, 3784225, 3672914, 3519453, 3658368, 3631424, 3734554, 3860578, 3744764, 3778366, 3884619, 3739733, 3811700, 3967029, 3982131, 3910513, 4037349, 4089223, 3904516, 4042536, 3967696, 3794046, 3931347, 3809802, 3635222, 3763136, 3698705, 3559007, 3593666, 3697094, 3668575, 3815382, 3736341, 3565030, 3628013, 3618224, 3694769, 3792076, 3564271, 3468783, 3432885, 3630032, 3523458, 3318188, 3421724, 3193808, 3115969, 2968169, 3033302, 2898214, 2946768, 2890869, 2890749, 2812982, 2625525, 2777129, 2997258, 3111762, 3063416, 2926582, 2731642, 2895437, 2816292, 2570644, 2479675, 2710907, 2815993, 2861633, 2645923, 2660140, 2538604, 2587654, 2690840, 2758776, 2871045, 2796928, 2694758]
5234B694758P3170n3594R3288J29338j64057N5817K37393j59141k73683Q435J08995
5223B750719o2979J15405j21861j14857k1257J10717m1037o6935K8973j0402L2805
5212B599291j05746M6846K7743o9575j10262J82065n741n7168m0412L7335j7632
5201B486744j21850j54390l7161K33220j8207J964R4083O3424N6086j77724n9958
5190B366231j52636K45046j79969J51244J25161M1889M9808j73151J02025M4497
5180B620145J74111J11916n9252M9236k52361J56441J11205j34465k36034J12195
5170B653137j6107K4412n7438j35318K5024J49211M9710K56419l1619m0449n7857
5159B819125k6770N4307L3387J40818q357r3226K76961J94107k43321o7458J22857
$$ y = [2694758, 2767928, 2714334, 2807622, 2936960, 2772903, 2828720, 3066113, 2906972, 2633289, 2641724, 2750719, 2687740, 2803145, 2681284, 2566427, 2545170, 2655887, 2614850, 2547915, 2576888, 2566486, 2599291, 2493545, 2540391, 2568134, 2498559, 2388297, 2570362, 2564621, 2507453, 2467041, 2504376, 2486744, 2364894, 2210504, 2173343, 2406563, 2388356, 2390320, 2484403, 2547827, 2603913, 2426189, 2366231, 2213595, 2458641, 2278672, 2429916, 2555077, 2596966, 2646774, 2473623, 2575648, 2620145, 2794256, 2906172, 2846920, 2896156, 2643795, 2800236, 2911441, 2776976, 2540942, 2653137, 2637030, 2661442, 2604004, 2468686, 2493710, 2642921, 2692631, 2949050, 2917431, 2876982, 2819125, 2792355, 2846662, 2880049, 3020867, 3012510, 2919284, 3196245, 3390352, 3147031, 3079573, 3202430]
5148C202430O0601L1442l04753j30112J13461J34241N3961P8181K34593j68828
5138C305217o8986J37264K56955R8410M17733K03850M21974L15889K12825J20760
5128E421891k00137N5955P2194l98190k56618l52893j11658M4845k9627M9361
5118D295123M476M1372j40563K7032J73380L40034K53674J07304K72273N43097
5108E917202N59757L15340M86480K12029j88186j75832k99403n18537m49353n07683
5098E351814j07792k20593o9869J3340J26917j55142q6034J24780K82518P4812
5088E334751K00785L34197k12710k86285K09686K7639N7854l8376j29517j53564
5078E344460j36055j66914l00084m42778l792n0637k09976k3808O4354q5560r2812
$$ y = [3202430, 3263031, 3294473, 2989720, 2859608, 2973069, 3107310, 3161271, 3239452, 3474045, 3305217, 3236231, 3373495, 3630450, 3728860, 4146593, 4350443, 4772417, 5088306, 5301131, 5421891, 5221754, 5277709, 5349903, 4951713, 4695095, 4342202, 4230544, 4275389, 4245762, 4295123, 4299599, 4340971, 4200408, 4227440, 4400820, 4740854, 4994528, 5101832, 5374105, 5917202, 6476959, 6792299, 7278779, 7490808, 7302622, 7126790, 6827387, 6308850, 5859497, 5351814, 5244022, 5023429, 4953560, 4966900, 5093817, 4938675, 4852641, 4977421, 5259939, 5334751, 5535536, 5869733, 5657023, 5370738, 5580424, 5608063, 5665917, 5627541, 5498024, 5344460, 5208405, 5041491, 4741407, 4298629, 4294837, 4244200, 4034224, 4010416, 4074770, 3989210, 3896398]
5067C896398L8099n6064J03998j7886m4888L2446K76227j12012k17333O3615p6161
5056C886439l73P1260j89834M6689J06267J3047r4217J0189J76657m8998k93289
5045C683837M5106J9583K59366r7231L5539P1694O3694L02186J15520q9523l238
5034D406533K8264J27178K93781J60169J29002J93179J86775k0931l8435K00292
5024E665807o4668k62812j83801O6956l5069j83644J20634o3299J26564j18899
5014E067769p3285o2656j98711O7977m4721K37912K66385M0793p3457q0240J84542
5003E332308K40846J16429K35131Q0177J86882M1706J1780k20155k87142p3366
4993E664596N340m6316J0555r2582P4659K00234j9549K00555K81517j367N1959
$$ y = [3896398, 3934497, 3878433, 3982431, 3964545, 3919657, 3952103, 4228330, 4116318, 3898985, 3962600, 3886439, 3886066, 3957326, 3767492, 3814181, 3920448, 3933495, 3839278, 3849467, 4026124, 3977126, 3683837, 3728943, 3748526, 4007892, 3910661, 3946200, 4017894, 4081588, 4383774, 4499294, 4409771, 4406533, 4434797, 4561975, 4855756, 5015925, 5144927, 5338106, 5524881, 5503950, 5465515, 5665807, 5601139, 5338327, 5154526, 5221482, 5186413, 5002769, 5123403, 5060104, 5186668, 5067769, 4994484, 4931828, 4733117, 4801094, 4756373, 4994285, 5260670, 5301463, 5228006, 5147766, 5332308, 5573154, 5689583, 5924714, 6004891, 6191773, 6233479, 6245259, 6025104, 5737962, 5664596, 5669936, 5623620, 5634175, 5541593, 5616252, 5816486, 5796937, 5997492, 6279009, 6277642, 6329601]
4982F329601O6672j18699J09252P1724M3137L5232P3941j177p8321J04107k6688
4971F608781m9045k84357k5831L4889J30575Q2229m4493J00859J31680K6693R1139
4960F803119J38287J66334J29116J77406J43656N5828M393J15929L27845j79083
4950G882830N9604K02099M71059J39620M58498K68235J22446K58425K90088N21879
4940A0674783O17696N02211N65352O12338M42104Q51350P59229P64318R08604
4931A6697985J020536R01374O91716M30113N92820L86473N8413L0212k03664j11067
4921B0494911l47526k3028J21213r2317J79131K02028L07665J2853p6620J11701
4911B0890011J63376j95523p19546l26323q17326j088494r50531p09222o39615
$$ y = [6329601, 6396273, 6277574, 6386826, 6458550, 6501687, 6536919, 6610860, 6609683, 6531362, 6635469, 6608781, 6559736, 6275379, 6249548, 6284437, 6415012, 6497241, 6452748, 6553607, 6685287, 6711980, 6803119, 6941406, 7107740, 7236856, 7414262, 7557918, 7613746, 7618139, 7734068, 8061913, 7882830, 7942434, 8144533, 8615592, 8755212, 9213710, 9481945, 9604391, 9862816, 10152904, 10674783, 11292479, 11794690, 12360042, 12972380, 13414484, 14265834, 15025063, 15789381, 16697985, 17718521, 18619895, 19311611, 19741724, 20334544, 20721017, 20779430, 20809642, 20605978, 20494911, 20147385, 20124357, 20245570, 20153253, 20332384, 20534412, 20842077, 20854930, 20778310, 20890011, 21053387, 20857864, 20138318, 19811995, 18994669, 17906175, 16955644, 16246422, 15606807]
4902A5606807q13437n66786l98128l50158k92242m25992l42846k95642l08988
4893A1812588j77779n8219M0368J7157J04786j32352R2109K45484L6430K05301
4883A2185873J46204K14506L75436K41457K91849L03233K19137M13992O05360
4874A4997047L63478N16379O88579P74259P43564J018711J297973J102696J073947
4865B2576633J196657J102192J099839J068081J027689Q34736L98794L02348K3607
4856B9630576j07203l61314l42476M4554l3764m66l1359K10134m3772K8596j04831
4845B8888675l19739k74329p39166o95729j127632r74112q50988r78151q50711
4836B2078118p64288m33721m20508m65096l31655n01572o24670l59997j63948
$$ y = [15606807, 14793370, 14226584, 13828456, 13478298, 13186056, 12760064, 12417218, 12121576, 11812588, 11634809, 11576590, 11616958, 11634115, 11738901, 11606549, 11698658, 11944142, 11980572, 12185873, 12332077, 12546583, 12922019, 13163476, 13455325, 13758558, 13977695, 14391687, 14997047, 15360525, 15876904, 16565483, 17339742, 18083306, 19102017, 20399990, 21502686, 22576633, 23773290, 24875482, 25975321, 27043402, 28071091, 28905827, 29304621, 29606969, 29630576, 29523373, 29162059, 28819583, 28864137, 28830373, 28829907, 28798548, 29008682, 28964910, 28993506, 28888675, 28568936, 28294607, 27555441, 26859712, 25732080, 24757968, 23906980, 22928829, 22078118, 21313830, 20880109, 20459601, 19994505, 19662850, 19161278, 18536608, 18176611, 18012663]
4827A8012663r3679j63765j65818o2992p7042J66080K55394P413l398R7975M49508
4816A8422339N01858K24020M42700M04472M80960L73280M04713N42581O43030
4807B2439953J165769J070901P14699R57943J183206R88897J397078R85005J335199
4798C2238650J455258J418506J657443J681925J940613K265565L007854L467452
4790D9133266M569539N594812O404973P545257Q726015J0669620J2836268J5498452
4782A20978202J9316053K4608134L1981393L3075153K5802822J4633057k943256
4775B67451558k4794576l3502740l6155793l5139119k5375749j7001559j1894438
4768H3587584q856044o702064n359355m683174m105834l431801l315702k498258
$$ y = [18012663, 17918984, 17755219, 17589401, 17526409, 17449367, 17615447, 17870841, 17878254, 17874856, 17972831, 18422339, 18924197, 19148217, 19590917, 19995389, 20476349, 20849629, 21254342, 21796923, 22439953, 23605722, 24676623, 25391322, 26349265, 27532471, 28521368, 29918446, 30903451, 32238650, 33693908, 35112414, 36769857, 38451782, 40392395, 42657960, 45665814, 49133266, 53702805, 59297617, 65702590, 73247847, 81973862, 92643482, 105479750, 120978202, 140294255, 164902389, 196883782, 229958935, 255761757, 270394814, 267451558, 242656982, 209154242, 172998449, 137859330, 112483581, 95482022, 83587584, 74731540, 68029476, 62670121, 57986947, 53881113, 50449312, 47133610, 44635352]
4760D4635352k309170j860911j633708j200785r85968o08111m66525k55223l07944
4751C5007007m89220l44794l28165N487J03642J02016L54984K55565M28179L46344
4741C5441045L93085N70669M43464M66533P55267P93473Q62935J088525J183222
4732D1998218J443956J723815J791404K657310L416452M694181N437647O429960
4724F9592943Q132968R323510J1482098J3741644J7057845K1759785K8361376
4717A79452169L0379188K3118113J6383877Q852056j2496931k7697135k8159115
4710A89832222l1978396l1240038k2231674j4985907j0738261p972037o051952
4703F4633957m936554m398334l710498k959173k782771k277261j996727j662948
$$ y = [44635352, 42326182, 40465271, 38831563, 37630778, 36644810, 36036699, 35570174, 35314951, 35007007, 34517787, 34172993, 33844828, 33850315, 33953957, 34055973, 34410957, 34666522, 35094701, 35441045, 35834130, 36404799, 36848263, 37314796, 38070063, 38863536, 39726471, 40814996, 41998218, 43442174, 45165989, 46957393, 49614703, 53031155, 57725336, 63162983, 69592943, 77725911, 87049421, 98531519, 112273163, 129331008, 151090793, 179452169, 209831357, 232949470, 249333347, 258185403, 245688472, 217991337, 189832222, 157853826, 126613788, 104382114, 89396207, 78657946, 70685909, 64633957, 59697403, 55299069, 51588571, 48629398, 45846627, 43569366, 41572639, 39909691]
4695C9909691j298619j077518r71662j105443o84193p83573r30848r59056q84951
4686C1213828n23300m36254j98285l56580o92553p41964o45884n10602o86647
4677B6421759q70431r44033q26511r35608p80083q85225o58900n31329o99412
4668A9290227o69270l24072l70096p76657o04943k50149j32006k39896j96659
4659A5726479j68519l08209o2781m1574j73567m8498n3609j15540q5831K17408
4649A4885759J63712Q9435k16985j90840J95273J53406J77296L41381J66997K80411
4639A6045845J77450J93537K76483M48573M22884M99472N11517N78963M30295
4630A9585019L46261L02386M26767L46610Q3742n6501q1928r8123J27111j0058
$$ y = [39909691, 38611072, 37533554, 36561892, 35456449, 34772256, 33988683, 33057835, 32098779, 31213828, 30690528, 30254274, 30055989, 29699409, 29006856, 28264892, 27619008, 27108406, 26421759, 25551328, 24607295, 23780784, 22845176, 22065093, 21179868, 20520968, 19989639, 19290227, 18620957, 18296885, 17926789, 17150132, 16545189, 16295040, 16163034, 15923138, 15726479, 15557960, 15249751, 15186970, 15145396, 14971829, 14923331, 14869722, 14754182, 14668351, 14885759, 15049471, 15138906, 14921921, 14731081, 14926354, 15079760, 15257056, 15598437, 15765434, 16045845, 16223295, 16416832, 16693315, 17141888, 17564772, 18064244, 18575761, 19154724, 19585019, 19931280, 20233666, 20660433, 21007043, 21090785, 21034284, 20952356, 20854233, 20981344, 20971286]
4620B0971286k81571k86657j54632l00350k47769l80308o40222l91510m18470
4611A7869797p50059o64302n56714p00427p77706o20559n02835o15834n16351
4602A2165010k93658l13620m91045m23695j80856j49625j67327l84389m54351
4593I306444p1921k12961l6445j29785p0572j68677k63738r8867k70485p726j90799
4582G784468j25330m1838j53825N4817J9080j89319J9592j21984m0170j59845
4572G045646k0579J63999j49458Q7844J12816J42296j39307J0663q252K80334
4562G526002k05503m0044j02030R3370j7417p9412p9910q662N7477M9393K64439
4551G457703Q6230K0707J65944o0245J26197K04679l9556R6514M0607J82536K11610
$$ y = [20971286, 20689715, 20403058, 20248426, 19948076, 19700307, 19319999, 18679777, 18288267, 17869797, 17119738, 16455436, 15898722, 15198295, 14420589, 13800030, 13297195, 12681361, 12165010, 11871352, 11557732, 11066687, 10642992, 10462136, 10312511, 10145184, 9760795, 9306444, 9234523, 9021562, 8985117, 8855332, 8784760, 8616083, 8352345, 8253478, 7982993, 7975267, 7784468, 7659138, 7617300, 7463475, 7518292, 7537372, 7348053, 7367645, 7245661, 7205491, 7045646, 7025067, 7189066, 7039608, 7127452, 7240268, 7382564, 7243257, 7253920, 7245668, 7526002, 7320499, 7280455, 7178425, 7271795, 7254378, 7174966, 7095056, 7086394, 7143871, 7193264, 7457703, 7543933, 7564640, 7730584, 7670339, 7796536, 8001215, 7961659, 8058173, 8098780, 8281316, 8492926]
4540H492926J4119J14062O7730K31392L28067o4908J95199K23566K37366N39460
4530A0378979L90052M65263N08177L88247K30572M07856N54203L22805K20230
4521A3866384O6865j22776k25463l91711m52869j41073k20751m60157l91442j71399
4511A1355608m43039j81950n9379k35166o2797l4671L9386o7830p5200j23643
4501A0111319l1754L1655k9523J39180J11467J68530K48569L75532J00023J66408
4491A1391406M51461L85088L85202K10906L36199L91576M42324M73773L59806
4482A4827741L32305M5451J38989K6985n5745p4032q3165k87408k74647k57114
4472A4339360l39829j36478J414o7221J74480K32051K59189J63153L05914L24768
$$ y = [8492926, 8507045, 8621107, 8688837, 8920229, 9248296, 9183388, 9378587, 9602153, 9839519, 10378979, 10769031, 11234294, 11742471, 12130718, 12361290, 12769146, 13323349, 13646154, 13866384, 13933249, 13810473, 13585010, 13193299, 12740430, 12599357, 12378606, 11918449, 11527007, 11355608, 10912569, 10730619, 10671240, 10436074, 10373277, 10338606, 10377992, 10310162, 10234962, 10111319, 10079565, 10111220, 10081697, 10220877, 10332344, 10500874, 10749443, 11124975, 11224998, 11391406, 11842867, 12227955, 12613157, 12824063, 13160262, 13551838, 13994162, 14467935, 14827741, 15160046, 15205497, 15344486, 15371471, 15315726, 15241694, 15158529, 14871121, 14596474, 14339360, 13999531, 13863053, 13864467, 13797246, 13971726, 14203777, 14462966, 14626119, 14932033, 15256801]
4462A5256801L75086p6425j12825J69909L2353n7337K51598K00363K57262n4157
4452A6242628l76851k99952k32199l70359k11920j57711J1377j40714K22588K66784
4442A4953671J27479N41530L14725L56565N15385O50614O49605Q03231O50418
4433A9563223J023661P38618N98693P90246O27745M35549L06462j90795k85960
4424B3607442l03049o11952n77608m53940k81668n42495m01672m86608n27753
4415A9420697l05793l28088n09536m55403k40091o36172o8700k11j03953j58183
4405A6614567L9717J59666M37377O6032J40670L68975L26256M33524J17536K87797
4395A8992117M80937M08939M18260O34146M06599J81521O06400L55327K3577j35852
$$ y = [15256801, 15631887, 15555462, 15442637, 15612546, 15644899, 15587562, 15839160, 16039523, 16296785, 16242628, 15865777, 15565825, 15333626, 14963267, 14751347, 14593636, 14605013, 14464299, 14686887, 14953671, 15081150, 15622680, 15937405, 16293970, 16809355, 17459969, 18109574, 18912805, 19563223, 20586884, 21325502, 21924195, 22714441, 23342186, 23777735, 24084197, 23893402, 23607442, 23304393, 22692441, 22114833, 21660893, 21379225, 20836730, 20435058, 19948450, 19420697, 19114904, 18786816, 18277280, 17821877, 17581786, 16945614, 16876914, 16876703, 16772750, 16614567, 16654284, 16813950, 17251327, 17317359, 17458029, 17827004, 18153260, 18586784, 18704320, 18992117, 19473054, 19881993, 20300253, 20934399, 21340998, 21522519, 22128919, 22484246, 22507823, 22371971]
4385B2371971l33401n74960n30897o77515m64668n05425q14654n43353n32119
4376A7394979j29489k6065L6636j50368L7027K97036J50217K03836K41903M12805
4366A8468517M21872M13238K83819K39050R4470Q7494j7439m26272n70069n14178
4356A8480502n24531p26280o55131n88370n40048n13404p98099m52693p7397k72477
4346A3332072m3693k23799k85638k18233O6682Q7494k01349M5806J11321k0049
4336A2650614L3085K51632L6694K58638L77031M53427M63715N22597N93704L73815
4326A6014952N48665N65022N19962K02369j20367k780n7657m05875o00049p45895
4316A5918347q31905n73401o17119o83957n47263m60068j41521m33035l45202
$$ y = [22371971, 22038570, 21463610, 20932713, 20255198, 19790530, 19285105, 18470451, 17927098, 17394979, 17265490, 17239425, 17276061, 17125693, 17162720, 17459756, 17609973, 17813809, 18055712, 18468517, 18890389, 19303627, 19587446, 19826496, 19920966, 20008460, 19991021, 19564749, 18994680, 18480502, 17955971, 17229691, 16574560, 15986190, 15446142, 14932738, 14134639, 13681946, 13604549, 13332072, 13288379, 13064580, 12778942, 12560709, 12627391, 12714885, 12513536, 12559342, 12670663, 12650614, 12683699, 12935331, 12972025, 13230663, 13607694, 14061121, 14524836, 15047433, 15641137, 16014952, 16563617, 17128639, 17648601, 17850970, 17730603, 17727823, 17670166, 17264291, 16664242, 15918347, 15086442, 14513041, 13895922, 13211965, 12664702, 12204634, 12063113, 11630078, 11284876]
4307A1284876k87251l19933l16386k56137j33994j38887k87805M5193k23291k03190
4297I163195p6967m194M5285k78631l631k5514Q1n6675j12038p6237j93760K5596
4285H406510r0426J5482O5489L3152j8379Q3962K80368q8329R3073J61862j57503
4274H785261o6083N7671M2326K29521K85788J29925j52782J08606J42738J09915
4264I672886J51897J16150J36575K64413K40229J70909L60208J71788M66745L608
4254A1755408K34560L83604K21262N13398J61777J36276J95857K61587M4828J33813
4244A4042370J76538J52896R6530K70036J95417K71878K06748R6312M0333K04075
4234A5753133K52987M83509L30186M6590M35774J92205P2017L57186K38193L31190
$$ y = [11284876, 10997625, 10677692, 10361306, 10105169, 9971175, 9832288, 9544483, 9589676, 9366385, 9163195, 9086228, 9082034, 9127319, 8848688, 8845057, 8819543, 8819624, 8762949, 8650911, 8574674, 8380914, 8406510, 8316084, 8331566, 8397055, 8430207, 8411828, 8495790, 8776158, 8687829, 8780902, 8942764, 8785261, 8719178, 8776849, 8819175, 9048696, 9334484, 9464409, 9311627, 9420233, 9562971, 9672886, 9824783, 9940933, 10077508, 10341921, 10582150, 10753059, 11113267, 11285055, 11751800, 11755408, 11989968, 12373572, 12594834, 13108232, 13270009, 13406285, 13602142, 13863729, 13908557, 14042370, 14218908, 14371804, 14468334, 14738370, 14933787, 15205665, 15412413, 15508725, 15549058, 15753133, 16006120, 16489629, 16819815, 16866405, 17302179, 17494384, 17566401, 17923587, 18161780, 18492970]
4224A8492970O25760L40261J39130K18971K96002K41014L45086J79978N44312
4215B1423484M81759M26159L19125P39362O42314M53376O13887O48381J223122
4206B6970969P79884Q60151J191729J154367J117070J252275J489586J395867
4198C6211898J734082K018101J906605K002138K085737K289249K689948K902717
4190E3840475K972103L281880L770236M244871N034212N186328N804987O943968
4182I1079060P975093R841280J1906034J4360237J5985615J7045445J7616972
4175A85809736J8132306J9151689K2128494K6529953L2678180L8599014M1345956
4168C84375328L7580284K4716181L985575j9723286l9498238n0222139n1513023
$$ y = [18492970, 19118730, 19458991, 19598121, 19817092, 20113094, 20354108, 20699194, 20879172, 21423484, 21905243, 22331402, 22650527, 23389889, 24032203, 24485579, 25099466, 25747847, 26970969, 27750853, 28611004, 29802733, 30957100, 32074170, 33326445, 34816031, 36211898, 37945980, 39964081, 41870686, 43872824, 45958561, 48247810, 50937758, 53840475, 56812578, 60094458, 63864694, 68109565, 73143777, 78330105, 84135092, 91079060, 99054153, 108895433, 120801467, 135161704, 151147319, 168192764, 185809736, 203942042, 223093731, 245222225, 271752178, 304430358, 343029372, 384375328, 421955612, 446671793, 450657368, 430934082, 391435844, 341213705, 289700682]
4161B89700682m4928986l5482834k7130189k1040686j6992202j3769340j1435525
4154A18920920r729790q217297o883701o103430n189129n317981m696382m178053
4146F8605157l514601l093116k665719k601385k419078k458826k489687k136861
4138D7225884j952166j997705j663907j489377j447275j341885j239707j188180
4130C4905682j405241j240572j080824q86117q23086p14348r30752p58957q73231
4121B6192554p55279o66345n61084q44411n57054n39747p59679n65452l78575
4112B0564928j66960k92702m99618k22354m57396k82250m11359l39429k63739
4103A7629121l19874k26678j78186j71529j67146j11391q3138k44322k79065j69833
$$ y = [289700682, 244771696, 209288862, 182158673, 161117987, 144125785, 130356445, 118920920, 109191130, 100973833, 94090132, 87986702, 82797573, 77479592, 72783210, 68605157, 65090556, 61997440, 59331721, 56730336, 54311258, 51852432, 49362745, 47225884, 45273718, 43276013, 41612106, 40122729, 38675454, 37333569, 36093862, 34905682, 33500441, 32259869, 31179045, 30292928, 29469842, 28755494, 27824742, 27065785, 26192554, 25437275, 24770930, 24209846, 23365435, 22808381, 22268634, 21508955, 20943503, 20564928, 20397968, 20105266, 19605648, 19383294, 18925898, 18643648, 18232289, 17892860, 17629121, 17309247, 17082569, 16904383, 16732854, 16565708, 16454317, 16371179, 16126857, 15847792, 15677959]
4093A5677959j13928j2078l39093p5159j92795k59003k48864k82391k77301p6586
4083A3800761k61219k24831k02416J75024j9875j21823p4523k10001k00566k21708
4073A2438823k43926k06526K0667m7517p1315l11829j84317J17654n5021l2855
4063A1423838J67993o4787j73592K02059J82569j92272K296K42230j36573R6506
4053A1750267p7022k2156N4275L42381J62862K1578R3137J88704J1739J80291
4043A2706056M103K5545M9444r2947J50548R3062l0649O0285J92342O8252N04400
4032A3730441R3029K41125L96042L71227J25776O8301L12381M64162L82276M55553
4022A6640313O00681K69754K75121M22636L17731L53707N83182L68780N69765
$$ y = [15677959, 15564031, 15551953, 15212860, 15137701, 14944906, 14685903, 14437039, 14154648, 13877347, 13800761, 13539542, 13314711, 13112295, 13287319, 13267444, 13145621, 13071098, 12861097, 12660531, 12438823, 12194897, 11988371, 12009038, 11961521, 11890206, 11578377, 11394060, 11511714, 11456693, 11423838, 11591831, 11527044, 11353452, 11555511, 11738080, 11545808, 11548104, 11790334, 11653761, 11750267, 11673245, 11651089, 11705364, 12047745, 12210607, 12232185, 12325322, 12514026, 12525765, 12706056, 12710159, 12735704, 12785148, 12692201, 12842749, 12935811, 12905162, 12965447, 13157789, 13226041, 13730441, 13823470, 14064595, 14460637, 14831864, 14957640, 15025941, 15338322, 15802484, 16184760, 16640313, 17240994, 17510748, 17785869, 18208505, 18526236, 18879943, 19463125, 19831905, 20401670]
4013B0401670M41049O53758O72899M34524M79266N14330N13534O54250P15939
4004B5481219Q55419P12238Q93748Q96706R99198Q78816O54303R05732J186098
3995C3463477J038959J162537J302942Q03913J355421J279458J143915J129283
3987D2679905J325198J344319J216226J139031J513669J364892J492240J581286
3979E3656766J437441J162843J541914J485546J608908J444679J255997J435271
3971F5029365J258354J445589J355958J265558J093253J026534R96703O91955
3963G4163269Q08976O00648M68238J64504M11801j68515J4162N0909k84183m02108
3953G5827701o65794o72432j006994r17753q28724j163430j162855j309101j416571
$$ y = [20401670, 20842719, 21496477, 22169376, 22603900, 23083166, 23597496, 24111030, 24765280, 25481219, 26336638, 27048876, 27942624, 28839330, 29838528, 30717344, 31371647, 32277379, 33463477, 34502436, 35664973, 36967915, 37771828, 39127249, 40406707, 41550622, 42679905, 44005103, 45349422, 46565648, 47704679, 49218348, 50583240, 52075480, 53656766, 55094207, 56257050, 57798964, 59284510, 60893418, 62338097, 63594094, 65029365, 66287719, 67733308, 69089266, 70354824, 71448077, 72474611, 73471314, 74163269, 74972245, 75572893, 76041131, 76205635, 76617436, 76448921, 76463083, 76513992, 76229809, 75827701, 75161907, 74489475, 73482481, 72564728, 71736004, 70572574, 69409719, 68100618, 66684047]
3944F6684047j485879j350155j553062j816228j562874j481907j804045j875559
3936E3754338j795593j657616j832448j793598j399891j928192j711649j704822
3928C9930529j589389j515363j408847j488721j500480j288641j141753j363373
3920B8633962j173085j186929q16830r74948j094397r10657o71558q97654j071815
3911A9836089p23126n77883m38033m71606n30828m19311n02621n64044o02265
3902A5006372k42726j66789k82928n87186m26038m05704l77285k76459j10546
3893A2130711j11657j12898l58941j49141J1474J14024l7689l21653k61982q5150
3883A0817098K64124j87156k8284R6522K6727J74334P2596k06278k14637k63167
$$ y = [66684047, 65198168, 63848013, 62294951, 60478723, 58915849, 57433942, 55629897, 53754338, 51958745, 50301129, 48468681, 46675083, 45275192, 43347000, 41635351, 39930529, 38341140, 36825777, 35416930, 33928209, 32427729, 31139088, 29997335, 28633962, 27460877, 26273948, 25457118, 24482170, 23387773, 22477116, 21805558, 20907904, 19836089, 19112963, 18535080, 18097047, 17625441, 17094613, 16675302, 16172681, 15608637, 15006372, 14763646, 14596857, 14313929, 13726743, 13300705, 12895001, 12517716, 12241257, 12130711, 12019054, 11906156, 11547215, 11398074, 11409548, 11523572, 11485883, 11164230, 10902248, 10817098, 11081222, 10894066, 10865782, 10962304, 10989031, 11163365, 11235961, 11029683, 10815046, 10551879]
3873A0551879m22438m13243k63171j21842k22933k26246k47907j89236j25683
3864H319180k86893O4028j79427k61133r0798k363J72632j94345j39745J51019
3854G552155j78361J8188n9862k29967J1362J93707j43220j77101Q3051q6865
3844F983087K3019k09247p039P0486K4338J230q1725r1755P4410k8806K085P2467
3832F832550J01083k76730k41654p0930L2909J77809m1692o614o5945j18812K5149
3821F347123k20603k98079J74778K974j9350k4908p7512O6587j30540Q612r1256
3810E737826j24113J59398j47677Q164J2226J70725k3313l7735m8395j42313k4485
3799E540308L36121M5278j68929J28662j04751R8975J95533q3281P9851J48152
$$ y = [10551879, 10129441, 9716198, 9453027, 9331185, 9108252, 8882006, 8634099, 8444863, 8319180, 8032287, 8096315, 7916888, 7655755, 7564957, 7562594, 7735226, 7540881, 7401136, 7552155, 7373794, 7391982, 7332120, 7102153, 7113515, 7307222, 7164002, 6986901, 7069952, 6983087, 7006106, 6796859, 6789820, 6860306, 6884644, 6885874, 6804149, 6712394, 6786804, 6757998, 6760083, 6832550, 6933633, 6656903, 6415249, 6344319, 6377228, 6555037, 6513345, 6506731, 6440786, 6321974, 6347123, 6126520, 5828441, 6003219, 6006193, 5986843, 5961935, 5884423, 5951010, 5820470, 5829082, 5737826, 5613713, 5773111, 5625434, 5633598, 5645824, 5816549, 5793236, 5755501, 5707106, 5564793, 5540308, 5876429, 5921707, 5752778, 5881440, 5776689, 5875664, 6071197, 5987916, 6067767, 6215919]
3789F215919j55016R7571J9016o239L2466k22688N250J27992N5183j67436R7511
3778F099529J25500J4591p370N21K46812K46027j67542L0841j06601L9517l0155
3767F491670O4383o0214L41042m596j88600K954P8859K1307k03740N1565L02024
3756F896654k3335p6432J67361K5963P3768j77901j58738l1014J67036J0558Q2780
3745F956700J72145o1853j97029J61580K79636J01894j18597J99873Q1323L2158
3735G607830K4392k77J31164L6326k27105J46434K4999N0949M29481P8533M1055
3724H343781J45635J31079J67249n1160N185P0657L58515K03794R8182K285K85099
3713I760301K68318L7052J31238J68949K58721J74455J16161N318L37832J53791
$$ y = [6215919, 6060903, 6158474, 6177490, 6171251, 6203717, 5981029, 5986279, 6114271, 6169454, 6002018, 6099529, 6225029, 6239620, 6232250, 6232771, 6479583, 6725610, 6558068, 6588909, 6482308, 6521825, 6491670, 6556053, 6495839, 6836881, 6832285, 6643685, 6646639, 6725498, 6746805, 6543065, 6594630, 6896654, 6873319, 6796887, 6964248, 6990211, 7063979, 6886078, 6727340, 6696326, 6863362, 6873920, 6956700, 7128845, 7066992, 6869963, 7031543, 7311179, 7413073, 7294476, 7494349, 7575672, 7607830, 7632222, 7631945, 7763109, 7799435, 7572330, 7718764, 7743763, 7794712, 8224193, 8302726, 8343781, 8489416, 8620495, 8787744, 8736584, 8741769, 8812426, 9170941, 9374735, 9472917, 9475202, 9760301, 10028619, 10065671, 10196909, 10365858, 10624579, 10799034, 10915195, 10920513, 11258345, 11412136]
3703A1412136K92660K54266L05391L29484J53808L31950J37384K89631K96768
3694A3803478M35406K54744K14192J64691M29975M59268L88299M88254M26115
3685A7064422M27520P02720O20188M83514N93207L78585N48563K67356M71940
3676B1558015N68131N26346N50544L06797N17856M45925N01382L52106N53540
3667B5880642L95555K59437N05214L79869N49883K71317J29441J78542J39956
3658B8689856L63565M64641L98622L70216L60275M79090M97068O84162L51580
3649C2659075N30597P17259M77709Q12424Q49841O90229R50598R85353J091262
3640C9764347J079837J055027J527157J404675J153595J370199J747314J581035
$$ y = [11412136, 11704796, 11959062, 12264453, 12593937, 12747745, 13079695, 13217079, 13506710, 13803478, 14238884, 14493628, 14707820, 14872511, 15302486, 15761754, 16150053, 16638307, 17064422, 17491942, 18194662, 18814850, 19298364, 19891571, 20270156, 20818719, 21086075, 21558015, 22126146, 22652492, 23203036, 23509833, 24027689, 24473614, 24974996, 25327102, 25880642, 26276197, 26535634, 27040848, 27420717, 27970600, 28241917, 28371358, 28549900, 28689856, 29053421, 29518062, 29916684, 30286900, 30647175, 31126265, 31623333, 32307495, 32659075, 33189672, 33906931, 34384640, 35197064, 36046905, 36737134, 37687732, 38673085, 39764347, 40844184, 41899211, 43426368, 44831043, 45984638, 47354837, 49102151, 50683186]
3632E0683186J254689J626823J620533J302251J757239J518019J371631J335542
3624F2469913J235964J326560J257153J125844J049690R30443P13849R77480O52768
3615G1739664L89636M43162L10247J09748R3574M6984k46320n9255N5699n6565
3605G2826574k37724k91883j89547j62037j12459R8493N8684Q8504L56927M35081
3595G2870613N80110P90398J000635P39557J285224J359970J352971J619015K043767
3586H3642260J939242K091844K290590K314346K719135K798539K636220K795650
3578A03227826K904415L066828L126596L190673L529700L666973L603283L719084
3570A30035378M074936M025169M356899M403118M276125M595492M876602M750462
$$ y = [50683186, 51937875, 53564698, 55185231, 56487482, 58244721, 59762740, 61134371, 62469913, 63705877, 65032437, 66289590, 67415434, 68465124, 69395567, 70109416, 71086896, 71739664, 72129300, 72572462, 72882709, 72992457, 73086031, 73133015, 72886695, 72827440, 72883139, 72826574, 72588850, 72296967, 72107420, 71945383, 71832924, 71931417, 71990101, 72078605, 72435532, 72870613, 73450723, 74241121, 75241756, 75981313, 77266537, 78626507, 79979478, 81598493, 83642260, 85581502, 87673346, 89963936, 92278282, 94997417, 97795956, 100432176, 103227826, 106132241, 109199069, 112325665, 115516338, 119046038, 122713011, 126316294, 130035378, 134110314, 138135483, 142492382, 146895500, 151171625, 155767117, 160643719, 165394181]
3562A65394181M685763M676623M219499L742231L306148K794583K135344J258172
3554A92212544P31069M9030m25040q86169j206835j189315j601122j939014j892462
3545A83852686k200404k661458k906669l457245m226652m816166n236976n321609
3537A53025507n541779n407147n597261n114459m479829m339167l921594l426996
3529A15197275k932517k806446k522215k255183k100229j894096j518001j570419
3521I7598169r95366j186095j031183o61297o68100k23473j20620k39633j58060
3512I2314342K35640J8646K24640J71758K32031K99967J73766L6245J20120j06142
3502I3721013q5801L65380j88411j89521j10520l51929l95062m65619o38216p17209
$$ y = [165394181, 170079944, 174756567, 178976066, 182718297, 186024445, 188819028, 190954372, 192212544, 192943613, 192992643, 192567603, 191681434, 190474599, 189285284, 187684162, 185745148, 183852686, 181652282, 178990824, 176084155, 172626910, 168400258, 163584092, 158347116, 153025507, 147483728, 142076581, 136479320, 131364861, 126885032, 122545865, 118624271, 115197275, 112264758, 109458312, 106936097, 104680914, 102580685, 100686589, 99168588, 97598169, 96602803, 95416708, 94385525, 93724228, 93056128, 92832655, 92712035, 92472402, 92314342, 92549982, 92568628, 92793268, 92965026, 93197057, 93497024, 93670790, 93707035, 93827155, 93721013, 93635212, 94000592, 93812181, 93622660, 93512140, 93160211, 92765149, 92299530, 91661314, 90944105]
3492I0944105p61548j060100r54258j232160j144370j184084j551467j335886
3484H1720232j383876j377751j652505j691556j699088j712058j550163j878142
3476F8775093j548289j614984j755190j395684j700907j619598j459272j312821
3468E6368348j158644j155394r99929r97013j162073p70064o01730q71940q98817
3459D7752744n93496l74681o55457m42435o27318l01228J25825k20873o10343
3450D4052738l08308j47124m11608j51611k63961m51481l69103j13268k38144
3441D1598130n57039o31184n53070l47627j59624m19083r14895n92377o53473
3432C6769758o05575o46335r24899q51803p54888p89034j068023r83840q08111
$$ y = [90944105, 90182557, 89122457, 88168199, 86936039, 85791669, 84607585, 83056118, 81720232, 80336356, 78958605, 77306100, 75614544, 73915456, 72203398, 70653235, 68775093, 67226804, 65611820, 63856630, 62460946, 60760039, 59140441, 57681169, 56368348, 55209704, 54054310, 53054381, 52057368, 50895295, 50125231, 49523501, 48651561, 47752744, 47159248, 46784567, 46129110, 45686675, 45059357, 44758129, 44883954, 44663081, 44052738, 43744430, 43597306, 43185698, 43034087, 42770126, 42318645, 41949542, 41836274, 41598130, 41041091, 40409907, 39856837, 39509210, 39349586, 38930503, 38015608, 37423231, 36769758, 36164183, 35517848, 34592949, 33741146, 32986258, 32197224, 31129201, 30145361, 29337250]
3423B9337250o40173q13736q19424q53058j008182r35443q48216o70742o21139
3414B2127137r29570o80953m88148o93282n93738l52684j52445j80671m06023
3405A7649623j54269o48257j057280q24322n06185n49642n17336m18294m65634
3396A2508404l40585l30826j98106j42088k74595l10729k57135l48547r6009j37448
3386A0072336l10528k23116l52752N3461k33208m0492O1856m18063j50151k94715
3376H164628M56O9471k4944K4390k81863j34185p0374j72505j48472j1284r0499
3365G324819j78430Q4897l90804O8587o9479k28033O4066j78594j10659J20699
3355F507069K5795j03089j02519O4541j16303r4537J03418q8557r6852L2329r5467
$$ y = [29337250, 28697077, 27883341, 27063917, 26210859, 25202677, 24267234, 23419018, 22748276, 22127137, 21197567, 20516614, 20028466, 19335184, 18741446, 18388762, 18236317, 18055646, 17649623, 17495354, 16847097, 15789817, 14965495, 14459310, 13909668, 13392332, 12974038, 12508404, 12167819, 11836993, 11638887, 11496799, 11222204, 10911475, 10654340, 10305793, 10209784, 10072336, 9761808, 9538692, 9185940, 9239401, 9006193, 8965701, 9027557, 8609494, 8459343, 8164628, 8165084, 8234555, 8209611, 8234001, 7952138, 7817953, 7747579, 7575074, 7426602, 7415318, 7324819, 7146389, 7231286, 6840482, 6909069, 6839590, 6611557, 6675623, 6497029, 6386370, 6507069, 6532864, 6429775, 6327256, 6391797, 6275494, 6180957, 6284375, 6195818, 6098966, 6131295, 6035828]
3344F035828k70634L9513J36296J46175n8429J7709q1994m0588p8141l992m3314
3333E798429j30636J90893P3780L5177K6676Q3119k59571K8829M5810J34363j17309
3322E909560j14372N9494n8274J8428j79996j61815J47484L69131L0084K76373
3312F296097J16065j04393m2294L19897J03929R0393K23670J28601K75243J57694
3302G564902j9244k25578K48843J95320N6239K11842p737p2892j48168o5041j59415
3291G579071q2502P8612j02074n3041k869J00428P8375K45884K26051m4216J49392
3280H173111K2285L46418K85814L27759L87506K32239K14134K11494J20560L05615
3270A0626935J63744J94931K86247L25727L79004J02569K6924Q5180K91059k08030
$$ y = [6035828, 5765194, 5804707, 5941003, 6087178, 6028749, 6046458, 5964464, 5923876, 5845735, 5841743, 5798429, 5667793, 5858686, 5932466, 5967643, 5994319, 6077438, 5817867, 5846696, 5892506, 6026869, 5909560, 5795188, 5854682, 5796408, 5814836, 5634840, 5473025, 5620509, 5989640, 6019724, 6296097, 6412162, 6307769, 6265475, 6585372, 6689301, 6779694, 7003364, 7131965, 7407208, 7564902, 7545658, 7320080, 7568923, 7764243, 7820482, 8032324, 8024587, 7951695, 7803527, 7738486, 7579071, 7496569, 7575181, 7473107, 7420066, 7417197, 7517625, 7596000, 7841884, 8067935, 8023719, 8173111, 8195396, 8541814, 8827628, 9155387, 9542893, 9775132, 9989266, 10200760, 10321320, 10626935, 10790679, 10985610, 11271857, 11597584, 11976588, 12079157, 12106081, 12191261, 12482320, 12274290]
3260A2274290m12419k67632j20173q5245m56481k27223r6816j23209q5454j08182
3250A0291456k87598m54617j43190m28343k70859k45763l56493k36293l36661
3241G531639m9894k13678m0356K8460k42963j00085j53875k25637j59793j68376
3231F205442k31983l1806o8689k21116k11860r0544k60571j36149o1495p7870
3221D813359n9956l99419j2081K37627M9429j5387k32524j56607j49010p9881
3211C995550L9688r2145q0775l6737n5260N5j48408k80181P6157Q8940K2348M7022
3199C576254K7266M6655L5259K5350j97279j66471J04742M872M0645k28738j04216
3188C164339J16189j29688m8464R1391J8210o4447n1305j58659q4554J42943K54157
$$ y = [12274290, 11861871, 11594239, 11474066, 11388821, 10932340, 10705117, 10608301, 10485092, 10399638, 10291456, 10003858, 9549241, 9406051, 8977708, 8706849, 8461086, 8104593, 7868300, 7531639, 7481745, 7268067, 7227711, 7256171, 7013208, 6913123, 6759248, 6533611, 6373818, 6205442, 5973459, 5941653, 5872964, 5651848, 5439988, 5349444, 5088873, 4952724, 4891229, 4813359, 4753403, 4353984, 4341903, 4579530, 4628959, 4613572, 4381048, 4224441, 4075431, 3995550, 4035238, 3943093, 3862318, 3825581, 3770321, 3770376, 3621968, 3341787, 3417944, 3506884, 3529232, 3576254, 3603520, 3650175, 3685434, 3710784, 3513505, 3347034, 3451776, 3456648, 3497293, 3268555, 3164339, 3280528, 3150840, 3102376, 3193767, 3211977, 3147530, 3096225, 2937566, 2853012, 2995955, 3250112]
3177C250112j35699R6333K16849P8582K31149j21853K0419r690j35860l4901m4538
3166C410903j42623J4041J04845m46611j00290R7654M888j63107j80613M9564
3156B648651J06254n3555K4758j82965J60644J15412q1549R9286J96351O950J19296
3145C159533L8156P544j17591J99040k5901l41564j01045J18577j33233k00356
3135B603160j82195q7661j11721n1254j20791l9102O0809j80619j7177j74626
3125A698823r891Q3338p8611n7888K63244m7896r0476l5387K2230j19864m9677
3114A577945J2728R7762J45516m6816l06006J45866K46350J4559K9877p3308l88135
3103A456338m6869q983J36762o3630K5271K30554j29686k23591O3780j72493m7480
$$ y = [3250112, 3114413, 3210746, 3427595, 3506177, 3737326, 3615473, 3635892, 3626202, 3490342, 3455441, 3410903, 3268280, 3282321, 3387166, 2940555, 2840265, 2937919, 2942807, 2779700, 2599087, 2648651, 2754905, 2701350, 2726108, 2543143, 2703787, 2819199, 2737650, 2836936, 3033287, 3040237, 3159533, 3197689, 3205233, 3087642, 3286682, 3260781, 2919217, 2818172, 2936749, 2803516, 2603160, 2420965, 2333304, 2221583, 2170329, 2049538, 2010436, 2071245, 1890626, 1873449, 1698823, 1688932, 1772270, 1693659, 1635771, 1899015, 1851119, 1760643, 1725256, 1747486, 1627622, 1577945, 1590673, 1688435, 1833951, 1787135, 1481129, 1626995, 1873345, 1887904, 1917781, 1844473, 1456338, 1409469, 1400486, 1537248, 1473618, 1498889, 1729443, 1599757, 1376166, 1439946, 1267453, 1219973]
3092A219973R8959Q8937n5348l0442j35227K0364p8097J7878J07813L4599r9418
3081A189991o4926n8024o4688R5239K16922J62610k08146j40920j8438K6395J72599
3070A308614j07553k17086J37603J11074p7590l6960j6936j06376R6919K31805
3060A323514n9285j17088j00634l9954J64772j66253R2265j05974j51359J62554
3050A002558O053k18680R9217m0260k16389l5937J48104n3670j10761Q5397J72025
3039H37657R7455j9419P0870j15803K3425Q7211m198j10077M7854M7594K8106
3028I90675O9148l30962j815J52904K2068n4463K2643L9688R732q1221l0619r634
3016G98144j43114j8542J22249J88045J53972k48457J38972n5366j62731J55364
$$ y = [1219973, 1318932, 1407869, 1352521, 1322079, 1186852, 1207216, 1129119, 1146997, 1254810, 1289409, 1189991, 1125065, 1067041, 1002353, 1097592, 1314514, 1477124, 1268978, 1128058, 1109620, 1136015, 1308614, 1201061, 983975, 1121578, 1232652, 1155062, 1118102, 1101166, 994790, 1091709, 1323514, 1264229, 1147141, 1046507, 1006553, 1171325, 1005072, 1097337, 991363, 840004, 1002558, 1008611, 789931, 889148, 848888, 632499, 596562, 744666, 690996, 580235, 665632, 837657, 935112, 915693, 986563, 870760, 894185, 981396, 977198, 867121, 914975, 962569, 990675, 1059823, 728861, 727046, 879950, 902018, 847555, 870198, 909886, 919618, 838397, 807778, 798144, 655030, 636488, 758737, 946782, 1100754, 852297, 991269, 935903, 773172, 928536]
3006I28536J20370j68108J7085J21703J35615J5018o8617k8466j27025j0312j25103
2995H10696j73581J98028J25701k18700Q512r92j0281r0035J25515M6794r1530
2984G30127p3829r957P5911J28459K9419J1500j01985P7608K8348J12799J35795
2973A144195j64959l1437j59467L01854J1901O4837m1142j09718o1372J08885
2963A063577J9855N022l5895J24071o0975p2751J32677O5919J49120N6549N7276
2952A504445j49433M2938r550L12071r3681j5192L49570n4016J29193J49516Q5441
2941B251302Q3602j16329J1042Q7550m687j19865p2886K4483N740N6875N0908
2930B257735o6442K8515j6791j38669O1948J87350P7607J42211j1764K49252M0607
$$ y = [928536, 1048906, 880798, 897883, 1019586, 1155201, 1170219, 1101602, 1073136, 946111, 935799, 810696, 637115, 835143, 960844, 742144, 750656, 749664, 739383, 649348, 774863, 821657, 730127, 656298, 646341, 722252, 850711, 880130, 891630, 789645, 867253, 895601, 1008400, 1144195, 979236, 947799, 788332, 1090186, 1102087, 1166924, 1125782, 1016064, 954692, 1063577, 1083432, 1088454, 1052559, 1176630, 1115655, 1042904, 1175581, 1241500, 1390620, 1447169, 1504445, 1355012, 1397950, 1388400, 1700471, 1606790, 1591598, 1941168, 1887152, 2016345, 2165861, 2251302, 2334904, 2218575, 2229617, 2317167, 2312480, 2192615, 2119729, 2144212, 2149952, 2206827, 2257735, 2191293, 2219808, 2203017, 2064348, 2126296, 2313646, 2391253, 2533464, 2521700, 2770952, 2811559]
2919B811559j343K47047L22181K56362K55707l4122J02279j37138l46349j86388
2909C289795q0493k35520j48137j96865k21656l02153K3647J28641k79122p3264
2899A904873n2233n9835J91324M5457k03403N6901J42521J11508j48032j32258
2889A856823J45695j2782j28613N6653q1133K9337j4888J27460J7213K7658q7806
2878A935617j17775j79907j46898j3004l3566N2654k14587o0442p5151K3487K1194
2867A191622j5295K01895p9578K2734l94788J9013M5350k10206J44317j09854
2857H15210q2819J6627j2768j6027m5932J4147O8061m8362K00146k42359O3333
2846G29257j4199l9898k4918k23530N0913K36752j36869l5751J52582j47905j99491
$$ y = [2811559, 2810216, 3057263, 3379444, 3635806, 3891513, 3857391, 3959670, 3822532, 3476183, 3289795, 3209302, 2973782, 2825645, 2628780, 2407124, 2104971, 2128618, 2257259, 1978137, 1904873, 1852640, 1792805, 1984129, 2029586, 1826183, 1883084, 2025605, 2137113, 1989081, 1856823, 2002518, 1989736, 1861123, 1917776, 1836643, 1865980, 1851092, 1978552, 1995765, 2023423, 1935617, 1817842, 1637935, 1491037, 1478033, 1444467, 1497121, 1282534, 1222092, 1146941, 1170428, 1191622, 1176327, 1378222, 1298644, 1321378, 926590, 945603, 990953, 780747, 925064, 815210, 732391, 749018, 736250, 720223, 674291, 688438, 756499, 708137, 908283, 665924, 729257, 715058, 675160, 650242, 426712, 477625, 714377, 577508, 541757, 694339, 546434, 346943]
2835C46943M7781O343J73535O0297j31016J69462l7879L2674n6155o8907j38242
2824D04836k6030K4686M2473P0851j16655K1181J08146R6327N2761r6631M1827
2813F23772k62870J12024R2821j0657j60378m3888K42604k79963j20580J62542
2803C55427Q3268o6103Q7296M8806k03644o2160R184j4723m6228L8061J05294
2792C34478k284K7010o5297O1006K08273j12337p4019N6559K6233O4018j6676
2781E06964j03413j08442O2783Q6510Q9641j60134k53053n0309N5215J60567Q4692
2770C71021R250k5483r2762O648J41143K19012j54808l30531J89297r8187J77331
2759D11931n8539M2290k41569P9059N4831l9581j35415R4666o397j82928J81758
$$ y = [346943, 394724, 401067, 574602, 634899, 503883, 673345, 635466, 668140, 611985, 543078, 404836, 378806, 403492, 445965, 516816, 400161, 421342, 529488, 625815, 678576, 581945, 623772, 360902, 472926, 565747, 555090, 394712, 350824, 593428, 313465, 192885, 355427, 438695, 372592, 459888, 508694, 305050, 242890, 252074, 237351, 191123, 229184, 334478, 332194, 359204, 293907, 354913, 563186, 450849, 376830, 433389, 459622, 523640, 506964, 403551, 295109, 357892, 444402, 534043, 373909, 120856, 70547, 125762, 286329, 371021, 380271, 354788, 262026, 268674, 409817, 628829, 474021, 143490, 332787, 234600, 411931, 353392, 395682, 154113, 233172, 288003, 248422, 113007, 207673, 201276, 18348, 200106]
2748B00106R2179j54355j0358J21685N1110N5358k04560q8925J41871L5574k16278
2737B3407j0127J02252Q5194k27341K3800J24220K92812r8797l3840j00952J00230
2726B80858j95478q787J59568p2903P8539N1551k5307J5901l8550R160l466J9682
2714B70768r699r8584n9232m6499O5437Q7955m2463J0913O2713j32814P3360k9515
2702A52340n9920l7468j47179J29365J26223q7707O0696K38659j23516L8108N6974
2691C46575q985m23468n040J72179J20652K3435j06478m219j22784M2265K3113
2680E7245n3095j7356N8305N8302K58243j89658M9874L4696p9032N5842J20640
2669C54006r5939k9179J96978p8038j77869j36413r7237P0019J2142J6654j96781
$$ y = [200106, 292285, 137930, 127572, 249257, 300367, 355725, 151165, 62240, 204111, 239685, 23407, 13280, 115532, 200726, -26615, -2815, 121405, 414217, 315420, 281580, 180628, 280858, 85380, 76593, 236161, 163258, 241797, 293348, 268041, 283942, 245392, 254552, 251086, 270768, 261069, 162485, 103253, 56754, 122191, 210146, 167683, 178596, 241309, 108495, 181855, 152340, 92420, 54952, -92227, 37138, 163361, 75654, 136350, 375009, 251493, 289601, 346575, 337590, -85878, -90918, 81261, 201913, 225348, 118870, 114651, -8133, 34132, 57245, 4150, -13206, 45099, 103401, 361644, 171986, 221860, 256556, 177524, 233366, 354006, 258067, 228888, 425866, 347828, 169959, 33546, -63691, 6328, 18470, 35124, -161657]
2658a61657R9282J68861o1839Q5082K565K93264J02774k5072j46479j77672q4868
2647I4241l2500M1375M6367j12705N4452P5653j20438J30105m0861k2306r6129
2636A7254R4464N7809Q609K77955l45466j50308J41087J05571M594j01683p6776
2625C3110J15279j77309q4490R0955K08286l0307r8812p3060J12215O4297J21852
2614B82016P0389k02972J87481q3807p3918m2266J82063L0953j34439M8875K28930
2603D93305q4668j38271j82337L2153M8680m7259p8442N3783j36430P6419n2629
2592a5696R738N584k10J16491Q8321m8541r6510K44513R0567j45738j35030n285
2580A08204k2715r0410r2653K8906K39542N9505j27224J64940j59065j00549Q0126
$$ y = [-161657, -62375, 106486, 44647, 129729, 132294, 425558, 528332, 503260, 356781, 179109, 94241, 61741, 103116, 149483, 36778, 91230, 166883, 46445, 176550, 135689, 113383, 17254, 111718, 169527, 178136, 456091, 110625, -39683, 101404, 206975, 211569, 109886, 33110, 148389, -28920, -113410, -22455, 185831, 155524, 56712, -16348, 95867, 160164, 282016, 352405, 149433, 336914, 253107, 179189, 136923, 318986, 349939, 215500, 264375, 493305, 408637, 270366, 88029, 120182, 168862, 121603, 43161, 96944, -39486, 36933, -15696, -5958, -374, -584, 115907, 204228, 155687, 59177, 303690, 394257, 248519, 113489, 108204, 85489, -4921, -97574, -68668, 170874, 230379, 103155, 268095, 109030, 8481, 88607]
2569H8607K21526q1403j44499j08037R987J72475K47896k72300j90473K00932
2559A44711j3320J93710N6843j00540l05155o4500r9557J79260K4591o0961J30688
2548H5770J19491k1876j12123J19590J13798j26298j07125o2249J31069R6188
2538B36235j67154M3221k1227o2328l2701j6751K4397M7988J3315N0923k19558
2527a03640O4281J48217M6693J1988j64072k418Q5370q9888K1664O0728j51410
2516g2487J7872J91237m7047p1189J24427m7018o2953J88588m7734q6443k02670
2505a15417n183J89201J00917o7099q951J35642P2279j4824j82677O1383j14130
2494E1141K91590O5166j54033J00445j78740j25961J71565K9079j16576j49928
$$ y = [88607, 310133, 228730, 84231, -23806, -13819, 158656, 406552, 134252, -56221, 144711, 131391, 325101, 381944, 281404, -23751, -88251, -187808, -8548, 16043, -44918, 85770, 205261, 183385, 71262, 190852, 304650, 178352, 71227, 8978, 140047, 236235, 69081, 112302, 91075, 28747, -3954, -20705, 3692, 51680, 64995, 115918, -103640, -39359, 108858, 155551, 167539, 3467, 1049, 86419, -3469, 18195, 78923, -72487, -54615, 136622, 89575, 18386, 142813, 95795, 32842, 221430, 173696, 87253, -115417, -120600, 68601, 169518, 102419, 93468, 229110, 301389, 286565, 103888, 165271, 51141, 342731, 407897, 253864, 354309, 175569, 49608, 221173, 250252, 133676, -16252]
2484a6252J16111J53969j18045L6972J01345j26846j72015J67451P6150p2263
2474A46577m5060K6973m3587N7486k3537j26161l1249l9523J00193K021J11195
2463A35328J55380k26898j21975J23337l9141r0173J71582J42743j61881P0575
2453A58877N1343j84052m1809J52996P3335j24080j33772J09609j38166O3073
2443a2646n0018l08136K67463Q7448J41526R301J05045q656L2864k98687J36782
2432A02286J03516j18018K0423J02324o2523j484p2773J5010k9267j33527O9932
2421d101P7153n2209J11479K807j65740J65200M6781J33099j69062j44387J12599
2410A13619o7026q9746m431N0040K94028O4929j1390j06286j64838L6216J14189
$$ y = [-16252, 99859, 253828, 135783, 172755, 274100, 147254, -24761, 142690, 218840, 146577, 101517, 128490, 84903, 142389, 118852, -7309, -38558, -78081, 22112, 24133, 135328, 290708, 63810, -58165, 65172, 26031, -64142, 107440, 250183, 88302, 158877, 210220, 26168, -15641, 137355, 210690, 86610, -47162, 62447, -75719, -12646, -62664, -370800, -103337, -15889, 125637, 134938, 239983, 231327, 264191, -34496, 102286, 205802, 87784, 108207, 210531, 148008, 146524, 73751, 88761, 59494, -74033, -4101, 73052, 20843, 132322, 135129, -30611, 134589, 181370, 314469, 145407, 1020, 113619, 46593, -43153, -47584, 2456, 296484, 361413, 350023, 243737, 78899, 115115, 229304]
2399B29304k9348M0976m4254j57838J55926L050k29905K37743J1091j99848O1124
2388G8021J43054J63174M5396n6538m0533P3458J28946o4748J75993p0195O5697
2377F41725j18172j59004j41918q7071O0129N8700J40720k92874n6271l0573L8275
2366E3666J0089O2084J35356j02862J70678l7219J48177L7756M6086k61060k7272
2355B35479j32727Q8274M2162j32853o281N3912K71552j65618o2646j5831J13964
2344B89387j97238k6438J70947R454k8247j58435P648O8909K33975n1904l4362
2333B83696J8272j85575j35980P3014j05819o5183J94552N6082J7908J065k3919
2322A28113J30562R0322o9289L4256J7440k3401k05568M6475M2231Q4350m9414
$$ y = [229304, 199956, 240932, 196678, 38840, 194766, 197816, -32089, 205654, 216745, 16897, 78021, 221075, 384249, 429645, 373107, 332574, 406032, 534978, 470230, 646223, 576028, 641725, 523553, 364549, 222631, 135560, 195689, 254389, 395109, 102235, 45964, 15391, 53666, 63755, 125839, 261195, 158333, 329011, 291792, 439969, 477725, 523811, 262751, 235479, 102752, 191026, 233188, 100335, 94054, 147966, 419518, 253900, 191254, 175423, 289387, 92149, 65711, 236658, 246112, 217865, 59430, 67078, 135987, 369962, 318058, 283696, 301968, 116393, -19587, 53427, -52392, -117575, 76977, 133059, 150967, 152032, 128113, 258675, 348997, 279708, 313964, 331404, 308003, 102435, 148910, 191141, 275491, 226077]
2311B26077P7656j31302N2667j5393M4073J06675Q4876k60778n5692N565R0303
2300B24727M5713q9501J33904o9712Q8358j04789J10036J20319r4529j41281J36341
2289C59586M5636r4365J4176Q240J99614k03450r401P5415J3053j4388o5939J16085
2277D44262r0759k25269q0084R1852J98818M2827o9568q8404q4801J8335K46408
2266D03617J59624k150r8053j63335J8733j16289O2367K30082K364j83327m2811
2255B70822j10015L2309J10178P2553N804J40140J23322j55092n9533R4845k46219
2244B79114O4485O3023P3428p9803K78271J18749j61768r4536R5975j24000k10743
2233C02195K91474J166P2831j80000N0388P4558N1109j9442J12573k0369l7644
$$ y = [226077, 303733, 172431, 225098, 209705, 253778, 360453, 445329, 184551, 128859, 134424, 224727, 270440, 180939, 314843, 245131, 333489, 228700, 338736, 459055, 364526, 223245, 359586, 405222, 310857, 325033, 333273, 532887, 329437, 320036, 395451, 408504, 394116, 328177, 444262, 353503, 128234, 48150, 140002, 338820, 381647, 312079, 223675, 138874, 157209, 403617, 563241, 561091, 463038, 299703, 318436, 202147, 264514, 494596, 496960, 313633, 270822, 160807, 193116, 303294, 375847, 381651, 521791, 645113, 490021, 430488, 525333, 279114, 343599, 406622, 480050, 400247, 678518, 797267, 635499, 540963, 636938, 512938, 302195, 593669, 594835, 667666, 487666, 538054, 612612, 663721, 644279, 756852, 736483, 698839]
2222F98839K11756p9202q1955M7847K7826J92438j73334N1566k13820l954K63679
2211I41686q7196k34182J71056J29166k1170J47863K4677L982L6622k11630L25109
2200A225983J01699M9887o6857M3158O6404p5918K37577J31194j41937o2134J39548
2189A648604P7223J99013j24690J2156l4059L84663o6083l20152J48091K39213
2179B163979k3992P7590j65859j3144J93168J33337P052m0514J15241r994J87839
2168B624703P6023n22Q0123N7733K25908k77905m030J84476J79446l4266K2091
2157C133780J82712K28529R9301J16541J93969p251R310K62210M44049j5888R44
2146D648206K57978L66089O00011L07988L25431M42340M46733N05912M46638J46992
$$ y = [698839, 910595, 831393, 749438, 797285, 825111, 1017549, 844215, 895781, 681961, 678007, 941686, 854490, 620308, 791364, 920530, 899360, 1047223, 1071900, 1075882, 1112504, 900874, 1225983, 1327682, 1377569, 1310712, 1353870, 1420274, 1344356, 1581933, 1713127, 1571190, 1509056, 1648604, 1725827, 1924840, 1800150, 1812306, 1778247, 2162910, 2096827, 1776675, 1924766, 2163979, 2139987, 2217577, 2051718, 2038574, 2231742, 2365079, 2372131, 2331617, 2446858, 2436864, 2624703, 2700726, 2700204, 2780327, 2838060, 3063968, 2786063, 2782033, 2966509, 3145955, 3111689, 3133780, 3316492, 3545021, 3644322, 3760863, 3954832, 3947581, 3956891, 4219101, 4663150, 4647262, 4648206, 4906184, 5272273, 5872284, 6180272, 6505703, 6948043, 7394776, 7900688, 8347326, 8494318]
2136H494318O72431M79917O76049P96759R19427J005134R78151J057456J159817
2127A6239459J218286J477536J627811K119982K637434L354736M302749N318283
2119C8296276O127713P584308R733713J3943647J7936522J3690533J725528o542577
2111A02495663j5974173k1451177j4570483r766811o539356m530165l451140k979654
2103B3232704j936916j694173j269052q65279r08562j035098j066057j427537
2095A3030030j184738r42760p78025o18219l47520m83473l91256j73173l87129
2086G723737k52884k98070m33052j34943k06106j52282k59649m38683l97142j34282
2076E016644k67183p496k13084j63427j80155j33532n5616j10860n8216k22244
$$ y = [8494318, 9166749, 9646666, 10322715, 11119474, 12038901, 13044035, 14022186, 15079642, 16239459, 17457745, 18935281, 20563092, 22683074, 25320508, 28675244, 32977993, 38296276, 44423989, 52008297, 61742010, 75685657, 93622179, 107312712, 109038240, 102495663, 86521490, 65070313, 50499830, 40733019, 34193663, 29663498, 26212358, 23232704, 21295788, 19601615, 18332563, 17467284, 16558722, 15523624, 14457567, 13030030, 11845292, 10902532, 10124507, 9506288, 9158768, 8675295, 8284039, 8110866, 7723737, 7470853, 7172783, 6739731, 6604788, 6398682, 6246400, 5986751, 5548068, 5150926, 5016644, 4749461, 4741965, 4528881, 4365454, 4185299, 4051767, 3996151, 3885291, 3827075, 3604831]
2066C604831k07268j44782J08800k57646J1596j81235j12796l5473M2654j43922
2056B684759q8248m9682j36622j4177m4184p566l70288l4483R0176j46153K47762
2045B131294R4222m8388r9648j23021j25868n6384p9417o6900L6509q3974R0405
2034A668830j4391j89981J10902J48J19395p8682j24944K3715j03910k02338J02073
2023A310817k26198Q0162l1424N3697J67575r8438m6013m023k45259N0546l7085
2012I74357p5002J22846Q7974l1881j37312j47131l7902J02693j33644o3607R0980
2001G52371J68505k5448R206M5737j61088O256J67760q3409q5665k00230q2857
1990E11138o7086J71008R6086L3399J53243l8076j09915j29571L792l9192l95978
$$ y = [3604831, 3397563, 3252781, 3361581, 3103935, 3115531, 2934296, 2821500, 2786027, 2828681, 2684759, 2596511, 2546829, 2410207, 2396030, 2351846, 2344280, 1973992, 1939509, 2029685, 1883532, 2131294, 2225516, 2177128, 2077480, 1954459, 1828591, 1772207, 1692790, 1625890, 1662399, 1578425, 1668830, 1654439, 1464458, 1575360, 1575508, 1694903, 1616221, 1491277, 1514992, 1411082, 1208744, 1310817, 1084619, 1164781, 1133357, 1187054, 1354629, 1256191, 1210178, 1206155, 960896, 1011442, 974357, 899355, 1022201, 1110175, 1078294, 940982, 793851, 755949, 858642, 724998, 661391, 752371, 920876, 895428, 904634, 950371, 789283, 795539, 963299, 879890, 794225, 593995, 511138, 444052, 615060, 711146, 744545, 897788, 859712, 749797, 620226, 624018, 584826, 188848]
1979A88848K77655J71349O5360j29244k18874K2641j3710j1013Q9427p1319J10584
1968D81704m4665j4309K8862J9409J66201j27871L2301j92074r8360l4040J34368
1957C51526o1846m1341J21653J29531J502L2414P170j95305K3064O0595l40789
1946H8174n2074K72728Q7687j02270k3470R1190p0141k864q1677j00993K27616
1935C33906J31262j89007j0385q7591k8944P5003j36327J9801q8727N3382L17563
1924C89936q965q7695J9710r0663K01018r5725J7561k2444J945R7871K7602j26272
1912C23879p4407J51017j16951l0020j21017Q8976K27910j61838n8708j31230
1902I7611J31224J5106Q2843J02732j33464j75644r3695l2961j13978K92552J09986
$$ y = [188848, 466503, 637852, 703212, 573968, 355094, 377735, 364025, 353012, 442439, 371120, 481704, 437039, 422730, 451592, 471001, 637202, 509331, 541632, 349558, 251198, 217158, 351526, 289680, 248339, 369992, 499523, 501025, 533439, 540609, 345304, 368368, 428963, 88174, 36100, 308828, 396515, 294245, 270775, 361965, 291824, 288960, 207283, 106290, 333906, 465168, 276161, 265776, 178185, 149241, 224244, 87917, 107718, 18991, 72373, 389936, 380971, 293276, 312986, 222323, 423341, 327616, 345177, 322733, 324678, 422549, 450151, 323879, 249472, 400489, 283538, 253518, 132501, 221477, 449387, 287549, 228841, 97611, 228835, 243941, 326784, 429516, 296052, 120408, 26713, -6248, -120226, 172326, 282312]
1891B82312K5184j08961J13713m8218j99471l0304P7243M3850J72315P6577j11109
1880B93131J31459j38584n4979j28176k80128m7191J70130K4595O9890J60477
1870B00624j69656L2746M4795N6505L9352j40894j23855L76289l9712k8560l4457
1859B13177j18434j58361J95060J40370l3483R9522N0084K4927Q167R6744p9217
1848D38556m3780J85097l4235J4186j33281n4313K35987k36231j87855R0798j43046
1837A31883m9540K14685j00285M3542J3534J7511J10382J6898r3027j65389j11834
1826B8360j24185J29777k2750m5299O9136J01557k73541J30213K30390j08767
1816A14891N4713m5210j84308K7704J82891j02020n4061P9220J50089j14742J30473
$$ y = [282312, 307496, 198535, 312248, 264030, 64559, 34255, 111498, 155348, 327663, 404240, 293131, 424590, 286006, 231027, 102851, -177277, -224468, -54338, -29743, 40147, 200624, 30968, 63714, 108509, 165014, 204366, 63472, -60383, 315906, 276194, 247634, 213177, 94743, -63618, 131442, 271812, 238329, 337851, 387935, 412862, 421029, 517773, 438556, 394776, 579873, 545638, 559824, 426543, 372230, 608217, 371986, 184131, 274929, 131883, 82343, 297028, 196743, 240285, 253819, 271330, 381712, 398610, 305583, 140194, 28360, -95825, 33952, 11202, -34097, 35039, 136596, -136945, -6732, 223658, 114891, 169604, 124394, -59914, -32210, 150681, 48661, -5400, 73820, 223909, 109167, 239640]
1805B39640k0261k36267j00258J77331N4105J33691j03368j31883K4298o267m116
1794B6645j66096r101N1830L0327P5878k0710N7919m0627J7902J58685m7115L9846
1782A75383j96954M641J43875k8151l8265P3946J19332k19260m2654Q8990r4307
1771a3424P49J9547j83374N0921n917N5561j14442O5811L09629n167n9779O6785
1759A86900m5290r1459N8526j21740k9193o409Q1836J50520j10567J20252j44893
1748D8483J74163k24357M8082o1219j50132J60539J74973j09901J37236J06620
1738C04487k42699J94802n3207l2712L9612j00551n1186m0569j46125J86124k29478
1727a71502R0402L6857R0743m5249J03629L8920j19628j1551j16919K04549n0229
$$ y = [239640, 219379, -16888, -117146, 60185, 114290, 247981, 144613, 12730, 37028, 30761, 26645, -139451, -148552, -96722, -66395, 9483, -11227, 46692, 6065, 23967, 182652, 135537, 175383, -21571, -16930, 126945, 98794, 60529, 134475, 253807, 34547, -8107, 80883, -13424, -12675, 6872, -176502, -125581, -131498, -75937, -190379, -124568, 185061, 179894, 120115, 186900, 141610, 50151, 108677, -13063, -42256, -48665, 33171, 183691, 73124, 193376, 48483, 222646, -1711, 46371, -14848, -164980, -4441, 170532, 60631, 197867, 304487, 61788, 256590, 203383, 170671, 210283, 109732, 58546, 17977, -128148, 57976, -171502, -81100, -44243, 46500, 1251, 104880, 143800, 24172, 12621, -104298, 100251, 50022]
1716E0022k6748J20350j23854o1940N0022j24987m9479J2394J58427O6768j30281
1705e9306J82178J760j32626K2149J64189p0116j38907n8991K41065j03281k09246
1694a61132J2121K07332k2084M4373o2566J52849m6789j35970N5873J8288L4746
1683I7041k2110J5385N9990j21556k04543m3136K4490K70951L196n046O6498j16131
1671B5029j09263Q4783j55110o9744K32641P9893q6252O0418j09123N2459J01099
1660A06830k88802K01754J36504k66516J8993q3048K32596O8077l11663q4847
1650b70122J30828j3281J39891r0933r232K405K37726J19545l83000L0516J27099
1639B1442M8699r628j18593o5310J66663j9648P1083l4425q5869J72478J9457
$$ y = [50022, 23274, 143624, 19770, -42170, 7852, -117135, -166614, -154220, 4207, 70975, -59306, 122872, 124632, -7994, 14155, 178344, 108228, -30679, -89670, 151395, 48114, -161132, -149011, 58321, 36237, 80610, 18044, 170893, 124104, -11866, 44007, 62295, 97041, 74931, 90316, 150306, 28750, -175793, -218929, -194439, 76512, 79708, 74662, 141160, 25029, -84234, 549, -154561, -224305, 8336, 88229, 1977, 62395, -46728, 5731, 106830, -181972, 19782, 156286, -110230, -91237, -174285, 58311, 126388, -185275, -270122, -139294, -152575, -12684, -103617, -112849, -110444, 127282, 246827, -136173, -105657, 21442, 70141, 60513, -58080, -123390, 43273, 23625, 94708, 60283, -25586, 146892, 166349]
1628A66349j14062k5983q1583p9692j60004J39401L57717j35229J95669p9577
1618A83006j91591n3184o1141J57227N1097k67906m8278p7072J36969J85310J30641
1607A45078j20637l0777l1308j07651J36616K57067o5623o0434l2727r0977L3701
1596C2328l5954R7915o3795p8999N2546J9007j09806j20060J13707J56927m2180
1585B1636P2903r9316J49706j61463j27303j77439j6524R6053J64327l5872j69818
1574b83110p6064L48053J10153O3110j72903o2653q9833l5695K45016j620j79432
1563a34978J50626R6309r4064m7444n7233P7799j47997P3465K12998l8274Q8519
1552A79726j18308J78346L9160l60200N9791K0955r8982J67529j830j83862L7772
$$ y = [166349, 52287, 26304, -55279, -134971, -294975, -155574, 202143, 66914, 262583, 183006, -8585, -61769, -122910, 34317, 85414, -182492, -230770, -307842, -170873, 14437, 145078, 24441, -6336, -37644, -145295, -8679, 248388, 182765, 122331, 89604, -1373, 32328, -3626, 94289, 30494, -48505, 4041, 23048, -86758, -206818, -93111, 63816, 21636, 94539, -4777, 144929, -16534, -143837, -321276, -337800, -241747, -77420, -113292, -283110, -359174, -11121, 99032, 162142, -10761, -73414, -163247, -198942, 46074, 44454, -134978, 15648, 111957, 17893, -29551, -86784, -8985, -156982, -83517, 129481, 91207, 179726, 61418, 239764, 278924, -81276, -21485, -530, -99512, 68017, 66187, -117675, -79903]
1541g9903j25487J77266L0737j70329j38115j35640K41209J81363j486o2479k17392
1530c00256J33703j29733O9109o8442J80150o0128L6081k7117J46329J42774r552
1519A12918n8851L1079l8093M1162j10497p2421J66535j88503P9132n8064n9444
1508a55047J83208K7358n0309N5747L1294j37171p7957J45701J22797j8568j44329
1497a7276K4383K82758j938j77479k03169j77594j1677J34077l1502p9264J90529
1486f8152j53962K07271M9346l6118K6100l6132O0346j48595J6324r3295Q3093
1475i3774o2888j42092K03001O6663M2097P1314O2728j37550j48389p5841N2934
1464a61797L8149M9232j33996k8613j23631J88745P9682j70145J02789J07384
$$ y = [-79903, -205390, -28124, 2613, -167716, -305831, -441471, -200262, -18899, -20385, -82864, -300256, -166553, -296286, -227177, -295619, -115469, -175597, -139516, -166633, -20304, 122470, 112918, 54067, 85146, 47053, 88215, -22282, -94703, 71832, -116671, -37539, -95603, -155047, 28161, 55519, 5210, 60957, 92251, -44920, -122877, 22824, 145621, 127053, -17276, 7107, 289865, 287927, 110448, -92721, -270315, -281992, -147915, -179417, -258681, -68152, -222114, -14843, 34503, -1615, 24485, -11647, 48699, -99896, -83572, -176867, -93774, -156662, -298754, -95753, -29090, 13007, 84321, 147049, 9499, -138890, -214731, -161797, -123648, -74416, -208412, -237025, -360656, -171911, -92229, -262374, -159585, -52201]
1454e2201m5068J30032R0274j0747j2670j17942R924J9367M9611j89951K1563
1443a07808o9043M723J67591m3109K7643l3345K3287K36113j52787n2336m301
1432c372o6255P7662P2143o1451O0595m3118J9749M8973p523L8063p7304o9702
1420a1540o2872q3256p489L60377p7104k94210j2556K12409j44817p2200N1571
1409a41687K56344K7548N2691j83239j78614O8307L397j22167R2978J34573n2201
1398d2070O0253L0667n8720j01841K3995P2357J35842l3209P61o317J6990r2751
1386E957P6409p6237k9935K2096q4380Q5293l1700j94642r251N7260o8406K15624
1374c1912Q0881N1813K1300j76444J10180O5272j32489k5357j7396k11669r7345
$$ y = [-52201, -97269, 32763, 123037, 112290, 99620, -18322, -8398, 10969, 60580, -129371, -107808, -176851, -172128, -4537, -47646, -20003, -53348, -30061, 206052, 53265, 929, -3372, -69627, 8035, 80178, 18727, 79322, 36204, 55953, 104926, 97403, 135466, 58162, -11540, -74412, -157668, -165157, 195220, 118116, -176094, -188650, 23759, -121058, -193258, -141687, 114657, 142205, 194896, 11657, -166957, -98650, -95253, -217420, -124442, 10131, -42070, 18183, 48850, -9870, -111711, -87716, -15359, 120483, 87274, 88035, 81718, 98708, 5957, 82366, 6129, -23806, -1710, -86090, -797, -32497, -227139, -236390, -179130, -247536, -31912, 48969, 100782, 122082, -54362, 55818, 121090, -11399, -36756, -54152, -265821, -363166]
1363c63166J90750J88364J42809j3291Q2451n7025n7614K5784j92835Q9891L0578
1352F6696k15684q017J27085P3307J9701o7847j34860r7586O1745j00137L873
1341b71724K62222r1607j0017K75355j71371j0778p250k5591k22144o2789L60112
1330B4418O196o3671j51827j54152J86949N0914j34319R0229J74434j70014J9100
1319a21743J49414M0865j05023j52115J46759J51281k6551j78557J4110M427k5116
1308a02249J9249K74626m1202O634N1399j05898j78432o4848P6819J589n2436
1297a14749l4429J29415r2220J01603M5723M284j71684M7888N8453n7789L8452
1286d5053P6345N6357K8536r9540j1252k2744m3932n6937J38810k36416k7227
$$ y = [-363166, -172416, 15948, 158757, 145466, 227917, 170892, 113278, 139062, -53773, 36118, 66696, -148988, -157005, -29920, 43387, 63088, -4759, -139619, -237205, -175460, -275597, -271724, -9502, -101109, -111126, 164229, -7142, -17920, -25170, -50761, -272905, -335694, 24418, 30614, -33057, -184884, -339036, -152087, -101173, -235492, -145263, 29171, -140843, -121743, 27671, 68536, -36487, -188602, -41843, 109438, 82887, -95670, -81560, -77133, -102249, -83000, 191626, 150424, 157058, 208457, 102559, -75873, -140721, -63902, -62313, -114749, -149178, -19763, -111983, -10380, 35343, 39627, -132057, -84169, -25716, -83505, -45053, 31292, 87649, 116185, 16645, 5393, -17351, -61283, -118220, 20590, -215826, -243053]
1275b43053J35002Q843J18940k3393j29177O8013K03583o923p8222J61424j30343
1264H4694j94036N2654o0192j94080l9903K29546O8488L2895O3987J63697n1343
1253A56407N4394j12704l1603l7232j29956N5264L1102j4704p0490o0627k6944
1242a87093P5200J38315j59798K6889R0064m5742n5369J61558O2752q9189j98829
1231a81242J13554j5173N5367n5196j12389N4744J17649Q6219L50826l38529k17666
1220a41836K13920k99147J9726j11860K3341J65353j952k7814L0520k33447J84708
1209a78488J26406r1829L0265r4003J28104n0897K1713L3185m6065p590O5494
$$ y = [-243053, -108051, -99208, 19732, -3661, -132838, -64825, 138758, 131835, 53613, 215037, 84694, -109342, -56688, -116880, -310960, -350863, -121317, -52829, -19934, 44053, 207750, 156407, 210801, 98097, 66494, 29262, -100694, -45430, -14328, -29032, -99522, -160149, -187093, -111893, 26422, -133376, -106487, -16423, -62165, -117534, 44024, 106776, 17587, -181242, -67688, -82861, -27494, -82690, -195079, -140335, -22686, 63533, 414359, 75830, -141836, 72084, -227063, -207337, -319197, -295856, -130503, -132455, -160269, -129749, -363196, -178488, -52082, -143911, -113646, -207649, -79545, -130442, -108729, -75544, -121609, -129199, -63705]
$$ [...]
##END NTUPLES=NMR SPECTRUM
##END=
