##TITLE=1H_TG-2341-B3
 CDCl3
 8 sc, 
 12.1.2022
##JCAMPDX= 6.0         $$ Bruker NMR JCAMP-DX V2.0
##DATA TYPE= NMR SPECTRUM
##DATA CLASS= NTUPLES
##ORIGIN= UXNMR, Bruker Analytische Messtechnik GmbH
##OWNER= root
$$ XWIN-NMR		Version 3.5
$$ Wed Jan 12 13:44:08 2022 Russian Standard Time (UT+4h)  she@DPX200
##.OBSERVE FREQUENCY= 200.131346
##.OBSERVE NUCLEUS= ^1H
##.ACQUISITION MODE= SIMULTANEOUS
##.ACQUISITION SCHEME= undefined
##.AVERAGES= 8
##.DIGITISER RES= 18
##SPECTROMETER/DATA SYSTEM= spect
##.PULSE SEQUENCE= zg30
##.SOLVENT NAME= D2O
##.SHIFT REFERENCE= (INTERNAL, D2O, 0, 15.7193)
##AUDIT TRAIL= $$ (NUMBER, WHEN, WHO, WHERE, WHAT)
$$ ##TITLE= Audit trail, XWIN-NMR		Version 3.5
$$ ##JCAMPDX= 5.01
$$ ##ORIGIN= Bruker BioSpin GmbH
$$ ##OWNER= she
$$ F:/spectra/data/she/nmr/H-F/1/pdata/1/auditp.txt
$$ ##AUDIT TRAIL=  $$ (NUMBER, WHEN, WHO, WHERE, WHAT)
(   1,<2022-01-12 13:42:40.65 +0400>,<she>,<DPX200>,
      <created by zg, POWCHK disabled, PULCHK disabled
       configuration hash MD5:
       00 E9 B6 7A A2 85 ED C7 34 08 36 98 17 FE 4E 26
       data hash MD5: 16K
       F6 5D DA 26 BC 19 14 65 06 35 8E 9A 02 77 EC 4A>)
(   2,<2022-01-12 13:42:43.04 +0400>,<she>,<DPX200>,
      <Start of raw data processing
       efp BC_mod = 2 LB = 0.24 FT_mod = 6 PKNL = 1 PHC0 = -15872.31 PHC1 = 15.80079 SI = 16K 
       data hash MD5: 16K
       78 C6 76 7A CA 87 53 12 39 F8 6B AC 17 BB D1 14>)
(   3,<2022-01-12 13:43:03.68 +0400>,<she>,<DPX200>,
      <pk PHC0 = 7.626522 PHC1 = -7.199999 
       data hash MD5: 16K
       E4 B3 21 E3 C1 4E 1B 8C 26 64 57 0F 7A C7 50 58>)
(   4,<2022-01-12 13:43:07.04 +0400>,<she>,<DPX200>,
      <abs ABSG = 5 
       data hash MD5: 16K
       75 90 84 28 86 E8 8A C9 93 FD C2 87 52 F5 5A C2>)
$$ ##END=
$$ 
$$ hash MD5
$$ 5D 2E DB DA 76 A4 E1 FC 24 15 17 AC C8 A4 14 55
##$RELAX= 
##$RELAX= 
##$RELAX= 
##$RELAX= 
##$RELAX= 
##$RELAX= 
$$ Bruker specific parameters
$$ --------------------------
##$DU= <F:/spectra>
##$EXPNO= 1
##$NAME= <H-F>
##$PROCNO= 1
##$TYPE= <nmr>
##$USER= <she>
##$AMP= (0..31)
100 100 100 100 100 100 100 100 100 100 100 100 100 100 100 100 100 100 
100 100 100 100 100 100 100 100 100 100 100 100 100 100 
##$AQSEQ= 0
##$AQ_mod= 1
##$AUNM= <au_zg>
##$AUTOPOS= <>
##$BF1= 200.13
##$BF2= 200.13
##$BF3= 200.13
##$BF4= 200.13
##$BF5= 200.13
##$BF6= 200.13
##$BF7= 200.13
##$BF8= 200.13
##$BYTORDA= 1
##$CFDGTYP= 0
##$CFRGTYP= 5
##$CHEMSTR= <none>
##$CNST= (0..31)
1 1 145 1 1 1 1 1 1 1 1 1 1 1 1 1 1 1 1 1 1 1 1 1 1 1 1 1 1 1 1 1 
##$CPDPRG= <>
##$CPDPRG1= <>
##$CPDPRG2= <>
##$CPDPRG3= <>
##$CPDPRG4= <mlev>
##$CPDPRG5= <mlev>
##$CPDPRG6= <mlev>
##$CPDPRG7= <mlev>
##$CPDPRG8= <mlev>
##$CPDPRGB= <>
##$CPDPRGT= <>
##$D= (0..31)
0 1.2 0 0 0 0 0 0 0 0.06 0 0.03 0 0 0 0 0.0002 0 0 0 0 0 0 0 0 0 0 0 0 
0 0 0 
##$DATE= 1641980560
##$DBL= (0..7)
120 120 120 120 120 120 120 120 
##$DBP= (0..7)
150 150 150 150 150 150 150 150 
##$DBP07= 0
##$DBPNAM0= <>
##$DBPNAM1= <>
##$DBPNAM2= <>
##$DBPNAM3= <>
##$DBPNAM4= <>
$$ [...]
##$SUBNAM2= <"">
##$SUBNAM3= <"">
##$SUBNAM4= <"">
##$SUBNAM5= <"">
##$SUBNAM6= <"">
##$SUBNAM7= <"">
##$SUBNAM8= <"">
##$SUBNAM9= <"">
##$SW= 18.0517287032376
##$SWIBOX= (0..15)
0 0 2 0 0 0 0 0 0 0 0 0 0 0 0 0 
##$SW_h= 3612.71676300578
##$TD= 16384
##$TD0= 1
##$TE= 0
##$TE2= 300
##$TE3= 300
##$TEG= 300
##$TL= (0..7)
0 120 120 120 120 120 120 120 
##$TP= (0..7)
150 150 150 150 150 150 150 150 
##$TP07= 0
##$TPNAME0= <>
##$TPNAME1= <>
##$TPNAME2= <>
##$TPNAME3= <>
##$TPNAME4= <>
##$TPNAME5= <>
##$TPNAME6= <>
##$TPNAME7= <>
##$TPOAL= (0..7)
0.5 0.5 0.5 0.5 0.5 0.5 0.5 0.5 
##$TPOFFS= (0..7)
0 0 0 0 0 0 0 0 
##$TUNHIN= 0
##$TUNHOUT= 0
##$TUNXOUT= 0
##$USERA1= <user>
##$USERA2= <user>
##$USERA3= <user>
##$USERA4= <user>
##$USERA5= <user>
##$V9= 5
##$VALIST= <valist>
##$VCLIST= <CCCCCCCCCCCCCCC>
##$VD= 0
##$VDLIST= <DDDDDDDDDDDDDDD>
##$VPLIST= <PPPPPPPPPPPPPPP>
##$VTLIST= <TTTTTTTTTTTTTTT>
##$WBST= 1024
##$WBSW= 4
##$XGAIN= (0..3)
0 0 0 0 
##$XL= 0
##$YL= 0
##$YMAX_a= 310917
##$YMIN_a= -502441
##$ZGOPTNS= <>
##$ZL1= 120
##$ZL2= 120
##$ZL3= 120
##$ZL4= 120
##$ABSF1= 15.72926
##$ABSF2= -2.322589
##$ABSG= 5
##$ABSL= 3
##$ALPHA= 0
##$AQORDER= 0
##$ASSFAC= 0
##$ASSFACI= 0
##$ASSFACX= 0
##$ASSWID= 0
##$AUNMP= <proc_1d>
##$AZFE= 0.1
##$AZFW= 0.1
##$BCFW= 0
##$BC_mod= 2
##$BYTORDP= 0
##$COROFFS= 0
##$CY= -3
##$DATMOD= 1
##$DC= 0
##$DFILT= <>
##$DTYPP= 0
##$F1P= 0
##$F2P= 0
##$FCOR= 1
##$FTSIZE= 16384
##$FT_mod= 6
##$GAMMA= 0
##$GB= 0
##$INTBC= 1
##$INTSCL= 0
##$ISEN= 128
##$LB= 0.24
##$LEV0= 0
##$LPBIN= 0
##$MAXI= 10000
##$MC2= 0
##$MEAN= 0
##$ME_mod= 0
##$MI= 1.114404
##$NCOEF= 0
##$NC_proc= -6
##$NLEV= 6
##$NOISF1= 3.799351
##$NOISF2= 2.8
##$NSP= 0
##$NTH_PI= 0
##$NZP= 0
##$OFFSET= 15.71934
##$PC= 1
##$PHC0= -15864.68
##$PHC1= 8.600791
##$PH_mod= 1
##$PKNL= yes
##$PPARMOD= 0
##$PSCAL= 0
##$PSIGN= 0
##$REVERSE= no
##$SF= 200.130006446544
##$SI= 16384
##$SIGF1= 3
##$SIGF2= 2
##$SINO= 5.538805
##$SIOLD= 16384
##$SREGLST= <1H.CDCl3>
##$SSB= 0
##$STSI= 16384
##$STSR= 0
##$SW_p= 3612.71676300578
##$SYMM= 0
##$S_DEV= 0
##$TDeff= 16384
##$TDoff= 0
##$TI= <>
##$TILT= no
##$TM1= 0
##$TM2= 0
##$TOPLEV= 0
##$USERP1= <user>
##$USERP2= <user>
##$USERP3= <user>
##$USERP4= <user>
##$USERP5= <user>
##$WDW= 1
##$XDIM= 16384
##$YMAX_p= 416163743
##$YMIN_p= -694740
$$ End of Bruker specific parameters
$$ ---------------------------------
##NTUPLES= NMR SPECTRUM
##VAR_NAME=  FREQUENCY,     SPECTRUM/REAL,   SPECTRUM/IMAG
##SYMBOL=    X,             R,               I
##VAR_TYPE=  INDEPENDENT,   DEPENDENT,       DEPENDENT
##VAR_FORM=  AFFN,          ASDF,            ASDF
##VAR_DIM=   16384,         16384,           16384
##UNITS=     HZ,            ARBITRARY UNITS, ARBITRARY UNITS
##FACTOR=    0.220516191357247, 1,           1
##FIRST=     3145.91168045796, 0,            0
##LAST=      -466.805082547818, 0,           0
##MIN=       -466.805082547818, -694740,     0
##MAX=       3145.91168045796, 416163743,    0
$$ Real data points
##PAGE= N=1
##DATA TABLE= (X++(R..R)), XYDATA
$$ [...]
$$ plain form
7127 7057843 7422092 7662153 7956973 8176987 8560724 8915324 9313838 9679316 10043564 10505650
7117 10505650 11004605 11504293 11896499 12014301 12076600 11931282 11582164 11308406 10865082 10646961
7107 10646961 10553094 10597124 10604342 10676288 10803143 11104676 11385843 11603513 11807210 12062331
7097 12062331 12315294 12710105 13144740 13477538 14042708 14619879 15202152 15858570 16457509
7088 16457509 17182339 17893261 18751070 19781114 20796278 21871749 23132745 24612253 26238703
7079 26238703 28026694 30076511 32673459 35773574 39302732 43207266 47524511 52334234
7071 52334234 57636476 63326012 69649965 76771516 84760067 93237114 101493752 108523496
7063 108523496 113860693 116475975 115552027 111067925 103693238 93969285 83063076 71832909
$$ packed form
7127G057843L64249K40061K94820K20014L83737L54600L98514L65478L64248M62086
7117A0505650M98955M99688L92206J17802O2299j45318l49118k73758m43324k18121
7107A0646961r3867M4030P218P1946J26855L01533K81167K17670K03697K55121
7097A2062331K52963L94811M34635L32798N65170N77171N82273O56418N98939
7088A6457509P24830P10922Q57809J030044J015164J075471J260996J479508J626450
7079B6238703J787991K049817K596948L100115L529158L904534M317245M809723
7071E2334234N302242N689536O323953P121551P988551Q477047Q256638P029744
7063A08523496N337197K615282r23948m484102p374687r723953j0906209j1230167
$$ plain form
7055 71832909 61100708 52086621 44829407 39123391 34823731 31356575 28336804 25807717
7047 25807717 23568083 21712068 20105987 18578320 17334681 16183756 15032473 14185348
7039 14185348 13403761 12703280 12059726 11537082 10950301 10372538 9840038 9440340 9070719
7030 9070719 8696772 8291040 7870707 7523747 7239965 7019413 6788063 6484057 6364979 6052329
7020 6052329 5699276 5576172 5348104 5200960 5098611 4937637 4776174 4657512 4557981 4308075
7010 4308075 4207244 4094002 3999344 3829973 3659977 3576048 3537558 3410250 3329261 3300641
7000 3300641 3229822 3184806 3135038 3035776 2948515 2914017 2891990 2898489 2740028 2662059 2537169
6989 2537169 2551005 2552514 2451112 2250653 2232422 2281467 2233000 2217228 2151645 2158490 2041552
$$ packed form
7055G1832909j0732201r014087p257214n706016m299660l467156l019771k529087
7047B5807717k239634j856015j606081j527667j243639j150925j151283q47125
7039A4185348p81587p00481o43554n22644n86781n77763n32500l99698l69621
7030I070719l73947m05732m20333l46960k83782k20552k31350l04006j19078l12650
7020F052329l53053j23104k28068j47144j02349j60974j61463j18662r9531k49906
7010D308075j00831j13242r4658j69371j69996q3929l8490j27308q0989k8620
7000C300641p0819m5016m9768r9262q7261l4498k2027O499j58461p7969j24890
6989B537169J3836J509j01402k00459j8231M9045m8467j5772o5583O845j16938
$$ plain form
6978 2041552 1922513 2010361 2014194 1952354 1985406 1947649 1794110 1735552 1756832 1776974 1781425
6967 1781425 1747990 1659933 1609910 1558177 1508849 1571112 1557253 1473489 1463871 1481282 1374682
6956 1374682 1278374 1295450 1295987 1368508 1306209 1192512 1145142 1119177 1103942 1027273 1007679 1038471
6944 1038471 1044551 1036742 1009608 1012264 1063299 973706 951224 1038145 999450 944291 916843 909958
6932 909958 847738 880690 873196 842140 879268 917466 868055 879729 810054 773798 705771 838974
6920 838974 751646 695474 673395 658695 686466 715293 681253 641045 708418 668903 648106 570838
6908 570838 599421 644115 658165 703362 662409 526515 499749 612177 636504 543317 633680
6897 633680 720533 621421 495035 521503 509407 432148 388797 436186 432504 433184 330303 249669
$$ packed form
6978B041552j19039Q7848L833o1840L3052l7757j53539n8558K1280K0142M451
6967A781425l3435q8057n0023n1733m9328O2263j3859q3764r618J7411j06600
6956A374682r6308J7076N37P2521o2299j13697m7370k5965j5235p6669j9594L0792
6944A038471O080p809k7134K656N1035q9593k2482Q6921l8695n5159k7448o885
6932I09958o2220L2952p494l1056L7128L8198m9411J1674o9675l6256o8027J33203
6920H38974q7328n6172k2079j4700K7771K8827l4040m0208O7373l9515k0797p7268
6908E70838K8583M4694J4050M5197m0953j35894k6766J12428K4327r3187R0363
6897F33680Q6853r9112j26386K6468j2096p7259m3351M7389l682O80j02881q0634
$$ plain form
6885 249669 231235 226934 336598 406933 388229 329457 383305 500179 486321 474833 489991
6874 489991 425073 325933 359971 336077 415798 370468 333058 252996 445796 455913 368953
6863 368953 420457 400621 268488 366724 465741 410140 361949 317004 300190 364874 310135
6852 310135 221439 263741 330664 301259 291190 349572 381364 368282 355870 417350 438460 418519
6840 418519 390613 293409 343206 410207 282116 297841 360347 371336 250810 318397 325561
6829 325561 344816 378747 293316 327329 414209 392352 289689 250768 326603 435753 432211
6818 432211 359279 377851 340366 278259 193464 233327 267802 323308 363478 395289 331199 302353
6806 302353 341908 289136 356040 336641 315947 277761 230016 240131 233696 249664 276497 258513
$$ packed form
6885B49669j8434m301J09664P0335j8704n8772N3848J16874j3858j1488J5158
6874D89991o4918r9140L4038k3894P9721m5330l7410q0062J92800J0117q6960
6863C68953N1504j9836j32133R8236R9017n5601m8191m4945j6814O4684n4739
6852C10135q8696M2302O6923k9405j0069N8382L1792j3082j2412O1480K1110j9941
6840D18519k7906r7204M9797O7001j28091J5725O2506J0989j20526O7587P164
6829C25561J9255L3931q5431L4013Q6880k1857j02663l8921P5835J09150l542
6818D32211p2932J8572l7485o2107q4795L9863L4475N5506M0170L1811o4090k8846
6806C02353L9555n2772O6904j9399k0694l8186m7745J0115o435J5968K6833j7984
$$ plain form
6794 258513 159016 266445 254696 364643 386577 448042 413164 413528 394198 420037 372212 226469
6782 226469 209743 343528 277619 290891 300579 355926 423472 451520 425460 390766 412914 368774
6770 368774 393081 433383 421542 388925 385367 303231 405948 282994 284071 383442 355715 318636
6758 318636 362752 324879 316893 368748 508106 488879 349408 341219 282995 300431 261114 286248
6746 286248 247831 199388 247154 252147 373214 309609 389942 369071 320445 294635 317961 374418
6734 374418 391981 501345 472204 462207 479269 470432 424791 427549 517284 462628 383676 336439
6722 336439 311266 360969 395614 342065 347561 431424 464900 455096 481880 421762 439350 432009
6710 432009 443682 410882 355458 459569 360479 300798 380365 429305 508436 548228 535739
$$ packed form
6794B58513r9497J07429j1749J09947K1934O1465l4878L64j9330K5839m7825j45743
6782B26469j6726J33785o5909J3272R688N5347O7546K8048k6060l4694K2148m4140
6770C68774K4307M0302j1841l2617l558q2136J02717j22954J077R9371k7727l7079
6758C18636M4116l7873p986N1855J39358j9227j39471q189n8224J7436l9317K5134
6746B86248l8417m8443M7766M993J21067o3605Q0333k0871m8626k5810K3326N6457
6734C74418J7563J09364k9141r997J7062q837m5641K758Q9735n4656p8952m7237
6722C36439k5173M9703L4645n3549N496Q3863L3476r804K6784o0118J7588p341
6710D32009J1673l2800n5424J04111r9090n9681P9567M8940P9131L9792j2489
$$ plain form
6699 535739 483522 606297 610500 575019 479503 483943 464824 505359 573372 514656 577005 525781
6687 525781 584561 539085 545760 543488 514639 479830 468757 506929 588996 611885 600878 706305
6675 706305 697380 848585 820843 711558 845801 966962 912042 888415 922842 994467 982874
6664 982874 1075165 1074057 1014587 1050176 1144465 1074008 1003566 958810 1048110 1078739 1072964 1134107
6652 1134107 1054559 1037088 1058397 973000 880444 974108 1018963 905409 889496 880643 812626
6641 812626 871777 843238 899263 917944 1003996 1008255 1037187 1087300 994548 920887 962656 960752
6629 960752 1127341 1144660 1068406 1122255 1170053 1153152 1295533 1265978 1223531 1196493 1221295
6618 1221295 1211008 1209888 1208079 1226965 1177223 1232413 1279922 1295850 1302509 1234306 1309818 1228542
$$ packed form
6699E35739n2217J22775M203l5481r5516M440j9119M0535O8013n8716O2349n1224
6687E25781N8780m5476O675k272k8849l4809j1073L8172Q2067K2889j1007J05427
6675G06305q925J51205k7742j09285J34243J21161n4920k3627L4427P1625j1593
6664I82874R2291j108n9470L5589R4289p0457p0442m4756Q9300L0629n775O1143
6652A134107p9548j7471K1309q5397r2556R3664M4855j13554j5913q853o8017
6641H12626N9151k8539N6025J8681Q6052M259K8932N0113r2752p3661M1769j904
6629I60752J66589J7319p6254N3849M7798j6901J42381k9555m2447k7038K4802
6618A221295j0287j120j809J8886m9742N5190M7509J5928O659o8203P5512q1276
$$ plain form
6606 1228542 1298122 1259234 1238808 1274905 1253655 1378770 1404096 1299718 1385570 1418697 1425376
6595 1425376 1467298 1482788 1424823 1420193 1501974 1406749 1343088 1237655 1278894 1259129 1246668
6584 1246668 1294214 1279640 1276193 1218601 1217000 1198776 1189458 1254225 1200061 1179766 1168177 1277412
6572 1277412 1290520 1248180 1274234 1171622 1155462 1283969 1198239 1084958 1044502 1017495 1017303
6561 1017303 889901 923443 975099 991848 1026888 991030 947469 900624 857828 796092 715814
6550 715814 670874 690574 704912 724534 795756 777698 765861 766496 744394 722634 698871 735699
6538 735699 749923 732140 739805 756619 881413 942177 904744 734639 698812 703783 660882 659683
6526 659683 682126 697088 728165 621574 641507 726439 715727 627339 613415 559013 587811
$$ packed form
6606A228542O9580l8888k0426L6097k1250J25115K5326j04378Q5852L3127O679
6595A425376M1922J5490n7965m630Q1781r5225o3661j05433M1239j9765j2461
6584A246668M7546j4574l447n7592j601j8224r318O4767n4164k0295j1589J09235
6572A277412J3108m2340K6054j02612j6160J28507q5730j13281m0456k7007j92
6561A017303j27402L3542N1656J6749L5040l5858m3561m6845m2796o1736q0278
6550G15814m4940J9700J4338J9622P1222j8058j1837O35k2102k1760k3763L6828
6538G35699J4224j7783P665J6814J24794O0764l7433j70105l5827M971m2901j199
6526F59683K2443J4962L1077j06591J9933Q4932j0712q8388j3924n4402K8798
$$ plain form
6515 587811 570282 591922 590924 673146 746760 804567 748700 729034 688361 715296 824974 743082
6503 743082 718476 674862 600558 621611 627048 681271 672357 697225 597241 596721 694903 678273
6491 678273 596975 667064 718241 624431 609539 659367 728002 829221 728269 729891 831931
6480 831931 756938 705414 641166 631794 669163 704827 686292 674542 698491 784652 714220 728250
6468 728250 705436 677664 711773 895527 827293 803337 899541 922610 915847 826554 767839 851509
6456 851509 808091 858386 978687 1057759 1044510 1078984 1052738 1057936 1020213 1030425 974519 941142
6444 941142 947914 945403 934732 964165 967588 922634 813127 944641 923138 909612 899881 855450
6432 855450 923103 943099 1020222 1017981 1105005 1202613 1166454 1254192 1192928 1135964 1213118 1181107
$$ packed form
6515E87811j7529K1640r98Q2222P3614N7807n5867j9666m0673K6935J09678q1892
6503G43082k4606m3614p4304K1053N437N4223q914K4868r9984n20R8182j6630
6491F78273q1298P0089N1177r3810j4892M9828O8635J01219j00952J622J02040
6480H31931p4993n1524o4248r372L7369L5664j8535j1750K3949Q6161p0432J4030
6468G28250k2814k7772L4109J83754o8234k3956R6204K3069o763q9293n8715Q3670
6456H51509m3418N0295J20301P9072j3249L4474k6246N198l7723J0212n5906l3377
6444I41142O772k511j0671K9433L423m4954j09507J31514k1503j3526r731m4431
6432H55450O7653J9996P7123k241Q7024R7608l6159Q7738o1264n6964P7154l2011
$$ plain form
6420 1181107 1223297 1216596 1199863 1211367 1285021 1263194 1101301 1074175 1199063 1217223 1138337
6409 1138337 1029671 1203418 1183462 1155376 1164495 1206181 1229283 1249297 1336997 1342021 1276680
6398 1276680 1346519 1371605 1368790 1403414 1390529 1331572 1353345 1511115 1548393 1519099 1492066
6387 1492066 1531786 1422290 1418475 1421148 1418288 1444646 1322417 1356879 1487052 1531981 1508732
6376 1508732 1469987 1545056 1559660 1521955 1562767 1491799 1400841 1377432 1386900 1470988 1429893 1501576
6364 1501576 1701251 1553619 1534446 1450554 1421808 1567006 1581807 1635675 1635698 1669781 1563488
6353 1563488 1463804 1578392 1481656 1416056 1393775 1493577 1449646 1433815 1406205 1408188 1444486
6342 1444486 1448548 1361704 1427800 1558595 1530001 1611896 1660009 1693178 1544555 1509113 1547643
$$ packed form
6420A181107M2190o701j6733J1504P3654k1827j61893k7126J24888J8160p8886
6409A138337j08666J73747j9956k8086R119M1686K3102K0014Q7700N024o5341
6398A276680O9839K5086k815L4624j2885n8957K1773J57770L7278k9294k7033
6387A492066L9720j09496l815K673k860K6358j22229L4462J30173M4929k3249
6376A508732l8745P5069J4604l7705M0812p0968r0958k3409R468Q4088m1095P1683
6364A501576J99675j47632j9173q3892k8746J45198J4801N3868K3L4083j06293
6353A563488r9684J14588r6736o5600k2281R9802m3931j5831k7610J983L6298
6342A444486M062q6844O6096J30795k8594Q1895M8113L3169j48623l5442L8530
$$ plain form
6331 1547643 1539990 1560348 1546516 1537505 1452879 1424193 1445426 1428436 1516446 1430411 1399076 1411411
6319 1411411 1381777 1463982 1393747 1410639 1464318 1494970 1547078 1723277 1707796 1599800 1555584
6308 1555584 1636150 1626824 1482280 1560357 1600577 1666015 1619681 1546019 1658205 1715067 1752653
6297 1752653 1686376 1642413 1609229 1567659 1654056 1697952 1760783 1752007 1684189 1750983 1761243 1735170
6285 1735170 1737485 1646527 1706349 1727496 1724270 1706261 1727372 1763554 1874404 1854287 1919974 1916212
6273 1916212 1899922 1960293 2100676 2061793 2008354 2038250 2115819 2098194 2034530 2145171 2238138
6262 2238138 2342886 2230346 2163888 2242829 2197685 2102444 2140475 2242977 2259939 2231515 2282146
6251 2282146 2305008 2349940 2457386 2501006 2499634 2544750 2666408 2819335 2904286 2868468 2802335
$$ packed form
6331A547643p653K0358j3832r011q4626k8686K1233j6990Q8010q6035l1335J2335
6319A411411k9634Q2205p0235J6892N3679L0652N2108J76199j5481j07996m4216
6308A555584Q0566r326j44544P8077M0220O5438m6334p3662J12186N6862L7586
6297A752653o6277m3963l3184m1570Q6397M3896O2831q776o7818O6794J0260k6073
6285A735170K315r0958N9822K1147l226j8009K1111L6182J10850k0117O5687l762
6273A916212j6290O0371J40383l8883n3439K9896P7569j7625o3664J10641R2967
6262B238138J04748j12540o6458P8941m5144r5241L8031J02502J6962k8424N0631
6251B282146K2862M4932J07446M3620j372M5116J21658J52927Q4951l5818o6133
$$ plain form
6240 2802335 2767169 2712910 2775602 2832512 2709517 2694530 2628088 2481509 2511327 2526014 2586783
6229 2586783 2643495 2607296 2587609 2587559 2582062 2651300 2716696 2729167 2774236 2755364 2811209 2928963
6217 2928963 2990529 3086372 3213182 3133449 3127227 3248910 3305954 3377726 3531240 3627288 3631469
6206 3631469 3823398 4078342 4291108 4443340 4375435 4392286 4361175 4341446 4258061 4129227
6196 4129227 4028349 3874243 3733357 3674293 3739660 3705128 3572780 3543911 3608760 3570151 3635726
6185 3635726 3696402 3727629 3754359 3706014 3744115 3809561 3791342 3809045 3775052 3782893 3870379 3876230
6173 3876230 3891316 4050108 4109379 4170109 4132425 4319976 4465206 4542713 4640026 4725588 4745619
6162 4745619 4690739 4699208 4729147 4723677 4662137 4514783 4487699 4406179 4503772 4519550 4628290
$$ packed form
6240B802335l5166n4259O2692N6910j22995j4987o6442j46579K9818J4687O0769
6229B586783N6712l6199j9687n0n497O9238O5396J2471M5069j8872N5845J17754
6217B928963O1566R5843J26810p9733o222J21683N7044P1772J53514R6048M181
6206C631469J91929K54944K12766J52232o7905J6851l1111j9729q3385j28834
6196D129227j00878j54106j40886n9064O5367l4532j32348k8869O4849l8609O5575
6185C635726O0676L1227K6730m8345L8101O5446j8219J7703l3993P841Q7486N851
6173C876230J5086J58792N9271O0730l7684J87551J45230P7507R7313Q5562K0031
6162D745619n4880Q469K9939n470o1540j47354k7084q1520R7593J5778J08740
$$ plain form
6151 4628290 4753867 4847137 4997360 4899020 4927201 5129013 5141866 4922302 4786075 4689764
6141 4689764 4594149 4634041 4484585 4453947 4535452 4561356 4626878 4673765 4667869 4713298 4764729
6130 4764729 4682872 4694436 4761201 4829994 4935543 5066094 4964278 4960884 5107564 5144191 5050790
6119 5050790 5039486 5144918 5211262 5262223 5373995 5437094 5503240 5540288 5599745 5624840 5689648
6108 5689648 5645730 5643575 5719192 5794020 5722903 5868957 5879613 5923232 5988126 6088575 6184077
6097 6184077 6313868 6453399 6534408 6607608 6792498 6989567 7110968 7219452 7209756 7259537
6087 7259537 7142656 7065621 7006895 6972781 6945925 6793253 6838449 6859620 6881549 6920954 7008803
6076 7008803 7009598 6981233 7161926 7181856 7224450 7414913 7444533 7600701 7738385 7906151 7997032
$$ packed form
6151D628290J25577R3270J50223r8340K8181K01812J2853k19564j36227r6311
6141D689764r5615L9892j49456l0638Q1505K5904O5522M6887n896M5429N1431
6130D764729q1857J1564O6765O8793J05549J30551j01816l394J46680L6627r3401
6119E050790j1304J05432O6344N0961J11772O3099O6146L7048N9457K5095O4808
6108E689648m3918k155P5617P4828p1117J46054J0656M3619O4894J00449R5502
6097F184077J29791J39531Q1009P3200J84890J97069J21401J08484r696M9781
6087G259537j16881p7035n8726l4114k6856j52672M5196K1171K1929L9405Q7849
6076G008803P95k8365J80693J9930M2594J90463K9620J56168J37684J67766R0881
$$ plain form
6065 7997032 8161235 8246705 8235548 8349205 8413913 8454594 8387599 8328030 8389094 8571399 8634671
6054 8634671 8733852 8971831 9093903 9192258 9274017 9424992 9459475 9503998 9576072 9525436 9525569
6043 9525569 9449255 9581134 9727755 9864592 10022482 10121951 10186072 10209036 10227063 10349564
6033 10349564 10377491 10349978 10335770 10373999 10534452 10718755 10825845 10901505 11071219 11278068
6023 11278068 11330916 11435747 11529502 11693061 11821812 12029599 12147211 12569732 12815812 13030497
6013 13030497 13381765 13633849 13877591 14222650 14291903 14373447 14332223 14253843 13985985 13838441
6003 13838441 13658409 13397539 13233023 13060070 13011141 12665030 12433702 12286917 12101139 11895102
5993 11895102 11779359 11645590 11570658 11617326 11732143 11896604 12107409 12026405 11982082 11978564
$$ packed form
6065G997032J64203Q5470j1157J13657O4708M0681o6995n9569O1064J82305O3272
6054H634671R9181K37979J22072R8355Q1759J50975L4483M4523P2074n0636J33
6043I525569p6314J31879J46621J36837J57890R9469O4121K2964J8027J22501
6033A0349564K7927k7513j4208L8229J60453J84303J07090P5660J69714K06849
6023A1278068N2848J04831R3755J63559J28751K07787J17612M22521K46080K14685
6013A3030497L51268K52084K43742L45059O9253Q1544m1224p8380k67858j47544
6003A3838441j80032k60870j64516j72953m8929l46111k31328j46785j85778k06037
5993A1895102j15743j33769p4932M6668J14817J64461K10805q1004m4323l518
$$ plain form
5983 11978564 11979989 12001337 11809172 11616690 11471911 11196703 11162298 11117333 11046388 11015211 10883727
5972 10883727 10932068 10953266 11021746 11102132 11095421 11025777 10922449 10917035 10876948 10910582 10920796
5961 10920796 11064699 11077745 10998606 10993060 11036312 11137314 11138980 11054574 11146479 11210786 11275063
5950 11275063 11101349 11042841 11168430 11206140 11269442 11380949 11334461 11330430 11330926 11372907 11472270
5939 11472270 11415032 11501798 11639175 11642139 11669806 11814964 11931135 12021657 11906148 11897527 11956911
5928 11956911 11934626 11969285 11957911 12028284 11994882 11951453 12016623 12021310 12046567 12070699 12015666
5917 12015666 11907698 11918303 11915850 11844689 11879403 12022018 12161594 12177681 12209643 12278440 12389313
5906 12389313 12380190 12458565 12518769 12580109 12675585 12737012 12899795 13043499 13061311 13203976 13349005
$$ packed form
5983A1978564J425K1348j92165j92482j44779k75208l4405m4965p0945l1177j31484
5972A0883727M8341K1198O8480Q0386o711o9644j03328n414m0087L3634J0214
5961A0920796J43903J3046p9139n546M3252J01002J666q4406R1905O4307O4277
5950A1275063j73714n8508J25589L7710O3302J11507m6488m031M96M1981R9363
5939A1472270n7238Q6766J37377K964K7667J45158J16171R0522j15509q621N9384
5928A1956911k2285L4659j1374P0373l3402m3429O5170M687K5257K4132n5033
5917A2015666j07968J0605k453p1161L4714J42615J39576J6087L1962O8797J10873
5906A2389313r123P8375O0204O1340R5476O1427J62783J43704J7812J42665J45029
$$ plain form
5895 13349005 13407354 13462045 13598238 13787781 13776431 14034105 14168306 14140161 14185096 14232100
5885 14232100 14295360 14302163 14325673 14412589 14263383 14432111 14624612 14671102 14782342 14968254
5875 14968254 15186864 15373309 15353522 15359643 15392512 15372940 15473897 15365034 15224574 15229732 15204457
5864 15204457 15147073 15072744 15099400 15083760 15139817 15300311 15553625 15770392 15946668 16245282
5854 16245282 16411531 16591585 16793761 16970091 17251621 17617834 17919508 18355150 18799823
5845 18799823 19375743 19978665 20694186 21368886 21828270 22355854 22793798 23065946 23297124
5836 23297124 23478522 23640267 23711440 23817737 23795795 23838889 23928234 24122430 24413308 24613494
5826 24613494 25090174 25508452 26013443 26661889 27018932 27425325 27751336 27911580 27890260 27632990
$$ packed form
5895A3349005N8349N4691J36193J89543j1350K57674J34201k8145M4935M7004
5885A4232100O3260O803K3510Q6916j49206J68728J92501M6490J11240J85912
5875A4968254K18610J86445j9787O121L2869j9572J00957j08863j40460N158k5275
5864A5204457n7384p4329K6656j5640N6057J60494K53314K16767J76276K98614
5854A6245282J66249J80054K02176J76330K81530L66213L01674M35642M44673
5845A8799823N75920O02922P15521O74700M59384N27584M37944K72148K31178
5836B3297124J81398J61745P1173J06297k1942M3094Q9345J94196K90878K00186
5826B4613494M76680M18278N04991O48446L57043M06393L26011J60244k1320k57270
$$ plain form
5816 27632990 27306913 26954747 26575305 26341545 26196357 26159761 26399915 26763356 27284398 27804094
5806 27804094 28015131 28112281 28246137 28311623 28485674 28932493 29565186 30098982 30716250 31125304
5796 31125304 31349872 31384131 31380992 31106186 30597990 29877702 29076788 28521210 28063670 27665423
5786 27665423 27433930 27093066 26666320 26298997 25782406 25281500 24971615 24610343 24444316
5777 24444316 24459770 24658226 24985295 25304598 25860776 26397290 27147025 27759181 28508466 29302058
5767 29302058 30065748 30817977 31325695 31633318 31745599 31641286 31384942 30953798 30595286
5758 30595286 30418384 30264690 30280106 30312425 30588780 31015094 31492611 32132530 32625952 33274473
5748 33274473 33925604 34471830 35088189 35511279 35885037 36033459 35857470 35664556 35293798
$$ packed form
5816B7632990l26077l52166l79442k33760j45188l6596K40154L63441N21042N19696
5806B7804094K11037R7150J33856O5486J74051M46819O32693N33796O17268M09054
5796C1125304K24568L4259l139k74806n08196p20288q00914n55578m57540l98247
5786B7665423k31493l40864m26746l67323n16591n00906l09885l61272j66027
5777B4444316J5454J98456L27069L19303N56178N36514P49735O12156P49285P93592
5767B9302058P63690P52229N07718L07623J12281j04313k56344m31144l58512
5758C0595286j76902j53694J5416L2319K76355M26314M77517O39919M93422O48521
5748C3274473O51131N46226O16359M23090L73758J48422j75989j92914l70758
$$ plain form
5739 35293798 34932291 34556154 34226709 33933104 33806719 33819680 33828345 34174854 34578373 35113549
5729 35113549 35743523 36584434 37541979 38603698 39785030 41022362 42104187 43247271 44298852
5720 44298852 45133283 45923914 46634896 47362838 48179919 49015785 50100238 51392206 53016198
5711 53016198 54816203 56763607 58827369 60791984 62858688 64801489 66587382 68297255
5703 68297255 69920705 71200471 71929089 72241346 72104610 71499682 70720309 69857733 69214833
5694 69214833 68806198 68863346 69355235 70358742 71870409 73942030 76260209 78974651 81827932
5685 81827932 84427617 86638183 88179579 88827494 88474735 87234003 85162508 82319113
5677 82319113 78997954 75535969 72200349 69045099 66394449 64068173 62031656 60477480
$$ packed form
5739C5293798l61507l76137l29445k93605j26385J2961Q665L46509M03519N35176
5729C5113549O29974Q40911R57545J061719J181332J237332J081825J143084J051581
5720D4298852Q34431P90631P10982P27942Q17081Q35866J084453J291968J623992
5711E3016198J800005J947404K063762J964615K066704J942801J785893J709873
5703F8297255J623450J279766P28618L12257j36736o04928p79373q62576o42900
5694F9214833m08635N7148M91889J003507J511667K071621K318179K714442K853281
5685H1827932K599685K210566J541396O47915l52759j240732k071495k843395
5677H2319113l321159l461985l335620l155250k650650k326276k036517j554176
$$ plain form
5669 60477480 59139370 57894104 57036959 56378265 55737860 55331628 55007181 54838114 54614136
5660 54614136 54252787 53846387 53197905 52347526 51373985 50235938 48800486 47331109 46065028
5651 46065028 44908233 43751743 42678773 41895309 41187393 40672344 40320835 40100529 39909046
5642 39909046 39783397 39764369 39933644 40016390 40203226 40313797 40371198 40419896 40338531 40257880
5632 40257880 40092929 39914365 39656240 39173935 38688681 38219052 37826596 37452493 37064014
5623 37064014 36724533 36332766 36170500 36182485 36077800 36136508 36011176 35793082 35813254 35816022
5613 35816022 35667313 35441523 35165796 34879227 34487330 34164483 33701763 33230129 32772884
5604 32772884 32261474 31714013 31013804 30549286 29959739 29317102 28767370 28224868 27595353
$$ packed form
5669F0477480j338110j245266q57145o58694o40405m06232l24447j69067k23978
5660E4614136l61349m06400o48482q50379r73541j138047j435452j469377j266081
5651D6065028j156795j156490j072970p83464p07916n15049l51509k20306j91483
5642C9909046j25649j9028J69275Q2746J86836J10571N7401M8698q1365q0651
5632D0257880j64951j78564k58125m82305m85254m69629l92456l74103l88479
5623C7064014l39481l91767j62266J1985j04685N8708j25332k18094K0172K768
5613C5816022j48709k25790k75727k86569l91897l22847m62720m71634m57245
5604C2772884n11410n47461p00209m64518n89547o42637n49732n42502o29515
$$ plain form
5595 27595353 26987785 26384641 25719412 25081197 24416598 23686300 23146365 22664278 22248591
5586 22248591 21828919 21362857 20844003 20379336 19923471 19448614 19076677 18637331 18241906
5577 18241906 17799440 17325148 16846265 16386365 16002503 15593055 15149278 14839037 14631027
5568 14631027 14306755 14148672 14005922 13915512 13798853 13782049 13774588 13807362 13825821 13838931 14056237
5557 14056237 14367915 14626987 14542814 14299345 13918958 13301904 12515746 11820213 11292740 10965826
5547 10965826 10588674 10332828 10145345 10108882 10108400 9961416 9752279 9618967 9592627 9318753
5537 9318753 9150285 8968594 8829544 8727956 8544754 8444528 8356564 8273367 8146933 7949242
5527 7949242 7816742 7662733 7485708 7451981 7359241 7243030 7193846 7066490 6846725 6664637
$$ packed form
5595B7595353o07568o03144o65229o38215o64599p30298n39935m82087m15687
5586B2248591m19672m66062n18854m64667m55865m74857l71937m39346l95425
5577A8241906m42466m74292m78883m59900l83862m09448m43777l10241k08010
5568A4631027l24272j58083j42750r0410j16659j6804p461L2774J8459J3110K17306
5557A4056237L11678K59072q4173k43469l80387o17054p86158o95533n27473l26914
5547A0965826l77152k55846j87483l6463m82j46984k09137j33312k6340k73874
5537I318753j68468j81691j39050j01588j83202j00226q7964q3197j26434j97691
5527G949242j32500j54009j77025l3727r2740j16211m9184j27356k19765j82088
$$ plain form
5517 6664637 6643859 6460229 6382979 6330875 6252369 6307923 6256812 6204305 6064994 5983834 5745054
5506 5745054 5649307 5559643 5502019 5403392 5332056 5279353 5109525 5039260 5034396 5049498 4884902
5495 4884902 4747522 4815816 4791192 4750828 4786289 4652077 4543200 4580913 4574963 4545620 4493822
5484 4493822 4582169 4431361 4327719 4520450 4391329 4312992 4271963 4225242 4154224 4129952 4089228
5473 4089228 4049144 4033551 3946531 3965144 3976351 3941158 3893624 3934697 3994797 4085333 4100133
5462 4100133 4076312 4073039 3949235 3864000 3775832 3653916 3536119 3627198 3597057 3497858 3504130
5451 3504130 3503401 3530646 3516694 3494500 3412203 3254121 3264436 3392192 3267808 3191289 3283714
5440 3283714 3318306 3318860 3200339 3237214 3215847 3127579 3195128 3257753 3236958 3154364 3190716 3206261
$$ packed form
5517F664637k0778j83630p7250n2104p8506N5554n1111n2507j39311q1160k38780
5506E745054r5747q9664n7624r8627p1336n2703j69828p0265m864J5102j64596
5495D884902j37380O8294k4624m0364L5461j34212j08877L7713n950k9343n1798
5484D493822Q8347j50808j03642J92731j29121p8337m1029m6721p1018k4272m0724
5473D089228m0084j5593q7020J8613J1207l5193m7534M1073O0100R0536J4800
5462D100133k3821l273j23804q5235q8168j21916j17797R1079l0141r9199O272
5451C504130p29K7245j3952k2194q2297j58082J0315J27756j24384p6519R2425
5440C283714L4592N54j18521L6875k1367q8268O7549O2625k0795q2594L6352J5545
$$ plain form
5428 3206261 3153544 3239470 3284669 3182905 3141685 3109934 3218904 3207811 3064986 2973438 3063367
5417 3063367 3171701 3180114 3164076 3181308 3177060 3145308 3150112 2953901 3014044 3089509 3065881 3060111
5405 3060111 3047222 3061435 3082170 3078629 3063658 3160489 3246237 3192590 3235171 3315576 3443395
5394 3443395 3480482 3634792 3821120 3936406 3972641 4030546 4247396 4290735 4312070 4397224 4385176
5383 4385176 4383904 4524825 4570397 4605829 4623495 4542872 4596937 4713350 4631475 4700022 4791296
5372 4791296 4812676 4938208 4910957 5006736 5077767 5030049 5021286 5032471 5143379 5053332 4933550
5361 4933550 4850927 4665653 4651419 4515372 4422317 4300917 4198899 4133589 4069835 4079417 3871562
5350 3871562 3732194 3613980 3576174 3565742 3549547 3492378 3401095 3285930 3301397 3199520 3150810
$$ packed form
5428C206261n2717Q5926M5199j01764m1220l1751J08970j1093j42825r1548Q9929
5417C063367J08334Q413j6038J7232m248l1752M804j96211O0143P5465k3628n770
5405C060111j2889J4213K0735l541j4971R6831Q5748n3647M2581Q0405J27819
5394C443395L7087J54310J86328J15286L6235N7905K16850M3339K1335Q5154j2048
5383D385176j272J40921M5572L5432J7666q0623N4065J16413q1875O8547R1274
5372D791296K1380J25532k7251R5779P1031m7718q763J1185J10908r0047j19782
5361D933550q2623j85274j4234j36047r3055j21400j02018o5310o3754R582k07855
5350C871562j39368j18214l7806j0432j6195n7169r1283j15165J5467j01877m8710
$$ plain form
5339 3150810 3138658 3189578 3207667 3223974 3250408 3256352 3312944 3248971 3071319 3113571 3160698
5328 3160698 3106135 3015092 3033590 3001326 3022038 2983120 2997790 3091269 3018855 2951932 2974664
5317 2974664 2935303 3010082 3144587 3137952 3253784 3334529 3387547 3376453 3346857 3361651 3349439
5306 3349439 3392135 3356396 3293593 3287141 3196433 3307162 3320439 3240047 3212279 3218399 3291992 3220277
5294 3220277 3194614 3233610 3168305 3157201 3231878 3220426 3191898 3235929 3131364 3061450 3124474
5283 3124474 3200336 3167085 3235351 3226264 3183472 3064850 3121386 3069333 3001158 3052682 3053581 3012096
5271 3012096 2896768 2932356 2835164 2735037 2694407 2727835 2731957 2673021 2739959 2765130 2700924
5260 2700924 2601484 2606001 2623232 2685539 2678618 2590891 2589622 2605233 2604753 2642730 2670645 2607181
$$ packed form
5339C150810j2152N0920J8089J6307K6434N944N6592o3973j77652M2252M7127
5328C160698n4563r1043J8498l2264K0712l8918J4670R3479p2414o6923K2732
5317B974664l9361P4779J34505o635J15832Q0745N3018j1094k9596J4794j2212
5306C349439M2696l5739o2803o452r0708J10729J3277q0392k7768O120P3593p1715
5294C220277k5663L8996o5305j1104P4677j1452k8528M4031j04565o9914O3024
5283C124474P5862l3251O8266r087m2792j18622N6536n2053o8175N1524Q99m1485
5271C012096j15328L5588r7192j00127m0630L3428M122n8936O6938K5171o4206
5260B700924r9440M517J7231O2307o921q7727j269J5611m80L7977K7915o3464
$$ plain form
5248 2607181 2620699 2649898 2733906 2742887 2729821 2798174 2911200 3014316 3003082 2865022 2738459
5237 2738459 2496755 2465128 2530158 2421108 2332476 2308944 2379558 2251160 2211368 2212782 2277278
5226 2277278 2260924 2247451 2208601 2218430 2179520 2199815 2211035 2183240 2141563 2072078 2102104 2049491
5214 2049491 2001938 2095395 1960108 1943170 1958826 2043280 2031225 1957397 1933385 1878424 1964639
5203 1964639 1959736 1914114 1912286 2007346 1889961 1858188 1898523 1888529 1878650 1922662 1929550 1884137
5191 1884137 1792590 1727312 1710299 1731396 1746226 1677906 1666855 1772487 1812285 1845255 1832156
5180 1832156 1781831 1728672 1738241 1718778 1729681 1813469 1884236 1805914 1871491 1786572 1909172
5169 1909172 1935173 1902838 1976880 2038467 2071614 2016737 1995894 2101038 2171890 2090086 2089562 2057194
$$ packed form
5248B607181J3518K9199Q4008Q981j3066O8353J13026J03116j1234j38060j26563
5237B738459k41704l1627O5030j09050q8632k3532P0614j28398l9792J414O4496
5226B277278j6354j3473l8850R829l8910K0295J1220k7795m1677o9485L0026n2613
5214B049491m7553R3457j35287j6938J5656Q4454j2055p3828k4012n4961Q6215
5203A964639m903m5622j828R5060j17385l1773M0335r994r879M4012O888m5413
5191A884137r1547o5278j7013K1097J4830o8320j1051J05632L9798L2970j3099
5180A832156n0325n3159R569j9463J0903Q3788P0767p8322O5577q4919J22600
5169A909172K6001l2335P4042O1587L3147n4877k0843J05144P0852q1804n24l2368
$$ plain form
5157 2057194 2085589 2168533 2163259 2193801 2272757 2373812 2400517 2435528 2407569 2536463 2646927
5146 2646927 2539063 2589095 2628201 2745352 2776824 2777363 2881525 3115183 3080442 3182471 3353312
5135 3353312 3504499 3608632 3516943 3412920 3353175 3301173 3235539 3122806 3114086 3160504 3139931
5124 3139931 3091333 3101102 3179927 3165309 3147750 3162947 3287876 3320088 3409202 3314643 3483032
5113 3483032 3685791 3767929 3849885 3872823 3877780 3824404 3893298 3924500 3949977 3912126 3877140
5102 3877140 3894343 3875357 4014578 4233226 4416887 4702434 4841825 5100127 5420597 5810952
5092 5810952 6201687 6675019 7174752 7554595 7835472 7919535 7908359 7800360 7756772 7642464
5082 7642464 7216779 6754802 6466889 6353377 6322689 6266122 6285072 6348458 6536662 6803097
$$ packed form
5157B057194K8395Q2944n274L0542P8956J01055K6705L5011k7959J28894J10464
5146B646927j07864N0032L9106J17151L1472N39J04162K33658l4741J02029J70841
5135C353312J51187J04133r1689j04023n9745n2002o5634j12733q720M6418k0573
5124C139931m8598R769P8825j4618j7559J5197J24929L2212Q9114r4559J68389
5113C483032K02759Q2138Q1956K2938M957n3376O8894L1202K5477l7851l4986
5102C877140J7203j8986J39221K18648J83661K85547J39391K58302L20470L90355
5092E810952L90735M73332M99733L79843K80877Q4063j1176j07999m3588j14308
5082G642464m25685m61977k87913j13512l0688n6567J8950O3386J88204K66435
$$ plain form
5072 6803097 7151572 7598025 7983706 8614524 9264507 9991262 10590554 11083170 11514839 11682660
5062 11682660 11664057 11447160 11139060 10696255 10029154 9182094 8432038 7892587 7376194 7090817
5052 7090817 6794304 6642428 6515788 6516670 6567059 6560253 6641357 6713388 6863047 7017490 7211403
5041 7211403 7521100 7801220 7991342 8055107 7808749 7569644 7498194 7462896 7204310 6673586
5031 6673586 6226166 5995755 5806826 5674773 5461749 5332010 5201848 5149828 5134321 5169868
5021 5169868 5146349 5233010 5327304 5277397 5331643 5437567 5333337 5295431 5276053 5225504 5144029
5010 5144029 4966934 5048123 5054854 4919100 4890911 4850814 4907448 5007285 4990530 4936285 4989494
4999 4989494 4952137 4918163 5010125 5090369 5140793 5235964 5379752 5478346 5602409 5590539 5595271
$$ packed form
5072F803097L48475M46453L85681O30818O49983P26755N99292M92616M31669J67821
5062A1682660j8603k16897l08100m42805o67101q47060p50056n39451n16393k85377
5052G090817k96513j51876j26640Q82N0389o806Q1104P2031J49659J54443J93913
5041G211403L09697K80120J90122O3765k46358k39105p1450l5298k58586n30724
5031F673586m47420k30411j88929j32053k13024j29739j30162n2020j5507L5547
5021E169868k3519Q6661R4294m9907N4246J05924j04230l7906j9378n0549q1475
5010E144029j77095Q1189O731j35754k8189m0097N6634R9837j6755n4245N3209
4999D989494l7357l3974R1962Q0244N0424R5171J43788R8594J24063j1870M732
$$ plain form
4988 5595271 5738080 5757114 5814119 5830564 5854707 5825444 5772580 5844130 5814178 5986696 6120201
4977 6120201 6076827 6044111 5902204 5903250 5997529 6026896 6064849 6059381 6105437 6252692 6314109
4966 6314109 6336952 6478967 6547307 6666801 6988413 7082476 7239709 7459249 7630560 7853018
4956 7853018 7850568 7871125 8076899 8241278 8331336 8586176 8701303 8908093 9325100 9665873
4946 9665873 9965259 10225741 10554209 10951209 11460259 11937087 12537214 13155206 13624687 14246653
4936 14246653 14760212 15289885 15688659 15965090 15994258 16051773 16122789 16071874 16069681 15968619
4926 15968619 15875927 15857345 15770128 15772926 15841650 15914305 15979109 15934465 15827662 15608580 15217522
4915 15217522 14665333 14140189 13663609 13103207 12628718 12109322 11563326 11107988 10630626
$$ packed form
4988E595271J42809J9034N7005J6445K4143k9263n2864P1550k9952J72518J33505
4977F120201m3374l2716j41907J046R4279K9367L7953n468M6056J47255O1417
4966F314109K2843J42015O8340J19494L21612R4063J57233K19540J71311K22458
4956G853018k450K0557K05774J64379R0058K54840J15127K06790M17007L40773
4946I665873K99386K60482L28468L97000N09050M76828O00127O17992M69481O21966
4936A4246653N13559N29673L98774K76431K9168N7515P1016n0915k193j01062
4926A5968619r2692j8582q7217K798O8724P2655O4804m4644j06803k19082l91058
4915A5217522n52189n25144m76580n60402m74489n19396n45996m55338m77362
$$ plain form
4906 10630626 10305264 9916713 9564619 9414956 9246181 9066116 8823388 8678917 8561443
4897 8561443 8492677 8380235 8350888 8345921 8345920 8409005 8508183 8544089 8597083 8736005 8870069 9005514
4885 9005514 9094780 9294856 9623725 9881785 10094769 10475873 10856366 11264702 11587121 12165783
4875 12165783 12783196 13294633 13925213 14671699 15341004 16118176 16731972 17300697 17743408
4866 17743408 18144884 18389720 18440198 18561944 18576621 18455571 18327869 18143081 18089022 17931374
4856 17931374 17738122 17544303 17244608 16950261 16643873 16204318 15629919 14984465 14144943
4847 14144943 13364320 12648093 11873703 11153597 10606788 10044136 9459214 8949860 8412877
4838 8412877 8105615 7777816 7458622 7221035 6894207 6630708 6325029 6086938 5900844 5637717
$$ packed form
4906A0630626l25362l88551l52094j49663j68775j80065k42728j44471j17474
4897H561443o8766j12442k9347m967jO3085R9178L5906N2994J38922J34064J35445
4885I005514Q9266K00076L28869K58060K12984L81104L80493M08336L22419N78662
4875A2165783O17413N11437O30580P46486O69305P77172O13796N68725M42711
4866A7743408M01476K44836N0478J21746J4677j21050j27702j84788n4059j57648
4856A7931374j93252j93819k99695k94347l06388m39555n74399o45454q39522
4847A4144943p80623p16227p74390p20106n46809n62652n84922n09354n36983
4838H412877l07262l27799l19194k37587l26828k63499l05679k38091j86094k63127
$$ plain form
4828 5637717 5438326 5298978 5133541 5004383 4901976 4794184 4632301 4576572 4478557 4241326
4818 4241326 4193188 4197213 4194511 4138380 4009425 3980995 4032071 3873498 3714109 3782788 3753628
4807 3753628 3619156 3578584 3587628 3507941 3528977 3437130 3418498 3365445 3349623 3291552 3305998
4796 3305998 3249860 3275841 3267935 3172169 3191905 3278811 3256379 3288012 3278886 3175440 3120900 3070125
4784 3070125 3122311 3200134 3078364 3082189 3177012 3192042 3122117 3036196 3129925 3026384 3028320
4773 3028320 3023839 3076974 3175487 3162994 3285442 3137255 3130966 3311049 3327590 3368096 3412982
4762 3412982 3386483 3417244 3493340 3491279 3562137 3638213 3647495 3644959 3705532 3758410 3805739 3754153
4750 3754153 3755873 3736476 3858439 3923823 3859164 3915054 3883095 3910112 3947716 4037690 3925036
$$ packed form
4828E637717j99391j39348j65437j29158j02407j07792j61883n5729r8015k37231
4818D241326m8138M025k702n6131j28955k8430N1076j58573j59389O8679k9160
4807C753628j34472m0572R044p9687K1036r1847j8632n3053j5822n8071J4446
4796C305998n6138K5981p906r5766J9736Q6906k2432L1633r126j03446n4540n0775
4784C070125N2186P7823j21770L825R4823J5030o9925q5921R3729j03541J936
4773C028320m481N3135R8513j2493J22448j48187o289J80083J6541M0506M4886
4762C412982k6499L0761P6096k061P0858P6076R282k536O0573N2878M7329n1586
4750C754153J720j9397J21963O5384o4659N5890l1959K7017L7604Q9974j12654
$$ plain form
4739 3925036 3988308 4102720 4092067 4124790 4210276 4196273 4260083 4270258 4398820 4425610 4395688
4728 4395688 4624379 4548339 4524779 4499760 4541862 4639232 4667816 4673743 4780462 4802039 4711981
4717 4711981 4708616 4821593 4744924 4745791 4853578 4945318 5089404 5255348 5260365 5233824 5357068
4706 5357068 5398931 5477928 5725360 5883933 6018181 6177865 6223960 6374058 6477949 6551499
4696 6551499 6741565 6883204 6995099 7196043 7436533 7568560 7857177 8005403 8301321 8608466
4686 8608466 8776918 9100536 9393285 9717328 9984679 10326208 10765530 11081020 11410046 11734079
4676 11734079 12048701 12198392 12291343 12416725 12618105 12746893 12850667 12925447 12967597 13083178
4666 13083178 13141560 13064266 13042372 12961737 12695820 12362839 12115791 11807264 11321426 10842831
$$ packed form
4739C925036O3272J14412j0653L2723Q5486j4003O3810J0175J28562K6790k9922
4728D395688K28691p6040k3560k5019M2102R7370K8584N927J06719K1577r0058
4717D711981l365J12977p6669Q67J07787R1740J44086J65944N017k6541J23244
4706E357068M1863P8997K47432J58573J34248J59684M6095J50098J03891P3550
4696F551499J90066J41639J11895K00944K40490J32027K88617J48226K95918L07145
4686H608466J68452L23618K92749L24043K67351L41529M39322L15490L29026L24033
4676A1734079L14622J49691R2951J25382K01380J28788J03774P4780M2150J15581
4666A3083178N8382p7294k1894q0635k65917l32981k47048l08527m85838m78595
$$ plain form
4656 10842831 10453822 10223704 9971065 9604993 9510431 9379196 9244194 9233351 9139462 8970348
4646 8970348 8904841 8924531 8827429 8781188 8827392 8917524 8879168 8947946 9015401 9075352 9109958
4635 9109958 9222265 9419490 9549416 9647982 9906702 10061960 10420473 10760373 10899751 11130528
4625 11130528 11528304 11898751 12318018 12778228 13350293 13841918 14423590 15007530 15688639
4616 15688639 16388496 17045155 17623262 18084653 18597411 19020435 19359546 19595736 19723608
4607 19723608 19683199 19571303 19565052 19456698 19245800 19010699 18719059 18477788 18017569 17565094
4597 17565094 17059070 16544300 15892060 15301035 14575714 13988708 13384215 12770289 12214771
4588 12214771 11670000 11194770 10696208 10243798 9838528 9470691 9285622 8963341 8672561
$$ packed form
4656A0842831l89009k30118k52639l66072r4562j31235j35002j0843r3889j69114
4646H970348o5507J9690r7102m6241M6204R0132l8356O8778O7455N9951L4606
4635I109958J12307J97225J29926R8566K58720J55258L58513L39900J39378K30777
4625A1130528L97776L70447M19267M60210N72065M91625N81672N83940O81109
4616A5688639O99857O56659N78107M61391N12758M23024L39111K36190J27872
4607A9723608m0409j11896o251j08354k10898k35101k91640k41271m60219m52475
4597A7565094n06024n14770o52240n91025p25321n87006o04493o13926n55518
4588A2214771n44771m75230m98562m52410m05270l67837j85069l22281k90780
$$ plain form
4579 8672561 8656504 8463620 8194555 7963647 7733002 7506375 7426748 7273076 7138103 7082824
4569 7082824 7040940 6891848 6838433 6790691 6801612 6732292 6679614 6640622 6606566 6566515 6543997
4558 6543997 6530899 6681751 6705935 6489801 6460796 6430954 6373202 6481258 6543728 6579422 6592099
4547 6592099 6624081 6767120 6821066 6869993 6877759 6992766 7047835 7135486 7196100 7416298 7481854
4536 7481854 7453942 7607960 7684357 7750361 7846216 7917126 7937830 8033642 8069211 8249505 8503139
4525 8503139 8792466 8767778 8802072 9138211 9525012 9858523 10107059 10427783 10890653 11308917
4515 11308917 11767497 12241061 12671870 13101531 13508398 13980453 14367241 14603077 14697008 14713744
4505 14713744 14668239 14498439 14297605 13972614 13547159 13199590 12875510 12521125 12144636 11785423
$$ packed form
4579H672561j6057j92884k69065k30908k30645k26627p9627j53672j34973n5279
4569G082824m1884j49092n3415m7742J0921o9320n2678l8992l4056m0051k2518
4558F543997j3098J50852K4184k16134k9005k9842n7752J08056O2470L5694J2677
4547F592099L1982J43039N3946M8927P766J15007N5069Q7651O0614K20198O5556
4536G481854k7912J54018P6397O6004R5855P0910K0704R5812L5569J80294K53634
4525H503139K89327k4688L4294L36139L86801L33511K48536L20724M62870M18264
4515A1308917M58580M73564M30809M29661M06867M72055L86788K35836R3931J6736
4505A4713744m5505j69800k00834l24991m25455l47569l24080l54385l76489l59213
$$ plain form
4495 11785423 11551211 11440496 11282813 11085476 10933706 10852470 10811052 10772282 10762051 10874110
4485 10874110 10863930 10887297 10991801 11233812 11288262 11433824 11752851 11962805 12234825 12570043
4475 12570043 12873769 13273677 13698111 14119271 14443753 14897256 15329107 15592368 15826622
4466 15826622 16032617 16174351 16133649 15845083 15717697 15641364 15346894 15073278 14869592 14728981
4456 14728981 14775099 14684746 14674301 14643939 14530756 14451655 14274666 14078317 13855507 13786630
4446 13786630 13710439 13560500 13303096 13201492 13123826 12963175 12727637 12491602 12334909 12030107
4436 12030107 11734259 11427225 11139111 10980531 10899643 10602188 10408280 10291007 10166430 10050092
4426 10050092 9970224 10068801 10035140 9954693 9904398 10011287 10098293 10271707 10316632 10522248 10788904
$$ packed form
4495A1785423k34212j10715j57683j97337j51770q1236m1418l8770j0231J12059
4485A0874110j0180K3367J04504K42011N4450J45562L19027K09954K72020L35218
4475A2570043L03726L99908M24434M21160L24482M53503M31851K63261K34254
4466A5826622K05995J41734m0702k88566j27386p6333k94470k73616k03686j40611
4456A4728981M6118r0353j0445l0362j13183p9101j76989j96349k22810o8877
4446A3786630p6191j49939k57404j01604p7666j60651k35538k36035j56693l04802
4436A2030107k95848l07034k88114j58580q0888k97455j93908j17273j24577j16338
4426A0050092p9868R8577l3661q0447n0295J06889Q7006J73414M4925K05616K66656
$$ plain form
4415 10788904 10906938 11163843 11483299 11817676 12094321 12316378 12639034 13006992 13507193
4406 13507193 13877260 14320266 14789153 15045708 15457708 15859011 16092534 16409335 16637801
4397 16637801 16884095 17270352 17548761 17749853 17932561 18154788 18316752 18302754 18224024 18144533
4387 18144533 18036920 17747720 17493393 17106100 16570057 16047497 15440827 15027959 14634452
4378 14634452 14309354 13993495 13666239 13471113 13276777 13078853 13061114 12920375 12826797 12876870
4368 12876870 12862960 12893214 12984276 13131828 13226378 13444230 13765323 14026769 14214458 14513362
4358 14513362 14880391 15300904 15831875 16274643 16727595 17116803 17384354 17603466 17866900
4349 17866900 18012637 17936641 17945505 17898207 17567642 17257595 16995561 16628249 16338307 15992013
$$ packed form
4415A0788904J18034K56905L19456L34377K76645K22057L22656L67958N00201
4406A3507193L70067M43006M68887K56555M12000M01303K33523L16801K28466
4397A6637801K46294L86257K78409K01092J82708K22227J61964j3998p8730p9491
4387A8144533j07613k89200k54327l87293n36043n22560o06670m12868l93507
4378A4634452l25098l15859l27256j95126j94336j97924j7739j40739r3578N0073
4368A2876870j3910L0254R1062J47552R4550K17852L21093K61446J87689K98904
4358A4513362L67029M20513N30971M42768M52952L89208K67551K19112K63434
4349A7866900J45737p5996Q864m7298l30565l10047k62034l67312k89942l46294
$$ plain form
4339 15992013 15738567 15434713 15303120 15063777 14939548 14944582 14933167 14973117 15084542 15177838
4329 15177838 15425815 15691383 15768377 15934217 16096035 16271944 16302631 16356465 16284632 16153922
4319 16153922 15968767 15673164 15416069 15187032 14875933 14475474 14212908 13983006 13631180
4310 13631180 13400638 13322837 13095631 12920836 12842211 12691332 12611707 12500291 12463317 12411731
4300 12411731 12441790 12617708 12738250 12860425 12995138 13121748 13356114 13610517 13885997 14134137
4290 14134137 14525066 14855195 15129978 15450193 15649793 15816066 15911402 15884393 15838195 15660439
4280 15660439 15526358 15248294 14898016 14594855 14281744 13986395 13643239 13223075 12967981
4271 12967981 12811616 12635628 12399172 12257422 12174670 12152185 12184778 12019350 12093133 12299643
$$ packed form
4339A5992013k53446l03854j31593k39343j24229N034j1415L9950J11425R3296
4329A5177838K47977K65568P6994J65840J61818J75909L0687N3834p1833j30710
4319A6153922j85155k95603k57095k29037l11099m00459k62566k29902l51826
4310A3631180k30542p7801k27206j74795p8625j50879p9625j11416l6974n1586
4300A2411731L0059J75918J20542J22175J34713J26610K34366K54403K75480K48140
4290A4134137L90929L30129K74783L20215J99600J66273R5336k7009m6198j77756
4280A5660439j34081k78064l50278l03161l13111k95349l43156m20164k55094
4271A2967981j56365j75988k36456j41750q2752k2485L2593j65428P3783K06510
$$ plain form
4261 12299643 12410470 12545957 12638944 12674728 12840193 13092242 13248555 13432529 13575822 13756891
4251 13756891 13907394 14151371 14480399 14647226 14820593 15126888 15409222 15629563 15958582
4242 15958582 16155764 16380925 16677432 16979172 17138682 17192382 17418447 17632242 17777992 17989808
4232 17989808 18156157 18308524 18586371 18736369 18888581 19187278 19412488 19643737 20074983
4223 20074983 20491305 20767611 21160466 21543466 21911113 22304797 22727032 23034312 23503875
4214 23503875 24049144 24466076 24996057 25657596 26371276 27234312 28200551 29171128 30241415
4205 30241415 31148216 32254725 33414903 34641072 36056934 37435600 38716322 40285342
4197 40285342 41919044 43514514 45305019 47192700 49176106 51315014 53522953 55938386
$$ packed form
4261A2299643J10827J35487R2987L5784J65465K52049J56313J83974J43293J81069
4251A3756891J50503K43977L29028J66827J73367L06295K82334K20341L29019
4242A5958582J97182K25161K96507L01740J59510N3700K26065K13795J45750K11816
4232A7989808J66349J52367K77847J49998J52212K98697K25210K31249M31246
4223B0074983M16322K76306L92855L83000L67647L93684M22235L07280M69563
4214B3503875N45269M16932N29981O61539P13680Q63036R66239R70577J070287
4205C0241415R06801J106509J160178J226169J415862J378666J280722J569020
4197D0285342J633702J595470J790505J887681J983406K138908K207939K415433
$$ plain form
4189 55938386 58551790 61322085 64395969 67738956 71454493 75552745 80358890 85983417
4181 85983417 92550707 100239413 109234155 119752964 131952587 145781315 161686800 179592936
4173 179592936 199569420 222023076 247241479 275733216 308195613 343305645 377382351
4166 377382351 403996305 416163743 408379916 380724218 338772713 291870309 248575451
4159 248575451 212924210 184726384 162322582 144276070 129515342 117428507 107189381
4152 107189381 98482510 91169009 84973137 79507000 74565185 70026911 66029299 62177871
4144 62177871 58648474 55269874 52250133 49527441 47069226 45054067 43182447 41506939
4136 41506939 40232779 39038782 37820233 36731264 35761798 34708058 33678398 32501323
$$ packed form
4189E5938386K613404K770295L073884L342987L715537M098252M806145N624527
4181H5983417O567290P688706Q994742J0518809J2199623J3828728J5905485J7906136
4173A79592936J9976484K2453656K5218403K8491737L2462397L5110032L4076706
4166C77382351K6613954J2167438p783827k7655698m1951505m6902404m3294858
4159B48575451l5651241k8197826k2403802j8046512j4760728j2086835j0239126
4152A07189381q706871p313501o195872n466137m941815m538274l997612l851428
4144F2177871l529397l378600l019741k722692k458215k015159j871620j675508
4136D1506939j274160j193997j218549j088969r69466j053740j029660j177075
$$ plain form
4128 32501323 31152883 29778888 28452919 27252770 26197090 25192978 24250503 23474638
4120 23474638 22748235 22090403 21529011 20993050 20390112 19778175 19291067 18793122 18406213
4111 18406213 17932363 17465458 17057095 16766621 16641787 16282804 15953430 15672303 15379142
4102 15379142 15078678 14828633 14515509 14186038 13871297 13556864 13301984 13085448 12912906
4093 12912906 12748021 12583900 12422979 12380266 12221297 12054950 11868890 11725511 11563537 11448483
4083 11448483 11368302 11317862 11256615 11011396 10998175 10962357 10859407 10923461 10949085 10864337 10785254
4072 10785254 10739501 10703489 10524514 10443564 10408868 10239004 10197450 10146118 10092255 10010502 9867733
4061 9867733 9823157 9815585 9665853 9616188 9687510 9766475 9812017 9820127 9863727 9825825 9842618 9814155
$$ packed form
4128C2501323j348440j373995j325969j200149j055680j004112r42475p75865
4120B3474638p26403o57832n61392n35961o02938o11937m87108m97945l86909
4111A8406213m73850m66905m08363k90474j24834l58983l29374k81127k93161
4102A5379142l00464k50045l13124l29471l14741l14433k54880k16536j72542
4093A2912906j64885j64121j60921m2713j58969j66347j86060j43379j61974j15054
4083A1448483q0181n0440o1247k45219j3221l5818j02950O4054K5624q4748p9083
4072A0785254m5753l6012j78975q0950l4696j69864m1554n1332n3863q1753j42769
4061I867733m4576p572j49732m9665P1322P8965M5542Q110M3600l7902J6793k8463
$$ plain form
4049 9814155 9854690 9891022 9963443 10043090 10157270 10308370 10425694 10593506 10671136 10721100 10789506
4038 10789506 10964147 11249490 11465909 11502978 11710383 11979698 12055511 12145956 12340191 12535512
4028 12535512 12767314 12950047 13255691 13425555 13699809 14011892 14172122 14497708 14860651
4019 14860651 15245699 15604694 15935759 16345127 16657092 16969408 17296284 17617001 17994359
4010 17994359 18306540 18733769 19141097 19549200 19955187 20385508 20824615 21403012 21952343
4001 21952343 22472889 23102225 23610448 24077985 24688326 25452105 26119183 26699846 27434654
3992 27434654 28188517 29107703 29901141 30688952 31556612 32401889 33293789 34248517 35357179
3983 35357179 36368256 37407957 38485651 39646793 40803115 41985238 43263026 44490281
$$ packed form
4049I814155M0535L6332P2421P9647J14180J51100J17324J67812P7630M9964O8406
4038A0789506J74641K85343K16419L7069K07405K69315P5813R0445J94235J95321
4028A2535512K31802J82733L05644J69864K74254L12083J60230L25586L62943
4019A4860651L85048L58995L31065M09368L11965L12316L26876L20717L77358
4010A7994359L12181M27229M07328M08103M05987M30321M39107N78397N49331
4001B1952343N20546O29336N08223M67537O10341P63779O67078N80663P34808
3992B7434654P53863R19186P93438P87811Q67660Q45277Q91900R54728J108662
3983C5357179J011077J039701J077694J161142J156322J182123J277788J227255
$$ plain form
3975 44490281 45711937 46921352 48175840 49406454 50813529 52135134 53318147 54656127
3967 54656127 55917940 57148717 58342218 59419809 60642500 61824969 62722010 63510418
3959 63510418 64361225 65117799 65864040 66469709 66918752 67228544 67465483 67596189 67523599 67431328
3949 67431328 67296102 66996700 66574548 66003035 65398660 64554628 63606920 62694769 61660701
3940 61660701 60575340 59382460 58149544 56958403 55504412 53986201 52554510 50913163
3932 50913163 49485812 47961270 46461438 44948677 43368571 41842471 40345284 38915117
3924 38915117 37440726 35932386 34454261 33023845 31745811 30352699 29042391 27763580
3916 27763580 26543046 25480054 24495648 23382237 22405643 21534809 20666583 19874382 18968334
$$ packed form
3975D4490281J221656J209415J254488J230614J407075J321605J183013J337980
3967E4656127J261813J230777J193501J077591J222691J182469Q97041P88408
3959F3510418Q50807P56574P46241O05669M49043L09792K36939J30706p2590r2271
3949F7431328j35226k99402m22152n71513o04375q44032r47708r12151j034068
3940F1660701j085361j192880j232916j191141j453991j518211j431691j641347
3932E0913163j427351j524542j499832j512761j580106j526100j497187j430167
3924C8915117j474391j508340j478125j430416j278034j393112j310308j278811
3916B7763580j220534j062992r84406j113411r76594q70834q68226p92201r06048
$$ plain form
3907 18968334 18257701 17509639 16832893 16196290 15560342 14957354 14333468 13828534 13312488
3898 13312488 12902927 12415442 12077355 11835380 11481590 11232191 10944685 10690153 10401605
3889 10401605 10191110 10069320 9826524 9672505 9600584 9433760 9345261 9247849 9144587 9237341
3879 9237341 9218690 9142270 9150745 9130129 9061724 9005257 8961072 8703469 8402916 7950159 7637050
3868 7637050 7337882 7192320 7107038 6885091 6737840 6617735 6544896 6439702 6324494 6354968
3858 6354968 6282223 6132270 6057476 5899578 5785804 5734195 5713004 5606379 5521671 5430090 5356396
3847 5356396 5440025 5376371 5337405 5419818 5331354 5319595 5221002 5158478 5092768 5076803 5072739 5148681
3835 5148681 5093986 4994163 4981911 4862159 4836780 4981463 5041157 4883803 4930342 4971451 4980712
$$ packed form
3907A8968334p10633p48062o76746o36603o35948o02988o23886n04934n16046
3898A3312488m09561m87485l38087k41975l53790k49399k87506k54532k88548
3889A0401605k10495j21790k42796j54019p1921j66824q8499r7412j03262R2754
3879I237341j8651p6420Q475k0616o8405n6467m4185k57603l00553m52757l13109
3868G637050k99168j45562q5282k21947j47251j20105p2839j05194j15208L0474
3858F354968p2745j49953p4794j57898j13774n1609k1191j06625q4708r1581p3694
3847E356396Q3629o3654l8966Q2413q8464j1759r8593o2524o5710j5965m064P5942
3835E148681n4695r9823j2252j19752k5379J44683N9694j57354M6539M1109R261
$$ plain form
3824 4980712 4988591 4969054 4941053 4936977 4864036 4903369 4876644 4810797 4919030 4876702 4867025 4937870
3812 4937870 4862039 4835648 4862382 4758619 4754356 4903335 4879585 4819884 4709897 4748947 4819563
3801 4819563 4839591 4848197 4792193 4870520 4793929 4858710 5011477 5048951 5077409 5039747 5017170
3790 5017170 5061187 5023376 4968258 4990231 4958060 4958415 4995471 5032431 5023418 5029386 5111886 5065359
3778 5065359 5091839 5132836 5268736 5275978 5237921 5314860 5355175 5409981 5487659 5551187 5531688
3767 5531688 5613349 5687353 5746178 5803722 5744348 5793058 5876385 5960381 5991497 6002014 6122032
3756 6122032 6198598 6374711 6436525 6587159 6663540 6743860 6788972 6935494 7099563 7143711 7161879
3745 7161879 7190498 7255993 7296240 7311683 7290730 7465214 7561011 7571349 7682775 7760466 7743805
$$ packed form
3824D980712P879j9537k8001m076p2941L9333k6725o5847J08233m2328r677P0845
3812D937870p5831k6391K6734j03763m263J48979k3750n9701j09987L9050P0616
3801D819563K0028Q606n6004P8327p6591O4781J52767L7474K8458l7662k2577
3790E017170M4017l7811n5118K1973l2171L55L7056L6960r013N968Q2500m6527
3778E065359K6480M0997J35900P242l8057P6939M0315N4806P7678O3528j9499
3767E531688Q1661P4004N8825N7544n9374M8710Q3327Q3996L1116J0517J20018
3756F122032P6566J76113O1814J50634P6381Q0320M5112J46522J64069M4148J8168
3745G161879K8619O5495M0247J5443k0953J74484R5797J0338J11426P7691j6661
$$ plain form
3734 7743805 7788686 7796168 7858971 7903494 7975359 8000907 7970880 7939384 7882766 7892071 8063574 8113777
3722 8113777 8153084 8302268 8282687 8369048 8391135 8438502 8590803 8720583 8838452 8838857 8927239
3711 8927239 9147028 9265477 9336024 9398630 9607142 9766937 9894430 10100012 10237112 10393468
3701 10393468 10492195 10577566 10829435 11064169 11236548 11439773 11483492 11771753 12070024 12281812
3691 12281812 12509807 12781729 13000777 13203225 13510333 13796251 13983473 14347901 14695344
3682 14695344 14965475 15286530 15535152 15975664 16414997 16766998 17317756 17796520 18277070
3673 18277070 18726755 19142141 19697127 20241043 20784703 21324183 21912370 22496846 23077330
3664 23077330 23725521 24425912 25074425 25808337 26421004 27123130 27861048 28501442 29087312
$$ packed form
3734G743805M4881P482O2803M4523P1865K5548l0027l1496n6618R305J71503N0203
3722H113777L9307J49184j9581Q6361K2087M7367J52301J29780J17869M05Q8382
3711H927239K19789J18449P0547O2606K08512J59795J27493K05582J37100J56356
3701A0393468R8727Q5371K51869K34734J72379K03225M3719K88261K98271K11788
3691A2281812K27995K71922K19048K02448L07108K85918J87222L64428L47443
3682A4695344K70131L21055K48622M40512M39333L52001N50758M78764M80550
3673A8277070M49685M15386N54986N43916N43660N39480N88187N84476N80484
3664B3077330O48191P00391O48513P33912O12667P02126P37918O40394N85870
$$ plain form
3655 29087312 29777496 30508415 31185746 31827943 32614083 33315972 33809552 34378613 35074575
3646 35074575 35667666 36219284 36925705 37504200 38222077 38952688 39622091 40339904 41145369
3637 41145369 41857903 42631920 43410987 44111614 44923622 45777361 46589181 47567309 48460890
3628 48460890 49471459 50446318 51356041 52404309 53381793 54318335 55252511 56312044 57296353
3619 57296353 58238787 59298712 60415769 61371003 62412396 63360729 64379639 65271658 66050717
3610 66050717 66843383 67702964 68430728 69082022 69734398 70326810 70794310 71252076 71736836
3601 71736836 72198588 72653935 72884404 73185565 73558657 73840240 74118640 74354946 74691077
3592 74691077 75003899 75239384 75509128 75894689 76362160 76906448 77500336 78130460 78743564
$$ packed form
3655B9087312O90184P30919O77331O42197P86140P01889M93580N69061O95962
3646C5074575N93091N51618P06421N78495P17877P30611O69403P17813Q05465
3637D1145369P12534P74017P79067P00627Q12008Q53739Q11820R78128Q93581
3628D8460890J010569R74859R09723J048268R77484R36542R34176J059533R84309
3619E7296353R42434J059925J117057R55234J041393R48333J018910Q92019P79059
3610F6050717P92666Q59581P27764O51294O52376N92412M67500M57766M84760
3601G1736836M61752M55347K30469L01161L73092K81583K78400K36306L36131
3592G4691077L12822K35485K69744L85561M67471N44288N93888O30124O13104
$$ plain form
3583 78743564 79534688 80301867 81272892 82336596 83468407 84689570 85823012 87112685 88516739
3574 88516739 89895389 91313124 92862560 94303592 95800072 97130414 98488546 99770940
3566 99770940 100901383 102071061 103294437 104307710 105264952 106084721 106845540 107623277 108309140
3557 108309140 108918387 109467013 110051888 110686340 111089188 111620665 112281776 112960897 113830957
3548 113830957 114816327 115928538 117211948 118634225 120259523 122016452 123991205 126050814
3540 126050814 128016142 129916444 131688292 133392163 134744396 135827731 136567325 136908745
3532 136908745 137202558 137118387 136829641 136394474 135824107 135110001 134401693 133403428 132253055
3523 132253055 131039509 129258823 127346069 125338228 122963308 120502816 117934186 115324211
$$ packed form
3583G8743564P91124P67179R71025J063704J131811J221163J133442J289673J404054
3574H8516739J378650J417735J549436J441032J496480J330342J358132J282394
3566I9770940J130443J169678J223376J013273R57242Q19769P60819P77737O85863
3557A08309140O09247N48626N84875O34452M02848N31477O61111O79121Q70060
3548A13830957R85370J112211J283410J422277J625298J756929J974753K059609
3540A26050814J965328J900302J771848J703871J352233J083335P39594L41420
3532A36908745K93813q4171k88746m35167n70367p14106p08308r98265j150373
3523A32253055j213546j780686j912754k007841k374920k460492k568630k609975
$$ plain form
3515 115324211 112959247 110556438 108264543 106273438 104447677 102929211 101685438 100464026
3507 100464026 99539738 98802594 98181260 97782258 97498419 97180161 97037530 96861445 96736279
3498 96736279 96667249 96498953 96351230 96116346 95727617 95378739 94905882 94330974 93452664 92578233
3488 92578233 91707571 90840440 89734016 88492790 87273499 85917819 84411227 82761893
3480 82761893 81177976 79493189 77792160 75974935 74187703 72364624 70556038 68784723
3472 68784723 67001742 65207636 63571682 61911041 60333443 58818169 57523424 56237235
3464 56237235 54875088 53756418 52505976 51458178 50468977 49622796 48858302 48141686 47570148
3455 47570148 47033676 46594847 46180423 45828584 45491990 45346627 45105282 44794656 44576025
$$ packed form
3515A15324211k364964k402809k291895j991105j825761j518466j243773j221412
3507A00464026r24288p37144o21334l99002k83839l18258j42631j76085j25166
3498I6736279o9030j68296j47723k34884l88729l48878m72857n74908q78310q74431
3488I2578233q70662q67131j106424j241226j219291j355680j506592j649334
3480H2761893j583917j684787j701029j817225j787232j823079j808586j771315
3472F8784723j782981j794106j635954j660641j577598j515274j294745j286189
3464E6237235j362147j118670j250442j047798r89201q46181p64494p16616n71538
3455D7570148n36472m38829m14424l51839l36594j45363k41345l10626k18631
$$ plain form
3446 44576025 44433570 44283012 44161109 44044640 43895428 43616533 43395122 43120244 42765773
3437 42765773 42433550 42050578 41564598 41015821 40417522 39818535 39239364 38518762 37727500
3428 37727500 37014632 36260668 35440263 34563391 33666987 32865718 31919311 30850265 29983197
3419 29983197 29063586 28121346 27218698 26146450 25284248 24350981 23379483 22587180 21829921
3410 21829921 21043748 20189806 19333257 18552290 17728107 17080260 16490839 15927554 15458955
3401 15458955 14898668 14234756 13779915 13206288 12687406 12305476 12042617 11709616 11414422
3392 11414422 11053985 10787506 10457392 10167662 9956345 9691128 9423540 9277702 9106589
3383 9106589 8801901 8668977 8545817 8399050 8229601 8112787 7946573 7830515 7686944 7600299
$$ packed form
3446D4576025j42455j50558j21903j16469j49212k78895k21411k74878l54471
3437D2765773l32223l82972m85980n48777n98299n98987n79171p20602p91262
3428C7727500p12868p53964q20405q76872q96404q01269r46407j069046q67068
3419B9983197r19611r42240r02648j072248q62202r33267r71498p92303p57259
3410B1829921p86173q53942q56549p80967q24183o47847n89421n63285m68599
3401A5458955n60287o63912m54841n73627n18882l81930k62859l33001k95194
3392A1414422l60437k66479l30114k89730k11317k65217k67588j45838j71113
3383I106589l04688j32924j23160j46767j69449j16814j66214j16058j43571q6645
$$ plain form
3373 7600299 7315003 7248405 7057989 6871870 6888483 6803286 6706404 6541863 6371952 6360698
3363 6360698 6276742 6218794 5997921 5905956 5905473 5753189 5783646 5629583 5565901 5586836 5445289
3352 5445289 5324094 5235524 5223968 5173309 5090381 5159133 5105475 5037847 5025909 5026897 4918203
3341 4918203 4939885 4981802 4936166 4950044 4920319 4881873 4786943 4855316 4863262 4887057 4829804 4863867
3329 4863867 4835342 4846126 4856227 4911427 4864979 4781006 4778629 4718948 4732923 4699088 4739511 4736660
3317 4736660 4825225 4867940 4782113 4837112 4842642 4987393 5056550 5143374 5137960 5271823 5384233
3306 5384233 5473354 5683718 5916704 6211558 6390262 6664336 6710613 6701839 6546522 6440981
3296 6440981 6279015 6271103 6197921 6147973 5984003 5926063 5943034 5952055 6002050 5843753 5823073
$$ packed form
3373G600299k85296o6598j90416j86119J6613q5197r6882j64541j69911j1254
3363F360698q3956n7948k20873r1965m83j52284L0457j54063o3682K0935j41547
3352E445289j21195q8570j1556n0659q2928O8752n3658o7628j1938R88j08694
3341D918203K1682M1917m5636J3878k9725l8446r4930O8373P946K3795n7253L4063
3329D863867k8525J0784J0101N5200m6448q3973k377n9681J3975l3835M0423k851
3317D736660Q8565M2715q5827N4999N530J44751O9157Q6824n414J33863J12410
3306E384233Q9121K10364K32986K94854J78704K74074M6277q774j55317j05541
3296F440981j61966p912p3182m9948j63970n7940J6971R021M9995j58297k0680
$$ plain form
3285 5823073 5883231 5968213 6011422 6125992 6189265 6403189 6535777 6750678 6907602 7194757
3275 7194757 7480184 7744087 7969588 8128357 8284191 8220231 8261271 8438853 8582484 8739765
3265 8739765 9010127 9219129 9518328 9669350 9920739 10048270 9982172 9917118 9679006 9294935
3255 9294935 8906992 8560159 8220247 7776421 7432478 7188470 7078722 6707950 6487685 6260799
3245 6260799 6129782 6026202 5854729 5736047 5695474 5552659 5310670 5202048 5173255 5174432
3235 5174432 5120486 5099046 5041239 5054180 4992402 4942545 4862766 4730956 4721424 4663443 4590186
3224 4590186 4500297 4214767 4152705 4064405 4030459 3906871 3738386 3623769 3497020 3547778
3214 3547778 3558306 3474120 3552826 3495559 3501853 3370639 3280207 3342488 3347999 3254285 3204474 3173978
$$ packed form
3285E823073O0158Q4982M3209J14570O3273K13924J32588K14901J56924K87155
3275G194757K85427K63903K25501J58769J55834o3960M1040J77582J43631J57281
3265H739765K70362K09002K99199J51022K51389J27531o6098o5054k38112l84071
3255I294935l87943l46833l39912m43826l43943k44008j09748l70772k20265k26886
3245F260799j31017j03580j71473j18682m0573j42815k41989j08622k8793J177
3235E174432n3946k1440n7807J2941o1778m9857p9779j31810r532n7981p3257
3224D590186q9889k85530o2062q8300l3946j23588j68485j14617j26749N0758
3214C547778J0528q4186P8706n7267O294j31214r0432O2281N511r3714m9811l0496
$$ plain form
3202 3173978 3179863 3192156 3220274 3293176 3173902 3222141 3323247 3304524 3223107 3220029 3096564
3191 3096564 3036851 2993925 2956978 2948574 2875944 2823011 2807658 2780530 2826763 2815929 2754184 2825307
3179 2825307 2945123 3021667 3031198 3069503 3119563 3222884 3287939 3450235 3614779 3805293 4123364
3168 4123364 4358951 4563909 4775298 4847328 4855825 4665818 4355659 3976005 3683130 3507861
3158 3507861 3224303 2978884 2808751 2644411 2658741 2643516 2569416 2546202 2486852 2546398 2617859
3147 2617859 2629827 2740532 2887490 3044212 3174751 3356480 3559198 3704836 3938958 4070309
3137 4070309 4218103 4169117 3762537 3565893 3327363 2886721 2520826 2404702 2302144 2143625
3127 2143625 2027283 1836788 1861625 1806824 1742077 1702966 1705150 1569981 1571878 1557016 1476258
$$ packed form
3202C173978N885J2293K8118P2902j19274M8239J01106j8723q1417l078j23465
3191C096564n9713m2926l6947q404p2630n2933j5353k7128M6233j0834o1745P1123
3179B825307J19816P6544R531L8305N0060J03321O5055J62296J64544J90514L18071
3168D123364K35587K04958K11389P2030Q497j90007l10159l79654k92875j75269
3158C507861k83558k45419j70133j64340J4330j5225p4100k3214n9350N9546P1461
3147B617859J1968J10705J46958J56722J30539J81729K02718J45638K34122J31351
3137D070309J47794m8986m06580j96644k38530m40642l65895j16124j02558j58519
3127B143625j16342j90495K4837n4801o4747l9111K184j35169J897j4862q0758
$$ plain form
3116 1476258 1384857 1404992 1544555 1470991 1391409 1359739 1358483 1298021 1277851 1346279 1351348 1182573
3104 1182573 1143780 1228603 1332074 1248621 1121226 1202697 1119164 1079985 1082889 997443 951104
3093 951104 952721 949303 875968 912110 975004 997340 920462 813028 841031 864236 744960 788166
3081 788166 852587 830377 702130 661586 687015 745769 785366 779902 791627 763199 794338 750118
3069 750118 703375 639078 601505 699078 781274 725943 650904 635361 648436 686001 634442 681607
3057 681607 549190 532115 460018 424056 550987 548771 520518 463072 611051 592373 684573
3046 684573 620255 503311 529668 434523 386756 381864 433604 448020 418821 349186 263584 387385
3034 387385 459022 456618 540286 596176 581106 642455 578660 439479 422356 458337 515074 569731
$$ packed form
3116A476258r1401K0135J39563p3564p9582l1670j256o0462k0170O8428N069j68775
3104A182573l8793Q4823J03471q3453j27395Q1471q3533l9179K904q5446m6339
3093I51104J617l418p3335L6142O2894K2336p6878j07434K8003K3205j19276M3206
3081G88166O4421k2210j28247m0544K5429N8754L9597n464J1725k8428L1139m4220
3069G50118m6743o4297l7573R7573Q2196n5331p5039j5543J3075L7565n1559M7165
3057F81607j32417j7075p2097l5962J26931k216k8253n7446J47979j8678R2200
3046F84573o4318j16944K6357r5145m7767m892N1740J4416k9199o9635q5602J23801
3034C87385P1637k404Q3668N5890j5070O1349o3795j39181j7123L5981N6737N4657
$$ plain form
3022 569731 594035 454593 410584 517818 606050 611352 633418 507068 490923 432481 469430
3011 469430 512909 456794 414034 450853 462343 390285 464012 550402 524706 495113 472078 515064
2999 515064 528620 443073 448922 438811 508749 334348 362032 329360 391477 499487 417636
2988 417636 425152 484904 525692 638629 699779 686459 613358 509056 508417 549918 593712 543003
2976 543003 489915 423675 375076 432043 466884 594435 529730 571560 617250 643943 642364 563376
2964 563376 588427 576198 617189 660239 648156 589286 596222 696972 740388 589364 641083
2953 641083 572971 689416 848933 799967 813824 802914 804569 816917 869313 874855 888120 926290
2941 926290 899616 908247 874577 942062 971514 957378 967745 903738 949314 1062124 993706 915630
$$ packed form
3022E69731K4304j39442m4009J07234Q8232N302K2066j26350j6145n8442L6949
3011D69430M3479n6115m2760L6819J1490p2058P3727Q6390k5696k9593k3035M2986
2999E15064J3556q5547N849j0111O9938j74401K7684l2672O2117J08010q1851
2988D17636P516N9752M0788J12937O1150j3320p3101j04302o39M1501M3794n0709
2976E43003n3088o6240m8599N6967L4841J27551o4705M1830M5690K6693j579p8988
2964E63376K5051j2229M0991M3050j2083n8870O936J00750M3416j51024N1719
2953F41083o8112J16445J59517m8966J3857j0910J655J2348N2396N542J3265L8170
2941I26290k6674Q631l3670O7485K9452j4136J0367o4007M5576J12810o8418p8076
$$ plain form
2929 915630 899768 873004 903040 949530 943636 1084992 1134211 1082073 1131249 1151058 1176458 1211896
2917 1211896 1273985 1342623 1278459 1138794 1155212 1103134 1093982 1202394 1245159 1114822 1016875
2906 1016875 1051008 989798 960079 1011430 1019077 1088957 1137507 1098224 1125227 1153889 1272197
2895 1272197 1228002 1186409 1147541 1135972 1089095 1103593 1098001 1125587 1054659 984890 1044351 1108029
2883 1108029 1047396 977572 1009701 1007650 935751 873873 868307 866368 929261 808199 741682 758989
2871 758989 773944 814206 749275 784359 835029 843576 772411 709353 755132 746193 614151 542764
2859 542764 623751 652123 628642 448298 466642 518316 506932 492717 453486 423369 513346
2848 513346 475435 433941 393896 340968 352118 393397 329261 302785 303409 240716 232983 306135
$$ packed form
2929I15630j5862k6764L0036M6490n894J41356M9219n2138M9176J9809K5400L5438
2917A211896O2089O8638o4164j39665J6418n2078r152J08412M2765j30337r7947
2906A016875L4133o1210k9719N1351P647O9880M8550l9283K7003K8662J18308
2895A272197m4195m1593l8868j1569m6877J4498n592K7586p0928o9769N9461O3678
2883A108029o0633o9824L2129k051p1899o1878n566j939O2893j21062o6517J7307
2871G58989J4955M0262o4931L5084N0670Q547p1165o3058M5779q939j32042p1387
2859E42764Q0987K8372k3481j80344J8344N1674j1384j4215l9231l0117Q9977
2848E13346l7911m1494m0045n2928J1150M1279o4136k6476O24o2693p733P3152
$$ plain form
2836 306135 349059 288003 289883 350773 314066 249740 227908 166616 298446 362842 309457 268707
2824 268707 227394 316340 223003 209940 265763 212521 183224 142966 214611 174924 71040
2813 71040 172673 257542 234427 267321 233738 166369 97590 65525 114873 69829 86292 139538
2801 139538 139501 75243 135915 161031 142417 100070 63059 143578 188338 229932 223998 152382
2789 152382 182016 119397 77849 59693 95945 85599 83266 194313 181863 180519 153997 97200
2777 97200 96435 128321 178347 158747 60638 79409 40391 40114 51106 5370 38883 -19047 61357
2764 61357 91777 -12711 12522 139132 122866 106776 50421 -9766 55124 -48428 -64669
2753 -64669 -90781 -86557 -105769 -31426 -2787 46014 -29510 31666 -2889 -9225 -20068 -13676
$$ packed form
2836C06135M2924o1056J880O0890l6707o4326k1832o1292J31830O4396n3385m0750
2824B68707m1313Q8946r3337j3063N5823n3242k9297m0258P1645l9687j03884
2813G1040J01633Q4869k3115L2894l3583o7369o8779l2065M9348m5044J6463N3246
2801A39538l7o4258O0672K5116j8614m2347l7011Q0519M4760M1594n934p1616
2789A52382K9634o2619m1548j8156L6252j0346k333J11047j2450j344k6522n6797
2777I7200p65L1886N0026j9600r8109J8771l9018k77J0992m5736L3513n7930Q0404
2764F1357L0420j04488K5233J26610j6266j6090n6355o0187O4890j03552j6241
2753f4669k6112M224j9212P4343K8639M8801p5524O1176l4555o336j0843O392
$$ plain form
2741 -13676 83211 93437 71561 -14001 -64635 -30534 59920 27433 40885 119580 -96224 -78186
2729 -78186 -4710 6368 61438 -40019 15277 132812 141610 122483 110356 17362 22951 -67779
2717 -67779 -60427 -18371 -42159 -21177 27099 13962 -6004 30509 88569 4282 -61525 -41308
2705 -41308 -34877 -105994 -173246 -204305 -102139 -32577 -123302 -150993 -175143 -31044 -79787 -95605
2693 -95605 -30697 -42241 -63901 -90432 -19265 -100408 -171126 -126132 -47183 -38094 70175 10734
2681 10734 -94177 -150236 -147588 -105371 -108546 -100527 -194813 -160889 -107075 -56953 -94947 -164984
2669 -164984 -96301 -75873 -119751 -100844 32219 27399 35450 -52218 -134679 -208713 -189624 -137666
2657 -137666 -156247 -132878 -50105 96696 75764 -42996 -73403 4325 -1789 -52217 -29556
$$ packed form
2741a3676R6887J0226k1876q5562n0634L4101R0454l2487J3452P8695k15804J8038
2729g8186P3476J1078N5070j01457N5296J17535Q798j9127j2127r2994N589r0730
2717f7779P352M2056k3788K0982M8276j3137j9966L6513N8060q4287o5807K0217
2705d1308O431p1117o7252l1059J02166O9562r0725k7691k4150J44099m8743j5818
2693i5605O4908j1544k1660k6531P1167q1143p0718M4994P8949R089J08269n9441
2681A0734j04911n6059K648M2217l175Q019r4286L3924N3814N0122l7994p0037
2669a64984O8683K0428m3878J8907J33063m820Q051q7668q2461p4034J9089N1958
2657a37666j8581K3369Q2773J46801k0932j18760l0407P7728o114n0428K2661
$$ plain form
2646 -29556 51008 11236 -61711 -9102 66331 36972 64964 26000 -72452 -95440 -44143 -84457
2634 -84457 -89739 -92744 25390 33831 -6653 -99949 -144061 -191116 -92232 -43354 -55150 -66769
2622 -66769 -133368 -20135 20763 -11751 -24717 22744 11615 32403 -27359 -141072 -122320
2611 -122320 -64070 -43438 -76029 -124052 -54792 -26884 48055 -5940 -138848 -116755 -27090
2600 -27090 -44459 12377 -65924 8774 -44612 -2385 -94322 -153758 -105300 -163430 -84209 -47975
2588 -47975 -32267 -40294 -65143 -63757 -70087 -24964 -84972 -93046 -32706 -66193 -86449 -31137 -38745
2575 -38745 -108546 -119181 -162039 -141458 -156776 -172542 -135168 -136581 -98293 -139064 -141351 -97546
2563 -97546 -43974 -133939 -213093 -161652 -79353 -65818 -85237 -92956 -70581 -37124 -120225 -55114
$$ packed form
2646b9556Q0564l9772p2947N2609P5433k9359K7992l8964r8452k2988N1297m0314
2634h4457n282l005J18134Q441m0484r3296m4112m7055R8884M8878j1796j1619
2622f6769o6599J13233M0898l2514j2966M7461j1129K0788n9762j13713J8752
2611a22320N8250K0632l2591m8023O9260K7908P4939n3995j32908K2093Q9665
2600b7090j7369N6836p8301P4698n3386M2227r1937n9436M8458n8130P9221L6234
2588d7975J5708q027k4849J386o330M5123o0008q074O0340l3487k0256N5312p608
2575c8745o9801j0635m2858K0581j5318j5766L7374j413L8288m0771k287M3805
2563i7546N3572q9965p9154N1441Q2299J3535j9419p719K2375L3457q3101O5111
$$ plain form
2551 -55114 -120289 -139246 -169307 -76847 -105934 -128240 -69604 -101410 -97855 -75212 -66266 -10811
2539 -10811 -7016 -120842 -177083 -69857 -116722 -118586 -86723 -48713 54512 5243 -45348 -22101
2527 -22101 -61354 -78414 -148001 -12053 -47947 -100667 -66446 -118618 -119755 12018 26753 -91804
2515 -91804 -182816 -205808 -49134 -15100 -47912 -37663 -100988 -175094 -127277 -134982 -97350 -99666
2503 -99666 -75118 -42365 -44655 -52662 -108701 -79946 -159868 -153162 -108769 -94933 -6362 -69609
2491 -69609 -92802 -49886 -91254 -66840 -82916 -106817 -87467 -31837 -16138 -29261 -63658 -173068
2479 -173068 -152626 -122534 -67949 -121115 -126420 -86641 -151137 -128284 -47210 -93559 -74908 -94414
2467 -94414 -114965 -56040 -140972 -119626 -48053 -65939 -78631 -119569 -94962 -106221 -120928 -83017
$$ packed form
2551e5114o5175j8957l0061R2460k9087k2306N8636l1806L555K2643Q946N5455
2539a0811L795j13826n6241J07226m6865j864L1863L8010J03225m9269n0591K3247
2527b2101l9253j7060o9587J35948l5894n2720L4221n2172j137J31773J4735j18557
2515i1804r1012k2992J56674L4034l2812J0249o3325p4106M7817p705L7632k316
2503i9666K4548L2753k290q007n6039K8755p9922O706M4393J3836Q8571o3247
2491f9609k3193M2916m1368K4414j6076k3901J9350N5630J5699j3123l4397j09410
2479a73068K0442L0092N4585n3166n305L9779o4496K2853Q1074m6349J8651j9506
2467i4414k0551N8925q4932K1346P1573j7886j2692m0938K4607j1259j4707L7911
$$ plain form
2455 -83017 -155915 -93954 -29971 -32500 3889 -50664 -69814 -22252 13384 -59196 -176459 -214230
2443 -214230 -99342 -130570 -82486 -55954 -49586 -34472 -71828 -14630 -62826 -90850 -149033 -194089
2431 -194089 -211461 -147554 -123373 -73170 -67640 -113616 -101609 -138430 -19236 -7644 -80302 -151171
2419 -151171 -53655 703 -73842 -48268 -4877 -62222 -25571 9905 -40620 -88417 -137048 -86847
2407 -86847 -98281 -37974 6635 -4299 -29838 -52415 -12701 -59327 7575 -24130 -23897 58407
2395 58407 27807 12992 -34994 -62937 26271 100838 144626 173356 27395 -46428 91841
2384 91841 123193 123260 136916 94316 111041 200398 143219 92832 -28176 16444 94919 85931
2372 85931 102164 128911 -47537 -131147 -33229 -72977 -88601 -46398 -5982 768 50938 58697
$$ packed form
2455h3017p2898O1961O3983k529L6389n4553j9150M7562L5636p2580j17263l7771
2443b14230J14888l1228M8084K6532O368J5114l7356N7198m8196k8024n8183m5056
2431a94089j7372O3907K4181N0203N530m5976J2007l6821J19194J1592p2658p0869
2419a51171R7516N4358p4545K5574M3391n7345L6651L5476n0525m7797m8631N0201
2407h6847j1434O0307M4609j0934k5539k2577L9714m6626O6902l1705K33Q2304
2395E8407l0600j4815m7986k7943Q9208P4567M3788K8730j45961p3823J38269
2384I1841L1352O7J3656m2600J6725Q9357n7179n0387j21008M4620P8475q988
2372H5931J6233K6747j76448q3610R7918l9748j5624M2203M0416O750N0170P759
$$ plain form
2360 58697 1974 -38728 15387 -47708 -9049 -47380 13937 5182 -5546 -39215 -35404 -11318
2348 -11318 -27868 -5882 41831 93442 66452 35965 41416 -44887 46270 136723 77976 71640
2336 71640 144415 67336 -66618 -111039 -159816 -67326 47024 85032 40243 32926 -59138 -17894
2324 -17894 -32632 -85278 -26614 7289 34425 47468 52067 10836 -5730 9869 17 106143
2312 106143 85663 77557 107182 5144 -8210 63636 48336 -13002 52656 99007 145293 23944
2300 23944 33425 64324 125227 174125 107590 173164 164153 135973 190464 230245 202629 227756
2288 227756 179334 88842 118306 110104 151616 199925 167671 138337 98369 36650 5485 41247
2276 41247 77716 57385 19541 11452 111373 66967 155950 164310 51135 95851 106020 48992
$$ packed form
2360E8697n6723m0702N4115o3095L8659l8331O1317q755j0728l3669L811K4086
2348a1318j6550K1986M7713N1611k6990l0487N451q6303R1157R0453n8747o336
2336G1640P2775p7079j33954m4421m8777R2490J14350L8008m4789p317r2064M1244
2324a7894j4738n2646N8664L3903K7136J3043M599m1231j6566J5599r852J06126
2312A06143k0480q106K9625j02038j3354P1846j5300o1338O5658M6351M6286j21349
2300B3944R481L0899O0903M8898o6535O5574r011k8180N4491L9781k7616K5127
2288B27756m8422r0492K9464q202M1512M8309l2254k9334l9968o1719l1165L5762
2276D1247L6469k0331l7844q089R9921m4406Q8983Q360j13175M4716J0169n7028
$$ plain form
2264 48992 96043 110151 78739 67399 126532 144926 120018 218980 230425 299848 295246 167416
2252 167416 143292 162948 114583 118468 185411 109356 111524 121180 149967 175404 201626 254931
2240 254931 359521 337897 315401 384377 321795 278055 310702 376545 297169 261661 293910
2229 293910 275693 247402 262625 218407 230616 166650 225216 334403 359694 364535 444726 450638
2217 450638 457339 374239 479179 475753 551150 582166 533857 581728 629815 646128 638914 648797
2205 648797 731173 831031 714212 698476 662275 707089 739427 907014 892921 847218 900824
2194 900824 953800 1103980 1061297 1017986 955529 933881 953613 993850 993208 1049775 1090308 1143379
2182 1143379 1168363 1228430 1162265 1220068 1228719 1313589 1423718 1508756 1494642 1542160 1603507
$$ packed form
2264D8992M7051J4108l1412j1340N9133J8394k4908R8962J1445O9423m602j27830
2252A67416k4124J9656m8365L885O6943p6055K168R656K8787K5437K6222N3305
2240B54931J04590k1624k2496O8976o2582m3740L2647O5843p9376l5508L2249
2229B93910j8217k8291J5223m4218J2209o3966N8566J09187K5291M841Q0191N912
2217D50638O701q3100J04940l426P5397L1016m8309M7871M8087J6313p214R883
2205F48797Q2376R9858j16819j5736l6201M4814L2338J67587j4093m5703N3606
2194I00824N2976J50180m2683m3311o2457k1648J9732M0237o42N6567M0533N3071
2182A143379K4984O0067o6165N7803Q651Q4870J10129Q5038j4114M7518O1347
$$ plain form
2171 1603507 1464521 1516205 1640793 1659030 1603601 1625082 1662641 1914573 1950503 2074414 2126417
2160 2126417 2137682 2296769 2379080 2407479 2549796 2680730 2764213 2958459 3069736 3200726
2150 3200726 3335069 3449139 3607541 3768970 3947484 4185505 4482043 4637352 4835532 5131276
2140 5131276 5359711 5602521 5986918 6440777 7023846 7559137 8148770 8780395 9345371 10068722
2130 10068722 11078875 12009218 13283055 15155545 17459673 20348690 23760484 27916537
2122 27916537 33490489 40072664 46561089 52785429 53527881 45649429 34803426 26539959
2114 26539959 21325219 17691265 15168235 13293235 11763249 10541282 9549812 8698584
2106 8698584 8158720 7697406 7363574 6897896 6278502 5544478 5003601 4665644 4436296 4201421
$$ packed form
2171A603507j38986N1684J24588J8237n5429K1481L7559K51932L5930J23911N2003
2160B126417J1265J59087Q2311K8399J42317J30934Q3483J94246J11277J30990
2150C200726J34343J14070J58402J61429J78514K38021K96538J55309J98180K95744
2140E131276K28435K42810L84397M53859N83069N35291N89633O31625N64976P23351
2130A0068722J010153R30343J273837J872490K304128K889017L411794M156053
2122B7916537N573952O582175O488425O224340P42452p878452j0846003q263467
2114B6539959n214740l633954k523030j875000j529986j221967r91470q51228
2106H698584n39864m61314l33832m65678o19394p34024n40877l37957k29348k34875
$$ plain form
2096 4201421 3929984 3621537 3320155 3149186 2902437 2767011 2751831 2756910 2653771 2558664
2086 2558664 2408905 2331933 2148496 1912067 1836617 1842121 1759565 1698982 1755527 1616050 1623508
2075 1623508 1545469 1492369 1373433 1313791 1252099 1171960 1212496 1159587 1163760 1144763 1081948
2064 1081948 899857 879013 971269 861507 811027 821615 853255 847803 919387 847953 807398
2053 807398 864382 745522 670267 632428 664055 720980 700704 602164 615739 625495 554221 438852
2041 438852 547957 594390 513951 540261 465210 456004 425263 436666 424885 375715 429802 423771
2029 423771 407794 354401 390644 385254 352757 335990 327390 389717 424039 333490 310168 347829
2017 347829 351019 317177 321844 383275 252398 84374 170833 198082 236429 128934 73200
$$ packed form
2096D201421k71437l08447l01382j70969k46749j35426j5180N079j03139r5107
2086B558664j49759p6972j83437k36429p5450N504q2556o0583N6545j39477P458
2075A623508p8039n3100j18936n9642o1692q0139M0536n2909M173j8997o2815
2064A081948j82091k0844R2256j09762n0480J0588L1640n452P1584p1434m0555
2053H07398N6984j18860p5255l7839L1627N6925k0276r8540J3575R756p1274j15369
2041D38852J09105M6433q0439K6310p5051r206l0741J1403j1781m9170N4087o031
2029D23771j5977n3393L6243n390l2497j6767q600O2327L4322r0549k3322L7661
2017C47829L190l3842M667O1431j30877j68024Q6459K7249L8347j07495n5734
$$ plain form
2006 73200 172511 250784 296047 232295 178118 229695 243698 302449 221224 118872 133008 178935
1994 178935 153264 95546 100636 165443 190422 212333 195569 102410 3090 78269 57789 64606
1982 64606 67231 32116 61249 25894 -3517 -70130 54802 129499 81007 68427 70627 59180
1970 59180 101358 157316 59724 72631 107650 45216 10485 -22302 -87060 -114820 -48754 -11002
1958 -11002 58151 32023 -49946 -25345 47744 -32128 -11309 -6748 17558 -62045 -128472 -45077
1946 -45077 10543 57323 36952 -90909 -118820 -27983 4452 75642 -11189 6908 -117366
1935 -117366 -189389 -21250 -32265 -67197 -104454 -42840 -49444 -75946 -28302 -29255 -70250 8182
1923 8182 9526 -6122 -78946 -63562 -22125 -38247 39429 -35243 -27175 65903 18169 -21965
$$ packed form
2006G3200R9311P8273M5263o3752n4177N1577J4003N8751q1225j02352J4136M5927
1994A78935k5671n7718N090O4807K4979K1911j6764r3159r9320P5179k0480O817
1982F4606K625l5115K9133l5355k9411o6613J24932P4697m8492j2580K200j1447
1970E9180M2178N5958r7592J2907L5019o2434l4731l2787o4758k7760O6066L7752
1958a1002O9153k6128q1969K4601P3089p9872K0819M561K4306p9603o6427Q3395
1946d5077N5620M6780k0371j27861k7911R0837L2435P1190q6831J8097j24274
1935a17366p2023J68139j1015l4932l7257O1614o604k6502M7644r53m0995P8432
1923H182J344j5648p2824J5384M1437j6122P7676p4672Q068R3078m7734m0134
$$ plain form
1911 -21965 -64452 -3806 107264 4231 -101561 -65173 -119885 -150166 -43310 -104372 -36396
1900 -36396 -39386 -33447 1396 43598 64679 -38698 -25642 -27121 -52595 -167052 -76531 14526
1888 14526 -2156 1257 16022 12348 64096 44367 89825 155462 91165 59839 19291 48421
1876 48421 108412 79963 93482 -1621 56209 74623 70419 27938 36227 85195 76736 29019
1864 29019 105427 18197 9438 47862 156838 126829 -17079 21685 67688 57172 36277 165485
1852 165485 220114 274008 116904 205635 266136 271989 146815 14558 66963 37946 51880
1841 51880 4139 62815 34666 -52596 -21235 -77600 -125846 -124268 -30857 -304 3176 58923
1829 58923 46820 -83587 -59176 30467 -61286 -41049 -11663 -1828 98647 -20345 -65592
$$ packed form
1911b1965m2487O0646J11070j03033j05792L6388n4712l0281J06856o1062O7976
1900c6396k990N939L4843M2202K1081j03377J3056j479k5474j14457R0521R1057
1888A4526j6682L413J4765l674N1748j9729M5458O5637o4297l1326m0548K9130
1876D8421N9991k8449J3519r5103N7830J8414m204m2481Q289M8968q459m7717
1864B9019P6408q7230q759L8424J08976l0009j43908L8764M6003j0516k0895J29208
1852A65485N4629N3894j57104Q8731O0501N853j25174j32257N2405k9017J3934
1841E1880m7741N8676k8149q7262L1361n6365m8246J578R3411L0553L480N5747
1829E8923j2103j30407K4411Q9643r1753K0237K9386R835J00475j18992m5247
$$ plain form
1818 -65592 -88519 -45134 6055 -157942 -214552 -134683 -110654 -44274 -149736 -69867 -56402
1807 -56402 -118676 -70916 -40919 -2705 -77747 -38457 -58606 -98575 -135798 -76861 -95239 -90455
1795 -90455 14936 -39104 -71864 -64555 9635 -28668 33846 -20389 61084 33378 9142 -75421
1783 -75421 -50829 37690 -38553 -130667 -42392 28802 -10563 47423 -61616 -145372 -223324 -142529
1771 -142529 -76852 -76611 -106293 -116422 -19891 28765 101638 98829 72876 25490 -76161 -69687
1759 -69687 -115106 -96794 -67559 -50452 7123 -85258 -95753 -78008 -208533 -119794 -62761 -111278
1747 -111278 -63028 -43009 -56356 -183352 -243715 -196845 -184192 -128382 -163378 -132531 -20773
1736 -20773 -92206 -184587 -162351 -140545 -109173 -222340 -211418 -149318 -126681 -169633 -15052
$$ packed form
1818f5592k2927M3385N1189j63997n6610P9869K4029O6380j05462P9869J3465
1807e6402o2274M7760K9997L8214p5042L9290k0149l9969l7223N8937j8378M784
1795i0455J05391n4040l2760P309P4190l8303O2514n4235Q1473k7706k4236q4563
1783g5421K4592Q8519p6243r2114Q8275P1194l9365N7986j09039q3756p7952Q0795
1771a42529O5677K41k9682j0129R6531M8656P2873k809k5953m7386j01651O474
1759f9687m5419J8312K9235J7107N7575r2381j0495J7745j30525Q8739N7033m8517
1747a11278M8250K0019j3347j26996o0363M6870J2653N5810l4996L0847J11758
1736b0773p1433r2381K2236K1806L1372j13167J0922O2100K2637m2952J54581
$$ plain form
1725 -15052 27477 -48222 -66549 -35928 -55202 -24040 -52050 -146037 -96365 -24312 -102050 -44828
1713 -44828 -35753 -34980 -43862 -164066 -127529 -177327 -253025 -181565 -135409 -103601 -61701 -114774
1701 -114774 -74771 -134980 -181968 -248741 -162353 -42096 -87172 -42928 -19501 -41230 -15484
1690 -15484 58631 -39784 -133475 -84167 -65685 -34934 47131 2083 -57534 -65666 -46129 -23419
1678 -23419 -4480 81706 17496 -58169 -47705 -1740 16733 -155880 -110658 29342 -15063
1667 -15063 -11342 -11178 -71304 -95359 -76435 -124114 -74413 -22456 20859 -60194 -44060 19431
1655 19431 -1700 83 -23722 54455 21937 -94517 -56231 -87651 -50693 -62841 -40716 -53655
1643 -53655 -71684 -72775 -135036 -73153 -105006 -64996 85202 46404 -50576 25778 23860 36250
$$ packed form
1725a5052M2529p5699j8327L0621j9274L1162k8010r3987M9672P2053p7738N7222
1713d4828R075P73q882j20204L6537m9798p5698P1460M6156L1808M1900n3073
1701a14774M0003o0209m6988o6773Q6388J20257m5076M4244K3427k1729K5746
1690a5484P4115r8415r3691M9308J8482L0751Q2065m5048n9617q132J9537K2710
1678b3419J8939Q6186o4210p5665J0464M5965J8473j72613M5222J40000m4405
1667a5063L721J64o0126k4055J8924m7679M9701N1957M3315q1053J6134O3491
1655A9431k1131J783k3805P8177l2518j16454L8286l1420L6958j2148K2125j2939
1643e3655j8029j091o2261O1883l1853M0010J50198l8798r6980P6354j918J2390
$$ plain form
1631 36250 59304 63480 71757 -28279 -109603 -59173 9146 16320 70080 25944 -19290 -17215
1619 -17215 2674 129881 -20761 -59730 138765 84678 49403 45577 45395 -14655 -87899 -10106
1607 -10106 23341 30352 18373 17479 8257 -145962 -93125 -17355 96805 93038 -19259 53472
1595 53472 -18202 -68783 -119643 -73433 -63101 -71592 26420 33709 27822 48494 11035 -71198
1583 -71198 -56371 13511 -55983 -79223 -142936 -82532 -94631 -88304 -39017 -71442 -51149 -54053
1571 -54053 -68338 -46014 6135 38040 22754 -77360 -133390 -10294 34293 -15732 -20852 -40463
1559 -40463 2859 66158 31026 69997 -41109 -64448 -8371 -87191 8959 -103421 -142591
1548 -142591 -60727 -13559 -79120 -85390 -131068 -36356 -62270 -72083 -49377 -61210 -157691 -154618
$$ packed form
1631C6250K3054M176Q277j00036q1324N0430O8319P174N3760m4136m5234K075
1619a7215J9889J27207j50642l8969J98495n4087l5275l826j82o0050p3244P7793
1607a0106L3447P011j1979q94r222j54219N2837P5770J14160l767j12297P2731
1595E3472p1674n0581n0860M6210J0332q491R8012P289n887K0672l7459q2233
1583g1198J4827O9882o9494k3240o3713O0404j2099O327M9287l2425K0293k904
1571e4053j4285K2324N2149L1905j5286j00114n6030J23096M4587n0025n120j9611
1559d0463M3322O3299l5132L8971j11106k3339N6077p8820R6150j12380l9170
1548a42591Q1864M7168o5561o270m5678R4712k5914r813K2706j1833r6481L073
$$ plain form
1536 -154618 -125944 -96710 -109861 -75926 -48362 -42629 -35853 -84543 -92493 -45386 -123552 -94150
1524 -94150 -45500 -61724 52440 6484 -72015 -169622 -48040 -56978 -117411 -91563 -93913 47553
1512 47553 15578 -37025 -44499 -92631 -27357 -30200 20088 -24991 -46174 -83958 -34722 -72342
1500 -72342 -65643 -27377 24204 -1193 -93715 -44705 18675 26430 52804 -13764 42818 5555
1488 5555 -92747 -51674 1117 34019 2796 -6527 1619 7156 35982 64472 23061 -84565
1476 -84565 -70983 -51439 -72525 -58564 -40060 -33190 -38604 11993 -104910 -110714 -108961 -55540
1464 -55540 56152 -109578 -118325 -54216 34442 8715 -39879 44852 -10218 -45395 -61526 52806
1452 52806 123459 74643 94601 92482 29188 10880 -48246 -10610 -47690 -75792 -11585 -62444
$$ packed form
1536a54618K8674K9234j3151L3935K7564N733O776m8690p950M7107p8166K9402
1524i4150M8650j6224J14164m5956p8499r7607J21582q938o0433K5848k350J41466
1512D7553l1975n2603p474m8132O5274k843N0288m5079k1183l7784M9236l7620
1500g2342O699L8266N1581k5397r2522M9010O3380P755K6374o6568N6582l7263
1488E555r8302M1073N2791L2902l1223r323Q146N537K8826K8490m1411j07626
1476h4565J3582J9544k1086J3961J8504O870n414N0597j16903n804J753N3421
1464e5540J11692j65730q747O4109Q8658k5727m8594Q4731n5070l5177j6131J14332
1452E2806P0653m8816J9958k119o3294j8308n9126L7636l7080k8102O4207n0859
$$ plain form
1440 -62444 -137578 -167900 -72330 -106804 -102012 -136879 -115266 -77935 -103478 -24247 -107122 -97026
1428 -97026 -151068 -180135 -154335 -112779 -104059 -51207 -19959 -17497 -34685 -51159 -94661 -161555
1416 -161555 -146702 -81771 -55597 -13575 -85528 -203220 -99821 -72620 35647 59145 115294
1405 115294 59607 23535 -32752 -51698 -24091 -95807 5113 40477 20205 29059 -67062 -95262
1393 -95262 -4494 -107302 -115542 -115116 -17621 -51841 -115915 -58121 43579 17779 7161 33888
1381 33888 8426 5963 19983 81935 70344 73774 48076 65314 8358 73991 -3446 55146
1369 55146 71586 -4775 -23330 44025 64281 102286 78856 63608 51166 -25345 -36118 -94641
1357 -94641 -38638 81404 90750 82819 88026 14953 -21217 -24990 -51420 -95273 -20935 -88727
$$ packed form
1440f2444p5134l0322R5570l4474M792l4867K1613L7331k5543P9231q2875J0096
1428i7026n4042k9067K5800M1556Q720N2852L1248K462j7188j6474m3502o6894
1416a61555J4853O4931K6174M2022p1953j17692J03399K7201J08267K3498N6149
1405A15294n5687l6072n6287j8946K7607p1716J00920L5364k0272Q854r6121k8200
1393i5262R0768j02808q240M26R7495l4220o4074N7794J01700k5800j0618K6727
1381C3888k5462k463J4020O1952j1591L430k5698J7238n6956O5633p7437N8592
1369E5146J6440p6361j8555O7355K0256L8005k3430j5248j2442p6511j0773n8523
1357i4641N6003J20042R346p931N207p3073l6170l773k6430m3853P4338o7792
$$ plain form
1345 -88727 -127134 -167891 -121173 -96232 -38246 -51013 -16459 5968 -56829 -57696 -163708 -132662
1333 -132662 -70437 47095 -30625 -142830 -91366 -14892 52758 -30022 -72583 -47166 -196388
1322 -196388 -239818 -168134 -53657 48421 32711 265 31875 73218 120605 903 -82546
1311 -82546 -10318 -66111 3157 -131091 -64191 -44588 -33851 -38781 23234 -29876 5540 73326
1299 73326 -244 -22296 -95350 -110851 -86526 -39565 -84806 -64790 -100278 -53676 54368 18886
1287 18886 -14970 -47682 22063 51709 12706 79429 -24391 -68060 -39834 -28217 -10646 -27630
1275 -27630 -12990 -73711 -105893 48157 22523 178185 98321 48824 -51024 -96944 -33410
1264 -33410 57520 77766 12525 -38031 8602 32280 76862 62138 3035 39777 59090 77523
$$ packed form
1345h8727l8407m0757M6718K4941N7986j2767L4554K2427o2797q67j06012L1046
1333a32662O2225J17532p7720j12205N1464P6474O7650q2780m2561K5417j49222
1322a96388m3430P1684J14477J02078j5710l2446L1610M1343M7387j19702q3449
1311h2546P2228n5793O9268j34248O6900J9603J0737m930O2015n3110L5416O7786
1299G3326p3570k2052p3054j5501K4325M6961m5241K0016l5488M6602J08044l5482
1287A8886l3856l2712O9745K9646l9003O6723j03820m3669K8226J1617J7571j6984
1275b7630J4640o0721l2182J54050k5634J55662p9864m9497r9848m5920O3534
1264c3410R0930K0246o5241n0556M6633K3678M4582j4724n9103L6742J9313J8433
$$ plain form
1252 77523 53011 -16921 -126248 -139584 -54448 -113027 -4144 93454 -18237 11637 46206
1241 46206 17128 -28440 41244 -25433 32089 -103844 -17392 -48961 -104972 -80031 100221
1230 100221 75338 55832 20189 41547 90221 -52026 -35638 -54051 -164422 -60258 -52066
1219 -52066 -55130 -76098 23929 115933 27304 -67303 -83505 2461 91031 -3629 -99236 -46335
1207 -46335 -5593 21065 -39489 143717 20210 -10890 23022 22947 37971 37765 -2685 -6141 5203
1194 5203 41607 63581 132511 30127 -2070 -29116 -138 87574 61498 40130 -29709 -112240
1182 -112240 -19168 -56646 -56929 -88229 -72076 -23371 -151876 -90923 -147388 -92383 -43269 -79272
1170 -79272 -11766 -4802 -76405 -67899 -49666 -62704 -42983 -34140 -60106 -119316 -49677 -12583
$$ packed form
1252G7523k4512o9932j09327j3336Q5136n8579J08883R7598j11691K9874L4569
1241D6206k9078m5568O9684o6677N7522j35933Q6452l1569n6011K4941J80252
1230A00221k4883j9506l5643K1358M8674j42247J6388j8413j10371J04164Q192
1219e2066l064k0968J00027R2004q8629r4607j6202Q5966Q8570r4660r5607N2901
1207d6335M0742K6658o0554J83206j23507l1100L3912p5J5024k06m0450l456J1344
1194E203L6404K1974O8930j02384l2197k7046K8978Q7712k6076k1368o9839q2531
1182a12240R3072l7478k83l1300J6153M8705j28505O0953n6465N5005M9114l6003
1170g9272O7506O964p1603Q506J8233j3038J9721Q843k5966n9210O9639L7094
$$ plain form
1158 -12583 14846 -45581 -72107 -142281 -137522 6498 76258 17418 -38123 -56496 -95086 -74129
1146 -74129 -89096 -145235 -74402 -144114 -10504 46227 21214 44418 -75577 -34074 44927
1135 44927 -2596 -27347 -10538 -62638 -120324 -149993 -22904 -141568 -98173 36939 56449
1124 56449 162739 125241 176756 103943 -16074 6405 96095 133672 100170 95402 76275 24202
1112 24202 -42952 -4687 -968 76981 -15751 -59502 -36842 -44322 -119306 -157914 -146651 -65580
1100 -65580 -102375 -159623 -167905 -115497 -74402 -96518 -99020 -16079 17636 62703 20161 24187
1088 24187 54084 8475 -38835 57704 7691 33901 28708 -17173 49582 5858 56535 41277
$$ packed form
1158a2583K7429o0427k6526p0174M759J44020O9760n8840n5541j8373l8590K0957
1146g4129j4967n6139P0833o9712J33610N6731k5013K3204j19995M1503P9001
1135D4927m7523k4751J6809n2100n7686k9669J27089j18664M3395J35112J9510
1124E6449J06290l7498N1515p2813j20017K2479Q9690L7577l3502m768j9127n2073
1112B4202o7154L8265L719P7949r2732m3751K2660p480p4984l8608J1263Q1071
1100f5580l6795n7248q282N2408M1095k2116k502Q2941L3715M5067m2542M026
1088B4187K9897m5609m7310R6539n0013K6210n193m5881O6755m3724N0677j5258
$$ [...]
##END NTUPLES=NMR SPECTRUM
##END=
