##TITLE=1H_TG-2341-B2
 CDCl3
 8 sc, 
 11.1.2022
##JCAMPDX= 6.0         $$ Bruker NMR JCAMP-DX V2.0
##DATA TYPE= NMR SPECTRUM
##DATA CLASS= NTUPLES
##ORIGIN= UXNMR, Bruker Analytische Messtechnik GmbH
##OWNER= root
$$ XWIN-NMR		Version 3.5
$$ Tue Jan 11 11:50:44 2022 Russian Standard Time (UT+4h)  she@DPX200
##.OBSERVE FREQUENCY= 200.131346
##.OBSERVE NUCLEUS= ^1H
##.ACQUISITION MODE= SIMULTANEOUS
##.ACQUISITION SCHEME= undefined
##.AVERAGES= 8
##.DIGITISER RES= 18
##SPECTROMETER/DATA SYSTEM= spect
##.PULSE SEQUENCE= zg30
##.SOLVENT NAME= CDCl3
##.SHIFT REFERENCE= (INTERNAL, CDCl3, 0, 15.7171)
##AUDIT TRAIL= $$ (NUMBER, WHEN, WHO, WHERE, WHAT)
$$ ##TITLE= Audit trail, XWIN-NMR		Version 3.5
$$ ##JCAMPDX= 5.01
$$ ##ORIGIN= Bruker BioSpin GmbH
$$ ##OWNER= she
$$ F:/spectra/data/she/nmr/H-F/1/pdata/1/auditp.txt
$$ ##AUDIT TRAIL=  $$ (NUMBER, WHEN, WHO, WHERE, WHAT)
(   1,<2022-01-11 11:49:37.95 +0400>,<she>,<DPX200>,
      <created by zg, POWCHK disabled, PULCHK disabled
       configuration hash MD5:
       00 E9 B6 7A A2 85 ED C7 34 08 36 98 17 FE 4E 26
       data hash MD5: 16K
       90 7F 79 2A 21 5B 6A 4E 72 11 AC E0 66 C1 5D 8F>)
(   2,<2022-01-11 11:49:40.68 +0400>,<she>,<DPX200>,
      <Start of raw data processing
       efp BC_mod = 2 LB = 0.24 FT_mod = 6 PKNL = 1 PHC0 = -15866.9 PHC1 = 12.60079 SI = 16K 
       data hash MD5: 16K
       28 B8 9A D9 F3 18 B2 C1 80 A4 BD EB E2 84 33 F3>)
(   3,<2022-01-11 11:49:55.00 +0400>,<she>,<DPX200>,
      <pk PHC0 = -1.172932 PHC1 = 1.2 
       data hash MD5: 16K
       8C 61 12 CF F7 F0 2F B6 C7 16 53 1F 4F 0B FD 45>)
(   4,<2022-01-11 11:49:58.23 +0400>,<she>,<DPX200>,
      <abs ABSG = 5 
       data hash MD5: 16K
       1B 09 B7 FE 2D F3 DA 45 6C D8 6B 79 59 58 DD F1>)
$$ ##END=
$$ 
$$ hash MD5
$$ 11 55 F4 9B B6 85 F3 7F 10 CE AA 9B AB A5 94 08
##$RELAX= 
##$RELAX= 
##$RELAX= 
##$RELAX= 
##$RELAX= 
##$RELAX= 
$$ Bruker specific parameters
$$ --------------------------
##$DU= <F:/spectra>
##$EXPNO= 1
##$NAME= <H-F>
##$PROCNO= 1
##$TYPE= <nmr>
##$USER= <she>
##$AMP= (0..31)
100 100 100 100 100 100 100 100 100 100 100 100 100 100 100 100 100 100 
100 100 100 100 100 100 100 100 100 100 100 100 100 100 
##$AQSEQ= 0
##$AQ_mod= 1
##$AUNM= <au_zg>
##$AUTOPOS= <>
##$BF1= 200.13
##$BF2= 200.13
##$BF3= 200.13
##$BF4= 200.13
##$BF5= 200.13
##$BF6= 200.13
##$BF7= 200.13
##$BF8= 200.13
##$BYTORDA= 1
##$CFDGTYP= 0
##$CFRGTYP= 5
##$CHEMSTR= <none>
##$CNST= (0..31)
1 1 145 1 1 1 1 1 1 1 1 1 1 1 1 1 1 1 1 1 1 1 1 1 1 1 1 1 1 1 1 1 
##$CPDPRG= <>
##$CPDPRG1= <>
##$CPDPRG2= <>
##$CPDPRG3= <>
##$CPDPRG4= <mlev>
##$CPDPRG5= <mlev>
##$CPDPRG6= <mlev>
##$CPDPRG7= <mlev>
##$CPDPRG8= <mlev>
##$CPDPRGB= <>
##$CPDPRGT= <>
##$D= (0..31)
0 1.2 0 0 0 0 0 0 0 0.06 0 0.03 0 0 0 0 0.0002 0 0 0 0 0 0 0 0 0 0 0 0 
0 0 0 
##$DATE= 1641887377
##$DBL= (0..7)
120 120 120 120 120 120 120 120 
##$DBP= (0..7)
150 150 150 150 150 150 150 150 
##$DBP07= 0
##$DBPNAM0= <>
##$DBPNAM1= <>
##$DBPNAM2= <>
##$DBPNAM3= <>
##$DBPNAM4= <>
$$ [...]
##$SUBNAM2= <"">
##$SUBNAM3= <"">
##$SUBNAM4= <"">
##$SUBNAM5= <"">
##$SUBNAM6= <"">
##$SUBNAM7= <"">
##$SUBNAM8= <"">
##$SUBNAM9= <"">
##$SW= 18.0517287032376
##$SWIBOX= (0..15)
0 0 2 0 0 0 0 0 0 0 0 0 0 0 0 0 
##$SW_h= 3612.71676300578
##$TD= 16384
##$TD0= 1
##$TE= 0
##$TE2= 300
##$TE3= 300
##$TEG= 300
##$TL= (0..7)
0 120 120 120 120 120 120 120 
##$TP= (0..7)
150 150 150 150 150 150 150 150 
##$TP07= 0
##$TPNAME0= <>
##$TPNAME1= <>
##$TPNAME2= <>
##$TPNAME3= <>
##$TPNAME4= <>
##$TPNAME5= <>
##$TPNAME6= <>
##$TPNAME7= <>
##$TPOAL= (0..7)
0.5 0.5 0.5 0.5 0.5 0.5 0.5 0.5 
##$TPOFFS= (0..7)
0 0 0 0 0 0 0 0 
##$TUNHIN= 0
##$TUNHOUT= 0
##$TUNXOUT= 0
##$USERA1= <user>
##$USERA2= <user>
##$USERA3= <user>
##$USERA4= <user>
##$USERA5= <user>
##$V9= 5
##$VALIST= <valist>
##$VCLIST= <CCCCCCCCCCCCCCC>
##$VD= 0
##$VDLIST= <DDDDDDDDDDDDDDD>
##$VPLIST= <PPPPPPPPPPPPPPP>
##$VTLIST= <TTTTTTTTTTTTTTT>
##$WBST= 1024
##$WBSW= 4
##$XGAIN= (0..3)
0 0 0 0 
##$XL= 0
##$YL= 0
##$YMAX_a= 263374
##$YMIN_a= -398816
##$ZGOPTNS= <>
##$ZL1= 120
##$ZL2= 120
##$ZL3= 120
##$ZL4= 120
##$ABSF1= 15.72265
##$ABSF2= -2.3292
##$ABSG= 5
##$ABSL= 3
##$ALPHA= 0
##$AQORDER= 0
##$ASSFAC= 0
##$ASSFACI= 0
##$ASSFACX= 0
##$ASSWID= 0
##$AUNMP= <proc_1d>
##$AZFE= 0.1
##$AZFW= 0.1
##$BCFW= 0
##$BC_mod= 2
##$BYTORDP= 0
##$COROFFS= 0
##$CY= -3
##$DATMOD= 1
##$DC= 0
##$DFILT= <>
##$DTYPP= 0
##$F1P= 0
##$F2P= 0
##$FCOR= 1
##$FTSIZE= 16384
##$FT_mod= 6
##$GAMMA= 0
##$GB= 0
##$INTBC= 1
##$INTSCL= 0
##$ISEN= 128
##$LB= 0.24
##$LEV0= 0
##$LPBIN= 0
##$MAXI= 10000
##$MC2= 0
##$MEAN= 0
##$ME_mod= 0
##$MI= 1.114404
##$NCOEF= 0
##$NC_proc= -7
##$NLEV= 6
##$NOISF1= 3.799351
##$NOISF2= 2.8
##$NSP= 0
##$NTH_PI= 0
##$NZP= 0
##$OFFSET= 15.71714
##$PC= 1
##$PHC0= -15868.07
##$PHC1= 13.80079
##$PH_mod= 1
##$PKNL= yes
##$PPARMOD= 0
##$PSCAL= 0
##$PSIGN= 0
##$REVERSE= no
##$SF= 200.13000688609
##$SI= 16384
##$SIGF1= 3
##$SIGF2= 2
##$SINO= 5.538805
##$SIOLD= 16384
##$SREGLST= <1H.CDCl3>
##$SSB= 0
##$STSI= 16384
##$STSR= 0
##$SW_p= 3612.71676300578
##$SYMM= 0
##$S_DEV= 0
##$TDeff= 16384
##$TDoff= 0
##$TI= <>
##$TILT= no
##$TM1= 0
##$TM2= 0
##$TOPLEV= 0
##$USERP1= <user>
##$USERP2= <user>
##$USERP3= <user>
##$USERP4= <user>
##$USERP5= <user>
##$WDW= 1
##$XDIM= 16384
##$YMAX_p= 531180944
##$YMIN_p= -2158280
$$ End of Bruker specific parameters
$$ ---------------------------------
##NTUPLES= NMR SPECTRUM
##VAR_NAME=  FREQUENCY,     SPECTRUM/REAL,   SPECTRUM/IMAG
##SYMBOL=    X,             R,               I
##VAR_TYPE=  INDEPENDENT,   DEPENDENT,       DEPENDENT
##VAR_FORM=  AFFN,          ASDF,            ASDF
##VAR_DIM=   16384,         16384,           16384
##UNITS=     HZ,            ARBITRARY UNITS, ARBITRARY UNITS
##FACTOR=    0.220516191357247, 1,           1
##FIRST=     3145.47137600613, 0,            0
##LAST=      -467.245386999649, 0,           0
##MIN=       -467.245386999649, -2158280,    0
##MAX=       3145.47137600613, 531180944,    0
$$ Real data points
##PAGE= N=1
##DATA TABLE= (X++(R..R)), XYDATA
$$ [...]
7078A21517452j528k414306m621598p374425j0087038j2146649j2281865j0899978
7070F1690065q808243p036689n414930m210200l497657k756520k290456j880368
7062B5795002j419306j421116j324320j264411r15851r09180q02476r56399q09382
7053A5972561p63825n22017o68368n66914m64414l21842n28515m24191k94284
7044A1418191o04273m14150n69003n66297k47874j45164k60366m13057m95121
7035G702886l34353r8023j39877l61109k6219L3064k56255k31189j81302q9079
7025F018544p9177O3182l6302k5237o4789k43087l02034N015k49864k81094j91062
7014D614095k82187N4596r0928j94038j90210k33414k10964J815K06939j93817
$$ plain form
7078 121517452 121515924 119101618 114480020 107105595 97018557 84871908 72590043 61690065
7070 61690065 52881822 45845133 40430203 36220003 32722346 29965826 27675370 25795002
7062 25795002 24375696 22954580 21630260 20365849 19449998 18540818 17738342 16781943 15972561
7053 15972561 15208736 14686719 14018351 13451437 12987023 12665181 12136666 11712475 11418191
7044 11418191 10813918 10399768 9830765 9264468 9016594 8871430 8611064 8198007 7702886
7035 7702886 7368533 7270510 7130633 6769524 6743305 6776369 6520114 6288925 6107623 6018544
7025 6018544 5939367 6002549 5966247 5941010 5876221 5633134 5331100 5336115 5086251 4805157 4614095
7014 4614095 4331908 4386504 4295576 4101538 3911328 3677914 3466950 3468765 3675704 3481887
7004C481887k62113L2410o8356p0095r1072M5300j35352J729j18275m7528j62609
6993B605926O665n409j97954Q543j17187j00382Q0935k66533j90481n9020J56713
6982A921816O9937q6719P8010m3983p6331j59769k6533K49333n4787J0211o489
6971A874696J15609R3916j4413R3723j56360o3871r6575j03789j50271n6903j61581
6960A374181l6277J22153o1214R1751j20031n5889q1631j65310m0956L09154j46894
6949A189037l9061k09191p0552K19199k5582m7754j39804l459l649q7955j7933
6938G63296J48334M9320j077j82785Q8438J71655l4673j86772j6443M3842J41460
6927I84595r2479j494l4696r8313P6692K14993J5767n4846j54175q8738j31129
$$ plain form
7004 3481887 3219774 3252184 3183828 3113733 3022661 3067961 2932609 2934338 2816063 2768535 2605926
6993 2605926 2612591 2607182 2409228 2417771 2300584 2200202 2281137 2014604 1824123 1765103 1921816
6982 1921816 1991753 1905034 1983044 1939061 1862730 1702961 1676428 1925761 1870974 1881185 1874696
6971 1874696 1990305 2084221 2069808 2163531 2007171 1943300 1846725 1742936 1592665 1535762 1374181
6960 1374181 1337904 1460057 1398843 1490594 1370563 1314674 1233043 1067733 1026777 1335931 1189037
6949 1189037 1149976 940785 870233 1089432 1063850 1016096 876292 872833 869184 781229 763296
6938 763296 911630 960950 959873 777088 865526 1037181 1002508 815736 799293 843135 984595
6927 984595 892116 890622 855926 757613 834305 1049298 1065065 1010219 856044 767306 636177
6916F36177J10615J59815J71437q8220j45434j8868L2183j01269Q9470L3020k95370
6905E83556o4048l7389J98224k5282O3586J19292p991Q3768K1169j75774p0301
6894F88810R0586R807j16051j25360L46325K9153l40689J00945R9616K7990Q2281
6883H93413N246L7739J96438k12624k69813O2798L5841j00079j05253O4977M2686
6872F51369r0888M6678l3236l212N4791k4029J50203P4729j66221R5549J1538
6861G67271O6690p1791j8476R6525j30288J0485j84375J27498L1415n5886o9432
6850E69636l2141L8968j7737o5051J16798L2877N4036P2673k6027n2391M1133
6839G32774n8224K7446J56757j57058j31845j50351K08686K17833p8158o9101
$$ plain form
6916 636177 746792 906607 1078044 989824 844390 825522 857705 756436 845906 878926 583556
6905 583556 519508 482119 680343 655061 718647 837939 829948 913716 934885 759111 688810
6894 688810 779396 789203 673152 547792 894117 923270 582581 683526 783142 811132 893413
6883 893413 898659 936398 1132836 920212 650399 713197 749038 648959 543706 608683 651369
6872 651369 560481 607159 573923 570711 625502 601473 751676 826405 660184 755733 767271
6861 767271 833961 762170 743694 840219 709931 720416 536041 663539 694954 639068 569636
6850 569636 537495 576463 558726 493675 610473 643350 697386 770059 744032 691641 732774
6839 732774 674550 701996 858753 701695 569850 419499 628185 846018 767860 698759
6829F98759j05235N628j04511J3642K5929J5234Q2266j06558m3308K43078L9462
6818G64386n8276P7236P2419j32386j11212J69522m9386P7465j41209r9226j60240
6807D09093k2785J12391Q0178R2846m4538J9382J00794N6791k58L6974l4461O7392
6795H73799p0501J60573K12754k67640k67559j26301K28623L8841j04131K12063
6785H90521n296j39297j04300j14201L8239N1660j11572L8586J04219Q2638R5392
6774H26589k99618j01845j04864O8922J09498J61453l86127P8149K50128q1935
6764E20350Q4633J5985j6862j18891J9609O3382J38422l9399k29321j37885N1541
6753C51564J24511K5851J6915K53092j40885j97913m136M1247O7635M8074k5373
$$ plain form
6829 698759 593524 599152 494641 508283 534212 549446 631712 525154 481846 724924 764386
6818 764386 706110 783346 855765 723379 612167 781689 732303 809768 668559 569333 409093
6807 409093 386308 498699 578877 671723 627185 646567 747361 804152 803894 840868 806407 873799
6795 873799 803298 963871 1176625 908985 641426 515125 743748 782589 678458 890521
6785 890521 885225 745928 641628 527427 565666 617326 505754 544340 648559 731197 826589
6774 826589 526971 425126 320262 389184 498682 660135 274008 352157 602285 520350
6764 520350 604983 620968 604106 485215 504824 568206 706628 667229 437908 300023 351564
6753 351564 476075 501926 518841 771933 631048 433135 428999 470246 537881 585955 560582
6742E60582J8281P1640J49590j25440p4119J01858J4379o0213O9296J07116j32546
6731G00424k6062O6489O3686k2274j31418p6510j89815p9489K77240K04756j86753
6720F00274k4672m4810j24346J94666Q3134m6057R4696M1028l5155l8459J01243
6709H01542r9154j48933j23211J10674J33391N4092Q8881l1307m8856N7618J57696
6698I52433J66591k64600j83314J1495R8513K59122p2505M9321n6817q2023J29122
6687A007338j307j4568O5985R6970K3208K2750M7215k46K50298o9478j70629k38119
6675A019417q3471J38567k1393O0698P3599J23467n9100L4158k24132r1517J51658
6664A121951K2104Q2281j70610L3640N1305j8948k46784l9562J84630P289j93838
$$ plain form
6742 560582 578863 650503 800093 674653 600534 702392 716771 656558 725854 832970 700424
6731 700424 674362 740851 804537 782263 650845 574335 384520 305031 582271 787027 600274
6720 600274 575602 530792 406446 601112 684246 638189 732885 773913 738758 700299 801542
6709 801542 702388 553455 430244 540918 674309 728401 817282 785975 737119 794737 952433
6698 952433 1119024 854424 671110 682605 781118 1040240 967735 1017056 960239 878216 1007338
6687 1007338 1006031 991463 1057448 1154418 1177626 1200376 1247591 1247345 1497643 1428165 1257536 1019417
6675 1019417 935946 1074513 1053120 1113818 1187417 1310884 1251784 1285942 1061810 970293 1121951
6664 1121951 1144055 1226336 1055726 1089366 1140671 1121723 874939 835377 1020007 1027296 833458
6653H33458N9100K36866L4142r3368R83l55874J65282L51327k69708Q3234l8023
6642A007419j90161J28809N9709j4505L3425j08767o3594J67182J02674M036j67385
6631I58842J42456K6416j38516L7676N9218Q2780q3397J64558j53230j8563j36714
6620I41526K8209J6496k1172J9959Q7641r1091p7828n4482j51649K02499J76334
6609A076442R210j09502j11998J34895K07418o1854j64074K1216l5795k26818
6599G39140K31092K72252j09964m4625p5436L4420L0252J8940j67816n8242q8296
6588G81717q2186J2550P6724k946m5738R6269o5298q4362N5806N5834q4735M7546
6576G61181q0925q4512M5481J48201m1278o7331m1292j76274N6936J56315j43173
$$ plain form
6653 833458 892558 1129424 1163566 1070198 1071181 715307 880589 1231916 962208 1045442 1007419
6642 1007419 817258 946067 1005776 991271 1024696 915929 852335 1019517 1122191 1126227 958842
6631 958842 1101298 1127714 989198 1026874 1086092 1168872 1085475 1250033 1096803 1078240 941526
6620 941526 969735 986231 965059 985018 1072659 981568 903740 849258 697609 900108 1076442
6609 1076442 1085652 976150 864152 999047 1206465 1144611 980537 1001753 965958 739140
6599 739140 970232 1242484 1132520 1087895 1012459 1046879 1077131 1096071 928255 870013 781717
6588 781717 699531 712081 788805 785859 740121 836390 771092 686730 742536 798370 713635 761181
6576 761181 680256 595744 641225 789426 748148 680817 639525 463251 520187 676502 533329
6565E33329L7318K07737j23271k52561K5519R9461J69849j00817q3220j25279
6555C88065J33497J59811p6055J69425M1046l8945o9855o5734N1541j04429J07013
6544F95380J07461j88280J30004K8818r9693j1397K22310n1624j43886k24407
6534D64686r9099J54467J79133J15857j19324J8325q4347N8272J16660l1894p4260
6523F98476m6766j55793J93616J04917j0372j74156M9980q385o5451j38946K31150
6512F78270N0950j32825K60285p3483o2778N8756j08235k93494K23718J04451
6502G05615L6723j1386r2913K66866j005M819k14925j18410J02040J92681r1071
6491G79034j0211n268k6653j2518N1076J64452k05210j66994P1488n1644p1555
$$ plain form
6565 533329 570647 778384 655113 402552 428071 527532 697381 596564 513344 388065
6555 388065 521562 681373 605318 774743 815789 776844 706989 641255 692796 588367 695380
6544 695380 802841 614561 744565 773383 673690 662293 884603 832979 689093 464686
6534 464686 365587 520054 699187 815044 695720 714045 629698 687970 804630 772736 698476
6523 698476 651710 495917 689533 794450 784078 609922 659902 651517 586066 447120 678270
6512 678270 729220 596395 856680 783197 720419 779175 670940 377446 601164 705615
6502 705615 742338 730952 638039 904905 903900 908719 693794 575384 677424 870105 779034
6491 779034 768823 763555 736902 724384 775460 939912 734702 567708 639196 587552 515997
6480E15997J36839J9998K15192K3743J42796j99875J25078n5613j80095M513R0330
6469H38903J83705P8279k86110P0423L132k88294Q5314J12806n0348J31460J07704
6458I86974l7682j78296k7450m700n775N2726j08112p9077J73042J75025j01258
6447H45417j95593O3484K43873l7567k3410J51372q37j29299O1209j23489J6411
6436H71571L77004K2221l53533j16321J51300M0368k98166J34392M20534j7686
6426A231684j56683q8045O4322j0782j7790l2218J03388j2295J52410q4296j2207
6415A137488r9950q7506K06829j00239N9133Q1150m4295j31720p553l1431N6122
6404A038028Q3011N9829j17180N3745j60974o5438Q0876J62953k62648l2285J41370
$$ plain form
6480 515997 652836 672834 888026 911769 1054565 854690 979768 924155 744060 748573 838903
6469 838903 1022608 1100887 814777 885200 888332 600038 685352 798158 747810 879270 986974
6458 986974 949292 770996 743546 738846 733071 785797 677685 598608 771650 946675 845417
6447 845417 649824 713308 957181 919614 896204 1047576 1046739 917440 978649 855160 871571
6436 871571 1248575 1270796 917263 800942 952242 992610 694444 828836 1249370 1231684
6426 1231684 1075001 986956 1051278 1040496 1022706 990488 1093876 1081581 1233991 1149695 1137488
6415 1137488 1037538 950032 1156861 1056622 1115755 1196905 1152610 1020890 1013337 981906 1038028
6404 1038028 1121039 1180868 1063688 1117433 956459 891021 971897 1134850 872202 839917 981287
6393I81287J54467J47090J8764k72602m991J7236l1140j90332j29879J99121P7845
6382I66866l0606L564j02085k270J21112n0658J36185J8315o3078R8685J48279
6371A244309j33695o6019O8169O5047l2539m5656o4893o3391L3140J82689r8466
6360A088695k90909j0009j27779J55892Q0537p9555K60544j25573o3279J41072
6350A029636J24653r4267J6281j30862l5153J36780P5064n5236p6077l7808Q2658
6339A035669l3296L2644K4650j37678p5961L6291L09735j28355k61593N2505M5974
6328I00585j13061k8604J82749J67564r0842o8789J1116Q6223J44819j01965m7753
6317A042042q0083J49588q887r6732Q1261J14936j58676l0283k09004N4155P2220
$$ plain form
6393 981287 1135754 1282844 1301608 1029006 1024015 1041251 1010111 819779 689900 889021 966866
6382 966866 936260 939824 837739 835469 956581 905923 1042108 1060423 997345 1096030 1244309
6371 1244309 1110614 1044595 1112764 1177811 1145272 1099616 1034723 971332 1004472 1187161 1088695
6360 1088695 797786 787777 659998 815890 896427 816872 1077416 951843 888564 1029636
6350 1029636 1154289 1060022 1076303 945441 910288 1047068 1122132 1066896 990819 953011 1035669
6339 1035669 1002373 1035017 1059667 921989 846028 882319 1192054 1063699 802106 854611 900585
6328 900585 787524 758920 941669 1109233 1018391 949602 960718 1046941 1191760 1089795 1042042
6317 1042042 961959 1111547 1102660 1005928 1087189 1202125 1043449 1013166 804162 858317 930537
6306I30537P5501R6302n2260J16009P7399N0071j37740j29475j15685J1667J73708
6295A096034K18263Q1298j92142j02355p822M6354P0534K14375K24454j97273
6285A451720k5283j19466J22591m8427k4696J93124j06862k6669K43232J03621
6275A762885m7527j05836K41014j37192N0838J30987K8812j7n7316l7243j54450
6264A674955L7618l2580o9464j00665K9527J7670q349L233j22877m7614Q4130
6253A465584J11200l06109M824Q1804L0382j14845J9949q4321K25686J42654q3476
6242A493332J615p6808J57365J19951J39623O9272k22793k4867O5362l4266J98569
6231A886355J22489M8026K21653P441r0352K688j15767M0976k95477L9490j03454
$$ plain form
6306 930537 1006038 1102340 1050080 1166089 1243488 1293559 1155819 1026344 910659 922326 1096034
6295 1096034 1314297 1395595 1203453 1101098 1093276 1139630 1210164 1424539 1648993 1451720
6285 1451720 1426437 1306971 1429562 1381135 1356439 1549563 1442701 1416032 1659264 1762885
6275 1762885 1715358 1609522 1850536 1713344 1764182 1895169 1923981 1923964 1866648 1829405 1674955
6264 1674955 1712573 1679993 1610529 1509864 1539391 1557061 1548712 1551945 1429068 1381454 1465584
6253 1465584 1576784 1270675 1275499 1357303 1387685 1272840 1292789 1208468 1434154 1576808 1493332
6242 1493332 1494947 1418139 1575504 1695455 1835078 1904350 1681557 1656690 1722052 1687786 1886355
6231 1886355 2008844 2056870 2278523 2285964 2195612 2198300 2082533 2123509 1828032 1867522 1764068
6220A764068j865q9518j1389P7780j20083j75679L3001P7331J75720n4047j67737
6209A507582N3571K58783j98394j04756L4300K1836K7132P960j7441J5861L19312
6198A925746O6609O8758K70015j49992k0291j60091n6231R9590q0394j2297J64931
6187B116353m2511K39066j11894l01146N4098l3836K61290j60614k8633L761l2357
6176A963577j09645n3895L7986N6782l8252J27921l5568r284O0909J55595R6367
6165B252493n581j51260J13371j46038j14034K99072L4832m8343j6321O704k5146
6154B199749O470O2993M5205k51759l8330m2237m0107J34476r7052j2526m3608
6143A923274K7236K59468O2911J6082j52341q5733K38601O4937M6240N3981j09557
$$ plain form
6220 1764068 1762203 1672685 1661296 1739076 1618993 1443314 1476315 1553646 1729366 1675319 1507582
6209 1507582 1561153 1819936 1621542 1516786 1551086 1572922 1600054 1608014 1590573 1606434 1925746
6198 1925746 1992355 2061113 2331128 2181136 2160845 2000754 1944523 2044113 1963719 1951422 2116353
6187 2116353 2073842 2312908 2201014 1899868 1953966 1920130 2181420 2020806 1992173 1995934 1963577
6176 1963577 1853932 1800037 1838023 1894805 1856553 1984474 1948906 1939622 2000531 2156126 2252493
6165 2252493 2246912 2095652 2209023 2062985 1948951 2248023 2282855 2234512 2218191 2224895 2199749
6154 2199749 2206219 2269212 2314417 2062658 2024328 1982091 1941984 2076460 1979408 1966882 1923274
6143 1923274 1950510 2209978 2272889 2288971 2136630 2050897 2289498 2354435 2400675 2454656 2345099
6132B345099n7801J03953K50299k9542k53077J65109q7432k3772J47758j4144
6122B546450J09960K5647j5268J41510M7053J463L2421q7577K10574J52002j03897
6111C060338p1394n6587k26478K29391J9048j01709l3869k01847o1210M7443Q8992
6100B692118L5179K43689j12070m838j05093P6718K85728O3322M5699o6189j87364
6089B966899j6047J59593J18983P6107K636Q8074n0063j37297K99820j66259J26140
6078C468586K68207r5264p0886m2216O6750Q3106K6474p213l576k28113J75109
6067C640964K2189Q1140N2395J45274K45673J1071J7745J98059j8796j26013J32872
6056D402573r0181J91264j3327P265L4707J3793k7766M6669J37537K57993J33216
$$ plain form
6132 2345099 2287298 2391251 2641550 2612008 2358931 2524040 2436608 2412836 2560594 2546450
6122 2546450 2656410 2682057 2666789 2808299 2855352 2856815 2889236 2801659 3012233 3164235 3060338
6111 3060338 2988944 2932357 2705879 2935270 2954318 2852609 2818740 2616893 2555683 2603126 2692118
6100 2692118 2727297 2970986 2858916 2854078 2748985 2825703 3111431 3174753 3220452 3154263 2966899
6089 2966899 2950852 3110445 3229428 3305535 3308171 3396245 3346182 3208885 3508705 3342446 3468586
6078 3468586 3736793 3641529 3570643 3528427 3595177 3678283 3704757 3697544 3693968 3465855 3640964
6067 3640964 3663153 3744293 3796688 3941962 4187635 4198706 4216451 4414510 4395714 4269701 4402573
6056 4402573 4312392 4503656 4490329 4497594 4532301 4546094 4518328 4564997 4702534 4960527 5093743
6045E093743k0382n0765J58124O5629R7697K15028J32998L00235M2858R3670j71169
6034E957666J90639k33038M3942O5005R053l5972k03469r7183k38477J6190M8096
6023E522452k32381j66659r0916l21444p5202K2415o2639L1829q2399q8126m7334
6012D409596N4269J4553M2442p5608j2350p7140k17368L0565K50973j08860J55619
6001D466691K5232l41962r3963J45625k04138j17262O5095N3818J57799m1305
5991D115630J32886N3936L7577k15805N7289k54192j29845J18276N3153j9759
5981C949146J29649k29644J4149J00553J88830r35j73775K6196j16669K09322
5971D096822J09913J11978k23J74505J64256o0688J2462j05395K23783J21881
$$ plain form
6045 5093743 5073361 5022596 5180720 5246349 5344046 5559074 5692072 5992307 6035165 6128835 5957666
6034 5957666 6148305 5915267 5959209 6024214 6033267 5997295 5793826 5696643 5458166 5474356 5522452
6023 5522452 5290071 5123412 5032496 4711052 4635850 4658265 4595626 4627455 4545056 4456930 4409596
6012 4409596 4463865 4478418 4520860 4445252 4432902 4355762 4138394 4168959 4419932 4311072 4466691
6001 4466691 4491923 4149961 4055998 4201623 3997485 3880223 3945318 3999136 4156935 4115630
5991 4115630 4248516 4302452 4340029 4124224 4181513 3927321 3797476 3915752 3968905 3949146
5981 3949146 4078795 3849151 3863300 3963853 4152683 4151748 3977973 4004169 3887500 4096822
5971 4096822 4206735 4318713 4318490 4492995 4657251 4596563 4609025 4503630 4727413 4849294
5961D849294q1540O8685P3178J62602J8303P9939L5557n5139J8713J13234l14786
5950D968040N0845J33831j52629M4453K67971R4727r6942j3700J03534Q4856P7880
5939E562866J79630k49718j0570J44452K34648R5477j04796j18977J00937K35139
5929F069088M4779Q04l1207J55214P1120O81J50361J86417O9824K03030J11217
5918G031328Q4741Q5131K0819Q2581J28110k5300K19534K47018L0222R5762l7318
5907G962628J39955L5083J95342j56354l6573K98777M67138J68099j89035J68885
5897I053945K3811n571J00840J4846l8844P2464n9870J53381J64645J73990J58211
5886I811848L9229L6411m270K42304K88982J99468L87520J99607J98329K79470
$$ plain form
5961 4849294 4767754 4836439 4909617 5072219 5090522 5170461 5206018 5150879 5169592 5282826 4968040
5950 4968040 5018885 5152716 5000087 5044540 5312511 5407238 5310296 5296596 5400130 5484986 5562866
5939 5562866 5742496 5492778 5482208 5626660 5861308 5956785 5851989 5733012 5833949 6069088
5929 6069088 6113867 6114671 6083464 6238678 6309798 6310479 6460840 6647257 6717081 6920111 7031328
5918 7031328 7116069 7201200 7222019 7304600 7432710 7407410 7626944 7873962 7904184 7999946 7962628
5907 7962628 8102583 8137666 8333008 8176654 8140081 8438858 8905996 9074095 8885060 9053945
5897 9053945 9077756 9072185 9173025 9187871 9149027 9221491 9161621 9315002 9479647 9653637 9811848
5886 9811848 9851077 9887488 9883218 10125522 10414504 10613972 11001492 11201099 11399428 11678898
5876A1678898N4645K06299M48228K67984J46679L98560L17599M05373L14281N23811
5866A4762357L20732L20872M89877J16149M36610M16935J73436L81870M47924
5857A7866762K46979J14145M34795M46521M88361N25471M13801J22697M36900
5848B1096432J32003M35922K47126K50781L06863J84689L56988J28580P0749M5840
5838B3255973K80325K15044L36500L54905O34657N60443O07727O65552R67819
5829B7878945J016388R32988J078094J394707J258426J096354P50326J096445
5821C6502673R72022J179072J244563J480378K134530K173465K290162K200341
5813E0177206J778253J331018N58522k08509l77762l66723o26417o36178r03756
$$ plain form
5876 11678898 11733543 11939842 12388070 12656054 12802733 13201293 13518892 13924265 14238546 14762357
5866 14762357 15083089 15403961 15893838 16009987 16446597 16863532 17036968 17418838 17866762
5857 17866762 18113741 18227886 18662681 19109202 19597563 20123034 20536835 20659532 21096432
5848 21096432 21228435 21664357 21911483 22162264 22469127 22653816 23010804 23139384 23210133 23255973
5838 23255973 23536298 23751342 24087842 24442747 25077404 25637847 26245574 26911126 27878945
5829 27878945 28895333 29828321 30906415 32301122 33559548 34655902 35406228 36502673
5821 36502673 37474695 38653767 39898330 41378708 43513238 45686703 47976865 50177206
5813 50177206 51955459 53286477 53844999 53636490 53258728 52892005 52265588 51629410 50725654
5804E0725654j024744j231826j039917o70641n22513k39503j00888L57986N56409
5795D6810017J202424J491855K076430K194353K614430K892144K575356K087974
5787F3944983J150614N77479K25347q31691j629101k240021k628999k070126j722515
5778E4775970j645906j675925j339021j216264j194396p68109j83250J96482J34407
5769D7083988J71442O64844Q29538O60244P78301P44366N39384O28698Q5481j5136
5759E2171150j12483j80295o66686o41973k13726k00993m49340k74430j1358J92532
5749D9612398M37624M79617P85122R21072J004928J391387J543904J369979J775778
5740E9321809J544063J173063J372353J151112J050671J031352Q11159J077901
$$ plain form
5804 50725654 49700910 48469084 47429167 46758526 46236013 45996510 45895622 46253608 46810017
5795 46810017 48012441 49504296 51580726 53775079 56389509 59281653 61857009 63944983
5787 63944983 65095597 65673076 65898423 65066732 63437631 61197610 58568611 56498485 54775970
5778 54775970 53130064 51454139 50115118 48898854 47704458 46936349 46753099 46949581 47083988
5769 47083988 47255430 47920274 48749812 49410056 50188357 50932723 51472107 52100805 52186286 52171150
5759 52171150 52058667 51878372 51211686 50569713 50355987 50154994 49705654 49431224 49419866 49612398
5749 49612398 50050022 50529639 51314761 52235833 53240761 54632148 56176052 57546031 59321809
5740 59321809 60865872 62038935 63411288 64562400 65613071 66644423 67455582 68533483
5732F8533483J002011J113509J135411J332744J230132J589715J593560J268239
5724G8798804J395520J537199J490697J159811J165275Q47343O37083N63150M24363
5715H8019245J78880K41191M40153M61216O31205J275525J473422J010818R75311
5706I4706966N81620J5791l87427q99960j056214j231453j745562j813099k485639
5697H5685023k418239k411745k118920j669469j563354j351709p65170o26640
5689G2759777m89589o17807k80701k79043k06091L8367J50873J80712K62353M31559
5679G1950410L66987K62246j74498k38124m47987p02623j013930j165461j299358
5670F7537662j230703j509761j414659q78968j074728p50864m58005n65458k74604
$$ plain form
5732 68533483 69535494 70649003 71784414 73117158 74347290 75937005 77530565 78798804
5724 78798804 80194324 81731523 83222220 84382031 85547306 86394649 87031732 87594882 88019245
5715 88019245 88198125 88439316 88879469 89340685 89971890 91247415 92720837 93731655 94706966
5706 94706966 95288586 95304377 94916950 94016990 92960776 91729323 89983761 88170662 85685023
5697 85685023 83266784 80855039 78736119 77066650 75503296 74151587 73386417 72759777
5689 72759777 72270188 71652381 71371680 71092637 70886546 70924913 71075786 71256498 71518851 71950410
5679 71950410 72317397 72579643 72405145 72167021 71719034 71016411 70002481 68837020 67537662
5670 67537662 66306959 64797198 63382539 62503571 61428843 60677979 60219974 59654516 59379912
5661E9379912j88032l7814R5324K84535M48912L62024J13736K15952k19642n16178
5651E9938729p59914q12725p04774q53526q61813m97981n00747p67330p25044
5642E3454875j65898L035P8276J37451J76203L11160J27450K55122j07302k55346
5632E4015026j93496n95361o64109q92865r79074j047313j235202r49789p12395
5623D6745422q52385q73868n50519m04544m18875k89824o32133l78306j17612
5614D2227356m66981o60720n05957o49735p62548r29248q50644j038887q04234
5605C5558402p49309p58071p40106q70321o77519l89353o62209o31560o08765
5596B9471189m02941l24233l86155l0367j5829l92610k64940n62617j65934l02069
$$ plain form
5661 59379912 59191880 59154066 59249390 59533925 59982837 60344861 60458597 60674549 60454907 59938729
5651 59938729 59178815 58366090 57661316 56807790 55945977 55447996 54947249 54179919 53454875
5642 53454875 53288977 53292012 53370288 53507739 53683942 53995102 54122552 54377674 54270372 54015026
5632 54015026 53821530 53226169 52562060 51669195 50690121 49642808 48407606 47457817 46745422
5623 46745422 45893037 45019169 44468650 44064106 43645231 43355407 42723274 42344968 42227356
5614 42227356 41760375 41099655 40593698 39943963 39181415 38252167 37401523 36362636 35558402
5605 35558402 34809093 34051022 33310916 32440595 31763076 31373723 30711514 30079954 29471189
5596 29471189 29068248 28744015 28357860 28327493 28311664 27919054 27654114 27091497 26925563 26623494
5586B6623494n37610j68680l04291l34242j19704j26108l49172J83958J13382
5577B4981027j56440j09699L69904L18648L44717J41212L61925N55069P99327
5568B7605690J158724J212467J127401J490203Q98535J11266m97542j036633j952605
5559C0117506k260035j665366j008113p99022p23265n44958n37694k01487j83140
5550B2194426p8982l85711j90334m2595j7321P2522o1951K8023k78225K5911K94525
5539B1560288r766K3305K00484l0704k09595j9688o4967l23953j91516k35426
5529B0698462k10315J01946r0367p2683q6379j04283P6637L1357r9714J02473
5519B0347134J48593j40246m1264M7658p99R552k0714j49606Q2345M6579J70285
$$ plain form
5586 26623494 26085884 25917204 25612913 25278671 25158967 25032859 24683687 24867645 24981027
5577 24981027 24824587 24714888 25084792 25403440 25748157 25889369 26251294 26806363 27605690
5568 27605690 28764414 29976881 31104282 32594485 33493020 33604286 33106744 32070111 30117506
5559 30117506 27857471 26192105 25183992 24384970 23661705 23116747 22579053 22377566 22194426
5550 22194426 22115444 21729733 21539399 21496804 21479483 21552005 21490054 21518077 21239852 21265763 21560288
5539 21560288 21550522 21573827 21774311 21743607 21534012 21514324 21449357 21125404 20933888 20698462
5529 20698462 20488147 20590093 20499726 20427043 20340664 20236381 20313018 20344375 20244661 20347134
5519 20347134 20495727 20355481 20314217 20361875 20361076 20370628 20349914 20200308 20282653 20329232 20499517
5508B0499517P8075j9883M1340L15052j15509l2867K5667l9391l1355k6054k33103
5497B0461489k27152k78541j67731J30697K90947r2447p726R8021k03779j88776
5487A9815002Q1734L3055J76606J10407J39628J37506K48797K72788J11366M55836
5477B1582725M33327K87783L69598N09764J46171k04693l85731k3947j47906J13687
5467B2680778l80190o64745n53593l57036k81143m20454n7503n6348j79241N8415
5457A9788940j95720J04794q7850L0086J14453J66261q2605K10029L55248K06823
5447B0610459K02747K19230K28372N88806K38438L04068P9795l46173k24903k38333
5437B1662506n5077P935l62236q16265o50546l96384k29540k04206O2205k89803
$$ plain form
5508 20499517 20577592 20557709 20599049 20914101 20798592 20765725 20791392 20752001 20720646 20694592 20461489
5497 20461489 20234337 19955796 19788065 19918762 20209709 20117262 20109536 20207557 20003778 19815002
5487 19815002 19896736 19929791 20106397 20216804 20356432 20493938 20742735 21015523 21126889 21582725
5477 21582725 22016052 22303835 22673433 23183197 23329368 23124675 22738944 22714997 22567091 22680778
5467 22680778 22300588 21635843 21082250 20725214 20444071 20023617 19966114 19909766 19730525 19788940
5457 19788940 19593220 19698014 19610164 19640250 19754703 19920964 19838359 20048388 20403636 20610459
5447 20610459 20813206 21032436 21260808 21849614 22088052 22392120 22471915 22125742 21900839 21662506
5437 21662506 21607429 21615364 21253128 20436863 19786317 19389933 19160393 18956187 19018392 18728589
5427A8728589l30209j3251j40745p4937J08904j63024j09871L09919J48j1428
5417A8304095K23214J38223J76907K67139o4755J1411K22389J15686n4988j52189
5407A9187132P9033j58203P0129K731j93501K7584j52563n17871q2256K2558j10534
5396A8174239m1508m1891p643j02562j84875J86397j74558l8160O4569k54940
5386A7579068k6395q8229j96804j56989O934k51120L3498r5815j23973k23216
5376A6456959k19369Q1622O8300O4212l7660l5831j15005K16503j10213k01052
5366A6168466l02698m9163J94881j38395j43591p9712O7960K5981j57079R261
5356A5595911O6245o2356k94589J16162j2986j05107j10168k539J31005j44515
$$ plain form
5427 18728589 18398380 18385129 18244384 18169447 18278351 18115327 18005456 18315375 18315523 18304095
5417 18304095 18527309 18665532 18842439 19109578 19044823 19056234 19278623 19394309 19339321 19187132
5407 19187132 19266165 19107962 19178091 19180822 18987321 19014905 18862342 18344471 18262215 18284773 18174239
5396 18174239 18132731 18090840 18083197 17980635 17795760 17982157 17807599 17769439 17834008 17579068
5386 17579068 17552673 17464444 17267640 17110651 17117585 16866465 16899963 16804148 16680175 16456959
5376 16456959 16237590 16319212 16387512 16451724 16414064 16378233 16263228 16479731 16369518 16168466
5366 16168466 15865768 15816605 16011486 15873091 15729500 15649788 15717748 15743729 15586650 15595911
5356 15595911 15662156 15599800 15305211 15421373 15408387 15303280 15193112 15190573 15321578 15177063
5346A5177063r4041q2488j4905k55076j6444k7006m528j61047N7840K0382k85308
5335A4314442L12l5625j57538J14834j3831k75868J81595J08443j13355j430Q621
5324A4130600m5394n4672j33907j37457Q7029K08398l07816n4236p1861j02061
5314A3518623L5988q3508O1639L9597j23304R556k74874j78705r8593m2556L3692
5303A2897555N4948J23326j7174k17132l41200j0041K23678k2085l89065K266
5293A2305076L2914K1088j50683j50505O1267K439o9965k68202k57603M3435j1525
5282A1557736p0902j13086M466k2581j88563k85048P2923J70295J14249k11511
5272A1027978j04345M6160k46852O2725j57605j49649j3246r0017J528J22871
$$ plain form
5346 15177063 15083022 15000534 14985629 14730553 14714109 14687103 14682575 14521528 14579368 14599750 14314442
5335 14314442 14314754 14279129 14121591 14236425 14222594 13946726 14128321 14236764 14123409 14121979 14130600
5324 14130600 14085206 14030534 13896627 13759170 13846199 14054597 13746781 13692545 13620684 13518623
5314 13518623 13554611 13471103 13532742 13572339 13449035 13458591 13183717 13005012 12906419 12863863 12897555
5303 12897555 12952503 13075829 13058655 12841523 12500323 12490282 12713960 12691875 12302810 12305076
5293 12305076 12337990 12359078 12208395 12057890 12119157 12121596 12051631 11783429 11525826 11569261 11557736
5282 11557736 11486834 11373748 11378214 11355633 11167070 10882022 10954945 11125240 11239489 11027978
5272 11027978 10923633 10969793 10722941 10785666 10628061 10478412 10465166 10375149 10376677 10499548
5262A0499548m6310M8326m8892j36139K1994l9852Q768j82474j14897L02598L44362
5251A0657032J01060R3475L9532J15093J52391o199k53156k83849m04236p6825
5241A0134318j40776Q9564r0605l48666p2054J19215k12291k02614J2101M7362
5231I335554o4719l23687J81164k6814n4191K11626l12861j12634R6009j95112
5221H734335m6623J8048J05449l77360l4411k7123L1758o9271j75172j57953N3848
5210H055525j57247P7403K04298k49914q9836j64539N869j7004J31643k00581
5200G595617Q6224J16407j7203p4194k96921K2891j23753k43088N0729J45126
5190G261835O0311M754o3846k1505L3327m4763J05307j05106N7054J70354N9829
$$ plain form
5262 10499548 10453238 10501564 10452672 10316533 10338527 10298675 10307443 10124969 10010072 10312670 10657032
5251 10657032 10758092 10851567 10891099 11006192 11158583 11152384 10899228 10615379 10211143 10134318
5241 10134318 9993542 10083106 9992501 9643835 9571781 9690996 9478705 9276091 9288192 9335554
5231 9335554 9270835 8947148 9128312 9101498 9047307 9258933 8946072 8833438 8929447 8734335
5221 8734335 8687712 8705760 8811209 8433849 8399438 8372315 8404073 8334802 8159630 8001677 8055525
5210 8055525 7898278 7975681 8179979 7930065 7840229 7675690 7681559 7664555 7796198 7595617
5200 7595617 7681841 7798248 7781045 7706851 7409930 7432821 7309068 7065980 7116709 7261835
5190 7261835 7322146 7326900 7263054 7241549 7274876 7230113 7335420 7230314 7287368 7457722 7517551
5179G517551j42184k10402j56333J34848J92484R185J42535J57011k8900J43750
5169G759545K23867M4758K26506n4639j3562k17328r9551r5024n7643L8341N1398
5158G806668j07980O3625L1836k6901r4405k8649j23349J52991l2949j39715N7351
5147G558523K0427J34446J59971j17557j8336R8000q5325J68178o1643J01784
5137G958468R2226j40037r8371P6721l7238K53069J32882R223J63353P7978n0028
5126H438246L17113J68169L14458J06980N2932J8875O1544K25374J46950R6911
5116I947552J85473j89546O2417M4382j56332R9287o8568l0550O381p5020j84386
5105I641090j63674K11594M9727j31643J80646L10227L35839L218K47642M60426
$$ plain form
5179 7517551 7375367 7164965 7008632 7143480 7335964 7345149 7487684 7644695 7615795 7759545
5169 7759545 7983412 8028170 8254676 8200037 8186475 7969147 7869596 7774572 7716929 7755270 7806668
5158 7806668 7698688 7762313 7794149 7767248 7672843 7644194 7520845 7673836 7640887 7501172 7558523
5147 7558523 7578950 7713396 7873367 7755810 7737474 7835474 7750149 7918327 7856684 7958468
5137 7958468 8050694 7910657 7812286 7889007 7851769 8104838 8237720 8246943 8410296 8488274 8438246
5126 8438246 8755359 8923528 9237986 9344966 9397898 9416773 9478317 9703691 9850641 9947552
5116 9947552 10133025 9943479 10005896 10050278 9893946 9993233 9924665 9894115 9900496 9825476 9641090
5105 9641090 9477416 9689010 9738737 9607094 9787740 10097967 10433806 10437024 10684666 11145092
5095A1145092K26876J76508L00316M2236j44364k89792N3304j09800O5812p3285
5085A1392903o7133j74946m37064m06981j14770q5663o00054l67588j78525j42187
5075H817992O4662J8663O2407P1183o6236R9899K66800p888k5995O799O365p2854
5063I241797j79119j04939k43155q5192n2J54795j33226l86076q3301l3325r7931
5052H050276k29374k95491l437L13851o1221j75654k714j69647J80406M6614k09024
5041G444585N5663Q8114J1965j31716J08507K4395j12021j22496K2816k09179
5031G180633l9653K5278K7227K40583J50405j3797J4473J92233l260p5495J07406
5020G806033M0589j33646m1589j9185j75163K8679J76554J51235j48174k22704
$$ plain form
5095 11145092 11371968 11548476 11848792 11891028 11746664 11456872 11510176 11400376 11466188 11392903
5085 11392903 11325770 11150824 10713760 10306779 10192009 10106346 9506292 9138704 8960179 8817992
5075 8817992 8882654 8901317 8963724 9034907 8968671 9068570 9335370 9327482 9301487 9308286 9314651 9241797
5063 9241797 9062678 8957739 8714584 8629392 8629340 8784135 8650909 8264833 8181532 8148207 8050276
5052 8050276 7820902 7525411 7521974 7835825 7774604 7598950 7596236 7426589 7606995 7653609 7444585
5041 7444585 7500248 7588362 7600327 7468611 7577118 7601513 7489492 7366996 7389812 7180633
5031 7180633 7140980 7166258 7193485 7434068 7584473 7570676 7585149 7777382 7774122 7698627 7806033
5020 7806033 7846622 7712976 7671387 7652202 7477039 7505718 7682272 7833507 7685333 7462629
5010G462629o3498q9145J31640L8745q827K20678Q1592o6949n2722j07149Q7438
4999G634432O3769j6255R4178J90006Q7007L7268L7859Q9395J26458n034l21958
4988H017125p2083Q7718J20724R4514q8670J04106P5660n4824R6493J69488N779
4977H556030M9860K41321j05020K53065P1248J58985J47893J32534j43036M5099
4967I407979J04191M1404q9868J5580K63891K48870J30746J7274K26433J01584
4957A0468084O8631R0253J43882M07781M21684P4381K58339J32444L09558M82902
4947A2857939L81005K66030M10503M51546N46138K80110N68714M55083O26606
4938A6843674L56002L01560J97936k6464m3813j74291k97711q5555J9901j30198
$$ plain form
5010 7462629 7399131 7309986 7441626 7480371 7471544 7692222 7773814 7706865 7654143 7546994 7634432
4999 7634432 7698201 7681946 7776124 7966130 8053137 8090405 8128264 8217659 8344117 8339083 8017125
4988 8017125 7945042 8032760 8153484 8247998 8159328 8263434 8339094 8284270 8380763 8550251 8556030
4977 8556030 8605890 8847211 8742191 8995256 9066504 9225489 9373382 9505916 9362880 9407979
4967 9407979 9512170 9553574 9463706 9479286 9743177 9992047 10122793 10140067 10366500 10468084
4957 10468084 10536715 10626968 10770850 11178631 11600315 11674696 11933035 12065479 12375037 12857939
4947 12857939 13238944 13504974 13915477 14367023 14913161 15193271 15761985 16217068 16843674
4938 16843674 17199676 17501236 17699172 17672708 17628895 17454604 17156893 17071338 17091239 16961041
4928A6961041J79764j28658o0614J02247K40643m8410j21619n7487j38209l68512
4918A6560186m31682o49491o30159l76929n22301n33083m20895n62515m41807
4909A1991324m58604l03244j70292J04829j59845k8731j95249m8395j78691l03607
4899A0249495J47975m3585j82501L7549r1705M9658K36251j51434J12069L21505
4889A0685277K68373K81514J48499L35983J24867J14766L08452M57043N19262
4880A3244036J70593K82448P11366N40760M84037P08025N03407P73991O92137
4871A8110800P27331K52078J39570M5877J06067j87806l9769k88215k38627j84842
4861A8442464p0991r4528k25531O9498j50448m29660j6572l40046o30683o02967
$$ plain form
4928 16961041 17140805 17012147 16951533 17053780 17294423 17246013 17124394 17066907 16928698 16560186
4918 16560186 16128504 15479013 14848854 14471925 13949624 13416541 12995646 12433131 11991324
4909 11991324 11532720 11229476 11059184 11164013 11004168 10975437 10780188 10731793 10553102 10249495
4899 10249495 10397470 10353885 10171384 10208933 10117228 10166886 10403137 10251703 10363772 10685277
4889 10685277 10953650 11235164 11383663 11719646 11844513 11959279 12267731 12724774 13244036
4880 13244036 13414629 13697077 14408443 14949203 15433240 16141265 16644672 17418663 18110800
4871 18110800 18838131 19090209 19229779 19275656 19381723 19193917 19154148 18865933 18627306 18442464
4861 18442464 18371473 18276945 18051414 18120912 17970464 17540804 17524232 17184186 16553503 15950536
4851A5950536p21092r15483o94187o15630o19368m67727m15846l80031m34264
4842A0686908n14211l38063l13831l09629l04065j95459k24120j70368j98494
4833H118668k46307j45752k06941M6577k59449j30876j27163j35632J29997r3916
4823F949206j77203j81224k33829p2763q3832p3274Q3032p1329M9983O9455l59585
4812E898637m7999Q158m167j1174j31780j50054L1010M7393K6938k61211q4331
4801E321420O0020p8030p2941j71981l4108K55615K5892j24928M2484J01525j66636
4790E158332k8372K03041L2439J54279o4509R4322J76942n5808q5381P261J39154
4779E731700k55j9935J32404n5644Q768J52440k9256Q9403K35391J58178l3829
$$ plain form
4851 15950536 15229444 14313961 13619774 13004144 12384776 11917049 11501203 11121172 10686908
4842 10686908 10172697 9834634 9520803 9211174 8907109 8711650 8487530 8317162 8118668
4833 8118668 7872361 7726609 7519668 7566245 7306796 7175920 7048757 6913125 7043122 6949206
4823 6949206 6772003 6590779 6356950 6284187 6200355 6127081 6210113 6138784 6188767 6258222 5898637
4812 5898637 5850638 5858796 5854629 5843455 5711675 5561621 5592631 5640024 5666962 5405751 5321420
4801 5321420 5381440 5303410 5230469 5058488 5024380 5279995 5305887 5180959 5223443 5324968 5158332
4790 5158332 5129960 5333001 5365440 5519719 5455210 5549532 5726474 5670666 5585285 5592546 5731700
4779 5731700 5731445 5711510 5843914 5788270 5797038 5949478 5920222 6009625 6245016 6403194 6369365
4768F369365j26322j89619J17617K79682Q3177j62196K00753K7496L5812L0211
4758F665976j9762K30222L44778j11929J54520m5666J53899L011q327J90218O3556
4747G620496o4227O2041L8143J40198L59728N6423j62342j52671L35251J19012
4737H352052L2596P4418J73328K38044J79287Q6484k08729J73206K93342L22545
4727I716573M89497J58218M73228L64926J62100K47638M67379N21112M48236L65673
4717A3414580M44997M97841J65216o2554j31095o2564j59067N9746J32308K00681
4707A4500089L64809L51976N56765N61232L76895M02133O94855O37981N95035
4698A9041770L53297L88398M73231N05064N72597J72606j26713J57012k12324
$$ plain form
4768 6369365 6243043 6053424 6171041 6450723 6533900 6371704 6572457 6599953 6635765 6665976
4758 6665976 6646214 6876436 7221214 7109285 7263805 7218139 7372038 7375049 7366722 7556940 7620496
4747 7620496 7556269 7618310 7656453 7796651 8156379 8212802 8050460 7897789 8233040 8352052
4737 8352052 8384648 8459066 8632394 8870438 9049725 9136209 8927480 9100686 9394028 9716573
4727 9716573 10206070 10364288 10837516 11202442 11364542 11612180 12079559 12600671 13048907 13414580
4717 13414580 13859577 14357418 14522634 14460080 14328985 14266421 14107354 14167100 14299408 14500089
4707 14500089 14864898 15216874 15773639 16334871 16711766 17113899 17808754 18446735 19041770
4698 19041770 19395067 19783465 20256696 20761760 21334357 21506963 21380250 21537262 21324938
4689B1324938J43196P926Q0077P7970m0688M5051j6411K23246P1778J85524K78531
4678B2381138J2100M5258M8157K8850q3807j17409r6245j70683q9959J93948j19780
4667B2031568L13249L26882K67480M52823L23513r3962k15979j92599j65836k4511
4657B3022628l17894m66561m97563k79788j45815J20387J85866R4961M91804P08151
4647B2916176M21800N96546L89605L37911J94999J78981j0797L1579j79213n3507
4637B4824080M85k47827L24776J41220L11520N49451M92350O95127Q59420O24322
4627B8574924M44176N35874O09956L11990K3544R3777j21733k6326n6129k11449
4617C0178604k81357l97412m13887n36717m38591m27995q08497q87543q21531
$$ plain form
4689 21324938 21468134 21476060 21556137 21634107 21593419 21638470 21622059 21845305 21917083 22102607 22381138
4678 22381138 22393238 22438496 22486653 22515503 22431696 22314287 22218042 22047359 21957400 22151348 22031568
4667 22031568 22344817 22671699 22939179 23392002 23715515 23621553 23405574 23212975 23047139 23022628
4657 23022628 22704734 22238173 21740610 21460822 21315007 21435394 21621260 21716221 22208025 22916176
4647 22916176 23337976 23934522 24324127 24662038 24857037 25036018 25025221 25056800 24877587 24824080
4637 24824080 24824565 24576738 24901514 25042734 25354254 25903705 26396055 27091182 27950602 28574924
4627 28574924 29019100 29554974 30164930 30476920 30500464 30594241 30472508 30446182 30390053 30178604
4617 30178604 29897247 29499835 29085948 28549231 28110640 27682645 26874148 25986605 25165074
4608B5165074p65385q19140q57935r45079q42618o42566o55810q05935p15422
4599A8115184n24003l89004l79794l88760j43742m26170j45383k48578l64006
4590A5105744k46631O5431r8060r9693N2342k74065l964k17663j32493p1496K7876
4579A4107328J14209k28817k6271J79508L0261J39289j17242N9334J41057K73343
4569A4671999j65124O1563M25705R5821N5572L65536M97950N47093L25788M57834
4559A7339737P00750N71432P40876Q13993M73186L77106M28559j00814l45600
4550B0999225q15065o05984m61650o50703k61228k83091j60103q3894n731J89702
4540A7861478k8751L29951L61564J73433K68908L24891O07984N73226P53541P17070
$$ plain form
4608 25165074 24399689 23580549 22722614 21777535 20934917 20292351 19636541 18830606 18115184
4599 18115184 17591181 17202177 16822383 16433623 16289881 15863711 15718328 15469750 15105744
4590 15105744 14859113 14924544 14826484 14726791 14779133 14505068 14501104 14283441 14150948 14079452 14107328
4579 14107328 14221537 13992720 13966449 14145957 14176218 14315507 14198265 14257599 14398656 14671999
4569 14671999 14506875 14568438 14994143 15089964 15145536 15511072 16009022 16556115 16881903 17339737
4559 17339737 18040487 18611919 19352795 20166788 20639974 21017080 21445639 21344825 20999225
4550 20999225 20184160 19578176 19116526 18465823 18204595 17921504 17761401 17677507 17671776 17861478
4540 17861478 17832727 18162678 18524242 18697675 18966583 19291474 19899458 20472684 21226225 21943295
4530B1943295P83691R94079J024265Q52745R91569R42543J272749R32213J025466
4521C0762615Q04415P89121K80449l75015k85485r14548j223394j266647j148530
4512B7422981r67076j178922q13149l10412o35214l54247j80844r6638k54294
4503B2632185j7574J43540L03730K88139j59258J50916K39617k79173k42103l67033
4493B2692986j52206o5397j08413K91796K88485M57661L49752K81857L53098K43848
4483B4633467O12348N98139L99375K12034M04923J51655j80264n6580n3048j57841
4473B6564208k9716m42832k3476k12005j79281R3049J69224K06758J21633K73630
4463B6541192L20853J35152P6305k73605k97232n36066n78460m66886o15827q29381
$$ plain form
4530 21943295 22726986 23721065 24745330 25598075 26589644 27532187 28804936 29737149 30762615
4521 30762615 31567030 32356151 32636600 32261585 31976100 31061552 29838158 28571511 27422981
4512 27422981 26455905 25276983 24463834 24153422 23518208 23163961 22983117 22886479 22632185
4503 22632185 22614611 22758151 23061881 23350020 23190762 23341678 23581295 23302122 23060019 22692986
4493 22692986 22540780 22475383 22366970 22658766 22947251 23404912 23754664 24036521 24389619 24633467
4483 24633467 25245815 25843954 26243329 26455363 26860286 27011941 26831677 26775097 26722049 26564208
4473 26564208 26534492 26091660 26068184 25856179 25676898 25769947 25939171 26145929 26267562 26541192
4463 26541192 26862045 26997197 27073502 26799897 26502665 25966599 25388139 24921253 24305426 23476045
4453B3476045o96073n30177o52000n47055m42137m61708m32106l56549n61534
4444A8796706k32602k93022k96312p2125M1678j84595j42713K1855K9194J60928
4434A7828992n248J4093L51380M06652J11752L28831N90700M88046M57460M97100
4424B1069758M59996N07238M16789P53004Q19138L07114M14016M06403K69685
4415B5423141K66080R3167k74838l20935o02756n66270l22394n85658o40393n01786
4405B1967358n89527o65701o23226k66882m50544j44074m69731k86824j55077
4396A8315772k59348k68609J29938K20226j41862J03736N4474L17420R5313J54911
4386A8721971K77954R3764J96572L23300N72442J96207J40040J16835p485J43368
$$ plain form
4453 23476045 22779972 22249795 21597795 21050740 20608603 20146895 19714789 19358240 18796706
4444 18796706 18564104 18271082 17974770 17902645 17944323 17759728 17617015 17638870 17668064 17828992
4434 17828992 17823744 17837837 18189217 18595869 18707621 19036452 19627152 20115198 20572658 21069758
4424 21069758 21529754 22036992 22453781 23206785 24025923 24333037 24747053 25153456 25423141
4415 25423141 25689221 25782388 25507550 25186615 24583859 24017589 23695195 23109537 22469144 21967358
4405 21967358 21377831 20712130 20088904 19822022 19371478 19227404 18757673 18470849 18315772
4396 18315772 18056424 17787815 17917753 18137979 17996117 18099853 18154327 18471747 18567060 18721971
4386 18721971 18999925 19093689 19290261 19613561 20186003 20382210 20522250 20639085 20631600 20774968
4376B0774968J03671J9472o1994k5794j58307j085J2621k751k09287k45482k24906
4365A9981126J944m54789l83816J60741k37117j28229M6017J6152J88818m373
4355A9186474P9595J6622K3227l3218P6492J97342k79452K4074o3222o11j50936
4344A9076387l08362k41755K7202j59909m37194k20497j46005j31397j26896l63424
4334A6968150j24951k19669k14147K625j75859k01602J39901P888K35675l1255
4324A6386756k3625J18460M8270Q8670K93391L45916O5882K49196K72336J53076
4314A7998328R1036J93013K00278R3500p8780m965O7263R163l26069k20556k16927
4303A7805284J12971j23542j90375m09655l39616l34573k71031j2922k29277l11812
$$ plain form
4376 20774968 20878639 20898111 20836117 20810323 20652016 20650931 20663552 20660801 20451514 20206032 19981126
4365 19981126 19983070 19528281 19144465 19305206 19068089 18939860 18985877 19002029 19190847 19186474
4355 19186474 19266069 19282691 19305918 19272700 19349192 19546534 19267082 19291156 19227934 19227323 19076387
4344 19076387 18768025 18526270 18553472 18393563 17956369 17735872 17589867 17458470 17331574 16968150
4334 16968150 16843199 16623530 16409383 16412008 16236149 16034547 16174448 16182336 16418011 16386756
4324 16386756 16363131 16481591 16529861 16618531 16911922 17257838 17323720 17572916 17845252 17998328
4314 17998328 18089364 18282377 18482655 18576155 18497375 18492410 18559673 18568836 18242767 18022211 17805284
4303 17805284 17918255 17794713 17604338 17194683 16855067 16520494 16249463 16236541 16007264 15695452
4293A5695452l23608l29630j44107j82941k05280l9955l06250k45206P6413L7601
4283A4032489r4041j40373j45746j23372K3463K81420O3530K92886R4684k31901
4273A4053039J52266J11729L26139M16395L03637J70669K83391L53828J89259
4264A6360352L93513K39776K87407J33922J67404N40282L71124L09873R0427L32487
4254A9226567L20835K56899J29703L80057L51230L57954K02778L47911M81797
4245B2055731M47604K74720K58607K83534L80820M98104L75526L04923J79083
4236B5058652N32858M14538N09049P73048P14923O83352N48657M48933M79382
4227C0163392O16221N32569O80253P92058N56729J043691P94167M12424Q83830
$$ plain form
4293 15695452 15371844 15042214 14898107 14715166 14509886 14469931 14163681 13918475 13994888 14032489
4283 14032489 13938448 13798075 13652329 13528957 13552420 13833840 13897370 14190256 14284940 14053039
4273 14053039 14205305 14317034 14643173 15059568 15363205 15533874 15817265 16171093 16360352
4264 16360352 16753865 16993641 17281048 17414970 17582374 18122656 18493780 18803653 18894080 19226567
4254 19226567 19547402 19804301 19934004 20314061 20665291 21023245 21226023 21573934 22055731
4245 22055731 22503335 22778055 23036662 23320196 23701016 24199120 24574646 24879569 25058652
4236 25058652 25591510 26006048 26515097 27288145 28003068 28686420 29235077 29684010 30163392
4227 30163392 30779613 31312182 31992435 32784493 33341222 34384913 35179080 35591504 36475334
4218C6475334P99073R40496J121975J176115J082467J166663J193092J063702
4210D5018917J256533J235100J176344J363316J370219J355318J955417J778099
4202E6509263J753242K295570K411429K407609K570924K682690L144723L347686
4194G7123136L530610M116957M757318N253393O635767P670023Q352346J0166673
4186A27606223J1605020J2781972J4458829J6151516J8135591K0353948K3578195
4179B44671294K7503758L2703072L8127259M3391269M6215335M4590621L5578100
4172E12780708J8400236m062317k8069732m6399310n4747227n3432780m6251598
4165B98217980l7706344l0548385k5235651k0815611j6785501j3862570j1151374
$$ plain form
4218 36475334 37274407 38214903 39336878 40512993 41595460 42762123 43955215 45018917
4210 45018917 46275450 47510550 48686894 50050210 51420429 52775747 54731164 56509263
4202 56509263 58262505 60558075 62969504 65377113 67948037 70630727 73775450 77123136
4194 77123136 80653746 84770703 89528021 94781414 101417181 109087204 117439550 127606223
4186 127606223 139211243 151993215 166452044 182603560 200739151 221093099 244671294
4179 244671294 272175052 304878124 343005383 386396652 432611987 477202608 512780708
4172 512780708 531180944 527118627 499048895 452649585 397902358 344469578 298217980
4165 298217980 260511636 229963251 204727600 183911989 167126488 153263918 142112544
4158A42112544q799732p070970n871535m972017m302730l983388l512063l496417
4150A00103692l450990l436414l690528l576648l257097l255905k817918k613069
4142G4005123k858345k536732k315929k412618k542266k191542j600632j565006
4134E5982053j631340j562010j412868j070364j516549j617041j286471j734702
4126D4150708j842362j811642j960818j563807j271893r82839j162889q91475
4118C2662983p23053p75541p35924q46450p46948o84932m11635n58222n64122
4109B6616156l98331l94441p19936p44295p98678o93228n22495n51076l93898
4100B1399778m23735m75091m80067k44582m40973m26815M1760j45088m53907j65146
$$ plain form
4158 142112544 133312812 126241842 120370307 115398290 111095560 107112172 103600109 100103692
4150 100103692 96652702 93216288 89525760 85949112 82692015 79436110 76618192 74005123
4142 74005123 71146778 68610046 66294117 63881499 61339233 59147691 57547059 55982053
4134 55982053 54350713 52788703 51375835 50305471 48788922 47171881 45885410 44150708
4126 44150708 42308346 40496704 38535886 36972079 35700186 34717347 33554458 32662983
4118 32662983 31939930 31164389 30428465 29582015 28835067 28150135 27738500 27180278 26616156
4109 26616156 26217825 25823384 25103448 24359153 23560475 22867247 22344752 21793676 21399778
4100 21399778 20976043 20500952 20020885 19776303 19335330 18908515 18950275 18805187 18351280 18186134
4090A8186134j01909m15863k76215K51696j16082k50241l54796k20305j9346r1679
4080A6591394j62671k46650j35056n551l1857r2176J88418j45628J15699K29177
4070A6305099R6517L1670J09445p8226k9026j33677p0312L50834O768K64395R5808
4059A6949295J6243j45647k49221P2059P0945q8837K14538J78779P4439J63664
4049A7256257K28740k9547l2510J29008M51560L44442K99909Q9576R0104L96038
4039A9223577L41207P22645M66203M01585M01343M04370M86150N23107N31922
4030B3502109O60486P73921P12093P18757N09909N53427Q46076Q82656J054518
4021C0213952J053548J189530R62979R35009J365207J311742J259590J352599
$$ plain form
4090 18186134 18084225 17668362 17392147 17643843 17527761 17277520 16922724 16702419 16683073 16591394
4080 16591394 16428723 16182073 16047017 16041466 16009609 15917433 16105851 15960223 16075922 16305099
4070 16305099 16401616 16433286 16542731 16464505 16435479 16301802 16231490 16582324 16589092 16853487 16949295
4059 16949295 16965538 16819891 16570670 16642729 16713674 16624837 16839375 17018154 17092593 17256257
4049 17256257 17484997 17455450 17422940 17551948 18003508 18347950 18647859 18737435 18827539 19223577
4039 19223577 19564784 20287429 20753632 21155217 21556560 21960930 22447080 22970187 23502109
4030 23502109 24162595 24936516 25648609 26367366 26877275 27430702 28276778 29159434 30213952
4021 30213952 31267500 32457030 33420009 34355018 35720225 37031967 38291557 39644156
4013C9644156J436070J434127J529533J462010J570803J613141J783552J707035
4005E2180427J697927J842114K162957J926849J875382K176615K428287K310899
3997F8601457K091147K040200K171954K335880K223765K156485K000103K287384
3989H5908375K140603K144477K271756K474408J853163K161673K017638J786918
3981A02759011J783645J683501J407341J304338J506518J419878J191140P54135
3973A13809507P40575O08051O79233O63906J66420j16083j8742l15716o18996
3964A15598155o96172n59034j095953j053716r70514j432390j563246j607756
3956A06619374j761476j827994j626844j806014k281270k291856k184662k408267
$$ plain form
4013 39644156 41080226 42514353 44043886 45505896 47076699 48689840 50473392 52180427
4005 52180427 53878354 55720468 57883425 59810274 61685656 63862271 66290558 68601457
3997 68601457 70692604 72732804 74904758 77240638 79464403 81620888 83620991 85908375
3989 85908375 88048978 90193455 92465211 94939619 96792782 98954455 100972093 102759011
3981 102759011 104542656 106226157 107633498 108937836 110444354 111864232 113055372 113809507
3973 113809507 114550082 115158133 115837366 116501272 116667692 116551609 116532867 116217151 115598155
3964 115598155 114901983 114342949 113246996 112193280 111222766 109790376 108227130 106619374
3956 106619374 104857898 103029904 101403060 99597046 97315776 95023920 92839258 90430991
3948I0430991k254464k192642k568525k602651k450670k295990k307804k645561
3940G1112684k314281k451658k271166k331013k292262k186119k409653k161696
3932E2694836k097551k052323j862821j755480j867974j870420j595526j725476
3924C7867265j481575j364356j441043j152714j349503j265865r77701j122544
3916B7711964q65693j019469r96181o52306r93877p21252o57179p64668p57644
3907B0283695l84711o03365p33359l41677m72888m48901m00596n58768o1472k76649
3897A6001309l65586j13624k78411l34202k53747o2090o967l61402j56886n2817
3887A4015577k18731K54285K27560j21415m7602m5086k06539k43443m46131m77091
$$ plain form
3948 90430991 88176527 85983885 83415360 80812709 78362039 76066049 73758245 71112684
3940 71112684 68798403 66346745 64075579 61744566 59452304 57266185 54856532 52694836
3932 52694836 50597285 48544962 46682141 44926661 43058687 41188267 39592741 37867265
3924 37867265 36385690 35021334 33580291 32427577 31078074 29812209 28834508 27711964
3916 27711964 26846271 25826802 24830621 24178315 23184438 22463186 21806007 21041339 20283695
3907 20283695 19898984 19295619 18562260 18220583 17747695 17298794 16898198 16339430 16277958 16001309
3897 16001309 15635723 15522099 15243688 14909486 14655739 14593649 14586682 14225280 14068394 14015577
3887 14015577 13796846 14051131 14278691 14157276 14109674 14064588 13858049 13614606 13168475 12691384
3877A2691384l72974m59883l15014k17205m50915k90133j96947l07610j60081
3868I920622q4378j10297Q0165j13320k52992p3730j00087q9188k33957J33459
3858I076297q5462k78689J7401r6645L6973Q280j67132r2737m0532j32128j56084
3847H089542K15653R6297k8290j03539j39196J12934o3233j91531J5531J11161
3837H115329r5132j35158j44908j08005J82849J02997j3829p7167j35314J13570
3827G805232n024j29203M5894n3639j02862N0399k08162j68J70337J7231j51038
3816G438997j74661J63609k02703o8303J06680k04628O3664M806m6646K86300
3806G367115J5193r3972k6125r6040P8548K18589j89288L9344J26295J17751q5258
$$ plain form
3877 12691384 12318410 11858527 11543513 11326308 10875393 10585260 10388313 10080703 9920622
3868 9920622 9836244 9725947 9806112 9692792 9439800 9366070 9265983 9176795 8942838 9076297
3858 9076297 8990835 8712146 8729547 8632902 8669875 8678155 8511023 8418286 8377754 8245626 8089542
3847 8089542 8305195 8401492 8373202 8269663 8130467 8243401 8180168 7988637 8004168 8115329
3837 8115329 8020197 7885039 7740131 7632126 7814975 7917972 7904143 7826976 7691662 7805232
3827 7805232 7800208 7671005 7716899 7663260 7560398 7610797 7402635 7402467 7572804 7590035 7438997
3816 7438997 7264336 7427945 7225242 7156939 7263619 7058991 7122655 7127461 7080815 7367115
3806 7367115 7382308 7288336 7262211 7166171 7244719 7463308 7274020 7313364 7439659 7557410 7472152
3795G472152o591J0218J3123K21205k4207J55407J48524r8019j55032K09089q5699
3784G860170J32459m1692j21342p6295K03383R1897r068J20340K25105l3298M9120
3773H400779m6492J38844K9517K8198K35424N6628J08621J72502K73996k4281
3763I373736J34707J25636J78919O7703J2457P5698n8980K12000J40998N3180
3753A0316054J85891J03939P3164j93100J52823L79600k6878K0019J58510j14311
3743A1055711Q8097P8159M47193J00992o2452J88963J705P2224R6219L90275R5964
3732A2553050L43487K59138J85325K26380K01032K60559L94677J64424k0500M67240
3722A5034812K37854K93385K72490J16604J91871K72620L40964L34030L54205
$$ plain form
3795 7472152 7465561 7475779 7488902 7710107 7685900 7841307 7989831 7891812 7736780 7945869 7860170
3784 7860170 7992629 7950937 7829595 7753300 7956683 8048580 8039512 8159852 8384957 8351659 8400779
3773 8400779 8354287 8493131 8522648 8550846 8786270 8842898 8951519 9124021 9398017 9373736
3763 9373736 9508443 9634079 9812998 9880701 9893158 9968856 9909876 10121876 10262874 10316054
3753 10316054 10501945 10605884 10679048 10485948 10638771 11018371 10991493 11011512 11170022 11055711
3743 11055711 11143808 11221967 11669160 11770152 11707700 11896663 11898368 11970592 12066811 12457086 12553050
3732 12553050 12896537 13155675 13341000 13567380 13768412 14028971 14423648 14588072 14567572 15034812
3722 15034812 15272666 15566051 15838541 15955145 16147016 16419636 16760600 17094630 17448835
3713A7448835N57895K89717K88584N00842L51283L25885O49455N43266K86390
3704B1242152K87223N23932M55845L81999Q75259N41482M38531M11132N04515
3695B5662070P17531O48068N51772Q32894P84296J016933R46893Q51914N75572
3686C2587943J065988J157467Q32787J191144R58059J213758J301096J394035
3678D1702277J355080J264186J152754J339409J221411J051460J280277J060400
3670E1427254J091725J153355J117176J104609P57945J209437J116361Q65401
3662E9843263Q71342R70932O35630J055545Q45526P10666N51480N73776N65941
3653F6624101Q35838J017318Q08940R25343R60564R32223R34547J241070J364233
$$ plain form
3713 17448835 18006730 18296447 18585031 19085873 19437156 19763041 20412496 20955762 21242152
3704 21242152 21529375 22053307 22509152 22891151 23766410 24307892 24746423 25157555 25662070
3695 25662070 26379601 27027669 27579441 28412335 29196631 30213564 31160457 32012371 32587943
3686 32587943 33653931 34811398 35644185 36835329 37793388 39007146 40308242 41702277
3678 41702277 43057357 44321543 45474297 46813706 48035117 49086577 50366854 51427254
3670 51427254 52518979 53672334 54789510 55894119 56652064 57861501 58977862 59843263
3662 59843263 60714605 61685537 62321167 63376712 64222238 64932904 65484384 66058160 66624101
3653 66624101 67459939 68477257 69286197 70211540 71172104 72104327 73038874 74279944 75644177
3644G5644177J229959J271695J379778J552908J722064J726417J660058J891316
3636H8078372K161776K050581J912339K198408K291729K383992K543258K433237
3628A06053692K526595K487809K323923K450487K276901K282459K294276K115936
3620A24812078K210940J902184J918203J690960J730879J513942J371173J371571
3612A38521930J032115Q41507R47981Q72140Q04534Q04357N85562L79155L64763
3603A45154044M66248K93094J00543N86668L24264Q4066N28787N31999L68118
3594A48437831P57425J039816J208691J167966J459577J665568J875318J659760
3586A59271952K144785K190495K302752K297856K403184K774299K904525K719063
$$ plain form
3644 75644177 76874136 78145831 79525609 81078517 82800581 84526998 86187056 88078372
3636 88078372 90240148 92290729 94203068 96401476 98693205 101077197 103620455 106053692
3628 106053692 108580287 111068096 113392019 115842506 118119407 120401866 122696142 124812078
3620 124812078 127023018 128925202 130843405 132534365 134265244 135779186 137150359 138521930
3612 138521930 139554045 140395552 141343533 142215673 143020207 143824564 144410126 144789281 145154044
3603 145154044 145620292 145913386 146013929 146600597 146924861 147008927 147537714 148069713 148437831
3594 148437831 149195256 150235072 151443763 152611729 154071306 155736874 157612192 159271952
3586 159271952 161416737 163607232 165909984 168207840 170611024 173385323 176289848 179008911
3578A79008911K563474K705582K694209K612180K777484K407209K475253K452009
3570A99696311K464095K411505K240065K497637K089402K034071K288608K178182
3562B17899876K191572K391962K082701J963687J984974K457404K129230K109258
3554B35210664J822884J834090J689232J398957J681927J755327J987436J861288
3546B49241805J967646J734707J905610J676601J069683O22015J95448n31104
3538B57882411j116158j766363k244220k881019l113689l135789l376291l129085
3530B37119797l311234l334003l173340l391843l489942l422847l754594m094294
3522B09147700m026717m290844m470668m140923m160401l779707l521994l260851
$$ plain form
3578 179008911 181572385 184277967 186972176 189584356 192361840 194769049 197244302 199696311
3570 199696311 202160406 204571911 206811976 209309613 211399015 213433086 215721694 217899876
3562 217899876 220091448 222483410 224566111 226529798 228514772 230972176 233101406 235210664
3554 235210664 237033548 238867638 240556870 241955827 243637754 245393081 247380517 249241805
3546 249241805 251209451 252944158 254849768 256526369 257596052 258218067 258413515 257882411
3538 257882411 256766253 254999890 252755670 249874651 246760962 243625173 240248882 237119797
3530 237119797 233808563 230474560 227301220 223909377 220419435 216996588 213241994 209147700
3522 209147700 205120983 200830139 196359471 192218548 188058147 184278440 180756446 177495595
3514A77495595k844126k416768k429572k290801k289363j657635j652799j627890
3506A60286641j568671j798788j773449j692866j892603j886713k242519k056819
3498A45374213j905160k159737k428489k310335k501504k360028k441250k444460
3490A26823250k522334k468393k385400k620741k511851k361953k374002k461502
3482A07117074k440914k316455k083111k168039k168720j905044j986577k089311
3474H9958903j837594j706614j490429j180574j353011j360616j229821j542160
3466G8258084j192501r15906j098108r32634q70624o38156q86595j144438q23542
3457F9755580q85675p41211j043241o99072r18139q31062p77605o92361p98135
$$ plain form
3514 177495595 174651469 172234701 169805129 167514328 165224965 163567330 161914531 160286641
3506 160286641 158717970 156919182 155145733 153452867 151560264 149673551 147431032 145374213
3498 145374213 143469053 141309316 138880827 136570492 134068988 131708960 129267710 126823250
3490 126823250 124300916 121832523 119447123 116826382 114314531 111952578 109578576 107117074
3482 107117074 104676160 102359705 100276594 98108555 95939835 94034791 92048214 89958903
3474 89958903 88121309 86414695 84924266 83743692 82390681 81030065 79800244 78258084
3466 78258084 77065583 76149677 75051569 74118935 73248311 72610155 71723560 70579122 69755580
3457 69755580 68869905 68128694 67085453 66386381 65468242 64637180 63859575 63167214 62369079
3448F2369079q47630r78769r89786r20332q62133q98809j005437r34561j083777
3439E3847845j157036j278272j308994j137798j026516j291345j100002j239289
3431D4308593j339327j257626j310248j160237j179009j095418j103366r70985
3423C4892377j286604j159230j015618r07574r00957j200540j126759n93625q73932
3414B5827538j107787m81416p11257r87881q01721o71383n34593m35378o09454
3405A9486668o92889m43471l65594m11680l63835l11968m12250n46660k88112
3396A5650209m11580l41999k61029l51841k51270j36103r6294l60351k26444j21952
3386A3091346j53915k23988k44658k28261l80416k98097r7691j89672j84684j65398
$$ plain form
3448 62369079 61521449 60542680 59552894 58632562 57770429 56871620 55866183 54931622 53847845
3439 53847845 52690809 51412537 50103543 48965745 47939229 46647884 45547882 44308593
3431 44308593 42969266 41711640 40401392 39241155 38062146 36966728 35863362 34892377
3423 34892377 33605773 32446543 31430925 30523351 29622394 28421854 27295095 26701470 25827538
3414 25827538 24719751 24238335 23527078 22539197 21737476 21066093 20531500 20096122 19486668
3405 19486668 18793779 18350308 17984714 17573034 17209199 16897231 16484981 15938321 15650209
3396 15650209 15238629 14896630 14635601 14283760 14032490 13896387 13800093 13439742 13213298 13091346
3386 13091346 12937431 12713443 12468785 12240524 11860108 11562011 11464320 11274648 11089964 10924566
3376A0924566k39000q0553j24239j01379j66415R0060r4725k27035l51813j04863
3366I524604l5882j79510P8304k62212k08418q2183m8008j59435J21356P8839
3356H827455j96977k92975k8202l9754M4518j20054k64018L1202j85779R1627
3346G867043j77508m04915J8965K17140J0861L6821m9592j49620Q5239l0993J6107
3335G439548R9700p0955k89571q7363k3978O7409P6366O2607k5172j45529J18380
3324G221442J3880j0343K5251P8025N5903J091O1952J77663K6390O3785J22045
3313G837084J01206K60156J06788j6426R7246J35388j33028k48660j80606l8127
3303G921021K8717J08992J80462P7242j63319o8765k95518j6088J5814J63432
$$ plain form
3376 10924566 10685566 10605013 10480774 10379395 10212980 10303040 10208315 9981280 9629467 9524604
3366 9524604 9488722 9309212 9387516 9125304 8916886 8834703 8786695 8627260 8748616 8827455
3356 8827455 8630478 8337503 8309301 8269547 8314065 8194011 7929993 7961195 7775416 7867043
3346 7867043 7689535 7284620 7303585 7520725 7531586 7568407 7518815 7369195 7454434 7423441 7439548
3335 7439548 7539248 7468293 7178722 7091359 7067381 7134790 7211156 7273763 7248591 7103062 7221442
3324 7221442 7235322 7224979 7250230 7328255 7384158 7385249 7447201 7624864 7651254 7715039 7837084
3313 7837084 7938290 8198446 8305234 8288808 8386054 8521442 8388414 8139754 7959148 7921021
3303 7921021 7949738 8058730 8239192 8316434 8153115 8084350 7788832 7772744 7788558 7951990
3293G951990j10206j08284J97494K7339J27452N2164K06232J68417R2548Q2684
3283H687830J62986J72180K33788J88949K85300k14359j33803j55748K4815K00560
3273I452498J92285Q3537J8660K1792P3010J2302J65123Q7598j40755J34133N4579
3262A0154762q0368J9684n4631M27859J03407j3892R319K27355J90796K97114
3252A1281405P3259J21760M73465L74744K85246k33176m16646l66194O0506k55361
3242A1399008o77623n87629m92677o21610l48177o0457n3219p7249k7280j18924
3232H334163j31431P7515j07235j23583Q6234L04776R9705J67792M05866J43974
3222I257776N46962N70552M65549J072428J001768Q81564M55664m16310k96948
$$ plain form
3293 7951990 7841784 7733500 7930994 7958333 8085785 8137949 8344181 8512598 8605146 8687830
3283 8687830 8850816 9022996 9256784 9445733 9731033 9516674 9382871 9227123 9251938 9452498
3273 9452498 9644783 9728320 9746980 9768772 9841782 9854084 10019207 10106805 9966050 10100183 10154762
3262 10154762 10074394 10094078 10039447 10467306 10570713 10556821 10566140 10793495 10984291 11281405
3252 11281405 11354664 11476424 11949889 12324633 12609879 12376703 11960057 11593863 11654369 11399008
3242 11399008 10721385 10133756 9641079 9019469 8671292 8610835 8557616 8480367 8453087 8334163
3232 8334163 8202732 8280247 8173012 8049429 8135663 8440439 8540144 8707936 9113802 9257776
3222 9257776 9804738 10375290 10840839 11913267 12915035 13796599 14252263 13835953 13539005
3213A3539005l128J86844q00917j593781j200409q28730n55637l98193m75928
3204G869126l24600m95850j31717J00588j61450k25532n8862J49603j36504k7374
3194F557428j3147J18816L55055O2627J6901L38253N15189K7968L82010M28224
3184H789324N73692j64627k42115p8734Q5782k73148n59189m99374n06559m11254
3174F713798j38761O8940k70646l06735k51553m11245l36228R8316m04601j91848
3164D569437k72648j4467j16517k13382o1806j32311o7720L9133J43448O4358
3154C937525r5391k26969J30912J08628J3925J10459J19381J1667M5226Q026l981
3143D159408k67667j42501j39237k61239n6653Q5427j41159n5917k59802l59913
$$ plain form
3213 13539005 13535877 13722721 12921804 11328023 10127614 9298884 8743247 8345054 7869126
3204 7869126 7544526 7048676 6916959 7017547 6856097 6630565 6571703 6721306 6584802 6557428
3194 6557428 6544281 6663097 7018152 7080779 7097680 7435933 7951122 7979090 8361100 8789324
3184 8789324 9363016 9198389 8956274 8877540 8963322 8690174 8130985 7631611 7125052 6713798
3174 6713798 6575037 6643977 6373331 6066596 5815043 5403798 5067570 5165886 4761285 4569437
3164 4569437 4296789 4282322 4165805 3952423 3890617 3758306 3690586 3729719 3873167 3937525
3154 3937525 3842134 3615165 3746077 3854705 3868630 3979089 4098470 4110137 4155363 4163389 4159408
3143 4159408 3891741 3749240 3610003 3348764 3292111 3377538 3236379 3180462 2920660 2560747
3133B560747P4218k07233k17909n0327J87345o7706j13231j33773k1087J61767
3123B172811q279j68382R9677K24629n9308j59723K1821k46965j6317J62920j60841
3112A862043R6635q3962j57087J07856p8010n2175J47176j06569j596m9847R9243
3101A783707J15374K4572J3268k34964K5998j53377K91076l01784n7385O3025
3091A569510k68374J85891n8845J18458j60386k37588K47243j0614Q3481J45446
3081A614222r4096M3445l0291m9139j28128j36312J23601P4642k0165o7971j07794
3070A222014K3592O0437j61014n1121N5433O1685K6613l2886L9091q7943j17206
3059A038695M8519m7191k6036j37650J71836o0924M1520r1613n0142J54886o3138
$$ plain form
3133 2560747 2634965 2427732 2209823 2159496 2346841 2279135 2165904 2032131 2011044 2172811
3123 2172811 2164532 1996150 2095827 2320456 2261148 2101425 2123246 1876281 1859964 2022884 1862043
3112 1862043 1958678 1874716 1717629 1825485 1747475 1695300 1842476 1735907 1734311 1684464 1783707
3101 1783707 1899081 1923653 1936921 1701957 1727955 1574578 1865654 1563870 1506485 1569510
3091 1569510 1301136 1487027 1428182 1546640 1386254 1148666 1395909 1385295 1468776 1614222
3081 1614222 1520126 1563571 1533280 1484141 1356013 1219701 1343302 1417944 1397779 1329808 1222014
3070 1222014 1245606 1306043 1145029 1093908 1149341 1211026 1237639 1204753 1243844 1155901 1038695
3059 1038695 1087214 1040023 1013987 876337 1048173 987249 1028769 937156 887014 1041900 978762
3048I78762j16132k15499J54589K8795M0696J43378Q5129j88191O9193L9000j70634
3037H49086j38604K28793o3567j3410J64979l9399j19419j09239L28350Q7323
3027A174893l07140Q7881n5409o958J07335L0547j50797j52131O2930Q879j824
3016G98206P1552P2659K1847j29066K0879j05345k36173R9578L6918J1120j63212
3005D98963J25482R0875p5373Q7796k9979J17256r3003J7270K02753j94676o709
2994G40655j02567n8543J58234P1559J44559J16615j61755j45961J10128J2013
2984H84937J1677j7840R4221j96294N8795J79861K9123j32028j1169n0576j13222
2973G37485l5614k37473K22188K30497J18277M5575l3278j8340O1410j21382j7418
$$ plain form
3048 978762 862630 647131 801720 830515 871211 1014589 1099718 911527 980720 1019720 849086
3037 849086 710482 939275 875708 862298 1027277 987878 868459 759220 1087570 1174893
3027 1174893 867753 955634 900225 893267 1000602 1031149 880352 728221 791151 800030 798206
3016 798206 869758 942417 964264 835198 856077 750732 514559 614137 651055 662175 498963
3005 498963 624445 715320 639947 727743 697764 815020 722017 739287 942040 747364 740655
2994 740655 638088 579545 737779 809338 953897 1070512 908757 762796 872924 884937
2984 884937 896614 878774 972995 776701 835496 1015357 1044480 912452 901283 850707 737485
2973 737485 701871 464398 686586 917083 1035360 1080935 1047657 1029317 1090727 969345 951927
2962I51927K3607P2616r2194N0977K3901k3613j0138o8897K2119J61522J65613
2951A277440k84105N2593Q978O4107n217K2080k4761m9581J33829j23302K983
2940A075044k9271L7262J8968k93680n0805L1322R2200m4996O1996N1716K6927
2929I76683L35606j92189j60766N7965O2363K34155O5831o5968J21949n3439n3465
2918A328725R1039j43095P1481K5191j25692j37201L9129o9632m4603J26352n5809
2907A105885M6793n7925j89728K13576J31015j68239j88615n7946R6362N0712
2897I81890r3163J30406Q1357j42383J26673j47509P173p2021k40241L20348J65559
2886A118089j56209J36438j20308j0156p7590M6006L3794r59m0671j79063J7646
$$ plain form
2962 951927 975534 1048150 955956 1006933 1030834 1007221 997083 928186 950305 1111827 1277440
2951 1277440 993335 1045928 1054906 1119013 1113796 1135876 1111115 1061534 1195363 1072061 1075044
2940 1075044 1045773 1083035 1102003 808323 757518 788840 881040 836044 898040 949756 976683
2929 976683 1312289 1120100 959334 1017299 1079662 1313817 1379648 1313680 1435629 1382190 1328725
2918 1328725 1419764 1276669 1348150 1373341 1247649 1110448 1149577 1079945 1035342 1161694 1105885
2907 1105885 1152678 1094753 905025 1118601 1249616 1081377 892762 834816 931178 981890
2897 981890 888727 1019133 1100490 958107 1084780 937271 944444 872423 632182 952530 1118089
2886 1118089 961880 1098318 978010 967854 890264 936270 970064 969105 928434 749371 767017
2875G67017m7708J95825q7836N2209m2719j17486J50922J12556o0536j22957p6339
2864G22948M0508Q590j22032j01947J40069M5550J56192P0636j08899q1782j63978
2853F05855L1286J14823k25964j99370K46509L6107J5754N2833q0764N0885p6743
2842E71211k26015K06924P3896j54541M5440l2908j66274J82862j02978p3778
2832C23839n1403M0045Q8583l7073k0043J28299N7700J1220q5224l7362J0159
2821D28740r2004Q6066k858O1689r2675N238P6789r901j4629j015o9532L2639
2809D08547o0048P8858K1989j15915R3538j21285J57051j99659K5055k1380j03831
2798A62920j04916M2862J43015o1525J14432J3073J6741J49826j87361p0041O6897
$$ plain form
2875 767017 719309 915134 827298 879507 836788 719302 870224 982780 922244 799287 722948
2864 722948 763456 772046 650014 548067 688136 733686 889878 960514 851615 769833 605855
2853 605855 637141 751964 526000 326630 573139 609246 625000 677833 597069 647954 571211
2842 571211 345196 552120 626016 471475 516915 484007 317733 500595 397617 323839
2832 323839 272436 312481 401064 363991 343948 472247 529947 541167 455943 418581 428740
2821 428740 336736 422802 419944 481633 388958 394196 470985 461084 446455 445440 375908 408547
2809 408547 348499 427357 449346 333431 426969 305684 462735 263076 288131 266751 162920
2798 162920 58004 100866 243881 182356 296788 309861 326602 476428 289067 219026 285923
2787B85923K7763L75198j64833k39645n4339J45715j11277q3614K17749L9668
2777D38308k07551J2582J4572J95578P7410k05849q309j02666k0334J25996L5659
2766C55396K1566k36033p33O4049p1430P1521L9820P9854N3102o7285r7816M2469
2754B54480k5924Q7282j65028L7571j20496q5262l4255O05J75470L5185M9663
2743B09291j49157P4776p4632j80322K88847K49038j16805k57944K11964L1270
2733B86326r1630l3940n648J60720j08525J9605j94287r6411M7087K05770n3184
2722A35883q1595N6159K6697J4263J23977J7579j1818n1259p7644j49411P3905
2711G6736j4751N1441J36977j23445m3746J42401M1666k40142j6413J82410m200
$$ plain form
2787 285923 313686 688884 524051 284406 230067 375782 264505 180891 398640 438308
2777 438308 230757 243339 257911 453489 530899 325050 316741 214075 193741 319737 355396
2766 355396 376962 140929 140196 204245 132815 204336 244156 324010 377112 309827 212011 254480
2754 254480 228556 315838 150810 188381 67885 -17377 -51632 -51027 124443 159628 209291
2743 209291 60134 134910 60278 -120044 168803 417841 301036 43092 255056 286326
2733 286326 194696 160756 155108 315828 207303 226908 32621 -63790 -16703 189067 135883
2722 135883 54288 110447 137144 151407 275384 292963 281145 229886 152242 2831 76736
2711 76736 61985 113426 250403 126958 83212 225613 267279 27137 10724 193134 188934
2700A88934N71k57139O7350M9579p3746L0782J22160r8814j7817J52585m6007
2689A18438j02163J07314j48550J6746m740K9374J92269j15191k3727J93854M7742
2678C11366q1583j3010J44026Q8086q101o020n5682j00947j52668o3502l1996
2667B9969J00008j10840K19168j44228J43037Q9180j19099j26898r4880j0215
2657b4798J80917q1353N7377j09362K42577j5431k17159P989l4914r6269J5708
2646g4718K33574r9520J35449m126q3687J5049l7659K00988J51572N1406m6556
2635D41772p1954r3808L3422r5243j04065k14789P9006O5087K9549K75859j90591
2624A54245j35673L5457q8757r5066J20208K03874J97493r8333j41644J155J3767
$$ plain form
2700 188934 189505 -67634 -284 49295 -24451 6331 128491 29677 11860 164445 118438
2689 118438 16275 123589 -24961 -8215 -12955 16419 208688 93497 69770 263624 311366
2678 311366 229783 216773 360799 448885 440784 434764 379082 278135 125467 61965 29969
2667 29969 129977 19137 238305 94077 237114 326294 207195 80297 -14583 -24798
2657 -24798 156119 74766 132143 22781 265358 249927 32768 40757 5843 -90426 -74718
2646 -74718 158856 59336 194785 190659 106972 122021 84362 285350 436922 488328 441772
2635 441772 369818 276010 309432 214189 110124 -104665 -25659 39428 68977 344836 154245
2624 154245 18572 54029 -34728 -129794 -9586 194288 391781 293448 151804 152959 166726
2613A66726N3387l9947j84668j57513J97210J96831j41856l2041K36837L6967
2603C31933k02690q1237L4107l7188M4011k6415J21316K9295r6038L2200j32582
2592A6712J46059q859M0834O3513J33592j49817k34712R0025q4703L8826L4656
2581H6126k8800K02919m3605j4441J16401j2924j23186j46719K13648m8999r5289
2570A05131M3594j33968N1994L8368r2167K10873Q8308N5000K9717n813k3781
2559C67256r0629O529j21325m7038N7612R768L5367J31635R5666j25267j50900
2548A68674l1485k4841M118j13819K69744k16850L3047J03007j41475r2469J92359
2537A50010J42203J3101r2149p3130l4177K9091J93281J7900J6478j34674j37929
$$ plain form
2613 166726 220113 180166 -4502 -162015 35195 232026 90170 58129 294966 331933
2603 331933 129243 48006 82113 44925 88936 62521 183837 213132 117094 149294 16712
2592 16712 162771 153912 194746 258259 391851 242034 7322 97347 12644 51470 86126
2581 86126 57326 260245 216640 202199 318600 305676 182490 35771 249419 200420 105131
2570 105131 148725 14757 66751 105119 12952 223825 312133 367133 396850 391037 367256
2559 367256 276627 283156 161831 114793 172405 182173 217540 349175 444841 319574 168674
2548 168674 137189 112348 116466 2647 272391 55541 88588 191595 50120 -42349 150010
2537 150010 292213 305314 213165 140035 105858 134949 328230 346130 362608 227934 90005
2526I0005o0468J53586J1510K3561q2753O1720N5329k99587j0745j4984n446K29909
2514A51637m2340l9199Q6009n14p0130Q0758K9480j07320j95895m268K24006O476
2502A18700k19468o6291P8100Q5343o4598o0320K48722K07698j44085k58236m4201
2491a18636K43078q0094k35316K07863k26879K10937Q7256J0181q5683m5006K10680
2480A78381L2716k2394j17249q9840J28521J94987q6123j12563m7287Q1274k79329
2469a38906m7266J56734r6136J90283k0638J65738r5430L4343J1777J8373m2596
2458A36276k9472m6697k00355J73872J49744q9189O654j19312r3473J39145k14834
2447a87641J66557Q5833J96248j74656J66620J4342j43954o5826J1239p5101q4811
$$ plain form
2526 90005 29537 183123 194633 218194 135441 197161 252490 -47097 -57842 -72826 -78272 151637
2514 151637 109297 70098 156107 155593 85463 166221 195701 88381 -107514 -111782 112224 118700
2502 118700 -100768 -167059 -88959 -3616 -68214 -128534 120188 327886 183801 -74435 -118636
2491 -118636 124442 44348 -190968 16895 -209984 953 88209 98390 12707 -32299 178381
2480 178381 211097 188703 71454 -18386 110135 305122 218999 106436 59149 140423 -138906
2469 -138906 -186172 -29438 -125574 64709 44071 209809 114379 148722 160499 178872 136276
2458 136276 106804 60107 -140248 33624 183368 94179 100833 -18479 -111952 27193 -187641
2447 -187641 -21084 64749 260997 86341 252961 267303 123349 57523 68762 -6339 -91150
2436i1150l2584O2516o9441J56743j42711L4379J20550O7310J65336j37052j16628
2425A7268J55984k08086q993J45206j9927J78724J3688j97721q9556L0175K409
2414A9171O26J37280j5613o4794N0966j84970J32706N2024J57995R714k46718
2403D8387L9622J44195n2039m9947J63885J39287j88697j28053N6656R1171Q9410
2392C53877O7086k8613Q3979N622K16600K1102p5520m4774k8188n4571j7884j3366
2380D85350k62971r2877J09032k85479P0756J60020J83766k5138q8989n6283k1659
2369A75528n9377r1940P2387J52387K48080k20237k47019Q3559k0597j1118J46064
2358B27717J34319l35449q0634J92793M4473J12413j64462j04257N8624K5295
$$ plain form
2436 -91150 -123734 -61218 -130659 26084 -116627 -82248 38302 105612 270948 133896 17268
2425 17268 173252 -34834 -43827 101379 81452 260176 273864 76143 -13413 16762 19171
2414 19171 19797 157077 141464 76670 127636 -57334 75372 127396 285391 295105 48387
2403 48387 88009 232204 180165 130218 294103 433390 244693 116640 173296 264467 353877
2392 353877 420963 392350 476329 481951 698551 719653 644133 599359 571171 516600 498716 485350
2380 485350 222379 129502 238534 -46945 23811 183831 367597 342459 253470 197187 175528
2369 175528 116151 24211 96598 248985 497065 276828 29809 113368 92771 81653 227717
2358 227717 362036 26587 -54047 138746 183219 295632 131170 26913 85537 110832
2348A10832q2153M5634J5498J7607M1188o1253O7489K03375L601k32504k7930
2337A01384K82757p1779J05795Q645j22680P060J61918m1546O0963P5427o0215
2326E07729P6169j30799o3532o4878J07378O6190j46416n4318j88339O7826p9135
2315I7875K0752L8222L8704k5514J56921j82267M874K03304o229L9211O3929p4563
2303C75219k69038J54807n6187j6129J1500R341N6840N5414j40038J3654l2803
2292A62580j18256J54640Q8635L938k1160m9999N1539J7479N8104n6290M3103
2281C34313j27060Q8164J16065L7082J11134j52291N4222J55616j49741Q6777
2271E54281q7958M1631p0800j88622o9004J68988L1742K8353K28115j77000j73513
$$ plain form
2348 110832 28679 74313 89811 107418 148606 87353 154842 358217 361818 129314 101384
2337 101384 384141 312362 418157 426802 304122 311182 473100 431554 492517 567944 507729
2326 507729 583898 453099 389567 324689 432067 498257 351841 297523 109184 177010 97875
2315 97875 118627 156849 195553 170039 326960 144693 149567 352871 346642 385853 449782 375219
2303 375219 106181 260988 204801 188672 200172 209513 266353 321767 181729 195383 162580
2292 162580 44324 198964 287599 291537 270377 220378 271917 289396 347500 291210 334313
2281 334313 207253 295417 411482 448564 559698 407407 461629 617245 467504 554281
2271 554281 466323 507954 437154 248532 179528 348516 380258 408611 636726 459726 286213
2260B86213J73600L5330j09636P0149J2931j56377Q9449J31241J8093L9474L4231
2249F24698k4775o4409J50165J23686N8999l8663J737k8779o8335J89523l11549
2238F12298p2747J39975r9327j86477J55060j05993J14622K08935K8614L5018
2228H29978j50918m0495J59950K70974q8214K59094Q5554m3396k58239O1704j17233
2217I68759J1138L13709k7117p4665j01837N9759K50470J8058K28883n3618j2677
2206A580862J55975j1726j43441N6244M8721P7318L6817J77389K62282j57035
2196B083406n5691N0026J09312r9598n5148K92551J28479r8858Q423K56028l4178
2185B584752m876k6606j3336K15421L37L6228J25085L13171J89438j74410J58940
$$ plain form
2260 286213 459813 495143 385507 455656 468587 312210 401659 532900 550993 590467 624698
2249 624698 599923 535514 685679 809365 868364 829701 831438 802659 734324 923847 612298
2238 612298 539551 679526 580199 393722 548782 442789 557411 766346 794960 829978
2228 829978 679060 638565 798515 1069489 981275 1240369 1325923 1282527 1024288 1085992 968759
2217 968759 979897 1293606 1266489 1191824 1089987 1149746 1400216 1418274 1647157 1593539 1580862
2206 1580862 1736837 1725111 1581670 1637914 1686635 1763953 1800770 1978159 2240441 2083406
2196 2083406 2027715 2077741 2187053 2087455 2032307 2324858 2453337 2354479 2362902 2618930 2584752
2185 2584752 2579876 2553270 2539934 2755355 2755692 2791920 2917005 3230176 3419614 3245204 3404144
2174C404144J51453J28604K23643j4078j33244K40397K32325J51117R6917Q7205
2164D568483K1582K73860L34465L17900N3963J25832K86690K44125J96552K45937
2154F669389J38963j12800L80805K32302L34025M72861N85851N68698M50962K73981
2144I995037L91422O05798M15407O00234P10519R19871J450883J653733J609654
2135A8352558K069388J794555J615901J788348K368721K734790L171835L705333
2127C7601429N077518O643711Q638034J1539331J4695238J5039935J5954020J2681243
2119A27870459m525340k1213117k5242723j7806681j0850063p484424o018359
2112C4729752m856283m103444l126194k470108j496572r49490o10440n74585o56265
$$ plain form
2174 3404144 3555597 3684201 3907844 3893766 3760522 4000919 4233244 4384361 4481278 4568483
2164 4568483 4590065 4863925 5198390 5516290 5570253 5696085 5982775 6226900 6423452 6669389
2154 6669389 6808352 6695552 7076357 7308659 7642684 8115545 8701396 9270094 9721056 9995037
2144 9995037 10386459 10992257 11407664 12007898 12718417 13638288 15089171 16742904 18352558
2135 18352558 20421946 22216501 23832402 25620750 27989471 30724261 33896096 37601429
2127 37601429 42678947 49322658 57960692 69500023 84195261 99235196 115189216 127870459
2119 127870459 123345119 102132002 76889279 59082598 48232535 40748111 34729752
2112 34729752 29873469 25770025 22643831 20173723 18677151 17727661 17117221 16542636 15886371
2103A5886371r87346j084025q33724p67542n14554p32554p66230o81356o18146
2094H900894p57462l35432m00635m28328k02976k72663m29563l65514j43179m31898
2084E133244m09357k75597k41395j71030Q467p7954j52164j67764p8495J01284
2074C669239k02730j58050q7553j75791l2555J76j16104L5312k7843n6368k35082
2063B612651o1600n2831Q9584k42419J0116o7945J21871R6781j53388j31747k66058
2052A955015j90441K27339R6022j54535j857k19001q7005j52818L0479n5112j65521
2041A282565m8726K38107J31049r1045O5785m7712j02592j72563J4924q4430j47473
2030A037889P1985o5800R2871J47555p5926m5761o5942j59589n3986J69156J34640
$$ plain form
2103 15886371 14899025 13815000 12981276 12213734 11699180 10966626 10200396 9519040 8900894
2094 8900894 8143432 7808000 7407365 6979037 6776061 6503398 6073835 5708321 5565142 5133244
2084 5133244 4723887 4448290 4206895 4035865 4044332 3966378 3814214 3646450 3567955 3669239
2074 3669239 3466509 3308459 3220906 3045115 3012560 3012736 2896632 2931944 2904101 2847733 2612651
2063 2612651 2551051 2498220 2587804 2345385 2355501 2287556 2409427 2506208 2352820 2221073 1955015
2052 1955015 1764574 1991913 2087935 1933400 1931543 1712542 1625537 1472719 1503198 1448086 1282565
2041 1282565 1233839 1471946 1602995 1511950 1577735 1530023 1427431 1254868 1269792 1185362 1037889
2030 1037889 1109874 1044074 1136945 1284500 1208574 1162813 1096871 937282 883296 1052452 1187092
2019A187092J06507O8742m1954r308k11868N5027J10504k08174j13337L2097o5008
2008I10320J3139l8813J6863j07185n4715j70723N3633l7801q3272J05545j56102
1997D50889J89419j06725k73053O1125K97809l5703N461m9998J19299n3921o9872
1986E34730j2767o8129Q8551p2518j41700o3523j03255K35040Q2596k49120J43865
1975C73770j63050L9922o0395M2882j73123J08374K83826j36748K0076J00204
1965D35738K875l6466Q6468J7691q6763p8643m356K5218j63823J18567R6696j69427
1953B43775J45432R140r216j43219M7895R7792k1280J9340K47511k25776j73117
1942B38277L3288m9440J1287J13333J82344j42134Q140Q7252l16640r4949J84753
$$ plain form
2019 1187092 1293599 1362341 1320387 1311079 1099211 1154238 1264742 1056568 943231 975328 910320
2008 910320 923459 884646 901509 794324 739609 568886 622519 584718 501446 606991 450889
1997 450889 640308 533583 260530 321655 619464 583761 589222 539224 658523 604602 534730
1986 534730 521963 453834 542385 469867 328167 264644 161389 396429 479025 229905 373770
1975 373770 210720 250642 190247 233129 60006 168380 452206 315458 335534 435738
1965 435738 438613 402147 488615 506306 419543 340900 336544 361762 197939 316506 413202 243775
1953 243775 389207 398347 389131 245912 293807 391599 370319 389659 637170 411394 238277
1942 238277 271565 222125 233412 346745 529089 386955 395095 482347 165707 70758 255511
1931B55511j04243Q3927k2434K8866k7080m8947K37893j40705L7768J19538j02177
1920C17917q4954M480k2108j8331R8858K4209M9981j5498l02990J4528J80502
1909B46594J56064p8950o1069j33232l5950j09498N4135J26086j12317J28119
1899A79982j41436J95386N1655k7108J56933k69522J67943l7710l3597Q9613m6918
1888B85221j62843k5872M0550k33499j2225J13057J40301j37540L3081N5400R78
1877I6609O4376R0511p0454K48523O1028j48848k11275J2583P3114J15527J2862
1866C44556N9996m4334j98957o6069K03267K12944r4325k30391K6536J54771m5677
1855C22317O3296P2647N7721O8475J66627Q4534j92933L3380P5257n5905n418
$$ plain form
1931 255511 151268 235195 212761 241627 214547 165600 403493 262788 300556 420094 317917
1920 317917 232963 237443 215335 197004 295862 320071 370052 354554 51564 66092 246594
1909 246594 402658 323708 262639 129407 93457 -16041 38094 164180 51863 179982
1899 179982 38546 233932 285587 258479 415412 145890 313833 276123 242526 332139 285221
1888 285221 122378 96506 137056 -96443 -108668 4389 144690 7150 40231 95631 96609
1877 96609 160985 251496 181042 429565 490593 341745 130470 143053 216167 331694 344556
1866 344556 404552 360218 161261 95192 298459 511403 417078 186687 213223 367994 322317
1855 322317 385613 458260 515981 584456 751083 835617 642684 676064 751321 695416 689998
1844F89998j93982j37080o2673n7179Q3189n0567l09162O1426l5924O2538K38386
1833B88970j20243L7313p0646r5492n3815J7600M799J45997J96886j09953r7253
1822A44163K55928j20515n3931k68710r7541M9679J46135K5743j52931n8182N0635
1811g9527K09722q3777j55539M9840j01715j56222K92080Q1738K23738p5591m77
1800B04270j20208j82518P9141L4758P5680O143K34636p0252j9006K0070k93507
1789c0793K40414J70232k5717j92149k2336r8502K537J65966o2080J73509n144
1778C15937j06019j76298l4422K23820j92963r046J17868O0281L8242p9627J06242
1767B64015k01790L5396J57376o0307j44014k55024J30326O9230J04887k16613
$$ plain form
1844 689998 496016 358936 296263 239084 322273 271706 -37456 23970 -11954 50584 288970
1833 288970 168727 206040 135394 39902 -13913 3687 8486 154483 351369 241416 144163
1822 144163 400091 279576 225645 -43065 -140606 -90927 55208 80951 -71980 -130162 -79527
1811 -79527 130195 46418 -109121 -59281 -160996 -317218 -25138 56600 280338 204747 204270
1800 204270 84062 -98456 -19315 15443 91123 97266 331902 261650 242644 262714 -30793
1789 -30793 209621 379853 354136 161987 139651 41149 43686 209652 147572 321081 315937
1778 315937 209918 33620 -802 223018 30055 21009 138877 199158 237400 157773 264015
1767 264015 62225 97621 254997 194690 50676 -204348 -74022 -4792 100095 -116518
1757a16518O1247J76576k8032k82651L27702R6982j24083N5150L5517N0168k49167
1746B891O5338l9513M9900q0359O9365o57k8669Q9215p6244o9973R0090L1933
1734A03317j96553o4403J89855R3015o6123M1695j64275l1516J32764l0791M1580
1723D8565j30454j43674K86577M4249Q7544J0776j93575k3791j4584k05098J5467
1712b17998J98498q7457J25280Q6431j52720j4267K11292J512l42566j11752J55503
1701a48244N0293r0553k3986M1175K43803P0319o2260N5586k4430J04384j35994
1690H0093q2783P7896M4882L2834j06090m5660N5188r5772r2260J56767K0673
1679D5768j10510j86449Q9632J88489k41345j0390L3927o2131K68593N6618J3108
$$ plain form
1757 -116518 -55271 121305 93273 -189378 138324 235306 111223 166373 201890 252058 2891
1746 2891 68229 28716 78616 -1743 67622 66965 38296 127511 51267 -18706 71384 103317
1734 103317 -93236 -157639 32216 125231 59108 100803 -63472 -94988 37776 6985 48565
1723 48565 -81889 -225563 61014 105263 192807 203583 10008 -13783 -28367 -233465 -217998
1712 -217998 -19500 -106957 18323 104754 -47966 -62233 149059 150571 -191995 -303747 -148244
1701 -148244 -97951 -188504 -212490 -171315 72488 142807 80547 136133 111703 216087 80093
1690 80093 -2690 75206 120088 152922 46832 1172 56360 -39412 -131672 25095 45768
1679 45768 -64742 -251191 -161559 26930 -214415 -224805 -190878 -253009 15584 72202 85310
1668H5310M740m0317j55880M9863P6411j285K12024l5644j39423J29946N4753
1657B40498k71959J46939k4283k1392k1674J42909j79529J3635P3083j51185k0828
1646g3786P6734j20965O915m2236l2865J81824j32987O4394J54976J2617n0551
1635D4070J14203K9229k10235m88J85110J03786k07888o0288J46915J00335k98625
1624e3876J2312J48519p944j87296m5522R2774o274n3215M8352q4864j785N3250
1612h5569M7626J59691J303L792j13043J13347K7213p9119j92155J21687R8640
1601A03413J08777Q9738l8136k28866o2181J22988r6720N1483J56927L3707j48384
1590I2746k63465M8487J26842J39184j5384j03051M9497j29448o7731J78734N9871
$$ plain form
1668 85310 90050 49733 -106147 -56284 20127 18842 230866 195222 55799 185745 240498
1657 240498 -31461 115478 91195 69803 48129 191038 11509 25144 98227 -52958 -73786
1646 -73786 2948 -118017 -111102 -153338 -186203 -4379 -137366 -72972 82004 94621 44070
1635 44070 158273 187502 -22733 -23221 161889 265675 57787 -2501 144414 244749 -53876
1624 -53876 -41564 106955 99011 -88285 -133807 -41033 -47307 -100522 -52170 -137034 -138819 -85569
1612 -85569 -37943 121748 123051 126843 13800 127147 154360 75241 -116914 4773 103413
1601 103413 212190 301928 263792 34926 -27255 95733 -987 50496 207423 241130 92746
1590 92746 -170719 -122232 4610 143794 128410 25359 74856 -54592 -122323 56411 116282
1579A16282p4547j47254J10218J9635j29552n2175J14881J61445k03994o4550
1569a49611J22704P5772j6667P1762o5843j77946k3290J10827N8397m9333L0645
1558a2583m0995J94794O2699k79242j38778k3998N0782K13918R0516p563n1117
1547E8433J52107l70582K9266M6712J08201K16578j41366J13352o2981j2689N2106
1536A89137n583j04674O4715O021r4408j73074p6999K1675J23868P3781J37368
1525A61827q1646j42183J92830M5546j42063j86246k00341K59307O8758r7420
1515a21631Q1127r1211L9063O453J44355J18135r5101o3745j3132R382k850k1963
1503a1118R2752J14848j41873j88374r0095K4959J55671Q3315M666m5695j15686
$$ plain form
1579 116282 41735 -105519 4699 24334 -105218 -157393 -42512 118933 -85061 -149611
1569 -149611 -26907 48865 32198 103960 38117 -139829 -163119 -52292 6105 -43228 -12583
1558 -12583 -53578 141216 203915 -75327 -214105 -238103 -187321 26597 117113 109550 58433
1547 58433 210540 -160042 -130776 -84064 24137 240715 99349 212701 149720 137031 189137
1536 189137 183554 78880 143595 149616 55208 -117866 -194865 -173190 -49322 24459 161827
1525 161827 80181 -62002 130828 176374 34311 -151935 -352276 -92969 -24211 -121631
1515 -121631 -40504 -131715 -92652 -86199 58156 176291 81190 17445 4313 13695 10845 -11118
1503 -11118 81634 196482 54609 -133765 -223860 -198901 -43230 40085 44751 -944 -116630
1492a16630J59555J24623o1935n1789K28420R8959l10655p6400N5968N7084k2158
1481H5042L7033n6921N3034j41434j03407K43135O1803k93298Q1483L3767m9644
1470d9407k5385N0729J1443L3587j08139Q42J08016j02727J13170O6850j98817
1459i9838p0324M2619P6286j0020j29774l853R3783K26709J9036R9484N740r8429
1447A51419p2740j7127q1147M3485j64397R8439J19773j59488K66247K5495k04063
1436E896j6855p5670r6377J49803J63142p4575r0688l9290L3842k7276j17058
1425a85106Q589j46762l6458J98817R3957M3953M0818p5387j74148J31572J14882
1414A4727j84803p4266J91800r8063Q9318P7871k4627j64996J4873j49840K79950
$$ plain form
1492 -116630 42925 167548 105613 53824 282244 381203 70548 -5852 50116 107200 85042
1481 85042 122075 65154 118188 -23246 -126653 116482 178285 -115013 -33530 237 -49407
1470 -49407 -74792 -24063 -12620 20967 -87172 -86330 21686 -81041 32129 98979 -99838
1459 -99838 -170162 -127543 -51257 -61277 -191051 -194904 -101121 125588 144624 244108 249848 151419
1447 151419 78679 61552 -19595 23890 -140507 -42068 77705 -81783 184464 209959 5896
1436 5896 -10959 -86629 -183006 -33203 129939 55364 -35324 -74614 -40772 -68048 -185106
1425 -185106 -176517 -323279 -359737 -160920 -66963 -23010 17808 -57579 -231727 -100155 14727
1414 14727 -170076 -244342 -52542 -150605 -61287 16584 -8043 -173039 -158166 -308006 -28056
1403b8056n0221j36258K09199j24335j45267M9525K49633N116m1874n4666k3777
1392i0981l1227O0874p617j14284J59372N072r2306L7718K26435j60125N8323
1381E1254J63957l77628R4484K2269K820o3531J14178o7747O9979O8540l9Q0579
1369A59115j34387M766p5415J31586j2744K63642j40545k48828m7572J70365O8836
1358A38819m4268j5283l6498j30945k7631K4086J22165q3390r6023L09902J4910
1347A75844r4813j94117P4842p6845L3482J06846k1540k58066J31884P1469j44510
1336a95524M3173k6920J03444j00305q1220J84247j9559R2019j69764j26157l8440
1325c35006J30321Q0573r0428K3231J95315J37045n7312q562p5369k27864J37662
$$ plain form
1403 -28056 -78277 -214535 -5336 -129671 -274938 -225413 24220 29336 -12538 -67204 -90981
1392 -90981 -122208 -61334 -68951 -183235 -23863 -18791 -111097 -73379 153056 -7069 51254
1381 51254 215211 -162417 -67933 -45664 -42844 -106375 7803 -59944 10035 78575 78536 159115
1369 159115 24728 29494 -45921 85665 72921 336563 196018 -52810 -100382 69983 138819
1358 138819 94551 79268 42770 -88175 -115806 -91720 30445 -52945 -148968 160934 175844
1347 175844 81031 -113086 -38244 -115089 -81607 25239 3699 -254367 -122483 -51014 -195524
1336 -195524 -152351 -179271 -75827 -176132 -257352 -73105 -92664 -645 -170409 -296566 -335006
1325 -335006 -204685 -124112 -214540 -191309 4006 141051 83739 75177 -192 -228056 -90394
1314i0394P3102J59877l6849p1409o8137L6753R5365J36878l2487l06717o2317
1303a66335K05168J26549P2920k41341J6712J10109l4943J9787j37750M5285L9566
1292E5727M6885J4628j38056m9629n1888n9143Q6501j15126J69214K18825J8777
1281A96715k57866l4632J57911K4280r8537j1618K32102J11657k76897k17787
1271a74672r0656R7992L4735r6073K22190p4795j00850R8370N6178q5995J09641
$$ plain form
1314 -90394 -17292 142585 105736 34327 -33810 2943 98308 235186 202699 -104018 -166335
1303 -166335 38833 165382 238302 -3039 13673 123782 88839 108626 -29124 16161 55727
1292 55727 102612 117240 -20816 -70445 -122333 -181476 -94975 -210101 -40887 177938 196715
1281 196715 -61151 -95783 62128 86408 -12129 -23747 208355 320012 43115 -174672
1271 -174672 -265328 -167336 -132601 -228674 -6484 -81279 -182129 -83759 -27581 -113576 -3935
$$ [...]
##END NTUPLES=NMR SPECTRUM
##END=
