##TITLE=1H_TG-2341-B1
 CDCl3
 8 sc, 
 11.1.2022
##JCAMPDX= 6.0         $$ Bruker NMR JCAMP-DX V2.0
##DATA TYPE= NMR SPECTRUM
##DATA CLASS= NTUPLES
##ORIGIN= UXNMR, Bruker Analytische Messtechnik GmbH
##OWNER= root
$$ XWIN-NMR		Version 3.5
$$ Tue Jan 11 11:44:54 2022 Russian Standard Time (UT+4h)  she@DPX200
##.OBSERVE FREQUENCY= 200.131346
##.OBSERVE NUCLEUS= ^1H
##.ACQUISITION MODE= SIMULTANEOUS
##.ACQUISITION SCHEME= undefined
##.AVERAGES= 8
##.DIGITISER RES= 18
##SPECTROMETER/DATA SYSTEM= spect
##.PULSE SEQUENCE= zg30
##.SOLVENT NAME= CDCl3
##.SHIFT REFERENCE= (INTERNAL, CDCl3, 0, 15.7226)
##AUDIT TRAIL= $$ (NUMBER, WHEN, WHO, WHERE, WHAT)
$$ ##TITLE= Audit trail, XWIN-NMR		Version 3.5
$$ ##JCAMPDX= 5.01
$$ ##ORIGIN= Bruker BioSpin GmbH
$$ ##OWNER= she
$$ F:/spectra/data/she/nmr/H-F/1/pdata/1/auditp.txt
$$ ##AUDIT TRAIL=  $$ (NUMBER, WHEN, WHO, WHERE, WHAT)
(   1,<2022-01-11 11:43:35.28 +0400>,<she>,<DPX200>,
      <created by zg, POWCHK disabled, PULCHK disabled
       configuration hash MD5:
       00 E9 B6 7A A2 85 ED C7 34 08 36 98 17 FE 4E 26
       data hash MD5: 16K
       4F B0 64 2D A4 46 A5 D8 A0 EC 6B C5 70 0E 3B 0A>)
(   2,<2022-01-11 11:43:37.98 +0400>,<she>,<DPX200>,
      <Start of raw data processing
       efp BC_mod = 2 LB = 0.24 FT_mod = 6 PKNL = 1 PHC0 = -15864.89 PHC1 = 9.60079 SI = 16K 
       data hash MD5: 16K
       79 FD 51 9D FD 57 A1 81 9D 19 67 56 7E 29 84 F6>)
(   3,<2022-01-11 11:44:02.51 +0400>,<she>,<DPX200>,
      <pk PHC0 = -2.0084 PHC1 = 3 
       data hash MD5: 16K
       9E 2C 9F 43 C6 76 C2 A4 C1 15 63 AF C4 CC 0C 9B>)
(   4,<2022-01-11 11:44:05.53 +0400>,<she>,<DPX200>,
      <abs ABSG = 5 
       data hash MD5: 16K
       5C E4 19 A8 F6 AA 8A 97 5F 63 1E E7 5B 8E 05 00>)
$$ ##END=
$$ 
$$ hash MD5
$$ C5 9F F1 00 E6 97 83 5B 6F DE 7E B3 02 EF 69 7F
##$RELAX= 
##$RELAX= 
##$RELAX= 
##$RELAX= 
##$RELAX= 
##$RELAX= 
$$ Bruker specific parameters
$$ --------------------------
##$DU= <F:/spectra>
##$EXPNO= 1
##$NAME= <H-F>
##$PROCNO= 1
##$TYPE= <nmr>
##$USER= <she>
##$AMP= (0..31)
100 100 100 100 100 100 100 100 100 100 100 100 100 100 100 100 100 100 
100 100 100 100 100 100 100 100 100 100 100 100 100 100 
##$AQSEQ= 0
##$AQ_mod= 1
##$AUNM= <au_zg>
##$AUTOPOS= <>
##$BF1= 200.13
##$BF2= 200.13
##$BF3= 200.13
##$BF4= 200.13
##$BF5= 200.13
##$BF6= 200.13
##$BF7= 200.13
##$BF8= 200.13
##$BYTORDA= 1
##$CFDGTYP= 0
##$CFRGTYP= 5
##$CHEMSTR= <none>
##$CNST= (0..31)
1 1 145 1 1 1 1 1 1 1 1 1 1 1 1 1 1 1 1 1 1 1 1 1 1 1 1 1 1 1 1 1 
##$CPDPRG= <>
##$CPDPRG1= <>
##$CPDPRG2= <>
##$CPDPRG3= <>
##$CPDPRG4= <mlev>
##$CPDPRG5= <mlev>
##$CPDPRG6= <mlev>
##$CPDPRG7= <mlev>
##$CPDPRG8= <mlev>
##$CPDPRGB= <>
##$CPDPRGT= <>
##$D= (0..31)
0 1.2 0 0 0 0 0 0 0 0.06 0 0.03 0 0 0 0 0.0002 0 0 0 0 0 0 0 0 0 0 0 0 
0 0 0 
##$DATE= 1641887014
##$DBL= (0..7)
120 120 120 120 120 120 120 120 
##$DBP= (0..7)
150 150 150 150 150 150 150 150 
##$DBP07= 0
##$DBPNAM0= <>
##$DBPNAM1= <>
##$DBPNAM2= <>
##$DBPNAM3= <>
##$DBPNAM4= <>
##$DBPNAM5= <>
$$ [...]
##$SUBNAM2= <"">
##$SUBNAM3= <"">
##$SUBNAM4= <"">
##$SUBNAM5= <"">
##$SUBNAM6= <"">
##$SUBNAM7= <"">
##$SUBNAM8= <"">
##$SUBNAM9= <"">
##$SW= 18.0517287032376
##$SWIBOX= (0..15)
0 0 2 0 0 0 0 0 0 0 0 0 0 0 0 0 
##$SW_h= 3612.71676300578
##$TD= 16384
##$TD0= 1
##$TE= 0
##$TE2= 300
##$TE3= 300
##$TEG= 300
##$TL= (0..7)
0 120 120 120 120 120 120 120 
##$TP= (0..7)
150 150 150 150 150 150 150 150 
##$TP07= 0
##$TPNAME0= <>
##$TPNAME1= <>
##$TPNAME2= <>
##$TPNAME3= <>
##$TPNAME4= <>
##$TPNAME5= <>
##$TPNAME6= <>
##$TPNAME7= <>
##$TPOAL= (0..7)
0.5 0.5 0.5 0.5 0.5 0.5 0.5 0.5 
##$TPOFFS= (0..7)
0 0 0 0 0 0 0 0 
##$TUNHIN= 0
##$TUNHOUT= 0
##$TUNXOUT= 0
##$USERA1= <user>
##$USERA2= <user>
##$USERA3= <user>
##$USERA4= <user>
##$USERA5= <user>
##$V9= 5
##$VALIST= <valist>
##$VCLIST= <CCCCCCCCCCCCCCC>
##$VD= 0
##$VDLIST= <DDDDDDDDDDDDDDD>
##$VPLIST= <PPPPPPPPPPPPPPP>
##$VTLIST= <TTTTTTTTTTTTTTT>
##$WBST= 1024
##$WBSW= 4
##$XGAIN= (0..3)
0 0 0 0 
##$XL= 0
##$YL= 0
##$YMAX_a= 410466
##$YMIN_a= -681804
##$ZGOPTNS= <>
##$ZL1= 120
##$ZL2= 120
##$ZL3= 120
##$ZL4= 120
##$ABSF1= 15.71714
##$ABSF2= -2.334709
##$ABSG= 5
##$ABSL= 3
##$ALPHA= 0
##$AQORDER= 0
##$ASSFAC= 0
##$ASSFACI= 0
##$ASSFACX= 0
##$ASSWID= 0
##$AUNMP= <proc_1d>
##$AZFE= 0.1
##$AZFW= 0.1
##$BCFW= 0
##$BC_mod= 2
##$BYTORDP= 0
##$COROFFS= 0
##$CY= -3
##$DATMOD= 1
##$DC= 0
##$DFILT= <>
##$DTYPP= 0
##$F1P= 0
##$F2P= 0
##$FCOR= 1
##$FTSIZE= 16384
##$FT_mod= 6
##$GAMMA= 0
##$GB= 0
##$INTBC= 1
##$INTSCL= 0
##$ISEN= 128
##$LB= 0.24
##$LEV0= 0
##$LPBIN= 0
##$MAXI= 10000
##$MC2= 0
##$MEAN= 0
##$ME_mod= 0
##$MI= 1.114404
##$NCOEF= 0
##$NC_proc= -6
##$NLEV= 6
##$NOISF1= 3.799351
##$NOISF2= 2.8
##$NSP= 0
##$NTH_PI= 0
##$NZP= 0
##$OFFSET= 15.72265
##$PC= 1
##$PHC0= -15866.9
##$PHC1= 12.60079
##$PH_mod= 1
##$PKNL= yes
##$PPARMOD= 0
##$PSCAL= 0
##$PSIGN= 0
##$REVERSE= no
##$SF= 200.130005783613
##$SI= 16384
##$SIGF1= 3
##$SIGF2= 2
##$SINO= 5.538805
##$SIOLD= 16384
##$SREGLST= <1H.CDCl3>
##$SSB= 0
##$STSI= 16384
##$STSR= 0
##$SW_p= 3612.71676300578
##$SYMM= 0
##$S_DEV= 0
##$TDeff= 16384
##$TDoff= 0
##$TI= <>
##$TILT= no
##$TM1= 0
##$TM2= 0
##$TOPLEV= 0
##$USERP1= <user>
##$USERP2= <user>
##$USERP3= <user>
##$USERP4= <user>
##$USERP5= <user>
##$WDW= 1
##$XDIM= 16384
##$YMAX_p= 495129332
##$YMIN_p= -874856
$$ End of Bruker specific parameters
$$ ---------------------------------
##NTUPLES= NMR SPECTRUM
##VAR_NAME=  FREQUENCY,     SPECTRUM/REAL,   SPECTRUM/IMAG
##SYMBOL=    X,             R,               I
##VAR_TYPE=  INDEPENDENT,   DEPENDENT,       DEPENDENT
##VAR_FORM=  AFFN,          ASDF,            ASDF
##VAR_DIM=   16384,         16384,           16384
##UNITS=     HZ,            ARBITRARY UNITS, ARBITRARY UNITS
##FACTOR=    0.220516191357247, 1,           1
##FIRST=     3146.57395023433, 0,            0
##LAST=      -466.142812771446, 0,           0
##MIN=       -466.142812771446, -874856,     0
##MAX=       3146.57395023433, 495129332,    0
$$ Real data points
##PAGE= N=1
##DATA TABLE= (X++(R..R)), XYDATA
$$ [...]
9191 4270005 4395608 4513469 4589973 4460435 4304031 4233180 4206139 4179946 4186848 4176526 4170101
9180 4170101 4264155 4268279 4213712 4193556 4120437 4073602 4072969 4148129 4165930 4274558 4230796 4269660
9168 4269660 4421707 4423430 4457987 4596419 4653850 4740416 4758180 4831370 4955632 5001441 5070309
9157 5070309 5097096 5179846 5292267 5324595 5471125 5668534 5743025 5815365 5890943 5943787 6069692
9146 6069692 6164868 6299963 6423635 6591114 6661344 6839722 7004218 7092650 7265786 7220972
9136 7220972 7313224 7491521 7772502 7847779 7959660 7941820 8025536 8168696 8402961 8619042
9126 8619042 9011984 9370098 9758568 10282875 10741434 11254809 11967260 12872716 13688763 14426089
9116 14426089 15021629 15343151 15483788 15519896 15610083 15960923 16478705 17056857 17446691 17700490
9106 17700490 18094765 18546625 19227376 19919025 20516387 20992684 21032660 20933949 20845863 20997054
9096 20997054 21198291 21596743 22093913 22570301 22948288 23394244 23823860 24168333 24461147
9087 24461147 24690228 25048309 25663378 26452924 27322221 28294698 29290714 30257825 31462852
9078 31462852 32942871 34546315 36336578 38290069 40177897 42015166 43881033 45815752
9070 45815752 47785420 50170671 52848974 55059865 56735069 57818288 58300810 58697796
9062 58697796 59326174 60355635 61608916 62766699 63610140 64221850 64787996 65377052 65935992
9053 65935992 66089288 65090975 63165046 60684055 58163069 56070558 54650130 53946380 53713956
9044 53713956 53895444 54184858 54465031 55072455 55974020 57213560 59014423 61338668 64407027
9035 64407027 68236216 72619712 77311567 82081118 86623307 91273158 95927018 100274007
9027 100274007 103518863 105220388 105852127 106912220 109471464 113007998 115985928 116758201
9019 116758201 113828400 108110800 101238946 94262271 87784330 81935831 76309573 70865755
9011 70865755 65868840 61228038 57104771 53564397 50745186 48670432 47240639 46329594
9003 46329594 45931193 45963399 46454044 47527562 49217830 51665082 54620641 57893197 61158822
8994 61158822 64165914 66983223 69633831 72378874 75770385 79809350 83831487 86876588
8986 86876588 87974840 86991520 85114077 82031960 76580134 69343638 60977600 52682783
8978 52682783 45932524 40958742 37212585 34359457 32194391 30400956 28830280 27238041
8970 27238041 25577716 24024301 22508702 21088222 19813537 18625844 17734991 16945745
8962 16945745 16051112 15324694 14704948 14258870 13783005 13284626 13002120 12694091 12340192
8953 12340192 12077374 11864341 11533449 11186058 10936194 10782891 10610488 10487403 10381912
8944 10381912 10145002 10029090 9880118 9724008 9550476 9430733 9363153 9353042 9347468 9185562
8934 9185562 9103537 9004885 8879086 8709612 8595834 8557375 8350638 8255674 8136822 7960356
8924 7960356 7990030 8042233 7952706 7998267 8025335 7980503 7900108 8007579 8030963 8044430 7913397
8913 7913397 8047864 8277920 8216323 8133312 8191334 8269586 8270511 8385371 8421074 8445646 8589035
8902 8589035 8701410 8753880 8875998 9057837 9157613 9305003 9468901 9517809 9700360 9896680
8892 9896680 10064563 10351089 10567376 10702006 11005563 11283816 11561301 11929802 12259232 12688262
8882 12688262 13064874 13390422 13835762 14403628 15023278 15650948 16124371 16723655 17461248
8873 17461248 18063452 18770277 19393036 19800119 20279070 20745213 21145748 21560429 22088113
8864 22088113 22696435 23563662 24471360 25511969 26687265 27811963 28940461 30231174 31522604
8855 31522604 32767750 34206864 35351975 36225214 36943365 37409226 37797092 37862727 38226692
8846 38226692 38986625 39986210 41209274 42669934 44490023 46398565 48356495 50342928
8838 50342928 52495670 54581642 56857560 59468070 62256388 65026576 67796532 70665343
8830 70665343 73746988 76193437 77687610 78163095 78230937 78549880 78914258 78752790 78965304
8821 78965304 79548725 80611756 81372514 81592069 81493661 81093359 80351087 79664702 79584622 79679387
8811 79679387 80000393 80390415 80738963 80840673 81046408 81526151 82365601 83954173 86138507
8802 86138507 88876008 92435953 96440186 100949790 105508443 109250904 112534289 114645575
8794 114645575 114916354 113893675 112322463 109986366 106729435 103350670 100326663 97775960
8786 97775960 95611714 94277703 93175216 91646969 90085375 89029224 88110129 86888011
8778 86888011 85479446 83584456 81475279 79524639 77754788 76250390 75324421 74778335
8770 74778335 74164347 73655105 73055817 72304493 71656428 71362556 71763891 72637129 73676985
8761 73676985 74589332 75360015 75869232 75441658 74059034 71746142 68426845 64726659 61190140
8752 61190140 57709231 54770960 52746934 51276219 50247053 49637391 49423205 49431025 49610615
8743 49610615 49738627 49908144 50035480 49833916 48969262 47690605 46242360 44749164 43397683
8734 43397683 42340045 41582312 41123957 40765107 40336562 40072992 40081244 40714927 42028927
8725 42028927 43981481 46899394 51000813 56596277 63854759 72944827 84636766 100466691
8717 100466691 122367610 140608717 134972361 108649636 85605227 71291917 62099370
8710 62099370 56146792 52087670 49362188 47206168 45549471 44292581 43464457 42763998
8702 42763998 42326688 42113982 42053642 42252819 42458143 42659970 43117301 44024822 45221097
8693 45221097 46599670 47863142 49546649 51430605 52745862 53540258 53688754 53364492 53318055
8684 53318055 53306016 52363529 50939924 49420359 48259953 47469278 46770803 45854728 44828742
8675 44828742 44487700 44431631 44754830 45558562 46650567 47883874 49019150 50150953 50928737
8666 50928737 51314096 51618865 51683833 51335239 51290884 52068733 53189462 54365167 55845392
8657 55845392 57467000 58919696 59709345 60180434 59846058 58487227 56735911 54466188 51498460
8648 51498460 48490874 45868502 43988997 42772182 41674971 40699821 40146591 39593087 39020968
8639 39020968 38698236 38464396 38489830 38694663 38782977 38554032 38015913 37201221 36181101 35219051
8629 35219051 34449441 33984734 33861561 33772033 33654710 33586296 33249765 32618749 31643483 30532903
8619 30532903 29487969 28806406 27798162 26537569 25213428 23932435 22730380 21741285
8611 21741285 20633407 19593503 18769124 18183245 17707927 17177125 16782732 16536250 16198024
8602 16198024 15916720 15652708 15329230 15011581 14635927 14126384 13703916 13275392 12884597
8593 12884597 12435799 11843983 11350508 10833210 10367945 9991501 9589162 9289986 8722115
8584 8722115 8214389 7986316 7626816 7404238 7255123 7048318 6832920 6505346 6332215 6322766
8574 6322766 6104102 6005236 5926595 5816994 5738183 5779427 5688524 5687781 5653482 5649756 5739640 5733416
8562 5733416 5645469 5606026 5423623 5343006 5298977 5200501 5130806 5067377 5023456 4898333 4914503
8551 4914503 4845272 4701860 4573416 4317832 4121848 3960704 3775386 3610353 3498526 3388992
8541 3388992 3366756 3263203 3102101 3036916 3124356 3152927 3070364 2904909 2778465 2745398 2712313
8530 2712313 2604939 2587163 2567007 2585827 2484105 2441933 2376814 2336804 2248064 2142971 1952043
8519 1952043 1937459 1960089 1944337 1852351 1967555 1930341 1872208 1850009 1874898 1771230 1763517
8508 1763517 1920809 1801707 1708061 1707823 1765054 1804026 1676843 1642198 1718858 1614508 1483657
8497 1483657 1456017 1432563 1411924 1492058 1443886 1499895 1503448 1551012 1475891 1488385 1443896 1475914
8485 1475914 1460504 1423959 1388426 1448957 1507400 1495214 1503445 1502081 1480676 1480646 1396767 1374664
8473 1374664 1419778 1465246 1474984 1503353 1554269 1534753 1472610 1604692 1568574 1594125 1684432
8462 1684432 1645391 1701870 1872903 1777555 1815073 1841089 1816281 1653329 1591988 1706366 1648267
8451 1648267 1696857 1644164 1660835 1601754 1503895 1534566 1518811 1473698 1562311 1515047 1375789
8440 1375789 1479273 1560526 1390439 1423522 1530679 1498947 1491621 1475968 1500197 1527777 1550489
8429 1550489 1551249 1534426 1525311 1510108 1508627 1423385 1466439 1429154 1433869 1486498 1571291 1497682
8417 1497682 1456988 1469021 1393925 1309462 1181751 1179877 1194444 1163561 1104514 1123749 1228092
8406 1228092 1183695 1104151 1120111 1141242 1105150 1147685 1111583 1037526 951991 1002448 1113447
8395 1113447 1204514 1134055 1088920 1152107 1125327 1054518 973726 947495 964232 831300 879970
8384 879970 969675 940877 825815 714825 833190 834490 898429 900127 778348 750715 746614
8373 746614 655762 758544 721076 732296 679892 785383 777547 686143 630423 611516 703702
8362 703702 579906 519422 464415 451063 480091 478067 582095 564068 571841 643546 506659
8351 506659 431903 411847 436191 538690 553404 506683 582960 569708 430330 455605 597179
8340 597179 624957 613576 603716 521332 541000 519318 506613 497234 508268 516475 540705 502269
8328 502269 462591 546147 579808 575818 645514 573363 553589 589945 590366 617338 579478 495159
8316 495159 451283 507540 530608 478636 459873 542488 639077 663873 617073 619277 607992 620686
8304 620686 582100 503669 520998 635478 638123 610905 589650 690728 706186 583770 521319
8293 521319 621403 589656 670550 718630 691615 677300 701995 715144 633507 708428 756588
8282 756588 675942 592925 543965 518541 438167 515834 535643 551162 460026 416375 492072 484177
8270 484177 464377 565252 539646 429452 535575 552251 521114 489186 551172 453654 435261
8259 435261 355959 406679 432677 388494 405587 520390 497567 328428 418780 384039 332516
8248 332516 349409 403937 543976 554021 523774 460480 364430 483240 653423 734382 884395
8237 884395 875692 731044 637413 363421 227576 226097 170588 110051 60399 179836 139219
8226 139219 95377 210069 219359 206640 195865 149342 93774 129660 130814 121668 144575 35391
8214 35391 17118 -9713 76325 93444 51042 -16173 18150 -131531 -81477 -616 21070 54439
8202 54439 50487 156769 92211 72993 -31639 -77220 50553 -949 -22641 -94809 -874856
8191 -874856 -398167 -129622 -200258 -115660 -197622 -89645 -123252 -130809 -148028 -103470 -68331
8180 -68331 -45211 -64091 39621 65676 -9575 9198 53215 -678 -33485 -117165 -142607 -86539
8168 -86539 -45734 -118607 -132352 -133668 -208944 -202920 -187848 -146119 -129531 -139542 6752 -61566
8156 -61566 -124481 -111251 -86779 -83200 -101940 -183236 -204061 -138680 -63957 17988 -6913 4224
8144 4224 -30466 -70540 -115823 -61443 -84460 -166845 -155195 -147889 -128597 -130686 -69730 -114681
8132 -114681 -68154 -34260 -5492 -71926 -120840 -67891 3987 -58009 -66964 -21267 -54588 -157942
8120 -157942 -158256 -127396 -184257 -198001 -175498 -113813 -133231 -191030 -66180 -158803 -105786 -55265
8108 -55265 -84574 -194854 -240957 -135455 -95945 -102639 -57585 15246 -49549 -168027 -170516 -119060
8096 -119060 -102587 -62060 -112592 -22749 -25850 -41727 -7647 -26013 -8310 -18212 -132122 -149814
8084 -149814 -130604 -186911 -133816 -123805 -192192 -125380 -147865 -121386 -81275 -27221 -80707 -66759
8072 -66759 -52477 -89700 -157586 -145250 -189496 -194247 -143691 -180840 -284369 -134109 -108561 -163807
8060 -163807 -109343 -124098 -149093 -143924 -114843 -34983 3637 34857 -66088 -175040 -126132
8049 -126132 -88982 -66113 -116783 -173363 -173528 -141929 -168403 -132746 -83189 -174535 -213198 -163485
8037 -163485 -160308 -107220 -62748 -68807 -26565 -67603 -80388 -95010 -127514 -114152 -112017 -37367
8025 -37367 -82602 -85522 -110538 -90479 -94372 -78276 -147972 -137483 -54795 -43418 -95092 -31591
8013 -31591 23468 -95602 -64673 -92338 -125935 -86770 -90505 -227473 -170909 -64249 -98490
8002 -98490 -46177 -85009 -136442 -146995 -181528 -183891 -56580 -123107 -215113 -130055 -143493 -3753
7990 -3753 -131909 -179615 -111715 -41594 -35053 -60256 -141402 -146739 -37652 -52750 -103544 -57253
7978 -57253 -116521 -64424 -67629 -94668 -44785 -165283 -129371 -114471 -98665 -102072 -50907 -85113
7966 -85113 -15251 -24283 -87465 -121710 8144 94945 127541 76843 -32052 -100823 -63789 -96598
7954 -96598 -109649 -134769 -129701 -143294 -103450 -68744 -57029 -31766 -114371 -117995 -65984 -20879
7942 -20879 -86370 -79452 -182848 -163111 -129457 -133794 -186328 -145609 -48411 -124576 -147938 -86403
7930 -86403 -74921 -41988 40343 -4938 24265 3615 45810 -33668 -19230 -37223 -85379 -51698
7918 -51698 -49779 -41701 2768 49163 -26849 16485 45593 89077 20843 -59989 87232 41456
7906 41456 -11517 -63880 -63930 -117319 -78111 -114574 -274512 -194958 -30444 -24563 -61927 50954
7894 50954 18128 59657 -91255 -174203 -72553 -30393 23671 55848 -24801 -83370 -58643
7883 -58643 -96925 -25116 101383 27384 -43799 -9589 -88846 -74862 -34903 -43442 -96406 -60825
7871 -60825 -75243 -183258 -144387 -116300 -37432 -40198 -11078 -20690 -31417 -56662 26014 33762
7859 33762 26778 -8795 68155 65005 12021 104327 8712 -63317 -105656 -30891 -51462 -45277
7847 -45277 -2589 -73820 -109936 -5684 -98263 -58739 5795 -110212 -109553 -120630 -55743 -1674
7835 -1674 -9849 132 44448 17168 -63733 -190144 -78218 -50248 -83659 -111045 -60025 -103188
7823 -103188 -104653 -99492 -121441 -124040 28986 47786 1895 -69782 -142079 -70061 -59567 -111231
7811 -111231 -237399 -272342 -161525 -69090 -117827 -161095 -161169 -230005 -239061 -199592 -46860 -44807
7799 -44807 -123900 -107318 -16844 32461 -71719 -26955 13949 49240 43024 -40458 -134762 20177
7787 20177 41751 57753 -6736 -41388 29353 -65768 -45651 27367 20359 -45361 -124662 -74851
7775 -74851 -125112 -71520 -131735 -47744 -37366 -86817 -77988 -100300 -112719 -18223 -33158 -160105
7763 -160105 -142204 -72373 -17889 -62258 -58129 -56030 -89390 -102048 -140938 -197779 -155315 -152346
7751 -152346 -144314 -201652 -172478 -132181 -105962 -94842 -55586 -40543 -12565 25841 -57780 -19674
7739 -19674 -18906 4087 187423 46872 40581 27273 99008 87449 -17551 163537 268411
7728 268411 370113 325614 403092 427439 412620 412457 407598 343516 239710 113686 106304 136461
7716 136461 96802 -51667 69932 94324 98431 70287 24538 28543 11566 23211 29234 140294
7704 140294 14843 -19432 1329 114104 55628 16935 -45590 -115387 -108191 -105750 12618
7693 12618 56170 -58511 12243 -9341 98379 64550 -69691 -26372 35773 85803 64517
7682 64517 -32211 40301 114797 136170 121856 8136 -10924 1216 53669 96564 -50825
7671 -50825 -65160 -60792 -191234 -80424 -143118 -82512 -65017 -31567 -51337 -23926 -8587 -17095
7659 -17095 10297 -74647 -157851 -33018 5855 -24161 18730 -13832 -43183 -2415 -99941 -34066
7647 -34066 -25556 -43710 57357 87405 13078 4140 -57087 -52332 -31716 67771 79535 -30499
7635 -30499 -15521 46668 82360 -88039 -2068 -32173 -56646 -80064 -82428 -35117 -953 -13258
7623 -13258 79139 122590 48552 -29261 37248 33042 64041 76651 82992 -14463 19422 39164
7611 39164 30484 60457 119224 16253 -49371 36250 137148 126020 -2945 -28802 18320
7600 18320 88810 23155 28535 86073 61670 31448 82095 94278 58021 36354 20905 -5652
7588 -5652 17970 54436 -34670 -54220 47835 90347 43246 3769 -11922 10472 206916 280021
7576 280021 254384 174032 92684 119242 143125 59163 -969 -405 32593 149249 178874 126166
7564 126166 133753 179583 142980 26920 49095 69839 120100 -3479 103374 162672 176785
7553 176785 216583 142383 168928 198008 168310 165013 245188 219934 158365 182087 227937 228813
7541 228813 264786 273733 242538 232163 240560 277090 265015 286295 195103 161015 227398 232517
7529 232517 259112 348917 344321 301258 288618 300662 414784 421466 534399 390262 341900
7518 341900 365979 396101 382882 395408 406637 329749 342927 415143 535340 554320 641360
7507 641360 703708 733278 696715 710126 787678 603239 520609 610923 607116 617533 598727 571259
7495 571259 545426 518901 400712 456392 474619 412594 369954 463445 416813 395813 506817
7484 506817 497310 478361 410223 602222 614449 619588 519134 534857 520838 567171 577410 449706
7472 449706 453961 411482 304425 284324 392284 370817 422514 356944 421430 525701 600090
7461 600090 574612 669657 621829 575340 476323 546865 474374 434084 430214 510637 662569 719160
7449 719160 740588 703820 616148 691450 665517 621966 805265 748424 780766 802714 803631 808085
7437 808085 889782 1000746 954000 904949 941152 887052 864499 864098 775936 680239 705418 642093
7425 642093 707878 692669 656089 648415 598738 628274 530778 437778 491745 458977 498845 488241
7413 488241 465044 503991 580109 551096 452666 467802 534758 543812 627557 607224 576288 465502
7401 465502 464683 484288 557898 660760 730172 650445 546486 538676 519036 525947 460973 432607
7389 432607 384991 392141 436560 449604 383564 352813 435673 406059 300722 351044 367333 312861
7377 312861 432354 496039 428030 414922 379249 408462 382619 329255 418688 225965 176517
7366 176517 241080 319443 371444 438768 388734 341248 307795 261664 258428 249271 272992 332614
7354 332614 365027 329087 321819 281872 309595 371408 393395 272152 275123 235006 267308 249156
7342 249156 257546 236570 216825 238261 254252 250557 298631 318479 303644 302881 278158 273660 370710
7329 370710 445808 449224 305653 279404 323591 271606 229721 235479 288259 360381 392868 374470
7317 374470 350418 352118 247370 259211 287441 266995 287072 368466 307460 357129 353498 322784
7305 322784 338707 381732 370303 362203 410020 323697 353091 392960 289320 304475 349557 328564
7293 328564 198651 190459 323369 417124 311421 274521 312013 277172 321911 369332 383591
7282 383591 392167 453750 437226 494136 504816 463895 417333 539187 585522 577731 544203 433177
7270 433177 491507 501382 505087 567888 517365 449398 414627 367373 290439 365954 349225 270711
7258 270711 241857 409946 383265 422781 434029 335354 279328 335444 399975 321996 338397
7247 338397 407993 429724 382375 435749 458217 406355 483903 475157 497520 537287 489055 605154
7235 605154 500502 476970 489369 541322 575392 506180 588130 542081 564579 626525 546194
7224 546194 615084 586902 540140 543308 584674 598615 669346 719127 682086 735330 789525 778397
7212 778397 702952 719665 722582 812593 736048 824218 880206 987282 1034548 1069331 1061106 1028163
7200 1028163 1088362 1185468 1135019 1052539 943451 1016297 1159258 1122957 1147537 1131369 1101657
7189 1101657 1164143 1123385 1123112 1232451 1233545 1185392 1317109 1303705 1220411 1237135 1379286
7178 1379286 1348539 1386662 1496866 1544591 1685405 1709433 1785982 1729888 1973136 2029063 1946121
7167 1946121 2006526 1977012 2054655 2131635 2150542 2174874 2217140 2305381 2306548 2295526 2413021
7156 2413021 2676833 2719620 2658044 2699613 2813111 2825935 2881326 2963468 3220384 3342570 3604712
7145 3604712 3822656 3956332 4175636 4344908 4369245 4454974 4512535 4550381 4480647 4523954 4686108
7134 4686108 4866196 4929419 5082131 5298911 5372649 5467799 5544959 5640268 5892930 6054602
7124 6054602 6166572 6454844 6737773 7069980 7390220 7862064 8357750 8991183 9833842 11034215
7114 11034215 12533345 14419757 16832660 19612878 22879190 26190503 29131105 31122338
7106 31122338 32120836 31864386 30151145 27545118 24366633 21249937 18784708 17001989
7098 17001989 15750395 15111453 14697096 14641973 14716781 14938913 15059958 15227776 15280617 15262886
7088 15262886 15067877 14769447 14406557 13969083 13528150 12950096 12571560 12261062 12114741
7079 12114741 12061730 12004708 12018026 12202118 12267321 12474343 12786287 13111925 13468042 14052444
7069 14052444 14857891 15708006 16756060 17793181 18858876 19994224 20868949 21500904 21894089
7060 21894089 22090536 22038655 22078457 22439265 23051944 23965960 25207976 26930547 29023937
7051 29023937 31604722 34682129 38467117 42904594 48323220 54583065 61738598 69767849
7043 69767849 78416899 87176595 95180147 101707906 106163493 108268420 107944687 105147209
7035 105147209 100386303 94897011 88958311 82202891 74686027 66035515 57581294 50282989
7027 50282989 44208512 39297893 35340400 32063871 29111414 26564287 24375766 22372147
7019 22372147 20684263 19183523 17813828 16688094 15762420 14898237 14081575 13470273 13074091
7010 13074091 12839693 12807436 12962296 13349451 13855161 14343925 14885213 15240054 15309800 15071556
7000 15071556 14540147 13641557 12572092 11258386 10141891 9145795 8194632 7542062 7048663
6991 7048663 6588525 6352029 6028665 5732113 5491767 5252841 5061630 4970107 4830939 4624379
6981 4624379 4407027 4366670 4326703 4106928 3939427 3917629 3819174 3743471 3670941 3582763 3466228
6970 3466228 3481056 3412641 3338661 3331138 3195882 3075609 3003285 3003465 2871542 2804271 2810602 2704436
6958 2704436 2701508 2740693 2679789 2597754 2714698 2661852 2482728 2417786 2256801 2265675 2292447
6947 2292447 2244289 2133136 2040985 1973847 1956281 1899261 1913324 1935258 1962765 1967359 1809309
6936 1809309 1860758 1919051 1866500 1834582 1828860 1933694 1909227 1849388 1905142 1843564 1704279
6925 1704279 1710669 1650540 1650120 1499841 1519670 1600043 1452764 1480741 1400537 1418927 1352877 1315076
6913 1315076 1406439 1332869 1289116 1300630 1105764 982725 1033240 1044364 1091341 1065723 1069677
6902 1069677 965195 970078 948995 1015618 1015538 1014984 1087546 1140728 1096619 1006766 995535 952264
6890 952264 1033450 1130015 989013 963877 908672 871511 873248 879589 733416 795750 827728 888970
6878 888970 865004 774210 819487 804005 941581 919960 912521 866542 914176 973200 968588 949081
6866 949081 990570 1065212 1097076 1096936 1107668 1044861 967928 965175 1024923 1165400 1231231 1190800
6854 1190800 1167026 1117631 1116149 1113906 1165169 1207811 1169742 1197011 1250315 1214455 1181836 1180480
6842 1180480 1153605 1152415 1133498 1138681 1197865 1314324 1301133 1232572 1289783 1176666 1200645
6831 1200645 1177189 1211154 1084542 1152804 1122099 1085447 1139777 1020588 810318 920960 956954
6820 956954 1033046 1003344 959576 997690 901746 939231 891966 798046 818950 952528 974626
6809 974626 992959 938757 878486 943693 1015379 1071716 1046045 1062821 1052549 1020555 1098658 1159158
6797 1159158 1126205 1095787 1158550 1156152 1169613 1145921 1237664 1316259 1318174 1225527 1351418 1268106
6785 1268106 1140305 1177268 1214083 1153733 1073230 1091536 1221792 1107200 1099910 1080148 1169127
6774 1169127 1111175 1011577 915451 947285 1093309 1120051 1077419 1093543 1071521 1067451 1092316
6763 1092316 1073490 1145253 1092875 1136936 1119177 1093182 1001016 938417 842476 835737 909542 899840
6751 899840 794680 854127 941282 845773 823464 881089 978680 806670 779060 883874 948611
6740 948611 1053184 977583 949521 954323 1029517 1014234 1011948 1043469 989549 1029791 974462 953083
6728 953083 937515 984434 997713 986891 999759 979072 1124357 1120433 1031748 1046089 1044927 1002315
6716 1002315 1034035 1018238 985861 1017490 1000733 1006961 1136782 1145117 1171062 1254696 1168922 1254009
6704 1254009 1368110 1328284 1293587 1204243 1183801 1204671 1303584 1296888 1286822 1242040 1162058
6693 1162058 1184634 1217301 1239678 1332243 1242271 1241793 1198213 1295637 1252589 1069725 1015773 1092292
6681 1092292 1187181 1211872 1244181 1109289 1153927 1135777 1145339 1093941 1160987 1127183 1135377 1240086
6669 1240086 1241405 1276122 1247049 1251997 1181472 1163206 1298879 1359953 1356445 1393961 1440431 1428594
6657 1428594 1405754 1425767 1313920 1259080 1376199 1412093 1360099 1364964 1451526 1408133 1412311
6646 1412311 1519790 1579252 1572868 1610928 1654822 1610661 1568071 1604626 1743404 1752717 1756845 1780596
6634 1780596 1790529 1688379 1734052 1665195 1593494 1582317 1494942 1410989 1275310 1319197 1197880
6623 1197880 1285996 1328963 1313260 1325673 1319849 1352970 1321260 1298764 1245603 1275294 1206725 1242310
6611 1242310 1282425 1266849 1353515 1326760 1220895 1258855 1354024 1418306 1370882 1312216 1377314
6600 1377314 1445207 1368736 1295655 1341259 1360249 1341861 1292503 1279734 1298357 1346563 1413422
6589 1413422 1303825 1344717 1360892 1373397 1372047 1339512 1396797 1494862 1587526 1671134 1674360 1793504
6577 1793504 1795667 1729323 1849169 1757521 1746907 1742788 1729253 1659984 1703383 1615364 1511556
6566 1511556 1567240 1531849 1433701 1489546 1530397 1526768 1673035 1749985 1743831 1870003 2003170
6555 2003170 2140990 2246466 2377144 2562277 2740750 2896509 2911971 2868702 2769614 2635400
6545 2635400 2578774 2584744 2493955 2389786 2311328 2320531 2390031 2230816 2207275 2223392 2097018
6534 2097018 1993567 2039197 1966915 2001809 2086595 2101835 2166413 2256790 2383388 2443685 2596634
6523 2596634 2802222 3089268 3373787 3610338 3685261 3752335 3694227 3548966 3405323 3108223
6513 3108223 2931873 2786028 2707290 2620148 2493452 2421823 2464338 2385187 2372855 2487592 2490044
6502 2490044 2503802 2410615 2455424 2493142 2478384 2398499 2430693 2554233 2683329 2653423 2733764
6491 2733764 2779471 2708849 2817695 2827702 2817871 2690964 2559364 2544307 2594354 2455377 2315978
6480 2315978 2308585 2299363 2283048 2291784 2230693 2230720 2420180 2555145 2505053 2515315 2565129 2582530
6468 2582530 2649661 2694672 2764011 2837619 2896283 2822941 2871068 2822975 2775781 2727582 2706038
6457 2706038 2639388 2607920 2655338 2660246 2654287 2611697 2670402 2727115 2778228 2758459 2740645 2884325
6445 2884325 2933743 2987041 2999233 3150117 3197968 3247840 3259274 3425522 3430847 3340315 3411256
6434 3411256 3426289 3518406 3545731 3620680 3558068 3616233 3662847 3742816 3777818 3822249 3817132 3799195
6422 3799195 3802384 3779074 3814419 3997920 4031736 4105463 4236996 4328832 4343053 4324897 4531899
6411 4531899 4572337 4526259 4586202 4642639 4674919 4639052 4700866 4758117 4810986 4846324 4855361 4913998
6399 4913998 4879508 4990005 5110811 5262406 5359317 5271603 5278447 5343567 5371790 5414469 5456548
6388 5456548 5547053 5553248 5646678 5804906 5874470 5859105 5897726 5769631 5856277 5996611 5972117
6377 5972117 5968829 5928726 6067083 6176592 6304191 6389179 6317648 6209616 6293119 6356286 6359597
6366 6359597 6478158 6605010 6579158 6580010 6671759 6740169 6770510 6812961 6831203 6830068 6897428 6978640
6354 6978640 6933172 6879473 6863369 7000298 7071011 7079211 7162551 7224060 7297499 7451502 7464383
6343 7464383 7406566 7386131 7379202 7340239 7402688 7469191 7478923 7480319 7498792 7574379 7689385 7811298
6331 7811298 7912499 7986347 7982105 7975993 8097164 8217107 8150308 8244366 8261781 8299825 8332617
6320 8332617 8533314 8554426 8477993 8573511 8549400 8550679 8622032 8769784 8820047 8964304 9029095
6309 9029095 9172657 9468885 9737869 9855987 10123395 10621880 10994855 11242326 11325525 11295272
6299 11295272 11175263 11036732 10932601 10718548 10583098 10577949 10491200 10492411 10588433 10519789 10624287
6288 10624287 10585714 10549872 10656727 10679821 10583707 10530054 10623295 10707893 10698862 10714115 10909609
6277 10909609 11156107 11280750 11422192 11621420 11566801 11632117 11516843 11413567 11411739 11405768
6267 11405768 11365126 11398409 11500379 11450933 11464584 11585653 11683166 11818007 11898851 11990228 12166674
6256 12166674 12320340 12552845 12763209 13047067 13505370 14052701 14712230 15635039 16801163
6247 16801163 18303457 20241570 22337935 24325831 26107227 27282816 27355486 26961076 26728682
6238 26728682 25693831 23480315 21193903 19196007 17841947 16784144 15976427 15384932
6230 15384932 14879424 14527537 14218596 13876017 13549665 13433258 13268283 13257392 13200426 12967026
6220 12967026 12961485 12919089 12754771 12746626 12648129 12463816 12391613 12193462 12128005 12128008 12103528 12083937
6208 12083937 11983606 11928209 11745750 11651246 11504757 11374671 11269952 11263472 11308919 11231995
6198 11231995 11141428 11017921 11000421 11085249 11103917 11049716 11088237 11150964 11136383 11252095 11276191
6187 11276191 11361117 11446635 11478971 11657004 11699994 11818363 11868373 11889825 11890917 11885306 11799645
6176 11799645 11732656 11726172 11615135 11721077 11763416 11648181 11569192 11379964 11295942 11204407 11111686
6165 11111686 11073788 10934223 10799890 10747567 10668177 10507040 10339516 10230502 10308419 10222817
6155 10222817 10131833 10136041 10154616 10080377 10031993 10063520 9955524 9843620 9808707 9921672 9993580
6144 9993580 9988591 9987413 9948932 9880441 9862431 9829192 9758369 9835987 9774285 9686268 9723126 9753803
6132 9753803 9568119 9481310 9588020 9559689 9492167 9505083 9553038 9608774 9428826 9421698 9476299
6121 9476299 9532569 9533961 9391367 9334999 9251217 9122328 9086977 9083871 8984294 8868970 8610267
6110 8610267 8469350 8348072 8389093 8368889 8116752 8040512 7987924 7976242 8016926 7997218 7931619
6099 7931619 7933926 8045905 7998718 7912709 7830751 7907772 7995645 8056333 8107388 8225756 8333584
6088 8333584 8409978 8428566 8475633 8462014 8379738 8450858 8515455 8532916 8608629 8697224 8864054
6077 8864054 8985983 9242694 9561444 9992665 10534919 11218391 11891899 12291746 12766149 12997348
6067 12997348 13131521 13059514 12970660 12754485 12344500 12197732 12378449 12671994 12949096 13179152
6057 13179152 13313609 13228059 12984731 12713329 12384230 11813916 11034474 10377418 9936380 9640414
6047 9640414 9305431 9138524 9039431 8925315 8955067 8958463 8913680 8940255 8904937 8801965 8905740
6036 8905740 8840641 8752368 8744415 8788282 8912486 8975550 9010409 9134990 9263308 9403183 9553003
6025 9553003 9943236 10406124 10962182 11725109 12681606 13475856 14415707 15192094 15606788 15780165
6015 15780165 16012821 16173028 15919340 15648105 15405315 15372693 15611664 15891409 16317065 16600025
6005 16600025 16655331 16552285 16276272 15976775 15232128 14267802 13332926 12706464 12091229 11784806
5995 11784806 11584146 11421164 11266964 11257544 11285813 11333280 11441658 11488014 11465749 11638608
5985 11638608 11854621 12086941 12210522 12514876 12780818 13056119 13160232 13261665 13428374
5976 13428374 13498201 13348806 13144599 12964054 12631951 12235367 11884573 11622560 11252956 11004098
5966 11004098 10955710 10786617 10788178 10786502 10816036 10984958 11209058 11654478 12002261 12365615
5956 12365615 12758845 13022457 13090639 13048014 12746916 12403800 12098864 11961763 11800639 11744032
5946 11744032 11795753 11982283 12094922 12273137 12520517 12756630 12933957 13139632 13304978 13329816
5936 13329816 13278558 13329851 13263195 13159301 13052830 12889517 12767064 12620400 12596016 12840994
5926 12840994 13152006 13480198 13800999 13834308 13813095 13724532 13455309 13053187 12620888 12422031
5916 12422031 12278678 12337912 12449420 12570478 12771750 13031168 13118167 13266181 13513147 13766268
5906 13766268 14031702 14184510 14208222 14166352 14230140 14107903 13914834 13704407 13589082 13410061
5896 13410061 13355058 13521775 13674921 13790994 14039050 14133572 14389655 14731712 14869173 14987712
5886 14987712 14989958 15065000 15191563 15167551 15116852 15072555 14890395 14624449 14620154 14586155 14608637
5875 14608637 14729923 14749455 14791383 14628889 14500917 14429343 14510165 14519803 14437097 14320596 14286787
5864 14286787 14337929 14482967 14695654 15059339 15454445 15951318 16429532 16967776 17572553 18181914
5854 18181914 18606178 18852320 18884477 18746943 18646731 18600281 18334383 17898397 17725124 17833595
5844 17833595 17826102 17846257 17879278 17819747 17872379 18012574 18106486 18136169 18313875 18329833 18652600
5833 18652600 18709373 18785374 19010462 19334280 19687217 20169421 20863879 21633397 22542163 23628707
5823 23628707 24755318 25845909 26938498 27900181 28530837 29161218 30080446 30709355 31089541
5814 31089541 31598890 32272410 33049085 33978051 34992803 36172730 37342949 38592718 39858028
5805 39858028 40980770 41950093 42807131 43574486 44275961 44965151 45775567 46797722 47908338
5796 47908338 49404068 51229996 53345276 56072536 59499767 63228699 67194260 71017215
5788 71017215 74264654 76492051 77679498 77780320 77019100 75918672 74500335 72564947
5780 72564947 69638905 66025837 62349972 59047061 56396252 54650120 53622760 53292836
5772 53292836 53774763 54976849 57152328 60140579 63911792 68184497 72469921 76464899
5764 76464899 79569904 81269234 81388320 80170375 78304749 76295959 73934238 70655056
5756 70655056 66081725 60720032 55282720 50497278 46455782 43177552 40480858 38266550
5748 38266550 36387500 34819066 33595830 32519746 31621516 30876071 30189808 29875782 29726619
5739 29726619 29645017 29555677 29413749 29132007 28599126 27886973 27369359 26968800 26540828 25972983
5729 25972983 25141345 24309960 23584681 23105921 22584021 22192793 21951323 21880228 21711368 21573901
5719 21573901 21491249 21517015 21655819 21895484 22279167 22886793 23407376 23967199 24429300 24867769
5709 24867769 24988344 24930596 24811689 24694346 24743148 24807139 24629453 24110597 23633346 23373050
5699 23373050 23178772 22861293 22679033 22752251 22866738 22887453 23008386 23232567 23694865 24347880
5689 24347880 25221427 26153411 27079739 28076335 29075952 29917998 30555019 31101477 31876734
5680 31876734 32543059 32961046 33134846 33197589 32993965 32968815 33043373 32982306 32888033 32795705
5670 32795705 32681686 32608786 32606641 32664324 32884936 33158907 33655132 34533042 35602895 36881098
5660 36881098 38203418 39750532 41167431 42354234 43342367 44054432 44722017 44968100 44884793
5651 44884793 44435488 43666153 42607483 41361451 40124454 38848103 37574584 36230582
5643 36230582 34950707 33815085 32625119 31557838 30603858 29614216 28854378 28164428 27459730
5634 27459730 26868110 26364994 25887054 25479885 25023603 24710445 24406602 24158130 23925264
5625 23925264 23668615 23648047 23638953 23747221 23809957 23944973 24175298 24376711 24561433 24727941
5615 24727941 24835365 24914987 24985488 25008428 25050020 24877377 24813588 24694296 24530490 24410751
5605 24410751 24309827 24360548 24359477 24391797 24513465 24941173 25564791 26284698 27100426 28039187
5595 28039187 28983414 30064223 30861744 31411487 31812060 32040371 32026462 32056060 31857959 31517417
5585 31517417 31145379 30550098 29837341 29107648 28416609 27871270 27488010 27256279 27203252 27344577
5575 27344577 27735574 28382055 29207181 30166904 31220216 32254450 33138809 33589760 33864014
5566 33864014 33998299 33782920 33575131 33230914 32463898 31566886 30547846 29407167 28245295
5557 28245295 27099995 25962646 25056685 24342500 23710633 23426278 23342235 23299256 23335983 23571538
5547 23571538 23991093 24365994 24781137 25061059 25175945 25073012 24904843 24606191 24345180
5538 24345180 24071584 23637037 23248290 22871529 22510528 22174477 22152310 22251210 22296733 22610661
5528 22610661 22875769 22565989 22047697 21596246 21238404 20882491 20173121 19232065 18267750
5519 18267750 17521967 16916893 16389041 15872981 15491201 15173692 14868943 14557807 14211190
5510 14211190 13837796 13540234 13255125 13076303 12904298 12611716 12435552 12214588 11922717
5501 11922717 11580391 11371975 11101334 10815621 10626218 10393092 10204232 10008191 9673795
5492 9673795 9493661 9327265 9111368 8787112 8777263 8666087 8441775 8315318 8098123 8065615
5482 8065615 8114081 8091484 8074127 7957241 7839716 7812440 7712696 7669553 7652228 7627781 7590715
5471 7590715 7513020 7332730 7190079 7069927 7084196 6987887 6943371 6938342 6928774 6886806 6790524
5460 6790524 6784278 6724491 6686696 6579474 6549479 6432239 6471581 6420001 6243677 6242638 6287995
5449 6287995 6380665 6415201 6447999 6303727 6352654 6462038 6513304 6440380 6544273 6544268 6542860 6360583
5437 6360583 6252002 6359178 6332864 6263635 6250561 6388418 6404447 6453445 6423672 6303621 6272034
5426 6272034 6270570 6196902 6146360 6158353 6202141 6055916 6021045 5986110 6038479 6076208 6124374
5415 6124374 6155042 6242911 6408224 6581654 6614354 6611885 6602410 6578457 6654272 6640380 6488654
5404 6488654 6310660 6372628 6375435 6258002 6159727 6323250 6300071 6339487 6407845 6538697 6466980
5393 6466980 6393897 6404122 6413669 6502724 6534891 6405158 6521572 6644027 6689014 6820020 6840721
5382 6840721 7019568 7289691 7441184 7654939 7748238 7765575 7936877 8144115 8276178 8323002
5372 8323002 8295780 8484434 8763973 8820763 9020070 9206759 9588777 9832110 10060545 10241852
5362 10241852 10404524 10597582 10704225 10922732 11021865 11247149 11549120 11681885 11851353 12104770
5352 12104770 12340229 12429462 12483052 12553102 12741100 12832143 12994876 13048455 13093750 13234057
5342 13234057 13445710 13643690 14021991 14344553 14575146 14831135 15094858 15356422 15532290
5333 15532290 15684429 15870760 15900581 15970023 15925800 15760347 15614333 15359126 15149160 14732809
5323 14732809 14271037 13957478 13545175 13325080 13214169 13100493 12837945 12509206 12271578
5314 12271578 12076691 12057063 11929056 11721901 11491505 11355438 11192809 10967421 10936638 10797903
5304 10797903 10745646 10701121 10627786 10520228 10361339 10042140 9898405 9701183 9413402 9290774
5294 9290774 8961660 8706622 8530527 8451420 8324854 8327884 8499258 8686323 9008670 9167006
5284 9167006 9305928 9607498 9785103 9881970 9967158 10010363 10085976 10228754 10193529 10269803 10372427
5273 10372427 10476988 10688175 10825954 10911273 10966591 10851407 10856744 10817011 10588294 10336882
5263 10336882 10258237 10089311 9907022 9685885 9466329 9357312 9281406 9210761 9061268 8855300
5253 8855300 8698000 8463906 8306147 8212451 8291774 8299304 8213941 8094339 7988633 7990394 8018784
5242 8018784 7955762 7821248 7650310 7464219 7360762 7297925 7235604 7049161 6825437 6691827
5232 6691827 6560726 6374349 6292002 6271402 6204230 6112873 6068398 6057161 6033157 6166930 6273218
5221 6273218 6238717 6178477 6374145 6438931 6476813 6575543 6495223 6477826 6393135 6333774 6289596
5210 6289596 6311535 6375479 6366257 6237474 6172627 6191599 6116593 5961696 5967576 5934684 5826304
5199 5826304 5784050 5629248 5547254 5508641 5458084 5377267 5258024 5274387 5201288 5137105 5135977
5188 5135977 5048170 5064294 4962449 4852819 4981723 5115881 5223375 5219057 5184655 5277880 5317141
5177 5317141 5252128 5203137 5334938 5337445 5208007 5403490 5445932 5519560 5684097 5750673 5899721
5166 5899721 6075550 6141543 6054595 5981951 5971758 5960247 5999086 6004044 6091229 6060268 6153975
5155 6153975 6305028 6475795 6547659 6757737 6908228 7127036 7227395 7337886 7400926 7429524
5145 7429524 7594510 7764692 7880232 7961319 8240319 8460668 8824000 9213991 9509825 9643595
5135 9643595 9778466 9976415 10233408 10509853 10648513 10645111 10697453 10835668 11094249 11371898
5125 11371898 11673728 11915502 11977126 12309065 12748239 13096538 13479475 13737573 13755386 13737822
5115 13737822 13808016 13907637 14073097 14122321 14091564 14208471 14300561 14360144 14526613 14709821
5105 14709821 14811677 14804153 14975596 15182049 15317836 15585239 16111771 16687627 17176215 17643779
5095 17643779 18201941 18644301 18901420 19009729 19067539 19084252 19013983 18809317 18388460 17748711
5085 17748711 16908327 16159690 15715618 15174903 14779163 14518839 14336066 14227230 14117582
5076 14117582 14122552 14353041 14502267 14561192 14876775 15213330 15270395 15353802 15406944 15490693 15581077
5065 15581077 15729517 15933925 16085195 16278022 16360206 16638598 17006361 17612585 18421722 19395257
5055 19395257 20742300 22421662 24216546 26104631 28111204 30315344 32502088 34034456
5047 34034456 34721700 34960740 34740411 34453902 34337941 34314455 34088756 33280791 31885598
5038 31885598 30491666 29324051 28553935 28058745 28077792 28647701 29475662 30965850 32950553
5029 32950553 35665556 39001278 42523989 45976121 49264590 51816685 53302502 53608124
5021 53608124 53084842 52339659 51620054 50828996 49665254 47459133 44457718 41113533 37903857
5012 37903857 35182510 32895250 31096627 29692913 28747565 28398678 28454235 28880230 29595324
5003 29595324 30598012 31732278 32820314 33799938 34393025 34259501 33551632 32667276 31843546
4994 31843546 31169105 30423213 29363346 27660663 25616874 23743000 22169906 20878345
4986 20878345 19794859 18860536 18143091 17797034 17629492 17414124 17431979 17501643 17550566 17431239
4976 17431239 17211251 16695307 16424028 16099012 15791473 15558541 15097840 14536874 13937735
4967 13937735 13381208 12899321 12618268 12563650 12493176 12334878 12413044 12549154 12706615 12785678
4957 12785678 12994040 13361526 13780422 14181488 14413399 14687621 14779169 14618259 14638884 14591640
4947 14591640 14548959 14555786 14413195 14032454 13690623 13417405 13114123 13003742 13037321 13072824
4937 13072824 13193648 13316225 13240417 13333338 13368638 13479121 13595325 13535894 13383456 13315259
4927 13315259 13171487 13086331 12852322 12789533 12849597 12732389 12643590 12719088 12696545 12480925
4917 12480925 12361411 12165413 11909480 11574809 11274506 10988159 10906537 10627607 10351788 10183983
4907 10183983 9910522 9669459 9450823 9264435 9205898 9130260 8872839 8669475 8600991 8447050
4897 8447050 8239478 8119196 8091886 7918063 7918405 7940946 7985060 8153082 8228563 8218894 8249555
4886 8249555 8225923 8249123 8265526 8318160 8242197 8151106 8233869 8337543 8363689 8463099 8598059
4875 8598059 8837106 9059620 9213371 9377495 9748168 10039748 10244941 10419334 10697177 11011060
4865 11011060 11219032 11502904 11622692 11705016 11767684 11628051 11586633 11525197 11461506 11240848
4855 11240848 11093490 10993754 10755354 10546107 10242704 9980882 9796792 9523074 9242724 8904924
4845 8904924 8588735 8207256 7854944 7632365 7428890 7284767 6988991 6774261 6438568 6326458
4835 6326458 6085303 6001991 5815290 5720429 5487980 5470259 5355748 5202444 5045734 4985896
4825 4985896 4917545 4773862 4738925 4633443 4503350 4408067 4432237 4405379 4451992 4379170 4361132
4814 4361132 4293936 4295398 4274146 4234536 4242010 4157918 4124226 4181899 4221239 4244128 4202844 4197510
4802 4197510 4152296 4077012 4087603 4086082 4080275 4042282 4003126 3994631 4003612 4080543 4221438 4162700
4790 4162700 4120009 4026363 3956344 3848096 3828244 3796476 3787419 3771435 3779256 3775529 3631910 3664107
4778 3664107 3584966 3640999 3679828 3595235 3580064 3485814 3465074 3541859 3455354 3471600 3513304
4767 3513304 3601763 3571862 3566095 3581708 3677643 3546026 3540255 3601087 3630190 3691372 3738323 3726795
4755 3726795 3784015 3837282 3833620 3829772 3944537 3962601 3979889 3973586 3998716 4151467 4126453 4256745
4743 4256745 4257170 4407316 4389979 4470963 4557941 4636810 4754949 4829648 5034744 5121982 5328884
4732 5328884 5589802 5943954 6479904 7023196 7648888 8509991 9265846 9993817 10697725 11080447
4722 11080447 11084604 10935730 10885170 11056243 10990334 10641873 9968663 9268638 8880797 8717799
4712 8717799 8705018 8882879 9250791 9688574 10400485 11384411 12384339 13494470 14486603 15052154
4702 15052154 15479918 15805863 15871514 15619470 15062144 14366144 13883275 13012307 11902675
4693 11902675 11046049 10391635 9974768 9721230 9736095 9978839 10306889 10749960 11316116 11975738
4683 11975738 12497433 12893432 12788691 12366228 12212316 12453268 12518786 12077319 11361010 10717751
4673 10717751 10058528 9618754 9456325 9167550 8947400 8583485 8367790 8264881 8102556
4664 8102556 8141060 8174177 8130222 8097812 8156348 8292770 8336551 8399731 8551438 8608333 8629785
4653 8629785 8676644 8598366 8601521 8643904 8671100 8667782 8733057 8803846 8911003 8974512 9140248
4642 9140248 9361126 9498465 9664849 9802890 9888033 10035060 10087688 10041056 9993325 9994631 9881929
4631 9881929 9908010 9922854 9815128 9850864 9783244 9706616 9590243 9665783 9567652 9496328 9671798
4620 9671798 9682981 9667962 9827364 9900173 9930012 9916026 9886257 10099318 10289615 10305243 10311042
4609 10311042 10270854 10198874 10115604 10235953 10171849 10053592 9954987 9962913 9978690 9942921 10054239
4598 10054239 10203322 10407188 10681753 10926956 11280426 11545107 11878940 12178274 12386266
4589 12386266 12560457 12618346 12623324 12600136 12570336 12574133 12468114 12296077 12227010 12182993 12198871
4578 12198871 12137109 12209047 12273148 12109492 12356822 12407894 12393006 12612410 12796764 13035660
4568 13035660 13306331 13896068 14556087 15201970 15796184 16485401 16871479 17057917 16920988
4559 16920988 16827074 16862103 16945054 16750363 16544628 16567865 16739926 16989926 17196466 17394653
4549 17394653 17217741 17033836 16910014 16981560 17083964 16825817 16480620 16258046 16237336 16134229
4539 16134229 15884600 15591083 15416068 15430974 15212396 14881824 14636857 14506844 14436858 14504368
4529 14504368 14631408 14484162 14378275 14084718 13831054 13675648 13338561 12802945 12169502
4520 12169502 11543965 11066441 10734079 10589918 10377980 10188541 9985151 9760469 9562565
4511 9562565 9510217 9453187 9359549 9296362 9294603 9361313 9492052 9479745 9571228 9634584 9600922
4500 9600922 9710234 9646236 9826527 9823514 9778071 9794249 9779758 9817122 9882069 9998638 10094786
4489 10094786 10042010 10130381 10227101 10162574 10308468 10427428 10442768 10545704 10709997 10781536
4479 10781536 10760210 10861297 10928825 10782969 10682737 10659157 10539414 10463863 10332930 10228695
4469 10228695 10195742 10176766 10109800 10139482 10150349 10280928 10437995 10466126 10437763 10418877 10500566
4458 10500566 10551976 10485444 10508661 10619722 10646478 10815287 10945917 11083294 11318381 11392323
4448 11392323 11501516 11714631 11772202 11768414 11818461 11987441 12098659 12228921 12458378 12617297
4438 12617297 12746953 12838237 12929097 12723122 12496910 12339318 12118698 11800267 11484201 11148306
4428 11148306 10872510 10796499 10738873 10605177 10504757 10384874 10267244 10152900 10143546 10078108
4418 10078108 10070255 9961794 10055297 10042262 10105558 10185041 10127207 10016553 9790313 9780614 9779889
4407 9779889 9739932 9634916 9441272 9277294 9173069 9149953 9215933 9076893 9061157 9016341
4397 9016341 9012660 8916858 8788093 8897087 8997411 9007759 9142848 9125585 9252649 9302442 9447630
4386 9447630 9527324 9536561 9572133 9459249 9441316 9432888 9443559 9420227 9344407 9352588 9231111 9068662
4374 9068662 9027130 9036911 8951558 8928162 8940640 8805873 8622663 8465965 8389884 8424352 8404454
4363 8404454 8423894 8458790 8514610 8763201 8812883 8953566 9165286 9243666 9350333 9576213
4353 9576213 9839124 10036448 10159860 10298710 10507449 10631681 10855865 11074638 11251243 11303603
4343 11303603 11391339 11419325 11457028 11536501 11502638 11527973 11566831 11448354 11299597 11230436 11077426
4332 11077426 11099278 11110724 11112273 11190692 11214898 11363949 11504163 11580354 11652015 11687320 11732621
4321 11732621 11706026 11840657 12023656 12172704 12302548 12371867 12577748 12719508 12850053 13185786
4311 13185786 13440198 13683355 13771639 13948960 14056168 14189236 14258723 14425145 14479311 14401623
4301 14401623 14346972 14349753 14366962 14321678 14151490 14043445 13984822 13825694 13859710 13869924 13918295
4290 13918295 13847343 13922012 14002920 14039567 14074898 14202810 14286432 14296036 14353641 14311885 14264805
4279 14264805 14198614 14266735 14343916 14360042 14335499 14183437 14156339 14020790 13972546 13881217 13758161
4268 13758161 13621525 13431877 13280899 13113679 13022470 12853519 12815357 12699774 12556769 12549246
4258 12549246 12526526 12544943 12619360 12571374 12616542 12918070 13034311 13217414 13514922 13627592
4248 13627592 13910248 14182501 14624328 14871131 15239645 15618928 16022962 16655032 17059258
4239 17059258 17531051 17938003 18133956 18099480 18101433 18161721 18151643 18068971 17862431 17508853
4229 17508853 17276826 17075507 17052771 16982996 16918918 17154814 17258257 17369805 17652401 17857865
4219 17857865 18262315 18672141 18904932 19229330 19694556 19933116 20107507 20318157 20839014
4210 20839014 21264416 21583246 22073595 22465907 22923911 23425458 24000363 24511599 24979735
4201 24979735 25523402 26111846 26719283 27353419 28137683 28830967 29573428 30363586 31188544
4192 31188544 31937118 32707475 33743005 34559161 35509227 36611043 37678010 38925020 40083786
4183 40083786 41446774 42845772 44471797 46288891 48254282 50301594 52492430 54785591
4175 54785591 57289922 60076274 62944767 66134057 69416212 72820215 76341068 80021232
4167 80021232 84141930 88682457 93975676 100449595 108362070 118325760 130698259 145891440
4159 145891440 164642645 187735129 215490880 248140698 284857499 324250121 363433074
4152 363433074 401545106 435787943 464283497 484562356 495129332 494026215 481082966
4145 481082966 456097157 420006814 375933414 327955157 284031297 247298930 217805870
4138 217805870 194102111 174980936 159241750 145706414 133929956 123822398 114920819
4131 114920819 107431040 100699199 94780347 89601010 85245012 81396851 78173283 75590353
4123 75590353 73501484 71831949 70617897 69927011 69768504 70192092 70776762 71442346 72260666
4114 72260666 72557016 71387098 68858137 66070094 63896163 62887150 61152887 57256892
4106 57256892 52959095 49131883 46002261 43328439 40922205 38974670 37447854 36097543
4098 36097543 34894226 33844074 33002675 32244360 31500555 30670191 29942743 29254865 28429449
4089 28429449 27570519 26821019 26263359 25729040 25210126 24766804 24318340 23913382 23599047
4080 23599047 23302152 22873675 22454104 22191137 21854347 21418221 21092334 20758618 20361962
4071 20361962 20012581 19775764 19514235 19290458 19229520 19138155 18940089 18927611 18967506 18944685
4061 18944685 18872439 18958492 18946747 18847422 18952822 19117749 19065373 18951602 18919952 18978677 19220899
4050 19220899 19193015 19120822 19156610 19404132 19462963 19593763 19742775 19910173 20024066 20308532
4040 20308532 20528157 20710019 20850536 21047836 21429008 21743649 22111634 22424494 22706315
4031 22706315 23034868 23387464 23785100 24165939 24465321 24743578 24904374 25151710 25384765
4022 25384765 25571897 25740956 25994013 26209654 26465833 26657576 26931166 27286210 27606198
4013 27606198 28068921 28698738 29380910 30145507 31039790 32170881 33294255 34184043 34572286
4004 34572286 34235423 33590231 33178433 33037607 32727488 32539742 32451335 32429293 32552537 32578571
3994 32578571 32410046 32306157 32086523 31592155 31024342 30656901 30357383 30017559 29783386
3985 29783386 29705673 29589559 29548618 29486675 29475016 29508632 29466750 29611721 29792774 29945299
3975 29945299 30064082 30198106 30298329 30409129 30514017 30594445 30750115 30950869 31093240 31340149
3965 31340149 31412047 31652693 31961630 32309435 32667018 33131411 33561637 34000208 34425344 34731089
3955 34731089 34955966 35161966 35328269 35379836 35353620 35378333 35469858 35674957 36100828 36545097
3945 36545097 37009126 37598729 38267203 38963108 39763453 40523423 40921102 41155518 40875944
3936 40875944 40426945 39940020 39357336 39010393 38683758 38319473 37881644 37688849 37268925
3927 37268925 36936883 36550063 36073201 35709628 35197544 34640399 34051031 33610796 33102123
3918 33102123 32470678 31911857 31280605 30597110 29842943 29273089 28717974 27950455 27270449
3909 27270449 26638580 25984280 25372658 24722063 24059525 23481419 22988474 22393342 21917537
3900 21917537 21474509 20950398 20526501 20338081 20140577 19763265 19454384 19204962 19017737
3891 19017737 18908605 18710307 18516358 18308666 18160524 18080564 17948323 17817434 17706995 17397331
3881 17397331 17148336 17008790 16695532 16456589 16309036 16156826 15859396 15597546 15389725
3872 15389725 15138969 14945672 14844432 14719730 14618296 14618440 14754860 14852833 14821122 14831412
3862 14831412 14828932 14900538 14874708 14751514 14703613 14619967 14448454 14298789 14095002 13930920
3852 13930920 13709482 13524262 13482096 13366781 13311705 13346875 13361626 13291947 13332413 13450205
3842 13450205 13537689 13618011 13666024 13700713 13715498 13651117 13636293 13442581 13409758 13447530 13349520
3831 13349520 13407712 13442529 13358117 13297361 13304625 13291306 13296572 13322369 13413956 13442258 13530520 13550293
3819 13550293 13535751 13586295 13684934 13633266 13488821 13426876 13390588 13156616 12949949 12894299 12726752
3808 12726752 12554920 12383367 12411138 12299463 12123756 11982211 11779320 11508911 11293489 11049125
3798 11049125 10783856 10560169 10240942 10048033 9870100 9654316 9392305 9301277 9166378 9075028
3788 9075028 9097575 8984693 8942768 8799566 8771418 8770087 8916091 8976131 8987307 9072788 9185013
3777 9185013 9145121 9103473 9237583 9373907 9419507 9282613 9176800 9149869 9073801 8919434
3767 8919434 8880715 8890001 8930926 8854630 8805947 8936723 8900911 8896025 8942049 8992555 9121791
3756 9121791 9198200 9338468 9497245 9564905 9722308 9787023 9988316 10227834 10295813 10377389
3746 10377389 10364550 10440572 10638812 10761722 10783358 10844538 10873607 11032545 11122045 11270317
3736 11270317 11338719 11475934 11548539 11700667 11818030 11971871 12096353 12211453 12538649 12822747
3726 12822747 13091139 13422189 13688095 13873255 14134111 14236100 14399916 14567736 14510141 14574406
3716 14574406 14617112 14688535 14692841 14712771 14831779 14908553 15003317 15161393 15242845 15174519 15247735
3705 15247735 15218009 15144429 15164517 15172909 15163180 15166635 15195087 15082504 15101828 15206192 15303430
3694 15303430 15305070 15341718 15431983 15391032 15516775 15687680 15767920 15752254 15889999 16085088 16321870
3683 16321870 16524028 16706867 16988739 17214751 17407819 17850963 18226285 18425744 18709010
3674 18709010 19035507 19282815 19611941 19897971 20179476 20536447 20907177 21140543 21443718
3665 21443718 21778455 22162417 22434670 22669331 23024835 23291630 23685784 24105313 24452458
3656 24452458 24893704 25250139 25603936 25988157 26524516 27095296 27539955 28081311 28588486
3647 28588486 29206685 29849547 30545711 31412084 32356621 33399785 34430303 35713975 37170785
3638 37170785 38811676 40667098 42771416 45262444 47932338 50763996 53762057 56719736
3630 56719736 59394648 61704121 63688124 65485743 66830492 67705976 68423841 69133332 69882137
3621 69882137 70764841 71719836 72791757 73968236 75086718 76104410 76812511 77180827 77078569
3612 77078569 76540971 75735906 74561025 73112971 71681013 70226166 68671781 67220027
3604 67220027 65944922 64888335 64024834 63262250 62585337 61982893 61327364 60817163 60337545
3595 60337545 60031242 59937252 59727288 59552838 59310334 59140319 58895971 58694717 58628576 58515246
3585 58515246 58347603 58325618 58491607 58641554 58715203 58699438 58872750 59093612 59433496 59747374
3575 59747374 59927826 60313389 60885685 61478442 62140652 62831321 63632453 64563019 65633198
3566 65633198 66584585 67506723 68591253 69623667 70687318 71782346 73054968 74334517
3558 74334517 75669015 76922844 78163029 79573360 80725569 81904065 82977098 83905883
3550 83905883 84415713 84867631 85252427 85524503 85777950 85902038 86009433 86112385 86213549
3541 86213549 86034352 85985328 85764212 85235300 84640794 83922375 83101971 82162628 81194569 80189746
3531 80189746 79187852 78120114 77081711 76113348 75192293 74299369 73454891 72794662 72300847
3522 72300847 71877630 71639772 71312457 71276826 71256057 71240894 71358176 71580201 71834598 72081461
3512 72081461 72353202 72641858 73095415 73467682 73915386 74292480 74500597 74746381 74968942
3503 74968942 75108989 75032990 75013022 74851244 74509688 73995603 73321490 72684000 72119306 71364414
3493 71364414 70430134 69605217 68770492 67848455 66857809 65911512 65121864 64294095 63401664
3484 63401664 62752971 62190880 61788904 61290847 60924026 60557408 60255298 59902294 59464497
3475 59464497 58954941 58494605 58072894 57555481 57031223 56625530 56133499 55564030 55128777
3466 55128777 54611265 53990068 53374875 52544122 51815420 50904689 49945879 48982167 47913126
3457 47913126 46885371 45860594 44851642 43765631 42722840 41812754 40836027 39949105 39053034
3448 39053034 38243727 37402877 36653452 36026574 35363738 34725827 34233572 33663474 33066037
3439 33066037 32526707 32220531 31988696 31667858 31415029 31199391 31091867 31006530 31023093 31147081
3429 31147081 31227022 31394589 31734173 32151576 32764046 33314689 33952024 34325764 34243741 34098441
3419 34098441 34071884 33755119 33120185 32452663 32026614 31632339 31301173 31150304 30995528 30818526
3409 30818526 30689555 30584278 30586148 30776056 30822811 30985832 31106093 31039414 30899147 30587004
3399 30587004 30152784 29912233 29942693 30158249 30674740 31435195 32318735 33300603 34163836 34889075
3389 34889075 34952679 34823816 34743575 33825624 32487959 31365499 30392254 29339389 28607434
3380 28607434 28040207 27643906 27218066 26752182 26428746 26244228 25900513 25563659 25231612
3371 25231612 24916830 24854075 24824520 24675803 24619647 24736869 25097999 25515277 26074692 26740294
3361 26740294 27492394 28173126 28978729 29647112 30143029 30600256 30651388 30277827 29549249 28938806
3351 28938806 28542237 27757247 26858001 26321064 25911521 25700835 25576892 25615594 25721553 25845765
3341 25845765 26039250 26248795 26545152 26631316 26882993 26962335 27119735 27336332 27450344 27755275
3331 27755275 27971443 28216475 28558758 28945029 29515834 30150947 30843384 31465323 32215539
3322 32215539 32767157 33265350 33862553 34466536 34797345 35094394 35458844 35836159 36235767
3313 36235767 36672767 37227181 37586764 37820057 38002859 38296765 38738322 39327834 39898405
3304 39898405 40535074 41132312 41673532 42142920 42654785 43112711 43887587 44761821 45952033
3295 45952033 47334168 48847534 50491005 52158422 53781822 55099050 56186120 57422505
3287 57422505 58460536 59319709 60350969 61617775 62813283 64100340 65238564 65949343
3279 65949343 66719836 67543413 68143350 68915847 69932928 71161061 72805082 74570291 76630446
3270 76630446 79018123 81580674 84582032 87788459 91861080 96621085 102056423 107858617
3262 107858617 113882295 119836337 125449296 130649983 134862842 137670050 138642527 137749112
3254 137749112 134958519 130240287 124375246 118464819 113068038 108152907 103738483 99653380
3246 99653380 95801213 92023550 88294092 84769265 81162607 77862209 74679401 71637392
3238 71637392 68969022 66513475 64314410 62252096 60447923 59001831 57643827 56407897
3230 56407897 55344796 54398077 53526429 52710103 51913693 51126139 50115920 49192454 48370853
3221 48370853 47700950 47127421 46716005 46438961 46228188 46029931 45763879 45530755 45051883
3212 45051883 44244442 43504982 42632802 41636941 40671256 39717355 38804000 38072544 37540943
3203 37540943 37073171 36595795 36075904 35620263 35151763 34628955 34164503 33840732 33647442
3194 33647442 33440509 33195415 32752062 32342128 31977905 31580926 31308419 31282885 31477178 31730374
3184 31730374 32014401 32394065 32746491 32915354 32780838 32715657 32499453 32074313 31503423 30785165
3174 30785165 30237415 29921426 29719399 29573056 29607006 29558956 29374338 28997973 28632885 28354533
3164 28354533 27990156 27702730 27420948 27289236 27091013 26868634 26615028 26519594 26467902 26635405
3154 26635405 27212665 27976657 28877272 30090107 31413709 32925565 34408414 35575567 36340949
3145 36340949 36386401 36012860 35255776 34066505 32513031 30877915 29415867 28254486 27185438
3136 27185438 26328061 25720811 25113820 24511333 24167679 23769711 23482401 23271820 23350558 23291180
3126 23291180 23364818 23659558 24284024 25054367 25917461 27015827 28108232 29064183 29523424
3117 29523424 29383609 28999311 28257013 26873961 25180247 23458673 21994065 20878472 19923351
3108 19923351 19148270 18564411 18109581 17766011 17411464 17102931 16876509 16610713 16299123
3099 16299123 16044175 15825074 15703618 15541527 15479002 15468835 15356237 15261300 15397286 15422104
3089 15422104 15401057 15424344 15259535 14960979 14609679 14227176 13924307 13709022 13551204 13331545
3079 13331545 13104831 12934556 12893282 12828991 12753385 12587990 12502219 12506198 12525470 12430800 12357083
3068 12357083 12291242 12232332 12247682 12124574 12054870 12128786 12040917 12044407 12000410 11972564 12051224
3057 12051224 12120329 12073112 11985951 11885946 11746783 11651223 11437182 11415271 11265753 11171824
3047 11171824 11193186 11134187 11119229 10992343 10973459 10995562 10992445 10978504 11045511 11080206 11039724
3036 11039724 11059210 11065799 11048133 11040636 11074761 11100582 11265735 11423986 11507965 11620519 11784355
3025 11784355 11857311 11968209 11992412 12061890 12178611 12274356 12198042 12187881 12243124 12269710 12471660
3014 12471660 12602116 12728756 12843184 12905229 13140426 13030201 13120508 13074744 13074319 13072453 13142406
3003 13142406 13263579 13317673 13402346 13513729 13700463 13903305 14109535 14305362 14568889 14900722
2993 14900722 15287506 15566620 15935658 16361424 16807047 17147381 17397251 17515980 17386732
2984 17386732 17316118 17362255 17372173 17485947 17626833 17840625 18208238 18415629 18475306 18412124
2974 18412124 18255814 18173552 18139401 17984997 17737865 17771818 17709294 17793309 17777261 17962725
2964 17962725 18245777 18490946 18834066 19089827 19433584 19849474 20226326 20738142 21127696
2955 21127696 21486587 21943818 22414405 22892601 23481939 23871569 24359316 24934182 25467524
2946 25467524 25992373 26555434 27113988 27662591 28194355 28527104 28931976 29189733 29292524
2937 29292524 29390788 29406079 29378169 29544395 29689053 29851895 30089449 30356142 30760679 31154717
2927 31154717 31633211 32247353 32905089 33701120 34592312 35535753 36617895 37864901 39199388
2918 39199388 40743820 42256442 43996410 45702491 46788374 47699220 48268631 48468954 47971417
2909 47971417 46662302 45020417 43348177 41930744 40853924 40167241 39565901 39208939 39275519
2900 39275519 39327075 39249539 39491571 39645557 39890409 40202159 40442670 40694989 40939933 41258534
2890 41258534 41637800 42021473 42326090 42516967 42547134 42223082 41736956 41205379 40504408 39644215
2880 39644215 38774290 37828361 36687445 35607191 34574190 33833949 33136249 32690841 32179807
2871 32179807 31703562 31317604 30912560 30606851 30194230 29711983 29071241 28387570 27811449
2862 27811449 27111541 26463485 25705269 24918895 24173445 23450451 22634887 21896853 21238116
2853 21238116 20623478 19971968 19384175 18946606 18389571 17924279 17511222 17200651 16849041
2844 16849041 16397704 16097878 15890835 15596563 15401753 15197213 14965520 14713954 14465311
2835 14465311 14222058 13962091 13707674 13449500 13152978 12899548 12562182 12332950 12049380
2826 12049380 11858009 11720681 11558128 11326858 11092660 10963761 10736509 10595804 10433445
2817 10433445 10219332 10128827 9973564 9762673 9614643 9370313 9312071 9138191 9088711 9065616
2807 9065616 8742109 8551879 8387907 8342446 8268310 8264362 8166740 8038159 8039733 7922419 7772417
2796 7772417 7673286 7551375 7490974 7361958 7218765 6999629 6895470 6713944 6533423 6369264
2786 6369264 6221470 6177630 6119008 5903555 5850689 5872212 5845773 5808371 5698248 5659144 5447215
2775 5447215 5456315 5473824 5326322 5216673 5090477 4992230 5037949 5108145 4925369 4944259 4916628
2764 4916628 4780072 4747446 4765406 4632046 4457698 4528117 4271293 4135572 4059419 4006622
2754 4006622 3971091 3825023 3716974 3718863 3667476 3595568 3642858 3560429 3476470 3467915 3367152
2743 3367152 3370017 3310413 3304453 3341057 3256570 3140755 3158930 3123813 2948222 2864814 2899078
2732 2899078 2896116 2876645 2876744 2796658 2822000 2746907 2695617 2741793 2658171 2636879 2638517 2624471
2720 2624471 2564073 2547168 2524875 2417663 2404417 2443205 2434758 2339233 2329007 2412008 2305676
2709 2305676 2276444 2338796 2240317 2201389 2210034 2332796 2316011 2194940 2192581 2116540 2161746
2698 2161746 2180121 2101905 2056273 2004733 2012573 1973075 1931299 1992781 2022038 1983598 2044963 2136341
2686 2136341 2115464 1959217 1938981 1910018 1870180 1889850 1928261 1944431 1927934 1932637 1977989
2675 1977989 1970275 2020528 2009873 2053759 2096223 2146738 2180441 2066907 2150343 2075526 2061961
2664 2061961 2108259 2195011 2151597 2135535 2124429 2091133 2051739 2095195 2174915 2156654 2180890
2653 2180890 2109999 2059858 2149450 2205243 2169343 2296412 2306976 2223553 2270405 2212527 2254148
2642 2254148 2349568 2252462 2187735 2146450 2109711 2171271 2159274 2225522 2244396 2387103 2491306
2631 2491306 2522132 2561223 2542500 2599070 2682421 2550623 2518772 2453431 2418819 2386756 2383460
2620 2383460 2429476 2407398 2435569 2421775 2531905 2607664 2592563 2717756 2816190 2848895 2879438
2609 2879438 2768169 2779630 2730699 2673897 2650316 2567526 2425550 2434846 2327060 2232389 2212939
2598 2212939 2303776 2326794 2338869 2318358 2341815 2318100 2277404 2282260 2230602 2267630 2336056 2226634
2586 2226634 2219568 2179062 2205630 2074793 1975440 2061163 2072646 2170260 2119302 2152536 2192874
2575 2192874 2209048 2228377 2171348 2084675 2031057 1895210 1761288 1668528 1743881 1721375 1607403
2564 1607403 1536101 1459732 1473197 1369883 1284035 1387441 1419584 1393414 1453097 1307558 1333391
2553 1333391 1314778 1186719 1246459 1208538 1160039 1136279 1133198 1160965 1156806 1231263 1147940 1084706
2541 1084706 1055460 1037739 1088765 1104984 1058391 1020827 1023416 966967 909118 759760 840944
2530 840944 885290 834121 800723 733406 662582 701371 760465 668728 625341 613229 673230 808306
2518 808306 749699 750471 740455 670051 691581 632254 622796 594615 567275 565430 584695 609166
2506 609166 592438 640614 584159 613726 633943 581792 539543 593655 537591 399900 501986
2495 501986 442014 400642 461160 519836 529900 474867 387577 402066 479361 467356 483068 475894
2483 475894 548559 534633 468726 422142 492673 462756 478832 419141 369025 414665 404836 422284
2471 422284 391764 421140 349192 403013 476046 519578 300604 370237 450550 310587 278022
2460 278022 363046 378383 367888 403667 372636 225613 258126 317719 303827 361273 396286
2449 396286 285224 286032 292280 224160 305184 345805 267997 192293 273884 339801 382909 188754
2437 188754 156109 232539 293129 270624 282961 296375 234471 208400 285002 174110 216642
2426 216642 218894 262590 206786 341047 385179 246207 272496 293168 230014 378849 336409
2415 336409 340280 289580 262141 270667 264946 304397 255770 196568 158098 256443 288101 320066
2403 320066 296398 317439 276224 262712 203492 304208 399572 337623 257556 162596 257092
2392 257092 365555 330839 287173 235852 227971 238685 185488 219267 373340 309113 337390
2381 337390 370863 322130 330261 325118 252290 307386 293376 275505 237656 389672 296490 228787
2369 228787 131012 130296 187419 147345 242941 277061 315357 298971 320141 296295 334196 341247
2357 341247 237100 274727 314270 191724 160944 269362 282949 237436 173160 194338 220075
2346 220075 167846 117385 179472 228047 256497 299512 283189 194793 174471 156711 212700 210425
2334 210425 65345 13039 112905 145884 210623 163284 51586 35840 101682 157244 127376
2323 127376 102695 118852 39150 -30634 17279 36370 174610 235395 160376 -1762 36585
2312 36585 21646 104950 135083 106806 116232 74504 103280 223531 248089 144017 143037 130348
2300 130348 125692 146809 132616 63280 152247 143324 61720 61652 69905 132156 195610 249794 186131
2287 186131 171392 134161 166572 131095 179591 149196 74507 136664 220461 335718 158735
2276 158735 137151 211313 249029 242125 235368 173746 202758 249141 221281 211423 161683 192027
2264 192027 200761 157647 196853 84883 99586 116678 118292 191275 180284 196894 234919 167616
2252 167616 132751 153443 141522 164008 144026 193558 169876 158592 175899 154330 162726 179754
2240 179754 216085 171154 123624 103069 97398 115050 121438 175408 155965 176603 172843 251496
2228 251496 269743 344683 291113 263215 286616 283356 246711 249179 242350 321363 235291 283020
2216 283020 320366 275007 214646 283805 270760 338711 288792 227453 348007 362686 323937
2205 323937 256682 390213 404008 352174 370980 384979 389280 378985 342399 367653 359882 389189
2193 389189 354211 404426 447437 481146 403458 275954 368828 447467 453881 450206 460676 492238
2181 492238 524252 470489 434074 457854 514520 533040 513683 478595 550938 497621 524544 552927
2169 552927 596309 659147 697338 686999 744704 842264 870617 816969 806067 815161 858804 895171
2157 895171 864669 1018025 949852 967543 1080532 1156848 1140086 1083240 1158341 1228288 1215522
2146 1215522 1225915 1381984 1375549 1401601 1498596 1617126 1716692 1782277 2017229 2131587 2215145
2135 2215145 2261654 2415208 2601140 2812046 3027999 3307950 3522446 3786232 3875964 4093246
2125 4093246 4647576 5335694 6197349 7426983 8949938 11043857 13639516 16875891 21085764
2116 21085764 26805317 32051395 34212990 29364747 21718056 16532734 13371698 11222778
2108 11222778 9512436 8234805 7266131 6629391 5917878 5439268 5200210 4886919 4520797
2099 4520797 4223042 3828243 3459837 3120746 2859971 2594580 2434138 2197740 1977907 1925676
2089 1925676 1945410 1937298 1736725 1541940 1534413 1439025 1482286 1388760 1295521 1220564 1167799
2078 1167799 1062645 1031409 1082530 1137880 1168747 1131222 942004 900140 866789 771188 710568
2067 710568 663580 652143 735104 734869 723847 721942 741050 727575 752545 737843 761660 645637
2055 645637 475620 426413 443726 472411 500740 518759 491463 500957 559091 491167 454832 395516
2043 395516 500083 484704 423623 437568 367033 369485 449510 411210 387490 450058 555473
2032 555473 511920 451504 470900 569107 482349 361398 331644 278205 274632 254861 106427
2021 106427 171996 227781 276639 277885 171007 169257 320815 341429 275482 305806 402511 348799
2009 348799 318802 354866 278540 271994 256055 343403 305589 263988 170520 225731 307033 152879
1997 152879 239839 201242 192044 194714 162260 241694 247344 238625 175162 173053 146256 150683 130857
1984 130857 154329 84594 121100 104834 135827 119085 84300 35808 87688 147510 185824 99960
1972 99960 87446 55236 29546 69646 104597 200679 241274 333926 245182 146143 158058 127060
1960 127060 97525 132118 142438 99174 110375 68635 134198 184485 83946 7243 -4971
1949 -4971 43320 184422 213567 201396 244338 46048 -53359 51324 130748 168987 122744
1938 122744 169775 73614 134445 130036 -44669 -91595 18339 55668 218752 204375 161979
1927 161979 91646 106480 123684 130446 120948 59218 107751 179462 64098 8731 156010 146966
1915 146966 52040 18977 39101 53610 27991 31974 149053 93798 137522 106109 15730 105939
1903 105939 158275 43278 138503 190411 155913 147087 197313 144456 167694 164673 160365 180719
1891 180719 67751 102088 69464 3768 11371 32641 65635 -33002 -1329 14711 -16335 -60145
1879 -60145 73532 189779 66419 68494 72560 41895 65131 191291 189322 108201 88462 57140
1867 57140 57444 4692 -27218 -52716 29530 35348 97074 138010 44571 127757 60792 -8708
1855 -8708 -3164 -739 137593 212343 195911 212038 185478 152406 342020 394270 320105 215662
1843 215662 72860 139703 117271 39069 68367 167190 178759 152031 39173 73855 -8651
1832 -8651 -46822 5649 70352 34382 51453 115061 177660 160889 82212 123554 127360 114597
1820 114597 105143 54746 -49759 41441 30086 59058 -12182 -10656 94531 131586 53393 56865
1808 56865 73925 120600 31057 110481 134025 142292 80907 7839 4216 -47357 38111 30501
1796 30501 21632 136291 20350 4444 30552 -1844 -6889 48927 18327 -65456 47365 93169
1784 93169 61844 15731 215509 158543 41287 36174 50725 63089 76871 82893 59732 77931
1772 77931 -72201 -80005 72287 116185 17255 109752 77948 58989 119717 88687 19625 36722
1760 36722 79795 55652 99423 105745 168519 98785 -59860 -32600 -27387 84050 53506 20255
1748 20255 93465 69556 98245 100029 71070 -50279 -27449 -104074 -47332 30063 22775 -49782
1736 -49782 36063 -36948 -49748 32392 86806 72587 95962 83110 82440 38499 19070 5842
1724 5842 95573 109688 -20706 -12093 7254 -644 1927 24230 -26341 -80118 900 18438
1712 18438 -20227 -20965 -34346 14597 -4854 -6934 62067 29647 -48389 18478 75455 60309
1700 60309 84175 97061 22246 -3584 42279 64844 38524 7438 114426 160210 87449 72548
1688 72548 5664 23159 2149 -953 -28599 -20477 5414 45749 32784 8168 97704 21513
1676 21513 54817 142554 118655 85147 80432 84687 24517 -13338 -398 48583 87656 -36828
1664 -36828 -86256 31059 57284 14630 -9324 19002 38671 52968 114235 120571 97735 96424
1652 96424 63622 54094 70601 -51007 -90855 -51624 -101699 -37743 83814 94871 166694 -27105
1640 -27105 22081 88733 7096 -24940 -25259 80920 -23670 109522 193545 108835 59487 11876
1628 11876 -83 11559 50574 93414 62088 -29085 -20207 -2981 9055 65443 -30050 -65109
1616 -65109 -92856 83157 98212 53800 -30103 -69632 19606 100216 41656 1295 -95031 -4429
1604 -4429 31450 8435 46442 8671 68412 43690 13799 9930 21661 -3079 16105 58720
1592 58720 117317 25985 57115 56473 55443 3894 -45110 54765 25378 10263 55631 65307 60218
1579 60218 118715 86716 46388 41609 158899 134835 55145 34937 6056 -72187 -19612 62959
1567 62959 131360 131732 117616 73522 46672 78885 178735 113876 15845 -30637 -18426 56148
1555 56148 -1809 -42788 -3836 28315 74933 83357 2677 44663 203664 228983 -9631 71545
1543 71545 87760 31630 45728 -58349 -65969 45847 25992 6103 -65434 11806 54191 51394
1531 51394 29553 -49744 13187 41168 119191 194875 43841 -32312 2904 -10240 12867 46449
1519 46449 -14166 22889 -56702 -1166 88099 34822 -33683 -141072 -77837 63050 -62413
1508 -62413 -96250 -39188 -47990 4420 -22453 -87585 63226 50696 35389 3732 -26494 -4128
1496 -4128 -47585 25196 -112080 -103395 -32179 -27529 25665 11371 -43814 -93632 18263 84968
1484 84968 45992 29823 -52211 -17876 -16743 63854 114306 100399 39774 -8903 16039 -64121
1472 -64121 3643 25548 63400 120990 98564 28364 -28639 -44774 20498 -13407 9463 4759
1460 4759 -40572 1540 13544 36555 32267 53640 -12395 4283 24052 36281 -25567 -59598
1448 -59598 -18131 -119584 -111088 -151713 -199242 -125691 -83976 -20605 10891 54710 -33793 -49037
1436 -49037 60978 -4129 -69380 37900 97531 -18594 -72838 -59493 13425 26103 -30858
1425 -30858 -287 36769 86949 82404 99178 50938 23522 -31493 16218 14872 9251 10759 75209
1412 75209 29950 -41504 -63852 -63283 -70273 -51771 -28713 -34388 -137604 -10829 38017 11581
1400 11581 -23043 -36117 29433 67934 146114 36117 28688 31619 -60669 -60510 -55409 -7705 40138
1387 40138 -9861 39577 83912 -19882 -13505 -63296 -5766 118268 32495 -11364 8574 -44422
1375 -44422 32754 104581 49635 -38961 -14211 59142 -55432 -19358 -30389 8702 -28799 -36073
1363 -36073 -127706 -69472 -34928 -125920 -135784 -91928 12480 3516 54648 -13649 -42902 67585
1351 67585 5194 -37132 -96683 -10085 32111 30509 -10231 -27948 -91481 -73554 -85630 -50815
1339 -50815 52334 50731 87753 97238 10244 -5803 71776 106092 35371 864 40921 40480
1327 40480 35355 -2141 33030 37161 4943 5390 24323 16945 -39953 1531 103918 37739 -66395
1314 -66395 -47359 57405 74691 -10280 -99556 -123856 -71334 -16569 -35551 -33522 25124 -41611
1302 -41611 -116816 -32118 -39293 -49488 -57783 -24299 -15349 -47643 -93619 -61695 -80464 -77574 33581
1289 33581 39449 38727 38473 24847 40542 -24393 -48103 -82710 12136 32106 -6823 -15674 -72533
1276 -72533 -125200 -4946 57135 -60358 -167707 -91718 51878 8194 9435 -83034 -71862
1265 -71862 -18799 94953 63696 114636 108364 -6356 -36233 119844 85137 -467 -32839
1254 -32839 -110194 -58408 -17511 -137383 -70807 -44237 -91860 6547 -59103 -56092 -35822 -28336
1242 -28336 -103795 -114452 -116281 -14879 -99723 -125585 -66059 -94333 -104601 -61177 -5748 -6410
1230 -6410 -21202 -59588 -88640 -81893 -159231 -171147 -83534 -88154 -68638 7317 -37687 46338
1218 46338 130093 151331 158047 159399 193142 140824 165673 77245 23357 23546 28805 134116 20186
1205 20186 28006 47138 -66811 -111620 -53325 25947 118137 167456 134824 58342 -10368 59423
1193 59423 94233 116810 91308 51588 37851 13970 9859 18929 -12266 -45441 -2935 -54858
1181 -54858 -113304 -12775 2738 -15899 -70562 -24548 -54099 -93874 -54313 -16916 81370 61223
1169 61223 -47948 -21190 117828 118172 57734 75218 63030 13588 41189 26580 -11210 7344
1157 7344 -14362 61789 70733 77038 13031 -8592 -92438 5447 -18471 -4756 -99667 -65752
1145 -65752 -23745 39745 96824 33907 41321 25084 55595 58707 -8501 -49945 -30249 -65400
1133 -65400 -30151 -86591 -63843 -64609 -27135 -60452 11978 1464 -93791 -123127 32115 73242
1121 73242 63200 -41932 -143058 -93765 -83827 -80601 27915 -7199 116165 18905 -116096
1110 -116096 -96661 6199 28416 111176 54154 -31390 -2095 -33550 -97378 -79928 -22729
1099 -22729 -32236 -36618 -77083 -35089 141159 181103 55059 77224 74294 30839 28992 65653
1087 65653 51401 -17902 -2267 3609 -4308 -23821 -108551 -2608 12411 10834 9129 -7203
1075 -7203 -70794 16739 124598 188821 74895 39121 -46670 -116874 -25641 61775 17561 36900
1063 36900 83782 63049 70803 117175 -22733 -57109 -5404 -29557 -30907 -74940 -92952 -55509
1051 -55509 38256 44802 12311 -31214 -75860 -32574 -59775 19779 66488 75512 55881 -30811
1039 -30811 63393 40004 -8499 30847 39649 -80344 -131431 10239 1064 30435 59833 -53275
1027 -53275 -51000 54376 185416 -33079 -58406 36010 10240 39842 -26492 -97255 -33644
1016 -33644 25803 9659 29190 51768 -29376 -26756 64237 -12062 -44844 -7757 -19081 33181
1004 33181 7264 -81569 -37533 -85874 -130520 -51607 11543 3776 91057 63086 -72582 7503
992 7503 140125 184028 64681 71018 59919 6988 16161 40234 54994 1603 -69577 -6319
980 -6319 17782 92206 47165 -27519 -24607 -21073 -82146 -42708 51005 62249 -35946 -40364 -41781
967 -41781 -53903 -60902 -41724 43016 14980 17735 -82757 50429 45077 -38064 35077 49470
955 49470 -36440 26890 67362 82101 55862 71374 3338 -31799 7206 -84144 -32981 -9133
943 -9133 -137662 -119745 12747 46567 61799 85675 5438 -25308 -24686 -21554 -20326 -19422 -46570
930 -46570 -24325 84499 80770 28992 65496 64455 2030 83500 168266 66141 22386 33412
918 33412 -58446 -119765 -114927 -48964 -62857 -34343 -88386 -36136 -39278 -54495 -11054 83732
906 83732 -9678 -35436 -42407 -69002 -73800 -133303 -22555 -32983 -36456 -20153 37969 -12401
894 -12401 -64721 -69854 -43801 29177 -9825 72515 37527 13588 -46456 -50050 -22272 26095
882 26095 34628 17216 -32887 -34938 -64074 -83629 -21966 -17811 -58246 -115774 -10859 -60155
870 -60155 -76462 -35798 -81757 -113599 -29965 -46872 5896 -5112 46315 98235 25331 -5915
858 -5915 14106 -18488 -76195 -97704 -33741 -89995 -89288 -82535 -81621 390 49199 65256 34678
845 34678 37533 111083 117258 105417 -55285 -74959 -2776 -58212 -72519 44777 40126 64401
833 64401 92026 53746 4603 48991 79610 136852 101273 -44057 -69147 -68469 -28307 2410
821 2410 24469 -92777 -162612 -124055 -156927 -152343 -61717 -12019 9426 -37618 23917 -55938
809 -55938 61170 48388 -49594 -27956 -9927 13133 -28937 -31196 1707 -38150 -20495 38615
797 38615 8185 21001 37207 11634 13724 -27960 -37120 33218 60300 -72465 -182614 -60726
785 -60726 10131 -10322 52912 6813 -140495 -117568 -8830 72421 62833 79075 112979 16009
773 16009 -24539 -127961 -103799 -99885 -33120 -11043 -20693 7004 6969 -46730 -76540 15995 86906
760 86906 70115 29399 58945 101644 63905 -64905 -171478 -134521 -12299 91935 94094
749 94094 76995 19815 -47591 -26941 -65324 -30197 -1160 -30871 -110723 -96525 -52872 -62908
737 -62908 -80507 -52261 -64225 -90462 -21109 -67634 53194 17125 -32189 -44451 15930 -43935
725 -43935 5406 5050 -51088 -9474 -14528 73746 103480 64881 -59085 -123550 -31247 64678
713 64678 -99 17079 -23365 35379 96783 81434 -11877 -92241 -118723 -24173 -110041 -127703
701 -127703 -130093 -90218 -50567 -45658 -59854 35282 72150 88226 127709 90481 -10825 70984
689 70984 -64556 -106941 -117069 -168700 -157359 -91299 -50025 24745 -25479 -659 16899 -46812
677 -46812 -58602 -82354 -46171 -77677 20883 -52921 -76452 -48531 25526 30089 -28509 34082
665 34082 -5913 -19502 2169 8086 18501 -15353 4313 -90930 -127354 -120583 -99493 -66264
653 -66264 -88704 -20771 22085 -103434 -89869 -53685 -22298 -96521 -155203 -187389 -218470 -140775
641 -140775 -151080 -152488 -37740 -43518 -99784 -123028 -106610 -119276 -101315 -124277 -68372 5304
629 5304 120557 106766 -11471 -34691 -12034 -17143 -13780 65496 56862 6089 165984 71974
617 71974 -47138 -86956 -116244 -152571 -64497 -74593 46542 10528 -79683 83001 54761
606 54761 -10041 -36273 -40888 -72065 -7966 -72879 13606 21860 15200 -58004 -11151 79603 -50793
593 -50793 -8555 -32963 -123656 -30597 -36757 -82953 -63596 48981 53610 -96501 -161842 -117909
581 -117909 -30433 -101974 -59921 75344 2512 -22239 11658 -16993 9791 35271 -42032 -9086
569 -9086 8602 -124630 -26433 -8349 -54836 -121642 -128352 -23097 -30375 25450 55820 133124
557 133124 66158 61486 -7582 -93185 -9198 130230 40925 -3620 31218 -19057 -37699 10055
545 10055 -18385 -19696 -32797 -61573 -96559 -32432 -12782 -35780 45134 -115517 -86625 -60334
533 -60334 -139513 -176236 -71796 -20669 33342 56006 -59543 -151321 -124155 -144603 -96753 -74229
521 -74229 -57727 -64805 -56216 11890 81812 -23581 8265 76695 9714 -33642 25589 100121
509 100121 96302 95953 37594 18343 -68780 -93274 -36198 36871 -74389 -94030 -7628 -44849
497 -44849 -54974 -42831 -109582 -39814 -66875 21060 26179 -6069 42307 -14644 -39882 41870
485 41870 -16596 -50969 -41338 -58362 40220 57783 -34688 39515 -8856 -60448 -12343 91217
473 91217 32838 24346 31414 -19598 17652 -63462 -30284 -26822 -41275 -44330 -24089 18172 1988
460 1988 -32216 -11529 55136 50669 -95724 -78993 24432 65825 -70999 -16225 73543 60481
448 60481 37382 77525 32916 -14255 15179 130687 99683 75455 36506 -19524 -18973 -47761
436 -47761 -17227 -32349 -48577 24282 -17393 -32584 -59757 -64576 49493 43112 43116 9697 -14884
423 -14884 -73934 -95861 -114176 -55258 -12844 -20735 19581 63658 37755 -3046 31940 -22340
411 -22340 -28114 -36637 21322 63784 26902 21491 25745 69368 37410 -75418 -134058 2886
399 2886 -42412 -83730 -15663 33755 -10050 -23007 -42490 34492 89757 92785 97143 74481 5792
386 5792 22422 85355 102472 78963 -63749 -37713 13744 -64242 -56263 103380 79130 59085
374 59085 -5163 -36667 -206 86189 50881 -87555 -115581 -132541 -46932 3116 -668 -26698
362 -26698 -21481 -76371 -115015 -55264 -5943 26194 -2077 -48967 -41690 -18246 -57252 -90203
350 -90203 38982 81470 47797 17537 -12375 107584 95178 -80522 -58021 -10686 -4888 55314
338 55314 -26285 2235 114118 39403 -48718 -1366 59191 27178 55268 -38049 -14554 58941
326 58941 30324 45732 -52885 -73969 -18406 63146 71237 57673 96470 50761 796 71855
314 71855 3 -69584 -32145 108271 134652 102362 -1878 -25095 -6935 24504 50193 -9284
302 -9284 4115 -35362 -38819 75 16288 30185 74453 58018 -19534 50229 93042 -17534
290 -17534 -16824 28676 -2251 -48512 -94439 -50384 -23180 -39657 -64929 -20240 -11780 71330 105566
277 105566 37525 7198 -49007 60065 27762 -64335 -46973 29573 96111 57845 -19074 11462
265 11462 9307 1634 4242 72004 143510 159082 40025 -12533 11507 42416 -26071 -54562
253 -54562 113977 46142 35488 186968 173694 68003 -89684 -61818 -873 50654 30836
242 30836 -54296 -39094 -88087 -51420 35577 51121 13556 -26724 -33445 -60972 8807 -4990
230 -4990 -30528 37667 60316 24807 47396 21480 89727 68089 -60459 14870 -55267 -136187
218 -136187 24202 125393 15025 13353 7127 3497 6577 -4177 -57043 -28185 -92630 -21789
206 -21789 3317 15750 166835 117539 72888 61366 -43730 -6812 102611 48937 54507 51845
194 51845 -39987 -159889 -93167 10578 29720 -38391 80686 71449 26414 28230 -1319 -21658
182 -21658 16976 25929 -25411 -16100 -32278 39811 -7862 56611 69374 80616 14151 -39262
170 -39262 57002 31740 -35753 -19440 -48822 -53103 -54708 -29969 18225 8179 -13180 -40028
158 -40028 -28429 -41430 -40515 18201 41036 11329 87710 70623 74051 60518 8280 14275 57451
145 57451 -68293 -92837 15390 27848 26267 23075 31070 15090 11288 -72419 -67108 -34096 -37886
132 -37886 33004 101958 42960 36638 3744 29136 26441 10707 55743 37390 56967 45842
120 45842 15702 58700 74469 65852 107181 -21923 -17197 -6170 28604 55083 55104 61310 76416
107 76416 -19973 -36629 -36011 13255 107113 51361 70810 63561 73161 52575 66706 -11706 -3153
94 -3153 42198 94968 48664 31988 -14968 41709 26371 -16047 -52272 -72237 19149 13895 -57784
81 -57784 -9426 58059 84844 57149 113499 -51821 -10015 -24941 -21355 30924 -69191 -99395
69 -99395 -95897 21723 746 24137 44134 -3683 -35648 11320 15767 28201 7718 46694
57 46694 -12716 28118 37356 70360 37387 33314 61745 73838 24356 3602 25649 34011 38674
44 38674 59606 76523 69273 109005 105937 -5621 -25718 -22235 -18286 12291 -12695 -17708 6942
31 6942 -8936 14578 48428 69433 25950 -12351 15514 -64363 21759 -12536 -16081 4336 6821
18 6821 -8434 -8092 26439 -12914 45199 65534 57977 43474 -13818 -58074 -44260 -7938 22348
5 22348 3169 23151 69171 136588 70941
0 70941
$$ Imaginary data points
##PAGE= N=2
##DATA TABLE= (X++(I..I)), XYDATA
16383 -2096917 -2062377 -1998201 -1979849 -1969834 -1943979 -1939525 -1938968 -1919935 -1870316 -1807458 -1766775 -1701777
16371 -1701777 -1571257 -1575587 -1608016 -1523105 -1525162 -1449875 -1435349 -1389497 -1326773 -1316264 -1289113
16360 -1289113 -1261614 -1227757 -1188344 -1148880 -1029740 -932688 -876981 -828038 -879601 -834097 -840954
16349 -840954 -836552 -722908 -678240 -682367 -703069 -654423 -573305 -491625 -521819 -448290 -450922 -459848
16337 -459848 -407786 -390582 -380246 -287823 -311472 -262336 -184190 -183183 -139989 -117644 -49592 -65786
16325 -65786 15061 54804 64441 102762 126524 165696 196031 276476 300499 301611 281569 340921
16313 340921 435253 472366 505555 566307 618342 687195 684691 672634 675679 787127 775060 698651
16301 698651 752429 797859 848914 938225 932337 944210 935299 980921 1049766 1030505 1071173 1016803
16289 1016803 1150319 1189418 1198381 1341095 1356449 1377462 1355992 1370076 1433797 1452372 1413642
16278 1413642 1456013 1555028 1525138 1553727 1535101 1505510 1577385 1576855 1660209 1736245 1674862 1732946
16266 1732946 1796363 1758168 1727591 1762216 1847177 1894012 1885246 1971301 2001858 1976497 2026605
16255 2026605 2015080 2095874 2077435 2124325 2270780 2199727 2155201 2206664 2295899 2258174 2178063
16244 2178063 2249747 2254495 2320325 2438221 2410924 2394422 2378384 2404665 2435864 2431126 2428604 2516492
16232 2516492 2467330 2620108 2624718 2641191 2618528 2635694 2666318 2678067 2583756 2686789 2756210
16221 2756210 2716466 2621697 2621116 2674184 2688383 2717695 2719758 2830004 2903024 2953970 2909772 2965601
16209 2965601 2944005 3018334 2935209 2920313 2895268 2922061 3046998 2947594 2954136 3032468 3079311
16198 3079311 3053274 3115028 3153845 3125767 3147047 3144241 3271005 3293378 3259763 3197887 3197964 3198836
16186 3198836 3138830 3214698 3184539 3178540 3272683 3306242 3263389 3265503 3318470 3343989 3305024 3367974
16174 3367974 3403568 3414027 3477540 3378670 3410315 3370153 3346624 3384540 3436289 3509818 3547508
16163 3547508 3494414 3401346 3368079 3495791 3477369 3456659 3492580 3462278 3456181 3465088 3466688 3470785
16151 3470785 3482799 3470708 3528920 3626038 3610754 3612454 3627174 3589039 3551992 3568494 3605889
16140 3605889 3666768 3626692 3546176 3575213 3587673 3586836 3598928 3549446 3624695 3594916 3602606 3686197
16128 3686197 3665305 3683401 3689727 3765145 3799042 3700998 3663333 3684199 3661014 3760806 3733904
16117 3733904 3669932 3726219 3793184 3783140 3725760 3733738 3766752 3752557 3720089 3704056 3690141
16106 3690141 3738809 3817802 3848086 3775089 3746397 3669754 3772684 3853686 3727841 3760615 3888029
16095 3888029 3769497 3696441 3784809 3750924 3704321 3671613 3786423 3798002 3814885 3883211 3866023
16084 3866023 3874251 3892816 3827002 3761026 3741065 3718566 3644284 3728941 3810376 3839173 3762990
16073 3762990 3790449 3831720 3844869 3847339 3800460 3853159 3948507 3933809 3848369 3921807 3972223
16062 3972223 4024596 4016312 3945401 3905402 3974298 3908962 3942455 4044557 3961521 3841623 3880944
16051 3880944 3975585 3979400 3896823 3846971 3885626 3928367 3919987 3881254 3876635 3921521 3878118 3840032
16039 3840032 3904277 3936705 3888037 3942393 3906245 3867277 3926380 3942198 3996626 4003515 3971298
16028 3971298 3886757 3784154 3738557 3821388 3826357 3834364 3895421 3927705 3934963 3861488 3810763 3911798
16016 3911798 3994054 4007875 3915032 4019890 3954874 3875231 3867925 3911955 3859867 3844960 3876694
16005 3876694 3921225 3962350 3862969 3838373 3840536 3865419 3872991 3876850 3963750 4035396 3992401 3930227
15993 3930227 3953060 3951299 3935398 3863199 3850649 3800750 3801866 3873998 3856240 3915451 3920308 3954213
15981 3954213 3965303 3904396 3867500 3939615 3867492 3838727 3839394 3787331 3756987 3862551 3868552 3937167
15969 3937167 3915688 3938409 3960193 3830092 3873849 3897209 4007648 3939309 3888804 3897968 3899341
15958 3899341 3902693 3953686 3885222 3939932 3922096 3896894 4009141 3945274 3958618 3918153 3869154
15947 3869154 3827407 3886407 3928827 3898955 3840763 3877948 3985802 3984832 3966565 3970653 3961299 4037593
15935 4037593 4042735 4049445 3919108 3982057 4044959 3976869 3935952 3891033 3884312 3901537 4001262 4067948
15923 4067948 3966377 3956223 3925878 3896593 3899848 3986821 3890076 3947522 3959404 3927647 4043849
15912 4043849 4081533 4092229 4010532 3954516 3924494 3939002 3976213 4023050 3892710 4088491 4087762
15901 4087762 4079719 4073477 4059081 4011716 4010121 3985977 3984777 3927439 3977143 3986171 4021273 4108890
15889 4108890 4029442 3928198 3918586 3960191 3921677 3952700 3966326 3899484 3870208 3878108 3873722 3971960
15877 3971960 3989818 3994475 4004470 3915910 3920323 3911106 3815171 3915989 3873220 3973555 4014113 3950677
15865 3950677 3843999 3887995 3988742 3945285 4003648 3977091 3987732 4023046 3986235 4001857 3866595
15854 3866595 3826740 3887510 4000843 4042922 4044353 4007578 3933535 3940213 3951674 3923622 3961621
15843 3961621 4034022 3997403 3915579 3981130 3951445 4104693 4164059 4027278 4036289 4027675 4040021
15832 4040021 3926015 4016891 3969998 3970691 3958114 3906287 3906668 3906275 3991442 4038708 3926563 3872999
15820 3872999 3995564 3990037 4123399 4188062 4069306 4074155 3980126 3936765 3916506 3939888 3952937
15809 3952937 4021625 4121835 4182153 4019637 3912656 3946373 3844412 3933733 3989592 4038689
15799 4038689 3935971 3982862 3948877 3896485 4009212 3971792 3910084 3921898 4052097 4128674 4088613
15788 4088613 4107613 3978360 3996979 4042891 4126235 4083849 3964337 3972084 3960745 3908853 3995663
15777 3995663 4093357 3916311 3954267 4051327 4150400 4008232 4061419 4120537 4147610 4048144 4077997
15766 4077997 4048459 4047778 4014519 4085424 4045780 3959765 3992366 3952276 3997196 3962903 4010254 4064471
15754 4064471 4024509 3953823 3979048 3955192 3959277 4062052 4085648 4061212 3999792 4018212 4099753
15743 4099753 4073097 4066917 4032986 4051913 3980403 4013015 4045203 3986079 3964451 3969518 3974133 3879476
15731 3879476 3840819 3908217 3870831 3962846 4013603 4067335 4050986 4028921 4056761 4017681 4001321
15720 4001321 4046154 4092997 4084956 4054059 3920097 4027595 4184090 4179941 4072618 3987089 4027845
15709 4027845 4081902 4030496 4009347 3951418 4001937 4053385 4094971 4111739 4062736 4072004 4179767
15698 4179767 4229954 4199593 4119813 4094809 4074620 4021134 4050156 3974460 3931743 3933494 3984657
15687 3984657 4062798 4058610 4009870 4037461 4037550 4153534 4181070 4159748 4109935 4101297 4058945 4097851
15675 4097851 4203181 4079648 4041678 4033918 4061310 4141087 4041962 4070359 4142188 4045656 4107828
15664 4107828 4139064 4002144 3996385 4030398 4107347 4077422 4027473 4028835 4129257 4189524 4162536
15653 4162536 4094365 4069565 4008088 4087808 4093952 4085282 4055824 4059737 4014549 4012330 4013533 3991463
15641 3991463 4150716 4082105 4023597 4058055 4064736 4075003 4043180 4029561 4015088 3990806 4033561
15630 4033561 3934177 4017655 4070531 4133566 4120180 4072692 4085836 4057741 4136849 4107768 4129077
15619 4129077 4151580 4060557 4174749 4180088 4068762 4081102 4037815 4048591 4072538 4104773 4077396
15608 4077396 4034317 4030738 4054851 4055718 3989431 4000357 4060403 4051861 4061077 4014704 3946458 4041197
15596 4041197 4056951 4112439 4104705 4140914 4132786 3981764 3966370 4046416 4068334 4041379 4025793
15585 4025793 4050952 4149349 4141265 4033485 4120442 4175422 4157043 4108161 4132876 4220261 4156543
15574 4156543 4135762 4030935 4025848 4051958 4067105 4044016 4082276 4084390 4028987 4039884 4063726
15563 4063726 4102485 4158287 4165009 4103058 4096551 4164742 4253460 4216760 4090616 4099251 4214370
15552 4214370 4126807 4118024 4153094 4031755 3977525 4110733 4069272 4073259 4148426 4186818 4153826
15541 4153826 4175140 4177597 4099507 4101760 4187841 4126583 4146676 4223447 4182102 4025606 4018623 4149193
15529 4149193 4220911 4113565 4192067 4217107 4239369 4177535 4162916 4178830 4185150 4113131 4067660
15518 4067660 4124003 4137223 4067264 4042150 4082596 4061283 4172584 4140607 4183276 4220945 4264596
15507 4264596 4101015 4041318 4052702 4230560 4262539 4099587 4152127 4156219 4082462 4042824 4108278
15496 4108278 4117617 4014676 4122882 4133107 4128490 4146445 4168045 4160180 4180659 4125932 4132529 4106913
15484 4106913 4040021 4181704 4136215 4077687 4030867 4046496 4088822 4069537 4160842 4109180 4089920
15473 4089920 4149386 4314783 4316387 4155025 4107834 4112130 4094828 4111211 4153578 4126320 4096105
15462 4096105 4124992 4121645 4184700 4156038 4131107 4140692 4154600 4140258 4165469 4145497 4123466 4182996
15450 4182996 4200183 4078821 4144178 4325968 4265206 4267248 4209067 4191693 4242622 4166129 4059638
15439 4059638 4115826 4120379 4130974 4183081 4146600 4095936 4146312 4173176 4217558 4283379 4236768
15428 4236768 4157790 4139662 4151224 4180918 4252115 4209404 4247873 4240277 4222200 4210172 4135868
15417 4135868 4186711 4187699 4020278 4008282 4125005 4126163 4131411 4204517 4203189 4092910 4105454 4144172
15405 4144172 4183072 4243112 4183877 4087628 4097357 4106805 4207280 4187011 4200364 4239803 4278702
15394 4278702 4255216 4177972 4160900 4222100 4168615 4156597 4322971 4203957 4122906 4112427 4140449
15383 4140449 4025761 4059514 4196690 4255127 4317929 4217171 4143778 4213289 4361973 4345972
15373 4345972 4220931 4258429 4257302 4186660 4256276 4218237 4112296 4137112 4139729 4170112 4209350
15362 4209350 4175045 4210119 4193871 4179170 4132122 4129979 4216883 4174384 4141416 4119156 4147422
15351 4147422 4185257 4275950 4276604 4175792 4223172 4275777 4272193 4172665 4142546 4135201 4234661 4215102
15339 4215102 4088131 4138851 4216898 4195716 4254285 4156216 4151063 4149020 4129628 4146559 4230866
15328 4230866 4214489 4302220 4380777 4345270 4260277 4276452 4300513 4256135 4335004 4227290 4196998
15317 4196998 4223368 4184753 4216960 4302838 4316340 4204412 4166820 4201110 4164765 4141717 4262838
15306 4262838 4282045 4206883 4170244 4254075 4382691 4288553 4255342 4272798 4255943 4214264 4217557
15295 4217557 4253175 4261818 4249375 4283613 4347457 4351435 4312082 4321415 4236265 4338009 4342440 4335299
15283 4335299 4312791 4284697 4365068 4296423 4211462 4263395 4251621 4250267 4266221 4263181 4352529 4270837
15271 4270837 4305602 4260666 4246077 4245155 4275500 4325821 4212947 4251969 4333093 4370158 4246942
15260 4246942 4220003 4170922 4202971 4330787 4317023 4301493 4312703 4246496 4298810 4283419 4248260
15249 4248260 4277141 4233912 4222495 4223549 4246472 4247765 4190761 4187172 4268530 4188098 4098537 4167833
15237 4167833 4151911 4266994 4243548 4281294 4286171 4312070 4345404 4191340 4178109 4324248 4358271
$$ [...]
##END NTUPLES=NMR SPECTRUM
##END=
