##TITLE=1H_TG-2341-AO
 DMSO-d6, CD3ONa
 8 sc, 
 25.08.2022
##JCAMPDX= 6.0         $$ Bruker NMR JCAMP-DX V2.0
##DATA TYPE= NMR SPECTRUM
##DATA CLASS= NTUPLES
##ORIGIN= UXNMR, Bruker Analytische Messtechnik GmbH
##OWNER= root
$$ XWIN-NMR		Version 3.5
$$ Thu Aug 25 09:30:41 2022 Russian Standard Time (UT+4h)  she@DPX200
##.OBSERVE FREQUENCY= 200.1313499994
##.OBSERVE NUCLEUS= ^1H
##.ACQUISITION MODE= SIMULTANEOUS
##.ACQUISITION SCHEME= undefined
##.AVERAGES= 8
##.DIGITISER RES= 18
##SPECTROMETER/DATA SYSTEM= spect
##.PULSE SEQUENCE= zg30
##.SOLVENT NAME= DMSO
##.SHIFT REFERENCE= (INTERNAL, DMSO, 0, 15.7502)
##AUDIT TRAIL= $$ (NUMBER, WHEN, WHO, WHERE, WHAT)
$$ ##TITLE= Audit trail, XWIN-NMR		Version 3.5
$$ ##JCAMPDX= 5.01
$$ ##ORIGIN= Bruker BioSpin GmbH
$$ ##OWNER= she
$$ F:/spectra/data/she/nmr/H-F/1/pdata/1/auditp.txt
$$ ##AUDIT TRAIL=  $$ (NUMBER, WHEN, WHO, WHERE, WHAT)
(   1,<2022-08-25 09:29:01.57 +0400>,<she>,<DPX200>,
      <created by zg, POWCHK disabled, PULCHK disabled
       configuration hash MD5:
       00 E9 B6 7A A2 85 ED C7 34 08 36 98 17 FE 4E 26
       data hash MD5: 16K
       6A 97 1B 7F AB 19 70 52 6B 91 5F 24 A1 77 D5 1A>)
(   2,<2022-08-25 09:29:04.03 +0400>,<she>,<DPX200>,
      <Start of raw data processing
       efp BC_mod = 2 LB = 0.24 FT_mod = 6 PKNL = 1 PHC0 = -18050.36 PHC1 = 23.60069 SI = 16K 
       data hash MD5: 16K
       3E C5 22 5E 46 A1 52 AB BB 96 E6 17 4A B2 2B 3F>)
(   3,<2022-08-25 09:29:27.51 +0400>,<she>,<DPX200>,
      <pk PHC0 = 13.93218 PHC1 = -15 
       data hash MD5: 16K
       10 5F 63 59 F2 F7 A8 03 DE B5 75 51 76 1B 75 65>)
(   4,<2022-08-25 09:29:33.28 +0400>,<she>,<DPX200>,
      <abs ABSG = 5 
       data hash MD5: 16K
       DC E4 24 73 02 67 BB C2 3A 69 AC D1 16 B3 D1 1D>)
$$ ##END=
$$ 
$$ hash MD5
$$ 99 79 5F EF 1D 6F FD ED 76 F6 0D 14 32 2E 04 BB
##$RELAX= 
##$RELAX= 
##$RELAX= 
##$RELAX= 
##$RELAX= 
##$RELAX= 
$$ Bruker specific parameters
$$ --------------------------
##$DU= <F:/spectra>
##$EXPNO= 1
##$NAME= <H-F>
##$PROCNO= 1
##$TYPE= <nmr>
##$USER= <she>
##$AMP= (0..31)
100 100 100 100 100 100 100 100 100 100 100 100 100 100 100 100 100 100 
100 100 100 100 100 100 100 100 100 100 100 100 100 100 
##$AQSEQ= 0
##$AQ_mod= 1
##$AUNM= <au_zg>
##$AUTOPOS= <>
##$BF1= 200.13
##$BF2= 200.13
##$BF3= 200.13
##$BF4= 200.13
##$BF5= 200.13
##$BF6= 200.13
##$BF7= 200.13
##$BF8= 200.13
##$BYTORDA= 1
##$CFDGTYP= 0
##$CFRGTYP= 5
##$CHEMSTR= <none>
##$CNST= (0..31)
1 1 145 1 1 1 1 1 1 1 1 1 1 1 1 1 1 1 1 1 1 1 1 1 1 1 1 1 1 1 1 1 
##$CPDPRG= <>
##$CPDPRG1= <>
##$CPDPRG2= <>
##$CPDPRG3= <>
##$CPDPRG4= <mlev>
##$CPDPRG5= <mlev>
##$CPDPRG6= <mlev>
##$CPDPRG7= <mlev>
##$CPDPRG8= <mlev>
##$CPDPRGB= <>
##$CPDPRGT= <>
##$D= (0..31)
0 1.2 0 0 0 0 0 0 0 0.06 0 0.03 0 0 0 0 0.0002 0 0 0 0 0 0 0 0 0 0 0 0 
0 0 0 
##$DATE= 1661405341
##$DBL= (0..7)
120 120 120 120 120 120 120 120 
##$DBP= (0..7)
150 150 150 150 150 150 150 150 
##$DBP07= 0
##$DBPNAM0= <>
##$DBPNAM1= <>
##$DBPNAM2= <>
##$DBPNAM3= <>
$$ [...]
##$SUBNAM3= <"">
##$SUBNAM4= <"">
##$SUBNAM5= <"">
##$SUBNAM6= <"">
##$SUBNAM7= <"">
##$SUBNAM8= <"">
##$SUBNAM9= <"">
##$SW= 18.0517283424941
##$SWIBOX= (0..15)
0 0 2 0 0 0 0 0 0 0 0 0 0 0 0 0 
##$SW_h= 3612.71676300578
##$TD= 16384
##$TD0= 1
##$TE= 0
##$TE2= 300
##$TE3= 300
##$TEG= 300
##$TL= (0..7)
0 120 120 120 120 120 120 120 
##$TP= (0..7)
150 150 150 150 150 150 150 150 
##$TP07= 0
##$TPNAME0= <>
##$TPNAME1= <>
##$TPNAME2= <>
##$TPNAME3= <>
##$TPNAME4= <>
##$TPNAME5= <>
##$TPNAME6= <>
##$TPNAME7= <>
##$TPOAL= (0..7)
0.5 0.5 0.5 0.5 0.5 0.5 0.5 0.5 
##$TPOFFS= (0..7)
0 0 0 0 0 0 0 0 
##$TUNHIN= 0
##$TUNHOUT= 0
##$TUNXOUT= 0
##$USERA1= <user>
##$USERA2= <user>
##$USERA3= <user>
##$USERA4= <user>
##$USERA5= <user>
##$V9= 5
##$VALIST= <valist>
##$VCLIST= <CCCCCCCCCCCCCCC>
##$VD= 0
##$VDLIST= <DDDDDDDDDDDDDDD>
##$VPLIST= <PPPPPPPPPPPPPPP>
##$VTLIST= <TTTTTTTTTTTTTTT>
##$WBST= 1024
##$WBSW= 4
##$XGAIN= (0..3)
0 0 0 0 
##$XL= 0
##$YL= 0
##$YMAX_a= 104143
##$YMIN_a= -191799
##$ZGOPTNS= <>
##$ZL1= 120
##$ZL2= 120
##$ZL3= 120
##$ZL4= 120
##$ABSF1= 15.74358
##$ABSF2= -2.30827
##$ABSG= 5
##$ABSL= 3
##$ALPHA= 0
##$AQORDER= 0
##$ASSFAC= 0
##$ASSFACI= 0
##$ASSFACX= 0
##$ASSWID= 0
##$AUNMP= <proc_1d>
##$AZFE= 0.1
##$AZFW= 0.1
##$BCFW= 0
##$BC_mod= 2
##$BYTORDP= 0
##$COROFFS= 0
##$CY= -3
##$DATMOD= 1
##$DC= 0
##$DFILT= <>
##$DTYPP= 0
##$F1P= 0
##$F2P= 0
##$FCOR= 1
##$FTSIZE= 16384
##$FT_mod= 6
##$GAMMA= 0
##$GB= 0
##$INTBC= 1
##$INTSCL= 1.705223e-09
##$ISEN= 128
##$LB= 0.24
##$LEV0= 0
##$LPBIN= 0
##$MAXI= 10000
##$MC2= 0
##$MEAN= 0
##$ME_mod= 0
##$MI= 1.114404
##$NCOEF= 0
##$NC_proc= -8
##$NLEV= 6
##$NOISF1= 3.799351
##$NOISF2= 2.8
##$NSP= 0
##$NTH_PI= 0
##$NZP= 0
##$OFFSET= 15.75019
##$PC= 1
##$PHC0= -18036.43
##$PHC1= 8.600691
##$PH_mod= 1
##$PKNL= yes
##$PPARMOD= 0
##$PSCAL= 0
##$PSIGN= 0
##$REVERSE= no
##$SF= 200.130004270882
##$SI= 16384
##$SIGF1= 3
##$SIGF2= 2
##$SINO= 5.538805
##$SIOLD= 16384
##$SREGLST= <1H.CDCl3>
##$SSB= 0
##$STSI= 16384
##$STSR= 0
##$SW_p= 3612.71676300578
##$SYMM= 0
##$S_DEV= 0
##$TDeff= 16384
##$TDoff= 0
##$TI= <>
##$TILT= no
##$TM1= 0
##$TM2= 0
##$TOPLEV= 0
##$USERP1= <user>
##$USERP2= <user>
##$USERP3= <user>
##$USERP4= <user>
##$USERP5= <user>
##$WDW= 1
##$XDIM= 16384
##$YMAX_p= 409645808
##$YMIN_p= -1123589
$$ End of Bruker specific parameters
$$ ---------------------------------
##NTUPLES= NMR SPECTRUM
##VAR_NAME=  FREQUENCY,     SPECTRUM/REAL,   SPECTRUM/IMAG
##SYMBOL=    X,             R,               I
##VAR_TYPE=  INDEPENDENT,   DEPENDENT,       DEPENDENT
##VAR_FORM=  AFFN,          ASDF,            ASDF
##VAR_DIM=   16384,         16384,           16384
##UNITS=     HZ,            ARBITRARY UNITS, ARBITRARY UNITS
##FACTOR=    0.220516191357247, 1,           1
##FIRST=     3152.08554817655, 0,            0
##LAST=      -460.63121482923, 0,            0
##MIN=       -460.63121482923, -1123589,     0
##MAX=       3152.08554817655, 409645808,    0
$$ Real data points
##PAGE= N=1
##DATA TABLE= (X++(R..R)), XYDATA
$$ [...]
6317C698178J88451k94008q0772R0429J15385L22646O9927q3545L1124n0561L35908
$$ 3698178 3886629 3592621 3511849 3602278 3717663 4040309 4110236 4026691 4057815 4007254 4343162
6306D343162j79779k07081j19672m8079j87267L80436J74029j42745k31309M97418
$$ 4343162 4163383 3956302 3836630 3788551 3601284 3981720 4155749 4013004 3781695 4279113
6296D279113j5478j73841p4494l22622O0405K62728J45256q9864k65761N6615
$$ 4279113 4263635 4089794 4015300 3692678 3753083 4015811 4161067 4071203 3805442 3862057
6286C862057n17974R3222K73902j19892K95809M59865l35274m39051R3988J15249
$$ 3862057 3344083 3437305 3711207 3591315 3887124 4346989 4011715 3572664 3666652 3781901
6276C781901Q4220q3258q6029O0782m5958L29841j28703p7828j59973N21898M8790
$$ 3781901 3866121 3782863 3696834 3757616 3711658 4041499 3912796 3834968 3674995 4196893 4245683
6265D245683j1965m4685j54241J161l27119J71766j70982n8894L31232Q9750P678
$$ 4245683 4233718 4189033 4034792 4035953 3708834 3880600 3709618 3650724 3981956 4071706 4079384
6254D079384N5531R1843q2686K70418j5563j25391m1945j99576j06525j07259
$$ 4079384 4134915 4226758 4144072 4414490 4398927 4273536 4231591 4032015 3925490 3818231
6244C818231M97160L03285l62841O6692N2299k96909J86432J28864k11486n0753
$$ 3818231 4315391 4618676 4255835 4322527 4374826 4077917 4264349 4393213 4181727 4130974
6234D130974k18558K11693O8414J89991k23656j61086K33369O2991J95470j07040
$$ 4130974 3912416 4124109 4192523 4382514 4158858 3997772 4231141 4294132 4489602 4382562
6224D382562K80136j00936q7355j41279J32213J48776m5938O530k17488l56619
$$ 4382562 4662698 4561762 4474407 4333128 4465341 4614117 4568179 4574709 4357221 4000602
6214D000602M69019M5975j1809j31688j11027r7072K41232M24411j72485k18365
$$ 4000602 4469621 4515596 4503787 4372099 4261072 4164000 4405232 4829643 4657158 4438793
6204D438793K39715J97064l38022l83378M61790k14557P484L00369l00884m67102
$$ 4438793 4678508 4875572 4537550 4154172 4615962 4401405 4408889 4709258 4408374 3941272
6194C941272J24082N28019k2353j26422N72257j53967J06011k01586P0377M2040
$$ 3941272 4065354 4593373 4571020 4444598 5016855 4862888 4968899 4767313 4837690 4879730
6184D879730j55221o9279j49305l21990J13274J45919J03099m9349R3896O46774
$$ 4879730 4724509 4655230 4505925 4183935 4297209 4443128 4546227 4496878 4590774 5237548
6174E237548p9678L5124k87405j34369m84661J73529K87593R5697J73323k98449
$$ 5237548 5157870 5192994 4905589 4771220 4286559 4460088 4747681 4843378 5016701 4718252
6164D718252J49823o2680k55925K30203j75717K04593j29861k0341j63879Q1595
$$ 4718252 4868075 4805395 4549470 4779673 4603956 4808549 4678688 4658347 4494468 4576063
6154D576063K14238L1534m3689J68819q6894J03670L11370k17811J39455L63281
$$ 4576063 4790301 4821835 4778146 4946965 4860071 4963741 5275111 5057300 5196755 5560036
6144E560036q500l40055j97086J28877k12196K90207m61071L81690j08065j99180
$$ 5560036 5551536 5211481 5014395 5143272 4931076 5221283 4760212 5141902 5033837 4834657
6134D834657J11530j49880p5774k06737J92592J14644j41832J93564j11264N3287
$$ 4834657 4946187 4796307 4720533 4513796 4706388 4821032 4679200 4872764 4761500 4814787
6124D814787N69116k47426k65196j04145N87004k93351j88510L49682J09070k94560
$$ 4814787 5383903 5136477 4871281 4767136 5354140 5060789 4872279 5221961 5331031 5036471
6114E036471L0881k9230M75448K0164l12375o4354l82565L36767N81551m18129
$$ 5036471 5067352 5038122 5513570 5533734 5221359 5157005 4774440 5111207 5692758 5274629
6104E274629k07698n6886M6000L2855J57001J76589q5828L25870n7265k14059
$$ 5274629 5066931 5010045 5056045 5088900 5245901 5422490 5336662 5662532 5605267 5391208
6094E391208m77591M4404K47069L82479j13270o92885L4461K6431L29356L32137
$$ 5391208 4913617 4958021 5205090 5587569 5474299 4781414 4815875 4842306 5171662 5503799
6084E503799j03174k32471L928R0137L05403l06757L58984n1132j75612j26212
$$ 5503799 5400625 5168154 5172082 5262219 5567622 5260865 5619849 5568717 5393105 5266893
6074E266893J56496l9870l6667M37415j92136K72876k43474m52158k2114P3271
$$ 5266893 5423389 5383519 5346852 5784267 5592131 5865007 5621533 5169375 5147261 5220532
6064E220532J91714J5318j68149K75878L7468J4563N951K38304J51199l77378
$$ 5220532 5412246 5427564 5259415 5535293 5572761 5587324 5593275 5831579 5982778 5605400
6054E605400l8577J31498j21038k75116J83986L62322j06254j0324N6455L4033
$$ 5605400 5566823 5698321 5577283 5302167 5486153 5848475 5742221 5731897 5788352 5822385
6044E822385l50836J36455K66654m23196k91946K65888J66972L88757k9714j76467
$$ 5822385 5471549 5608004 5874658 5451462 5159516 5425404 5592376 5981133 5951419 5774952
6034E774952J91065j91441O044K5702L05537p7000J85783k38867l55648Q663K37127
$$ 5774952 5966017 5774576 5780620 5806322 6111859 6034859 6220642 5981775 5626127 5634790 5871917
6023E871917K81330k23322J83391R3656l51639k12558J68087L07018N7817n3686
$$ 5871917 6153247 5929925 6113316 6206972 5855333 5642775 5810862 6117880 6175697 6122011
6013F122011L26796n19593m24135L30037K70140r6864k16483J00009Q9511K5921
$$ 6122011 6448807 5929214 5505079 5835116 6105256 6008392 5791909 5891918 5981429 6007350
6003F007350k53966R2906K67247O8040P0804k00J91487l3950m6057J21060R4834
$$ 6007350 5753384 5846290 6113537 6181577 6252381 6252181 6443668 6409718 6363661 6484721 6579555
5992F579555m3444l2657m4681J29413l17970N07323J24331k31514l50596N58975
$$ 6579555 6536111 6503454 6458773 6588186 6270216 6777539 6901870 6670356 6319760 6878735
5982F878735m596j47033J06377p7791J36791J09019j98271j70857k14460M08656
$$ 6878735 6874139 6727106 6833483 6755692 6892483 7001502 6803231 6632374 6417914 6826570
5972F826570J87636q0588K14312p9204K24164j04808J7351j69370K42636J4225
$$ 6826570 7014206 6933618 7147930 7068726 7292890 7188082 7205433 7036063 7278699 7292924
5962G292924j56074J97794O2625L1639j47475k15482O0032L82561L99941l76113
$$ 7292924 7136850 7334644 7397269 7428908 7281433 7065951 7125983 7508544 7908485 7532372
5952G532372j48766K9632P45676m54987j81745J36660J1778L75799j59841N8760
$$ 7532372 7383606 7413238 8158914 7703927 7522182 7658842 7670620 8046419 7886578 7945338
5942G945338K45129Q9043K88629l54964n06115j33527K14396K00868l3875j27797
$$ 7945338 8190467 8279510 8568139 8213175 7707060 7573533 7787929 7988797 7954922 7827125
5932G827125N08021J61819k38138m64966m2062R76064J33391K49957l24879j27258
$$ 7827125 8335146 8496965 8258827 7793861 7751799 8727863 8861254 9111211 8786332 8659074
5922H659074M78611J44796n8778J00702J74891j84576J13375J82661j6439J86587
$$ 8659074 9137685 9282481 9223703 9324405 9499296 9314720 9428095 9610756 9594317 9780904
5912I780904M48053R7536j83239j17131L96708k19231J48959K91750k718j03005
$$ 9780904 10228957 10326493 10143254 10026123 10422831 10203600 10352559 10644309 10641591 10538586
5902A0538586M59399O0039J0550J82153k114N99599L14170L13006L01071L09917
$$ 10538586 10997985 11058024 11068574 11250727 11248613 11848212 12162382 12475388 12776459 13086376
5892A3086376K60377K27312M75505M08555K08136K64009J84277M42796P94596
$$ 13086376 13346753 13574065 14049570 14458125 14666261 14930270 15114547 15557343 16351939
5883A6351939R51845K33427j8201o1765Q2688l72855J5112l37475j77618L68382
$$ 16351939 17303784 17537211 17519010 17457245 17539933 17167078 17182190 16844715 16667097 17035479
5873A7035479j17155m7307J37501L67324L65309P54261P05100K68567J077475
$$ 17035479 16918324 16871017 17008518 17375842 17741151 18495412 19200512 19469079 20546554
5864B0546554P71204R33920N91392J14328j74358j43792m58700j31089P6957N6738
$$ 20546554 21317758 22251678 22843070 22957398 22783040 22639248 22180548 22049459 22126416 22183154
5854B2183154K54196j07584J1659L23316J024645P90594j4970P56098J425726
$$ 22183154 22437350 22329766 22341425 22664741 23689386 24479980 24465010 25221108 26646834
5845B6646834J106447J725923J229365J154129J919348K123863J913808J667990
$$ 26646834 27753281 29479204 30708569 31862698 33782046 35905909 37819717 39487707
5837C9487707J490406P93963l18835k57980j025588p80522j045606n51209l65659
$$ 39487707 40978113 41772076 41453241 41195261 40169673 39389151 38343545 37792336 37426677
5828C7426677O56093J22312M03358J222381J506118J607618J683805K167241K474876
$$ 37426677 38082770 38205082 38608440 39830821 41336939 42944557 44628362 46795603 49270479
5819D9270479L065568K483962K583730K195954J451657K59603j242834k363760
$$ 49270479 52336047 54820009 57403739 59599693 61051350 61310953 60068119 57704359
5811E7704359k758507l257382k839052k435159k624687k358670j489023j250397
$$ 57704359 54945852 51688470 48849418 46414259 43789572 41430902 39941879 38691482
5803C8691482j181399p96782j54804p57941n7980J18413N55809Q51311M45183
$$ 38691482 37510083 36713301 36558497 35800556 35742576 35860989 36416798 37268109 37713292
5794C7713292P50446J125190J333494J832590N88859j72325o6364j613340k182908
$$ 37713292 38463738 39588928 40922422 42755012 43343871 43171546 43105182 41491842 39308934
5785C9308934j976290k374804k002431j271700k075125j420897j148071j125663
$$ 39308934 37332644 34957840 32955409 31683709 29608584 28187687 27039616 25913953
5777B5913953r52166p99602l64694k62444l54996K8682Q0774p3696O3335j66764
$$ 25913953 24961787 24162185 23797491 23535047 23180051 23208733 23289507 23215811 23279146 23112382
5767B3112382J5657r54564n74622n35256m91734n35758m52827l92673k09878K3507
$$ 23112382 23128039 22173475 21598853 21063597 20571863 20036105 19583278 19190605 18980727 19004234
5757A9004234l28071p343Q5544m15635L01175K16870M2613J95803L83955N80267
$$ 19004234 18676163 18668820 18754364 18338729 18639904 18856774 18899387 19095190 19479145 20059412
5747B0059412L53475M30635N93425N95801k88650p79910n80799q21092q77404
$$ 20059412 20412887 20843522 21436947 22032748 21744098 20964188 20383389 19562297 18684893
5738A8684893n43251o74173k86602l93699l85233o10063K6337j66610n90075l5837
$$ 18684893 18141642 17467469 17180867 16787168 16401935 15791872 15818209 15651599 15061524 15025687
5728A5025687k83042n53079K44842J11258k99272k17936J64395l88534L03023
$$ 15025687 14742645 14189566 14434408 14545666 14246394 14028458 14192853 13804319 14107342
5719A4107342L68701k35824j66625m484q1797N1223L95587k38225j89282m1764
$$ 14107342 14476043 14240219 14073594 14069110 13987313 14038536 14434123 14195898 14006616 13964852
5709A3964852m66766K89857K07108n49240L54426O0822K21782l26220J30108K55740
$$ 13964852 13498086 13787943 13995051 13445811 13800237 13861059 14082841 13756621 13886729 14142469
5699A4142469M8626j7855j63683m3322M08336l9579J06720K6544J61542m87192
$$ 14142469 14191095 14173240 14009557 13966235 14374571 14334992 14441712 14468256 14629798 14142606
5689A4142606Q8019L97512K27544L06127k71139K38931R0987M71802m0508L61009
$$ 14142606 14230625 14628137 14855681 15161808 14890669 15129600 15220587 15692389 15651881 16012890
5679A6012890L45454k92066K8486M50778N07286P08312L17031N69836J1185L24740
$$ 16012890 16358344 16066278 16094764 16545542 17052828 17761140 18078171 18648007 18659192 18983932
5669A8983932k32185M33280L09536K32084L61135R0737L51213J14632J15758j28672
$$ 18983932 18751747 19185027 19494563 19726647 20087782 20178519 20529732 20644364 20760122 20631450
5659B0631450K55163K34388j71944M68992M63523P07230O21532L56158O19385
$$ 20631450 20886613 21121001 20949057 21418049 21881572 22588802 23210334 23566492 24185877
5650B4185877N98964R16516Q53971N76110M75618L11458M69438R6798J16898N65985
$$ 24185877 24784841 25701357 26555328 27131438 27607056 27918514 28387952 28484750 28601648 29167633
5640B9167633K32867Q4022K52187l63250j51387J9649l71836k8470j42980Q0325
$$ 29167633 29400500 29484522 29736709 29373459 29222072 29241721 28869885 28841415 28698435 28778760
5630B8778760r318K6348M88223M77310M18602L64562Q91237P85122O34656J86950
$$ 28778760 28769442 28795790 29284013 29761323 30179925 30544487 31435724 32220846 32855502 33042452
5620C3042452J66962J62809K66607J06807k62429N2664o5258m04518p57378o98997
$$ 33042452 33209414 33372223 33638830 33745637 33483208 33535872 33470614 33066096 32308718 31609721
5610C1609721o92195r16574q40363k84298l99027j66796q93199j07167O7786j2856
$$ 31609721 30917526 30000952 29160589 28876291 28477264 28310468 27417269 27310102 27377888 27365032
5600B7365032J11184l84750J91441M72132N7925K329l13947l72576R5269r5565
$$ 27365032 27476216 27091466 27282907 27755039 27812964 27815293 27501346 27128770 27224039 27128474
5590B7128474n07062o76041p09940n85837p36022n50813n92886l19552p77440
$$ 27128474 26621412 25945371 25235431 24649594 23913572 23362759 22769873 22450321 21672881
5581B1672881k38014m25642m06581k51311J09647l59545j13625l26549q7774q6291
$$ 21672881 21434867 21009225 20602644 20351333 20460980 20101435 19987810 19661261 19573487 19487196
5571A9487196p38514L12113o2321l95592J62500K276k10631j1422p94644m52811
$$ 19487196 18748682 19060795 18998474 18602882 18765382 18767658 18557027 18545605 17750961 17298150
5561A7298150j85167n66534J79055J20239l1117k92374k45796j33413m57479o7633
$$ 17298150 17112983 16546449 16725504 16845743 16814626 16522252 16276456 16143043 15685564 15617931
5551A5617931j43973N52337j19941k55788j01138J6992M2839j64303j33217j04346
$$ 15617931 15473958 16026295 15906354 15650566 15549428 15566420 15609259 15444956 15311739 15207393
5541A5207393K35689l23107L1503L06015j01552l63305l09436j60861J9714Q4520
$$ 15207393 15443082 15119975 15151478 15457493 15355941 14992636 14683200 14522339 14542053 14626573
5531A4626573q6141L55232L83135l71918k35321r4790L97814J07544j56194K33251
$$ 14626573 14540432 14895664 15278799 14906881 14671560 14576770 14974584 15082128 14925934 15159185
5521A5159185m54273O8021L52256j39448j35292j30314k76795J06332J56108L82611
$$ 15159185 14704912 14772933 15125189 14985741 14850449 14720135 14443340 14549672 14705780 15088391
5511A5088391J79504k23363j41273p5775K58359o6253m35049L40651P0940k90232
$$ 15088391 15267895 15044532 14903259 14827484 15085843 15019590 14584541 14925192 14996132 14705900
5501A4705900J64172L5938J54714N6408m62527k77530K24393J67025J0111l1869
$$ 14705900 14870072 14906010 15060724 15117132 14654605 14377075 14601468 14768493 14778604 14746735
5491A4746735j67696M29944Q7553j87067J17572j56019K13505j49887r2141L42096
$$ 14746735 14579039 15008983 15096536 14909469 15027041 14871022 15084527 14934640 14842499 15184595
5481A5184595k30786J31135o4973k19109K02146R494K56478P4038j07371j97805
$$ 15184595 14953809 15084944 15019971 14800862 15003008 15012502 15268980 15343018 15235647 15037842
5471A5037842P7414J5432m55004l4252j6398J87122Q3567L11356j29874k24357
$$ 15037842 15115256 15130688 14675684 14641432 14625034 14812156 14895723 15207079 15077205 14852848
5461A4852848L62164P3658J7906K63667m10190j20536M26383O1956k20126r4381
$$ 14852848 15215012 15288670 15306576 15570243 15160053 15039517 15465900 15527856 15307730 15213349
5451A5213349r3935M21585K494n20960m8482K10071K31976J7726n6156j07001
$$ 15213349 15119414 15540999 15543493 15022533 14974051 15184122 15416098 15433824 15377668 15270667
5441A5270667K98945K02244k1409L4726j58542J54450l44528L64829j95138L7466
$$ 15270667 15569612 15771856 15750447 15785173 15626631 15781081 15436553 15801382 15606244 15643710
5431A5643710j03054l22207j53449m6891J15281k67250L25021J07352M01240J56079
$$ 15643710 15540656 15218449 15065000 15018109 15133390 14866140 15191161 15298513 15699753 15855832
5421A5855832j69719k55479k73415K78545K26288r8387r1196L4711K89835j88545
$$ 15855832 15686113 15430634 15157219 15435764 15662052 15563665 15472469 15507180 15797015 15608470
5411A5608470k64360J92996n4813j24455r9712J60829R0387k45053K44191k3443
$$ 15608470 15344110 15537106 15482293 15357838 15258126 15418955 15509342 15264289 15508480 15485037
5401A5485037o38570M2738O01273K44967K81139k52346j55144k16500l6649J10298
$$ 15485037 14846467 14889205 15490478 15735445 16016584 15764238 15609094 15392594 15355945 15466243
5391A5466243m510J76130M4038J94526k84945j57941K00157o3430L89554l54751
$$ 15466243 15461733 15637863 15681901 15876427 15591482 15433541 15633698 15570268 15959822 15605071
5381A5605071J56693N819j69857l50195K7232K74347K03482L84920n9375m50973
$$ 15605071 15761764 15767583 15597726 15247531 15274763 15549110 15752592 16137512 16078137 15627164
5371A5627164j49057J83214J79964l82966J39398N9890P6277L16212J17944l08799
$$ 15627164 15478107 15661321 15841285 15458319 15597717 15657607 15733884 16050096 16168040 15859241
5361A5859241p6673j82630p8282L18174O3919j31038j23905k71086J6857J92799
$$ 15859241 15782568 15599938 15521656 15839830 15903749 15772711 15648806 15377720 15394577 15587376
5351A5587376K58787m9506l72687J10188K15670J064k92768j51045N67567M22644
$$ 15587376 15846163 15796657 15423970 15534158 15749828 15750892 15458124 15307079 15874646 16297290
5341A6297290l1406P8868k81521m8630m30008J65909L0095J75520J40403L56166
$$ 16297290 16265884 16344752 16063231 16014601 15584593 15750502 15780597 15956117 16096520 16452686
5331A6452686j87770m97809k60167J17842P843J43687L51364j32157R3948o04441
$$ 16452686 16264916 15767107 15506940 15624782 15632625 15776312 16127676 15995519 16089467 15485026
5321A5485026J95705K28578q5938J67038o4802l83243J55840K29658J99264l11467
$$ 15485026 15680731 15909309 15823371 15990409 15925607 15542364 15698204 15927862 16127126 15815659
5311A5815659J75917K50937k23000k75657j68587K95379l04057k24133o2568N37079
$$ 15815659 15991576 16242513 16019513 15743856 15575269 15870648 15566591 15342458 15279890 15816969
5301A5816969k07859k62323Q900k16845l17844L31126J35455L04080J9816J26266
$$ 15816969 15609110 15346787 15355687 15138842 14820998 15152124 15287579 15591659 15611475 15737741
5291A5737741J87905l74179m1528O1155m26346J33490J21876j19623M6939j64250
$$ 15737741 15925646 15551467 15509939 15571094 15144748 15278238 15400114 15280491 15327430 15163180
5281A5163180K2506j37709l81K53719J85861n8593L92900J09911l60183j43128
$$ 15163180 15185686 15047977 15047596 15301315 15487176 15428583 15821483 15931394 15571211 15428083
5271A5428083M8614J29322J87846j6264m04653q4602q472n3503J73692l23284
$$ 15428083 15476697 15606019 15793865 15777601 15372948 15288346 15279874 15226371 15400063 15076779
5261A5076779k8328J19287O5637n7235K8098k0521J33014j34181j18322L394R864
$$ 15076779 15048451 15167738 15233375 15176140 15204238 15183717 15316731 15182550 15064228 15067622 15077486
5250A5077486k2713j75297r4261l26599M10755Q4209n4715j19228J06927P460
$$ 15077486 15054773 14879476 14785215 14458616 14869371 14953580 14898865 14779637 14886564 14894024
5240A4894024l25939k73899K39919L6006O44707j06289j69145K37151k67342N7722
$$ 14894024 14568085 14294186 14534105 14570111 15214818 15108529 14939384 15176535 14909193 14966915
5230A4966915m28299j8601J98620K72333r0719K9956k49829J73526l733M6637
$$ 14966915 14538616 14520015 14718635 14990968 14900249 14930205 14680376 14853902 14850169 14896806
5220A4896806k26488n5727L5553J88923M22522j06767q2698j96129j92621l91913
$$ 14896806 14670318 14614591 14650144 14839067 15261589 15154822 15072124 14875995 14683374 14291461
5210A4291461O0899l24109R8656K26164J32324k66678N46047k43282m09830p430
$$ 14291461 14352360 14028251 14126907 14353071 14485395 14218717 14764764 14521482 14111652 14104222
5200A4104222J92842j47195K1880j02677P4132M8407o8174m655j15214K71223
$$ 14104222 14297064 14149869 14171749 14069072 14143204 14191611 14123437 14118782 14003568 14274791
5190A4274791J57886j70658k02151k27232l04663J68402J0644r1832n7615J50169
$$ 14274791 14432677 14262019 14059868 13832636 13527973 13696375 13707019 13615187 13557572 13707741
5180A3707741M933l10630O2114K91848k77825m4435K42483K10063j29277n41960
$$ 13707741 13712674 13402044 13464158 13756006 13478181 13433746 13676229 13886292 13757015 13215055
5170A3215055j92070K85149j14259M92198l9778k186k61852j0662L9874k45138
$$ 13215055 13022985 13308134 13193875 13686073 13646295 13644109 13382257 13371595 13411469 13166331
5160A3166331o25032K74772M841K89687L2721K17840k84504l27781J91109M69693
$$ 13166331 12541299 12816071 12820912 13110599 13143320 13361160 13076656 12748875 12939984 13409677
5150A3409677k98627k33240J11045J55683j70561j91505L8721k57178j39627J30231
$$ 13409677 13111050 12877810 12988855 13144538 12973977 12782472 12821193 12564015 12424388 12554619
5140A2554619J90978k86621K69630K99900m22010l91054J55034N7786j1841k95442
$$ 12554619 12745597 12458976 12728606 13028506 12606496 12215442 12370476 12428262 12416421 12120979
5130A2120979J37112K05274R1403j66337J52333n85057L0199M78837j556k87802
$$ 12120979 12258091 12463365 12554768 12388431 12540764 11955707 11985906 12464743 12463187 12175385
5120A2175385M5667Q3497n98152M36836m1738J28035J80125k88280k63188j77102
$$ 12175385 12221052 12304549 11706397 12143233 12101495 12229530 12409655 12121375 11858187 11681085
5110A1681085L37215k7394j98592J5936P928k18338k72705J23902k23595J91412
$$ 11681085 12018300 11990906 11792314 11808250 11816178 11597840 11325135 11449037 11225442 11416854
5100A1416854N1448k43479l7143J04724J2981p4432j37607l14375N04845K46270
$$ 11416854 11468302 11224823 11187680 11292404 11305385 11230953 11093346 10778971 11283816 11530086
5090A1530086r1971m52688K43582k41426j81889M62123J83298n76822j94375o3035
$$ 11530086 11438115 10985427 11229009 10987583 10805694 11267817 11451115 10874293 10679918 10616883
5080A0616883p0297p5549j85359J28862j94681r5739L03847J43341l25274k32280
$$ 10616883 10546586 10471037 10285678 10414540 10219859 10124120 10427967 10571308 10246034 10013754
5070A0013754K17076M143K79914k91818N1600k49667m5449k89124L03855J16303
$$ 10013754 10230830 10234973 10514887 10223069 10274669 10025002 9979553 9690429 9994284 10110587
5060A0110587k2602J159l19936j29924Q7157M2153K5848k05651j36687K39862
$$ 10110587 10087985 10089144 9769208 9639284 9726441 9768594 9794442 9588791 9452104 9691966
5050I691966j38855J86481n2266m1941j82399j92101J30377L29133j44538l68497
$$ 9691966 9553111 9739592 9687326 9645385 9462986 9270885 9401262 9730395 9585857 9217360
5040I217360M29004K11100j48317k98698k01367n8844Q4386j9978L9993M57702
$$ 9217360 9646364 9857464 9709147 9410449 9209082 9150238 9234624 9214646 9254639 9712341
5030I712341r5189p4811j01153j88212J50125k58150p7985o0121l76954M95652
$$ 9712341 9617152 9542341 9441188 9252976 9403101 9144951 9066966 9006845 8629891 9125543
5020I125543K82052K16923o51407j3159Q2719l3597m43380m11467L30021q3704
$$ 9125543 9407595 9624518 8973111 8959952 9042671 9009074 8565694 8154227 8484248 8400544
5010H400544O7237M45936j05951K00700k29285L75762k61656p8145J15741m44592
$$ 8400544 8467781 8913717 8807766 9008466 8779181 9154943 8893287 8815142 8930883 8486291
5000H486291M03265k03938k83828K20095p5568N5696O9070m15814k00465j8398
$$ 8486291 8889556 8685618 8401790 8621885 8546317 8602013 8671083 8255269 8054804 8036406
4990H036406J5137J66904O4646M5949l33561o9294J02236J59985l438p10K38546
$$ 8036406 8051543 8218447 8283093 8329042 7995481 7926187 8028423 8188408 8184970 8184260 8422806
4979H422806m01230R2914R8614J52677l24251j59242r2053j7450M6420k0834J58708
$$ 8422806 8021576 8114490 8213104 8365781 8041530 7882288 7790235 7772785 7819205 7798371 7957079
4968G957079p8189l23978l09423r398L22106n2434L42560L71993l12000l15884
$$ 7957079 7878890 7554912 7245489 7236091 7558197 7505763 7848323 8220316 7908316 7592432
4958G592432R731J21785j8253k12785K03059K16859j35435j61934k12396J75856
$$ 7592432 7602163 7723948 7705695 7492910 7695969 7912828 7777393 7615459 7403063 7578919
4948G578919l17163K8817j76197m26999N14559o4094k045r6081P4289n605P3344
$$ 7578919 7261756 7290573 7114376 6687377 7201936 7137842 7135797 7039716 7114005 7108400 7181744
4937G181744o1669q5360K94547l56831l10270J09150J20585l57999r1581j62978
$$ 7181744 7120075 7034715 7329262 6972431 6662161 6771311 6891896 6533897 6442316 6279338
4927F279338l031R6000L01570K32475j53169m1724J40867j31291r704k48154r1344
$$ 6279338 6276307 6372307 6673877 6906352 6753183 6711459 6852326 6721035 6711331 6463177 6371833
4916F371833M61298J22363l31277L59229l4202n75235L55541q819j53802M5302
$$ 6371833 6833131 6955494 6624217 6983446 6949244 6374009 6729550 6720731 6566929 6612231
4906F612231K12568k48125J58748j00681m09931K09486K88201m57547l12856K89065
$$ 6612231 6824799 6576674 6735422 6634741 6224810 6434296 6722497 6264950 5952094 6241159
4896F241159j49242j36501J59704K88071L4672k35337o6839O8929m0302r4618
$$ 6241159 6091917 5955416 6115120 6403191 6437863 6202526 6135687 6204616 6164314 6069696
4886F069696K91210P4822p7995K8985j15612K43242k86395n5146k06018J13944
$$ 6069696 6360906 6435728 6357733 6386718 6271106 6514348 6227953 6172807 5966789 6080733
4876F080733M23093j51021m3412K8380l3270j26218m04619L50762m8504l77112
$$ 6080733 6503826 6352805 6309393 6337773 6304503 6178285 5773666 6124428 6075924 5698812
4866E698812L3678q8083J40810L6358l61844J45459O474J47128q8830m5367m1482
$$ 5698812 5732490 5644407 5785217 5821575 5459731 5605190 5611664 5758792 5669962 5624595 5583113
4855E583113N2749Q2743k49180R613J42026m3766J30038L93122k01310m37204
$$ 5583113 5635862 5718605 5469425 5479038 5621064 5577298 5707336 6100458 5899148 5461944
4845E461944J63404K08220j89414O1828k11283Q689M5761n4913Q7867j4474J96854
$$ 5461944 5625348 5833568 5644154 5705982 5494699 5503388 5549149 5494236 5582103 5567629 5764483
4834E764483j73518k43212k4054k43760k22400M28970J52315k40953K11785R216
$$ 5764483 5590965 5347753 5323699 5079939 4857539 5286509 5438824 5197871 5409656 5418872
4824E418872K78988j69873o4074j93207K18430M85866k2042n44096L01157J67877
$$ 5418872 5697860 5527987 5463913 5270706 5489136 5975002 5952960 5408864 5710021 5877898
4814E877898k09344m4848k85072j55253j6915j68162K09916N1138J66256n13133
$$ 5877898 5668554 5623706 5338634 5183381 5166466 4998304 5208220 5259358 5425614 4912481
4804D912481p1455L42865J19140r012r9454J3773j64752K85776J03062k07337
$$ 4912481 4841026 5183891 5303031 5294019 5194565 5208338 5043586 5329362 5432424 5225087
4794E225087J56507P5195Q4734l12143P6129M02800l69989k22197J08717L88676
$$ 5225087 5381594 5456789 5541523 5229380 5305509 5708309 5338320 5116123 5224840 5613516
4784E613516m18667j14375M4745J54185j00143m99924n4895l44457o3999L37411
$$ 5613516 5194849 5080474 5125219 5279404 5179261 4679337 4624442 4279985 4215986 4553397
4774D553397r4920L367M39523K11917j42329j74149J638l60636k70071K93202
$$ 4553397 4458477 4461844 4901367 5113284 4970955 4796806 4798444 4437808 4167737 4460939
4764D460939J50376L21013K58443l00404O5203k65491J25173N01566M2511o75153
$$ 4460939 4611315 4932328 5190771 4890367 4955570 4690079 4815252 5316818 5359329 4684176
4754D684176j07757L41581k86934k11038l1323K11794L23586r5324n71466J4854
$$ 4684176 4576419 4918000 4631066 4420028 4388705 4600499 4924085 4828761 4257295 4272149
4744D272149K32707k3457K39599J14223q2673L33234l05812q3909l56259K26L77233
$$ 4272149 4504856 4481399 4720998 4835221 4752548 5085782 4779970 4696061 4339802 4340028 4717261
4733D717261M21522l47108K61872k66724q4484J84384m05262K45611k82557O5858
$$ 4717261 5138783 4791675 5053547 4786823 4702339 4886723 4481461 4727072 4444515 4510373
4723D510373k31735J78023J83015j24496l13653l2333K09553k87182J91956M9890
$$ 4510373 4278638 4456661 4639676 4515180 4201527 4169194 4378747 4091565 4283521 4333411
4713D333411K45648L7402j09929O6947k10756j02152K34931J42849L8713J8146
$$ 4333411 4579059 4616461 4506532 4573479 4362723 4260571 4495502 4638351 4677064 4695210
4703D695210l5399l5572L6527K9230j84716l10075N53663k95306k53863P5296
$$ 4695210 4659811 4624239 4660766 4689996 4505280 4195205 4748868 4453562 4199699 4274995
4693D274995n8147R5632O74215m64112L0445j32784P8421K82151J60972K45615
$$ 4274995 4216848 4312480 4986695 4522583 4553028 4420244 4498665 4780816 4941788 5187403
4683E187403j36789j09215l34495L12897J54967K66317J01353J93741q7780r701
$$ 5187403 5050614 4941399 4606904 4919801 5074768 5341085 5442438 5636179 5548399 5538698
4673E538698m9906k2165l31853j29271L19798K62200o12666J00047K79357L03107
$$ 5538698 5488792 5466627 5134774 5005503 5325301 5587501 4974835 5074882 5354239 5657346
4663E657346J28355j44501j63855p5642J6458N7250K71210k2288j45162k66543
$$ 5657346 5785701 5641200 5477345 5401703 5418161 5475411 5746621 5724333 5579171 5312628
4653E312628O7161K70574j4786M1577Q5104R7906P4232p9266k28324Q2067M41444
$$ 5312628 5379789 5650363 5635577 5677154 5762258 5860164 5934396 5855130 5626806 5708873 6150317
4642F150317N2606J94414j57144J65591J37345j18652q4010P5642P19878L27244
$$ 6150317 6202923 6397337 6240193 6405784 6543129 6424477 6340467 6416109 7135987 7463231
4632G463231j46361o2162L87148K09041M44489j98107q1704M85326L16686N2385
$$ 7463231 7316870 7254708 7641856 7850897 8295386 8097279 8015575 8500901 8817587 8869972
4622H869972M35438L667P52936K21568R06794N03219j0513M19581M47765o7866
$$ 8869972 9305410 9309077 10062013 10283581 11190375 11693594 11683081 12102662 12550427 12482561
4612A2482561L98593k89675k27132J11205j88726L3475k47498k69648Q9341k5066
$$ 12482561 12881154 12591479 12364347 12475552 12286826 12320301 12072803 11803155 11892496 11867430
4602A1867430j24712n8024N23634N17620K49462Q95506j49144N12850N48017J51190
$$ 11867430 11742718 11684694 12208328 12725948 12975410 13870916 13721772 14234622 14782639 14933829
4592A4933829O52330M67437J21723n3750k8017J3400j06675j9058m24766J45653
$$ 14933829 15586159 16053596 16175319 16121569 16093552 16106952 16000277 15981219 15556453 15702106
4582A5702106K61106M01756n7729J4814M40022J40510K69923J091716O79979O80608
$$ 15702106 15963212 16364968 16307239 16322053 16762075 16902585 17172508 18264224 18944203 19624811
4572A9624811L57984Q15823R04454J066139J304951J291923J121432J590984J633086
$$ 19624811 19982795 20798618 21703072 22769211 24074162 25366085 26487517 28078501 29711587
4563B9711587J499602R19395P78252M16368K95764l68386p81566m07633o48078
$$ 29711587 31211189 32130584 32908836 33325204 33620968 33252582 32471016 32063383 31415305
4554C1415305o39734j25101q39813k2212J39598M40853N02644M16140P47055P86223
$$ 31415305 30775571 30650470 29810657 29788445 29928043 30368896 30871540 31287680 32034735 32820958
4544C2820958R46036J425126J718349J359484J641846J348606J628335J247752
$$ 32820958 33766994 35192120 36910469 38269953 39911799 41260405 42888740 44136492
4536D4136492P54512K6906K3807o93833n37383o45126j699758k006373j527916
$$ 44136492 44891004 44917910 44941717 44247884 43710501 43065375 41365617 39359244 37831328
4527C7831328j925154j820611j884796j426072j144249j500219q93759q51645
$$ 37831328 35906174 34085563 32200767 30774695 29630446 28130227 27236468 26384823
4519B6384823n74875k82685m16818n92379p93087l27099K30305O36286J54498
$$ 26384823 25809948 25527263 25110445 24518066 23724979 23397880 23628185 24264471 24418969
4510B4418969j7484K53345P42979P26718N34891O80009J147911O26316M54856
$$ 24418969 24401485 24654830 25397809 26124527 26659418 27339427 28487338 29113654 29568510
4501B9568510K12440l38792n96110o63138q67957j307350j920014j107819q00190
$$ 29568510 29780950 29442158 28846048 28182910 27314953 26007603 24087589 22979770 22179580
4492B2179580j444493p52037m31296q94434n27577p39455k71958m3415l962L72006
$$ 22179580 20735087 19983050 19551754 18657320 18129743 17390288 17118330 17074915 17070953 17442959
4482A7442959r3269l76894j47950J714k9356p5336n45233o09680o83009p34136
$$ 17442959 17349690 16972796 16824846 16826560 16797204 16721868 16176635 15566955 14883946 14149810
4472A4149810p52797o9187l66509L4066j40730l63704j55833m87842K8904K90865
$$ 14149810 13397013 13327826 12961317 12995383 12854653 12490949 12335116 11847274 11876178 12167043
4462A2167043o40895K59280N00131m10j47525k74208O5929L0602L49146N61827
$$ 12167043 11526148 11785428 12285559 12285149 12137624 11863416 11929345 11959947 12309093 12870920
4452A2870920j0552M77775N04216j76484J50413J08872l10947k03652m56773l97380
$$ 12870920 12860368 13338143 13842359 13665875 13816288 13925160 13614213 13410561 12953788 12556408
4442A2556408k5549p26909p17797k90615k10591K30553J52758k277l02952J29923
$$ 12556408 12530859 11803950 11086153 10795538 10584947 10815500 10968258 10965981 10663029 10792952
4432A0792952K97642k06109n8582k39435M94764K5586K9213K58385M8647K94584
$$ 10792952 11090594 10884485 10825903 10586468 11081232 11106818 11136031 11394416 11443063 11737647
4422A1737647r2352j86653k87656K89443M3527J77037M52297K47933L2841M84788
$$ 11737647 11645295 11458642 11170986 11460429 11503956 11680993 12133290 12381223 12414064 12898852
4412A2898852O1289j33077P03214J77491P45247k4628M99648M60708K93551L73464
$$ 12898852 12960141 12827064 13530278 13707769 14453016 14428388 14928036 15388744 15682295 16055759
4402A6055759K73015Q43957L68827L32535M33047P36606R75890O87386R62124
$$ 16055759 16328774 17172731 17541558 17874093 18307140 19043746 20019636 20707022 21669146
4393B1669146R48217J583992J111799J345917J959632K055332K187093K680909
$$ 21669146 22617363 24201355 25313154 26659071 28618703 30674035 32861128 35542037
4385C5542037L159954L878692M398396M122117L952033J947455K249482J875878
$$ 35542037 38701991 42580683 46979079 51101196 55053229 57000684 59250166 61126044
4377F1126044L032736M670564O119296P001033N718621K284593l79680j300290
$$ 61126044 64158780 68829344 74948640 81949673 87668294 89952887 89573207 88272917
4369H8272917k83246K005024M219596O028035N290279K156332l286969o408485
$$ 88272917 87989671 89994695 94214291 100242326 105532605 107688937 104401968 97993483
4361I7993483o562284m293230k006648j10349R63433o88402l219470o265977o741024
$$ 97993483 91431199 87137969 85131321 85020972 85984405 85296003 82076533 75810556 69069532
4352F9069532o322805m295339k933511j608159j515426k811197l728736m683917
$$ 69069532 62746727 58451388 55517877 53909718 52394292 49583095 45854359 41170442
4344D1170442m371178l770877k797939k547778j796401j539490j411628j299766
$$ 41170442 36799264 33028387 30230448 27682670 25886269 24346779 22935151 21635385
4336B1635385j027312n85246q42673j162925q50085o79339q15748p53347p25410
$$ 21635385 20608073 20022827 19180154 18017229 17167144 16487805 15672057 14918710 14193300
4327A4193300r95476l25142p44218j44607j91753n15889n60326l2884k25998n07843
$$ 14193300 13197824 12872682 12128464 11983857 11792104 11276215 10715889 10683005 10457007 9949164
4317I949164L4503m37473m75103L2294j81007m12295j71347K99478N6962m62575
$$ 9949164 9983667 9546194 9071091 9103385 8922378 8510083 8338736 8638214 8695176 8232601
4307H232601n20140J15530J45047j05307q0170K37426r95733J6524M48480n72472
$$ 8232601 7712461 7827991 7973038 7867731 7787561 8024987 7029254 7045778 7494258 6921786
4297F921786M9560Q2723m04880m26475L29134m89327j64669M409J20859j75285
$$ 6921786 6971346 7054069 6649189 6222714 6551848 6062521 5897852 5902261 6023120 5847835
4287E847835j38829l02524J15862J12419K0484l23797n65101O0772J20555N0775
$$ 5847835 5709006 5406482 5522344 5634763 5655247 5331450 4766349 4827121 4947676 4998451
4277D998451K06044M1659l37219m52664n6683L0480J1011L29523k47864n3891
$$ 4998451 5204495 5246154 4908935 4456271 4399588 4430068 4441079 4770602 4522738 4468847
4267D468847J39637J43207J84935n03147o0998k76541j12151r587K53110k21190
$$ 4468847 4608484 4751691 4936626 4433479 4372481 4095940 3983789 3974202 4227312 4006122
4257D006122n2548K54488R4492j28994m45945L04658J57541l982j62715M0818
$$ 4006122 3953574 4208062 4302554 4173560 3727615 4032273 4189814 4185832 4023117 4063935
4247D063935k0097j35847j17249N07776J95635P0774m31804k54268L6307k99401
$$ 4063935 4043838 3907991 3790742 4298518 4494153 4564927 4133123 3878855 3915162 3615761
4237C615761O1970N1209L89401K64876j34276k15632j643J15076l8787L1619J60475
$$ 3615761 3677731 3728940 4118341 4383217 4248941 4033309 4031666 4146742 4107955 4139574 4300049
4226D300049k63732J31074L29495M44162n83490k17459K32546J02693l28320j70836
$$ 4300049 4036317 4167391 4496886 4941048 4357558 4140099 4372645 4475338 4147018 3976182
4216C976182o3783K97486M35322p95257L3209N6008J90636J46121J82601p01062
$$ 3976182 3912399 4209885 4645207 3849950 3883159 3939167 4129803 4275924 4458525 3757463
4206C757463K33342L64046j58655J09908J034l17112q3191K88705k67036k19082
$$ 3757463 3990805 4354851 4196196 4306104 4307138 3990026 3906835 4195540 3928504 3709422
4196C709422L47249m0018j13820L29746L09117p8973N7947N2032l13154K35834
$$ 3709422 4056671 4016653 3902833 4232579 4541696 4462723 4520670 4572702 4259548 4495382
4186D495382l72100K20007N34844J03028k20522J69186k67427l775k9614K53832
$$ 4495382 4123282 4343289 4878133 4981161 4760639 4929825 4662398 4658623 4629009 4882841
4176D882841j08586k9794k37276m8708L99959J08359j19281P9376J97528K02341
$$ 4882841 4774255 4744461 4507185 4458477 4858436 4966795 4847514 4926890 5124418 5326759
4166E326759K18999l22690N05128j23603j04459N5291m94259J26136o4070J02749
$$ 5326759 5545758 5223068 5728196 5604593 5500134 5555425 5061166 5187302 5123232 5225981
4156E225981L13171o3457K76436j82570K03489K29349q1518m37400K02982O86127
$$ 5225981 5539152 5475695 5752131 5569561 5773050 6002399 5920881 5483481 5686463 6372590
4146F372590K18716k17801L94563R9677j37335p4595P5420J79190L7411L92242
$$ 6372590 6591306 6373505 6768068 6867745 6730410 6655815 6731235 6910425 6947836 7340078
4136G340078K77169k02595K54344J61317J84915k08121n0613L96948j59052K50402
$$ 7340078 7617247 7414652 7668996 7830313 8015228 7807107 7756494 8153442 7994390 8244792
4126H244792o0395Q7486M20132K23983J90553N2129Q9708L46386M32317O8999
$$ 8244792 8184397 8271883 8692015 8915998 9106551 9158680 9248388 9594774 10027091 10096090
4116A0096090J17221R6009M3395O01755L59160o3766L90689N28778n66969K35592
$$ 10096090 10213311 10309320 10352715 10954470 11313630 11249864 11640553 12169331 11602362 11837954
4106A1837954N42708J02204N38465K26545P01192L85661Q0300O38053K83313K66833
$$ 11837954 12380662 12482866 13021331 13247876 13949068 14334729 14415029 15053082 15336395 15603228
4096A5603228L88933O45078M23187N21890M34637M31133J64896O22099P58759
$$ 15603228 15992161 16637239 17060426 17582316 18016953 18448086 18612982 19235081 19993840
4087A9993840M34048P04301L43022M07346P55057P35889J033785J044904P42983
$$ 19993840 20427888 21132189 21475211 21882557 22637614 23373503 24407288 25452192 26195175
4078B6195175Q69597P99045Q79366R49800J616166J530625J347099J469300J511482
$$ 26195175 27064772 27863817 28743183 29692983 31309149 32839774 34186873 35656173 37167655
4069C7167655J927816J898119J951659K724781K597883L041199L593878L185228
$$ 37167655 39095471 40993590 42945249 45670030 48267913 51309112 54902990 58088218
4061E8088218L880380N082153N512829O205344P985772R482484J0940553J3635858
$$ 58088218 61968598 67050751 72563580 78768924 86754696 96237180 107177733 120813591
4053A20813591J6771062K0824952K4545741K7208984K3988188J0629424r917733
$$ 120813591 137584653 158409605 182955346 210164330 234152518 244781942 234864209
4046B34864209k5488205l0431720k6440567k1231570j6937862j3057722j0189387
$$ 234864209 209376004 178944284 152503717 131272147 114334285 101276563 91087176
4039I1087176q015892o928045n934178n006091m100114k878430k688074k773818
$$ 91087176 83071284 76143239 70209061 65202970 61102856 58224426 55536352 52762534
4031E2762534j993584k340230j751403j206991j164536j456121r30942p55333
$$ 52762534 50768950 48428720 46677317 45470326 44305790 42849669 41918727 41163394
4023D1163394l53369r58385k21955n23171m91977k1857L05600j61915j34121O74288
$$ 41163394 40810025 39851640 39629685 39106514 38614537 38592680 38898280 38736365 38602244 39276532
4013C9276532k28433L80728Q36862K44374R78531N83520J024773J127039R67521
$$ 39276532 39048099 39428827 40265689 40510063 41488594 42072114 43096887 44223926 45191447
4004D5191447J284400J023730J807895J184094J432662J804374J483181J459461
$$ 45191447 46475847 47499577 49307472 50491566 51924228 53728602 55211783 56671244
3996E6671244K075452J728424J807626K334024J421520J922850K212881K324976
$$ 56671244 58746696 60475120 62282746 64616770 66038290 67961140 70174021 72498997
3988G2498997K488395K611766L159607K965439K533212R80934n38679K43151O34642
$$ 72498997 74987392 77599158 80758765 83724204 86257416 87238350 86699671 86942822 87577464
3979H7577464Q53688Q58577O97993N62737J173015O76846N37249K37684j43448
$$ 87577464 88431152 89289729 89987722 90550459 91723474 92400320 92937569 93175253 93031805
3970I3031805J23189k83226k89150l72589r1041n51826o14336m79030l53935p36267
$$ 93031805 93154994 92871768 92582618 92210029 92118988 91567162 90952826 90473796 90119861 89383594
3960H9383594p29758p87623q04190r14645r14117p52852j229238j044805r12115
$$ 89383594 88653836 87866213 87062023 86147378 85233261 84480409 83251171 82206366 81294251
3951H1294251r09266q49715q11961n88960k27474j01027j92167m45022k79598
$$ 81294251 80384985 79535270 78723309 78134349 77906875 77805848 77613681 77168659 76889061
3942G6889061j95887M57285L36903K18158Q92073L36318O78658K12106O50188
$$ 76889061 76693174 77150459 77487362 77705520 78597593 78933911 79612569 79824675 80474863
3933H0474863R91116J145807J014709J043630J060088J233588R59954P77214J043747
$$ 80474863 81465979 82611786 83626495 84670125 85730213 86963801 87923755 88700969 89744716
3924H9744716Q89549M61562M35286J089458P72847Q33944L93018L56427K3487
$$ 89744716 90634265 91095827 91531113 92620571 93393418 94227362 94620380 94976807 95000294
3915I5000294Q3813K04707j81759m39854j266954p38332n58134j343106j529171
$$ 95000294 95084107 95288814 95107055 94667201 93400247 92661915 92103781 90760675 89231504
3906H9231504j068210j207810r90576j947700j775204k155179j744766j336698
$$ 89231504 88163294 86955484 85964908 84017208 82242004 80086825 78342059 77005361
3898G7005361k081134k315831k536108k288823k608360k084274j983831k030837
$$ 77005361 74924227 72608396 70072288 67783465 65175105 63090831 61107000 59076163
3890E9076163k558421j853564k269891k076273j285161j782634k239866j882083
$$ 59076163 56517742 54664178 52394287 50318014 49032853 47250219 45010353 43128270
3882D3128270j316161j656976k039122j617797j436362j476456r37536j082447
$$ 43128270 41812109 40155133 38116011 36498214 35061852 33585396 32647860 31565413
3874C1565413r53010j642472r67505p00823r29638r37880m38627j089390j123857
$$ 31565413 30612403 28969931 28002426 27301603 26371965 25434085 24995458 23906068 22782211
3865B2782211m63846q25941m72539o21239k55217m91773q31972l45971m48479
$$ 22782211 22318365 21492424 21019885 20398646 20143429 19651656 18819684 18473713 18025234
3856A8025234r7463m69110m54439m60041l25821K53776j05567j97739k90499n54235
$$ 18025234 17927771 17458661 17004222 16544181 16218360 16472136 16366569 16168830 15878331 15324096
3846A5324096j34606k32609M7203J93958j83511k11376j5894L06961p5011j95168
$$ 15324096 15189490 14956881 15004084 15198042 15014531 14803155 14787261 15094222 15019211 14824043
3836A4824043q8851K00772P834M09j30332j56739j60380L69989L5053l82337m6846
$$ 14824043 14735192 14935964 14943798 14944207 14813875 14657136 14496756 14866745 14901798 14519461 14472615
3825A4472615K91047j42662J95063K63403k53952k10749k43653K8296N6126N0788
$$ 14472615 14763662 14621000 14816063 15079466 14825514 14614765 14371112 14399408 14455534 14506322
3815A4506322k11602k57044P0859J50099M08523R5925l55336J7162k7319m07824
$$ 14506322 14294720 14037676 14108535 14258634 14667157 14763082 14407746 14424908 14397589 13989765
3805A3989765J31672J51859K57610m1561K07103l46221J87140K02492P589J88201
$$ 13989765 14121437 14273296 14530906 14489345 14696448 14350227 14537367 14739859 14747448 14935649
3795A4935649J17219k98374M05846o4797K75219N05024j81154J59174O8267J80084
$$ 14935649 15052868 14754494 15160340 15095543 15370762 15875786 15694632 15853806 15922073 16102157
3785A6102157K73309P00572J04695J07566K41473K12926L73890J67185M09562
$$ 16102157 16375466 17076038 17180733 17288299 17529772 17742698 18116588 18283773 18693335
3776A8693335L88242L06843J57616O68945M57159j64193M59858q6068M35617J099826
$$ 18693335 19081577 19388420 19546036 20214981 20672140 20507947 20967805 20881737 21317354 22417180
3766B2417180N31995L86647L01769L58313L95252K42027P90936P09953L69219
$$ 22417180 22949175 23335822 23637591 23995904 24391156 24633183 25424119 26134072 26503291
3757B6503291P66914N50324M66744N28475K34726R36341N63044N01214J211139
$$ 26503291 27270205 27820529 28287273 28815748 29050474 29986815 30549859 31051073 32262212
3748C2262212L78623L68941N23307Q11299J129709O39604J167065R51185J202255
$$ 32262212 32640835 33009776 33533083 34344382 35474091 36113695 37280760 38231945 39434200
3739C9434200J354435J468777J443536J215216J586602J467898J834855J851820
$$ 39434200 40788635 42257412 43700948 44916164 46502766 47970664 49805519 51657339
3731E1657339K671167K410360K274103L014880K644970L345517L869564M404627
$$ 51657339 54328506 56738866 59012969 62027849 64672819 68018336 71887900 76292527
3723G6292527M473104N587450N699684O649337P038204Q131386R251712J0157702
$$ 76292527 80765631 86353081 92052765 98702102 105740306 113871692 123123404 133281106
3715A33281106J0738522J2227186J2038779J1439657J0509189R114748O380439
$$ 133281106 144019628 156246814 168285593 179725250 190234439 199349187 205729626
3708B05729626M145651K386156L25114p09581j193507r99198j207864p87758o81205
$$ 205729626 209875277 212261433 212586547 211876966 210683459 209684261 208476397 207688639 207007434
3699B07007434m03462j233459j672294k977672m092431o366220q178588r599235
$$ 207007434 206603972 205370513 203698219 200720547 196628116 190261896 182083308 172484073
3691A72484073j0617643j1022184j1025288j0647816r570414q539906p620027
$$ 172484073 161866430 150844246 139818958 129171142 119600728 111060822 103440795
3684A03440795p123017n786568n444134m856224m517569l773950l036610l397109
$$ 103440795 96317778 90531210 85087076 80230852 75713283 71939333 68902723 65505614
3676F5505614k383614j941082j950960j652426j910783j770127j257494j375423
$$ 65505614 63122000 61180918 59229958 57577532 55666749 53896622 52639128 51263705
3668E1263705r55011j127643r31157r39433o51267n21392l24531l33964l30746
$$ 51263705 50308694 49181051 48249894 47310461 46659194 46137802 45813271 45479307 45148561
3659D5148561l24539J33355l70230j04922J07861Q9654j84944J07163r8717L0822
$$ 45148561 44824022 44957377 44587147 44482225 44590086 44679740 44494796 44601959 44503242 44534064
3649D4534064N82084M17885K60050O16151O67603O79678Q70190P82367J101984
$$ 44534064 45116148 45534033 45794083 46410234 47077837 47757515 48627705 49410072 50512056
3640E0512056K81619R50906O13882P38382J089804P15135J067827O51828L77805
$$ 50512056 50793675 51744581 52358463 53096845 54186649 54901784 55969611 56621439 56999244
3631E6999244P59503M69225J014204J433681O30974N82104N67141J95398P83587
$$ 56999244 57758747 58227972 59242176 60675857 61306831 61888935 62456076 62651474 63435061
3622F3435061P71146N56076L11648m3590M2211M37793J3630P87722O93625N64390
$$ 63435061 64206207 64762283 65073931 65030341 65072552 65510345 65523975 66311697 67005322 67569712
3612F7569712M89453K18179O95408J161716R30640Q68195J042989N77451R53864
$$ 67569712 68059165 68277344 68972752 70134468 71065108 71933303 72976292 73553743 74507607
3603G4507607J178447J161039J616009J300624J726581J686006J743983K095852
$$ 74507607 75686054 76847093 78463102 79763726 81490307 83176313 84920296 87016148
3595H7016148K256411J897650K442025K863437K709972K679615K720394L591441
$$ 87016148 89272559 91170209 93612234 96475671 99185643 101865258 104585652 108177093
3587A08177093L369146L171115L392497L332193L527705L633619L413041L598144
$$ 108177093 111546239 114717354 118109851 121442044 124969749 128603368 132016409 135614553
3579A35614553L573665L447261L520011L457590L596396L146893L504970L800234
$$ 135614553 139188218 142635479 146155490 149613080 153209476 156356369 159861339 163661573
3571A63661573L713782L958000L844500L406497L557834L586832L156700L296692
$$ 163661573 167375355 171333355 175177855 178584352 182142186 185729018 188885718 192182410
3563A92182410L725629L982279M014783M138264N012142N841885O126497P667667
$$ 192182410 195908039 199890318 203905101 208043365 213055507 218897392 225023889 232691556
3555B32691556Q349739R762554R979828J0791707J2075047J2114603J2830236
$$ 232691556 241041295 250803849 260783677 271575384 283650431 295765034 308595270
3548C08595270J3648017J3516753J3056534J1921086J0246639Q243429P201710
$$ 308595270 322243287 335760040 348816574 360737660 370984299 379227728 386429438
3541C86429438N256042M220278L329771L394399K295856J958227J670022M86868
$$ 386429438 391685480 395905758 399235529 402629928 404925784 406884011 408554033 409040901
3533D09040901O04907j393179k760776m466976n736309p556714r140614j0477253
$$ 409040901 409645808 408252629 405491853 401024877 395288568 387731854 378591240 368113987
3525C68113987j1115321j1705411j2015720j1979735j1883617j1327485j0833330
$$ 368113987 356998666 345293255 333277535 321297800 309414183 298086698 287253368
3518B87253368r802588r736158q925373q344556p972658p455365p507898o626709
$$ 287253368 277450780 267714622 258789249 250444693 242472035 235016670 227508772 220882063
3510B20882063o416353n982893o045435n529562m971287n419175m908383m878062
$$ 220882063 214465710 208482817 202437382 196907820 191936533 186517358 181608975 176730913
3502A76730913m577455m341252m335796m383765m830817l887109l647853l692535
$$ 176730913 172153458 167812206 163476410 159092645 154261828 150374719 146726866 143034331
3494A43034331l369410l466084l558200k819921l241821l643891l494501l532920
$$ 143034331 139664921 136198837 132640637 129820716 126578895 122935004 119440503 115907583
3486A15907583l404165l385407k983960k716939k749396k892844k566743k267486
$$ 115907583 112503418 109118011 106134051 103417112 100667716 97774872 95208129 92940643
3478I2940643j965330k170476j889049j788318k018931k265992j735880j489389
$$ 92940643 90975313 88804837 86915788 85127470 83108539 80842547 79106667 77617278
3470G7617278j676497j587066j169569j655562j434231j230670j385271j308308
$$ 77617278 75940781 74353715 73184146 71528584 70094353 68863683 67478412 66170104
3462F6170104j073609j426844r92960j229332j027819j455706j274228q18025
$$ 66170104 65096495 63669651 62676691 61447359 60419540 58963834 57689606 56871581
3454E6871581j225887j230752j180461m60704j334574r84944q94439j204624j391633
$$ 56871581 55645694 54414942 53234481 52773777 51439203 50454259 49559820 48355196 46963563
3445D6963563j890904j258262r59597j024817j255611j131054q36122q61126q93156
$$ 46963563 45072659 43814397 42854800 41829983 40574372 39443318 38607196 37746070 36852914
3436C6852914j333724j383559n93376r56897q62669q57851j253310r23351r87279
$$ 36852914 35519190 34135631 33542255 32585358 31722689 30864838 29611528 28688177 27700898
3427B7700898p82165q63089j036370r57426m46515q71956l82655n52185p31519
$$ 27700898 26918733 26055644 25019274 24061848 23615333 22743377 22360722 21808537 21077018
3418B1077018m44353J61503l50595r72495p19750o1760l58968m61843n95389o95208
$$ 21077018 20632665 20794168 20443573 19471078 18751328 18689568 18330600 17868757 17273368 16578160
3408A6578160k25835k56252k60203m51329K9639k9689q7143o19059k29970n4115
$$ 16578160 16352325 16096073 15835870 15384541 15414180 15384491 15297348 14678289 14448319 14394204
3398A4394204j96940j42677o86909k32763o54458n3010J64785M13311o85321m94529
$$ 14394204 14197264 14054587 13367678 13134915 12480457 12427447 12592232 13005543 12320222 11825693
3388A1825693k18294Q9056k00825q95097k32188P8068L5663q964l8894j69924
$$ 11825693 11607399 11696455 11495630 10600533 10368345 10446413 10482076 10473112 10434218 10264294
3378A0264294K6445m74962j16368n7607n04033Q2569R5218q43646J3173K3562
$$ 10264294 10290739 9815777 9699409 9641802 9137769 9220338 9315556 8471910 8485083 8508645
3368H508645l84648K92242l1583Q7833k012j030195j34152K26808r0825k39552
$$ 8508645 8123997 8416239 8384656 8472489 8470477 7440282 7306130 7532938 7442113 7202561
3358G202561o6267Q3562K98306m74952K58941J15022j80106K31771k69295m88483
$$ 7202561 7136294 7219856 7518162 7043210 7302151 7417173 7237067 7468838 7199543 6711060
3348F711060j42216Q1940K78951L2551j24409k12682k62029o8463j77836r6938
$$ 6711060 6568844 6650784 6929735 6962286 6837877 6625195 6363166 6294703 6116867 6019929
3338F019929j82014k18008k7657M61378l61126j69791k29725j6979N66274P7515
$$ 6019929 5837915 5619907 5592250 6053628 5692502 5522711 5292986 5276007 5842281 5919796
3328E919796q4930N933L9804o3005r8802O3750j8191J95826l67541k08757J36512
$$ 5919796 5834866 5840799 5880603 5817598 5718796 5782546 5764355 5960181 5592640 5383883 5520395
3317E520395l15693l00662k25783m5077J60235J84312j92001j32928j11260q9999
$$ 5520395 5204702 4904040 4678257 4633180 4793415 4977727 4785726 4652798 4541538 4451539
3307D451539L84963j81289l18440L70780j60355K7285j35567J08162l71739J48923
$$ 4451539 4836502 4655213 4336773 4707553 4547198 4574483 4438916 4547078 4175339 4324262
3297D324262j7658L0826L84695j26928j12851P1264k80163p8434M78392K45651
$$ 4324262 4306604 4337430 4722125 4595197 4482346 4553610 4273447 4195013 4673405 4919056
3287D919056N9763m30315L5818j03618l18663l9703M94734L605J14830K0674J6301
$$ 4919056 4978819 4548504 4584322 4480704 4162041 4122338 4617072 4620677 4735507 4756181 4772482
3276D772482l30952L2426k26992L3694j92512L11080K10056k86090L09536k6059
$$ 4772482 4441530 4473956 4246964 4280658 4088146 4399226 4609282 4323192 4632728 4606669
3266D606669j84563M34003J3364m43010L26003J76662M8061j38057j90521J4978
$$ 4606669 4422106 4856109 4869473 4426463 4752466 4929128 4977189 4839132 4648611 4663589
3256D663589R1898r3501j48347J49867M15735k59454J5950k18707Q3973K49711
$$ 4663589 4755487 4661986 4513639 4663506 5079241 4819787 4835737 4617030 4701003 4950714
3246D950714L55201j43800p5872l64419j11931j06750k78171J00344M02512J15343
$$ 4950714 5305915 5162115 5086243 4721824 4609893 4503143 4224972 4325316 4727828 4843171
3236D843171l14534l4094l92853R918J00383P0229K23110j8181K26581k98823
$$ 4843171 4528637 4494543 4101690 4111608 4211991 4282220 4505330 4487149 4713730 4414907
3226D414907j28842L18607j23641q0917K6818l13839m7303j456M33278l4583j00493
$$ 4414907 4286065 4604672 4481031 4400114 4426932 4113093 4065790 4064334 4497612 4463029 4362536
3215D362536J35999k48400j47043J67691L3616l88521L60521l61243M6704k36518
$$ 4362536 4498535 4250135 4103092 4270783 4304399 3915878 4276399 3915156 3961860 3725342
3205C725342j73505J19328M1561q4640n13345j34959n8273j03952K69177l04672
$$ 3725342 3551837 3671165 3712726 3628086 3114741 2979782 2921509 2817557 3086734 2782062
3195B782062l8989R740k83525M59918m417j07041j99145m48790J44200L19131
$$ 2782062 2743073 2752813 2469288 2929206 2924789 2817748 2618603 2169813 2314013 2633144
3185B633144k7269j12125n5529L30631k4579j72736k41894k75294l23565K6140
$$ 2633144 2605875 2493750 2438221 2768852 2744273 2571537 2329643 2054349 1730784 1756924
3175A756924L65781q1436l34915R8859j60298r3473O69033k22622J23461N0999
$$ 1756924 2122705 2041269 1706354 1805213 1644915 1551442 2220475 1997853 2121314 2172313
3165B172313o33949n5731o1894j06543N27626P8471j70914K06832J34962j53424
$$ 2172313 1538364 1482633 1420739 1314196 1841822 1920293 1749379 1956211 2091173 1937749
3155A937749k87708k33654K3889l9060j0702J62953L9533l06497J36608j17580
$$ 1937749 1650041 1416387 1440276 1401216 1390514 1553467 1593000 1286503 1423111 1305531
3145A305531j64050J7378L82684L96568p38208L26023l16960Q935M41197k91013
$$ 1305531 1141481 1158859 1541543 1938111 1199903 1525926 1208966 1217901 1659098 1368085
3135A368085n49J01220L65317j32387R5896L26143j30603j86362k04213r7733
$$ 1368085 1367536 1468756 1834073 1701686 1797582 2123725 1993122 1806760 1602547 1504814
3125A504814K03075l62531o3245K62824l0830o58966M29456M1925j83615n2428
$$ 1504814 1707889 1345358 1282113 1544937 1514107 855141 1284597 1326522 1142907 1090479
3115A090479k07331K6853J31858j77150K01170M2471m27746j38826L34138J99130
$$ 1090479 883148 910001 1041859 864709 1065879 1108350 680604 541778 875916 1075046
3105A075046K12538j58855n10771R5956o68N60518o11127j23874K18942K97230
$$ 1075046 1287584 1128729 617958 713914 713246 1273764 662637 538763 757705 1054935
3095A054935k16246n33728M46959K74100k14827L0458J94103j90279J13793L01970
$$ 1054935 838689 304961 751920 1026020 811193 841651 1035754 845475 959268 1261238
3085A261238l97822p5117n7890P880j2207J37484j45539j02592k8009k42424n2936
$$ 1261238 863416 788299 730409 738289 726082 863566 718027 615435 587426 345002 292066
3074B92066L43194K784K4163L45422q969m05607k53919k22081J72816J15373j85500
$$ 292066 635260 638044 662207 1007629 998660 593053 339134 117053 289869 405242 219742
3063B19742K12245j04389k00704L20346l323N3047Q4272m99434M99393k17161
$$ 219742 431987 327598 126894 447240 443917 496964 581236 81802 581195 364034
3053C64034Q9955L27759j70614J7951k80369m34173J29424O61725q4777l17980
$$ 364034 453989 781748 611134 629085 348716 -85457 43967 705692 620915 302935
3043C02935J27467M31819j50263J5483k89596k23942J70544o1057O5633K4406
$$ 302935 430402 862221 711958 727441 437845 213903 384447 323390 389023 413429
3033D13429J88841L32549p2108m77951k05302L26181J5876j37543J9942O9401
$$ 413429 602270 934819 862711 384760 179458 505639 521515 383972 403914 473315
3023D73315M08422o26577k7175K25740L25639k89056j53346J12833k824O7291
$$ 473315 881737 255160 227985 453725 779364 490308 336962 449795 446971 514262
3013E14262j94726J97406j54979J95850m2785j4431j39893O3014J25798k12091
$$ 514262 319536 516942 361963 557813 515028 500597 360704 423718 549516 337425
3003C37425J30767P459k6778m9515k00520J14117J11092l1857j07199K74652J5829
$$ 337425 468192 475651 448873 399358 198838 312955 424047 392190 284991 559643 575472
2992E75472m9617j75488k01243J38233J29343J77235K32369l64272J46646K10805
$$ 575472 525855 350367 149124 287357 416700 593935 826304 462032 608678 819483
2982H19483p5770k6782k24661j33792j02556k70033j94832J92454K65911o3300
$$ 819483 743713 716931 492270 358478 255922 -14111 -208943 -16489 249422 186122
2972A86122j5431K11990J72286K39451j67990m68246k15016O86224P9698j35352
$$ 186122 170691 382681 554967 794418 626428 158182 -56834 629390 709088 573736
2962E73736k6090r0618o5042K79453j40320J24721L4993N2032p6343l34608m2672
$$ 573736 547646 457028 391986 671439 531119 655840 690833 742865 666522 331914 289242
2951B89242K34235L38682j50455l56224J70753o4560j55695r0971j385K0625n85490
$$ 289242 523477 862159 711704 355480 526233 461673 305978 215007 213622 234247 -351243
2940c51243K32522L78509R3936m28374K75278L97178J62536N0937o12279k85642
$$ -351243 -118721 259788 353724 -74650 200628 597806 760342 811279 199000 -86642
2930h6642L9473J06761K10239j04792K5528r1614n555j09373K2397J07712j54140
$$ -86642 -47169 59592 269831 165039 190567 98953 93398 -15975 6422 114134 -40006
2919d0006k49295j33320M15341L81957J82801m47766J77717J09180N1997l72147
$$ -40006 -289301 -422621 -7280 374677 557478 109712 287429 396609 448606 76459
2909G6459j00207j9597K25156M2656o2805K45246j86463p2293L33716P545p0807
$$ 76459 -23748 -43345 181811 224467 161662 406908 220445 148152 481868 489413 418606
2898D18606m3830J59619k3030n93470j92252K60475P73372M7959n71556j92203
$$ 418606 374776 534395 511365 -82105 -274357 -13882 759490 807449 235893 43690
2888D3690Q5769R4581K05890O7298j06836J33899k33757l29528j71156N0412L63678
$$ 43690 129459 224040 429930 497228 390392 524291 290534 -38994 -210150 -159738 203940
2877B03940l642J71540J12086J97732P8631K49390n30470J81328M8096m47170
$$ 203940 200298 371838 483924 681656 760287 1009677 479207 660535 708631 261461
2867B61461K59099K27324j19028j30603k1728J17468l23374J96984K5099k94745
$$ 261461 520560 747884 628856 498253 476525 593993 270619 467603 492702 197957
2857A97957J63124P4393K23567J86579k35529j36126j71022l2544q9111J25146
$$ 197957 361081 435474 659041 845620 610091 473965 302943 270399 181288 306434
2847C06434L02245l16216k00486L1867r7655J65478R850j63907M32585L16309
$$ 306434 608679 292463 91977 123844 26189 191667 201517 37610 470195 786504
2837G86504m7856m00381K57277k36517j42253J69785o4499k89546J42508O7833
$$ 786504 738648 338267 595544 359027 216774 386559 322060 32514 175022 242855
2827B42855Q2765M58996j70082j23197m65817j98691L22965m6266J20245J52144
$$ 242855 325620 784616 614534 491337 25520 -173171 149794 103528 223773 375917
2817C75917J24199m15988j94883k8717j70859K62706J49920n27774R0639L9402
$$ 375917 500116 84128 -110755 -139472 -310331 -47625 102295 -425479 -334840 -295438
2807b95438l23770N39107p281M4823L66218N0650j51453j48925J44925k15527
$$ -295438 -619208 -80101 -87382 -42559 323659 374309 222856 73931 218856 3329
2797C329q546k60007n0659K67546K30340n3141j49829j36356L12592J81692j48732
$$ 3329 -5217 -265224 -315883 -48337 182003 128862 -20967 -157323 155269 336961 188229
2786A88229K29476k37140l44134O6778p9169l2684K8595j03096M9348j08875j37849
$$ 188229 417705 180565 -163569 -96791 -175960 -208644 -180049 -283145 -233797 -342672 -480521
2775d80521L4311J94556J17665P4417J81277N6700l50817J51487K20190K6999
$$ -480521 -446210 -251654 -133989 -59572 121705 178405 -172412 -20925 199265 226264
2765B26264m86548m24472M58689P65762l08403j47208j13973J93658k82987P4059
$$ 226264 -260284 -684756 -226067 539695 231292 84084 -29889 163769 -119218 -45159
2755d5159k03379J55379R318l7647K85770j78868j73136J10082j65776m23169
$$ -45159 -248538 -93159 -83841 -121488 164282 -14586 -187722 -77640 -243416 -666585
2745f66585K32378p5128L04519M40655m60916K12873J61643k27813Q8946n1775
$$ -666585 -434207 -509335 -204816 235839 -225077 -12204 149439 -78374 10572 -41203
2735d1203K62472J82037J7876m24304m2947J05346K8917K85308r8286k24267L50767
$$ -41203 221269 403306 421182 -3122 -46069 59277 88194 373502 275216 50949 401716
2724D01716k90636J09605k99478k51733K89180n6825J32362R1105m90935n6478
$$ 401716 111080 220685 -78793 -330526 -41346 -98171 34191 125296 -365639 -422117
2714d22117K06339M14768j91609l4058J22036K20834k88493L2415K20245l61674
$$ -422117 -215778 198990 7381 -26677 95359 316193 27700 60115 280360 -81314
2704h1314j72818l8538K20600q2779l93679J85168J31364j13464j80030J17872
$$ -81314 -254132 -292670 -72070 -154849 -548528 -363360 -231996 -345460 -525490 -407618
2694d07618P0481j20613J135r1237M41442o0826j96431K45984J37832m520j26296
$$ -407618 -337137 -457750 -456615 -547852 -106410 -167236 -363667 -117683 20149 15629 -110667
2683a10667k79793J43335o2101P8809L32115j36006O6875k98354k35065L51906
$$ -110667 -390460 -247125 -309226 -230417 101698 -34308 32567 -265787 -500852 -148946
2673a48946K77805N8003K23848m7137l8673l84842k74077M411R4226J29052J79782
$$ -148946 128859 186862 410710 363573 324900 -59942 -334019 -329608 -235382 -106330 73452
2662G3452k05622k70400K97322R2582J04801k68208l5652m27968p1973m5227J343
$$ 73452 -132170 -402570 -105248 -12666 92135 -176073 -211725 -639693 -711666 -756893 -755550
2651g55550L1960K04342J02647k80713j01K89926K2896O0712K4102m9898L23790
$$ -755550 -723590 -519248 -416601 -697314 -697415 -407489 -384593 -323881 -299779 -349677 -25887
2640b5887l85773J17897M38718N1219k77141k75552p2830l53601P6355L03539
$$ -25887 -411660 -293763 144955 196174 -80967 -356519 -429349 -782950 -706595 -403056
2630d03056l052l47250J52802O149K90574j62L574P448K24413o534l50520O6366
$$ -403056 -406108 -753358 -600556 -594407 -303833 -303995 -300421 -292973 -68560 -75094 -425614 -359248
2618c59248J9392p3231l40590J73186M88414K06578K8040k96468l43659L85320
$$ -359248 -339856 -413087 -753677 -580491 -92077 114501 142541 -153927 -497586 -112266
2608a12266K23991l64688l94428j32602K44998O9756J71721L61892j74284m80222
$$ -112266 111725 -252963 -647391 -779993 -534995 -465239 -293518 68374 -105910 -586132
2598e86132J73320L49031k39846J92606j12545l47591r0676K23971M62902n8979
$$ -586132 -412812 -63781 -303627 -111021 -223566 -571157 -661833 -437862 25040 -33939
2588c3939m06956j44920L67202o7983M4443L69876J2569l7723M7997l40668J21564
$$ -33939 -440895 -585815 -218613 -286596 -242153 127723 140292 102569 150566 -190102 -68538
2577f8538L3688l41708J50333J8206j97777J71751K16591k98182j8987k09005
$$ -68538 -34850 -376558 -226225 -208019 -405796 -234045 -17454 -315636 -334623 -543628
2567e43628J41027j9248J71074L74503k39173q4993M15496K7923K6710k92025
$$ -543628 -402601 -421849 -250775 123728 -115445 -200438 215058 242981 269691 -22334
2557b2334j21839K15256P3234J43152q6180j20097j85032L7508K9529J02970m8995
$$ -22334 -144173 71083 144317 287469 201289 81192 -103840 -66332 -36803 66167 17172
2546A7172l14666L09095l0694n97078P9172M5523p7057K38967l0391j16588n3037
$$ 17172 -297494 11601 -19093 -616171 -536999 -491476 -568533 -329566 -359957 -476545 -529582
2535e29582n94007J92405L73588J36728K13630l43466J58043L97312l5408k10298
$$ -529582 -1123589 -931184 -557596 -420868 -207238 -550704 -392661 4651 -30757 -241055
2525b41055j37169P2410J20324r9536n4221K40034j87466L70448j27500o8029
$$ -241055 -378224 -305814 -185490 -285026 -339247 -99213 -286679 83769 -43731 -111760
2515a11760k2922j23879j64016R9015M72784k01888l82755q1560q1527l5628N0507
$$ -111760 -134682 -258561 -422577 -323562 149222 -52666 -435421 -516981 -598508 -634136 -583629
2504e83629J88908M7833j65785O18791l25926l14960J97756k5954J58606q1402
$$ -583629 -394721 -346888 -512673 106118 -219808 -534768 -337012 -362966 -204360 -285762
2494b85762j73225j10770r3072K77462l32137M25026L32671k30636j96018k35768
$$ -285762 -458987 -569757 -662829 -385367 -717504 -292478 40193 -190443 -386461 -622229
2484f22229L94999k0253J1865o699n4728J75068K68364j23610k52726q3710k1930
$$ -622229 -227230 -247483 -235618 -242317 -297045 -121977 146387 22777 -229949 -313659 -335589
2473c35589m68377J25044K95657Q0306J309l77207N23905j25109M9591P0949r4893
$$ -335589 -803966 -678922 -383265 -302959 -301650 -678857 -154952 -280061 -230470 -159521 -254414
2462b54414l0082J19070j19995j14126K90501j97478k20189L09937J26873m4418
$$ -254414 -284496 -165426 -285421 -399547 -109046 -306524 -526713 -216776 -89903 -134321
2452a34321P0248r9698j19443L30155k67046j93966K30089k23678M54120p3155
$$ -134321 -64073 -163771 -283214 46941 -220105 -414071 -183982 -407660 46460 -26695
2442b6695k70951k05336J32146j0495L67505l08899J99821p1818k24944J12789
$$ -26695 -297646 -502982 -370836 -381331 -13826 -322725 -122904 -194722 -419666 -306877
2432c06877l01288O82714J73020k11245k09347n22743O2323N75800K34704o7955
$$ -306877 -608165 74549 247569 36324 -173023 -695766 -633443 -57643 177061 109106
2422A09106k18539L02451J1L52891p19872l91389j1963L70750k33682J4699K04085
$$ 109106 -109433 193018 193029 545920 -173952 -565341 -577304 -206554 -440236 -425537 -221452
2411b21452P2518J38471m15906n4070K56248l72009O27330J73286k30760j18091
$$ -221452 -148934 -10463 -426369 -480439 -224191 -596200 31130 204416 -26344 -144435
2401a44435j50678p8946M5612L57650M7702J07232m16145L45778j79338k15152
$$ -144435 -295113 -374059 -328447 29203 76905 184137 -232008 113770 -65568 -280720
2391b80720j3092L4375o1444J29339L55283k12337J09229K94341j17985j68132
$$ -280720 -293812 -259437 -320881 -191542 163741 -48596 60633 354974 236989 68857
2381F8857k39370J50499m2361j63726j06415M22413j40720j15583m86228J56491
$$ 68857 -170513 -20014 -62375 -226101 -332516 89897 -50823 -166406 -652634 -496143
2371d96143Q6531L73559k26785J98483K07303k59860J65361j61876l1120l41285
$$ -496143 -409612 -36053 -262838 -64355 142948 -116912 48449 -113427 -144547 -485832
2361d85832l34341P56856L15527O9273k931l34705K268L90180m75351j80464p1918
$$ -485832 -820173 -63317 252210 321483 318552 -16153 -13885 376295 -99056 -279520 -351438
2350c51438M32056J38276n98178N9621O47035N1519j92723k59323L25326k53056
$$ -351438 80618 218894 -379284 -319663 327372 378891 186168 -73155 252171 -885
2340h85j37649l8902m44179O6604L4574O02215k23066p6767j79647K94809j09661
$$ -885 -138534 -177436 -621615 -555011 -520437 81778 -141288 -218055 -397702 -102893 -212554
2329b12554n4086L82736M8946j69417m18485K71582K31795k34145j36717J31153
$$ -212554 -266640 116096 165042 -4375 -422860 -151278 80517 -153628 -290345 -159192
2319a59192K27752J39009j33816j8234K53436k41562j20154l31012k01839O7885
$$ -159192 68560 207569 73753 55519 308955 67393 -52761 -383773 -585612 -517727
2309e17727L92711j55268J59799M1522K3159m513J36923p6651k03379j91659L6489
$$ -517727 -125016 -280284 -120485 -78963 -55804 -60317 76606 -45 -203424 -395083 -358594
2298c58594J09159m5667K9939M95743l3972k57741l15737P31458J79279j06560
$$ -358594 -249435 -295102 -265163 230580 196608 -61133 -376870 354588 533867 427307
2288D27307n16477n7924l5791M31787l12515P0357K66406l33735j90422J62858
$$ 427307 -89170 -147094 -182885 248902 -63613 6744 273150 -60585 -251007 -88149
2278h8149P0958p711l0072J48031J37179j3087j74776j83897N265J84038K19614
$$ -88149 -17191 -24902 -54974 93057 230236 217149 42373 -141524 -136259 47779 267393
2267B67393j84588J75759r3065K70074j22143r2705R8961l73879J92794K50231
$$ 267393 82805 258564 165499 435573 313430 220725 319686 -54193 138601 388832
2257C88832k86928k41326P1177O9634O9176J84833k69588J7088k45297L43424
$$ 388832 101904 -139422 -68245 1389 70565 255398 -14190 2898 -242399 101025
2247A01025n4094j33204j36063J99654j05132J20907K54019n1380k79922J24718
$$ 101025 46931 -86273 -222336 -22682 -127814 -6907 247112 195732 -84190 40528
2237D0528J0611J20787l29975j94609L17948L52482L9747k26401J27403k19433
$$ 40528 51139 171926 -158049 -352658 -34710 317772 357519 131118 258521 39088
2227C9088m84245L24470N2722Q0618L4604M45638J07883K57983k06326l3906P020
$$ 39088 -445157 -120687 -67965 12653 47257 492895 600778 858761 652435 618529 625549
2216F25549k91958l21874N9964k4918j27904M79092J90552j34450O7627K2234
$$ 625549 333591 11717 71681 46763 -81141 397951 588503 454053 521680 543914
2206E43914Q910q1419k9756j07863L6489J37545J42867J01627n3590J30647k12229
$$ 543914 552824 471405 441649 333786 370275 507820 650687 752314 698724 829371 617142
2195F17142P8146J76225k3062p4853l31681l51018M19775o2619K32954K52539
$$ 617142 695288 871513 848451 773598 441917 90899 510674 448055 681009 933548
2185I33548j28878j61148N3774J403j91557K6275N22725K83940j94519p0635j15776
$$ 933548 804670 643522 697296 698699 507142 533417 1056142 1340082 1145563 1074928 959152
2174I59152P1953K49861k91688L10210K40010l33413J33869M4031j05442j19365
$$ 959152 1031105 1280966 989278 1299488 1539498 1206085 1339954 1383985 1278543 1159178
2164A159178j33094O2719O1436L35407L9801k55167l40990L24709Q5237J04157
$$ 1159178 1026084 1088803 1150239 1485646 1525447 1270280 929290 1253999 1339236 1443393
2154A443393L29592M02266J52582k56556K66987M0291K8638m2016J12371p5492
$$ 1443393 1772985 2175251 2327833 2071277 2338264 2378555 2407193 2365177 2477548 2402056
2144B402056R0393M23497k38428N4541K77902j10032n2148M3425J78220q1377
$$ 2402056 2492449 2915946 2677518 2732059 3009961 2899929 2847781 2891206 3069426 2988049
2134B988049M64276M08062j95020L9168k9915J77799P9930L20936J04405J36112
$$ 2988049 3452325 3860387 3665367 3704535 3674620 3852419 3932349 4253285 4357690 4493802
2124D493802L61197j7163J20495O74286L76185L36823M9592q1718M39402L60797
$$ 4493802 4854999 4837836 4958331 5632617 6008802 6345625 6395217 6313499 6752901 7113698
2114G113698R8757K70014O92049K00435P14018Q49812L16180Q26083Q08400J383061
$$ 7113698 7212455 7482469 8174518 8374953 9088971 9938783 10254963 11081046 11889446 13272507
2104A3272507J433834Q30393M63579O95377J145656J402000J641519K608885L044786
$$ 13272507 14706341 15536734 16000313 16695690 17841346 19243346 20884865 23493750 26538536
2095B6538536M050615N251772O841130R575600J4776001J8813898J5849802q510062
$$ 26538536 30589151 35840923 42682053 52257653 67033654 85847552 101697354 93187292
2087I3187292k3356674j7158611j1551493p054711n385369l874829l624117k038397
$$ 93187292 69830618 52672007 41120514 34065803 28680434 24805605 21181488 19143091
2079A9143091k296940j248122q66606p25161n26485m87131j011207j029298j524334
$$ 19143091 16846151 15598029 14731423 14006262 13479777 12992646 11981439 10952141 9427807
2070I427807n06929j47569o60739o47227k18497m65645m10823r45234l93414K7935
$$ 9427807 8920878 8773309 8112570 7465343 7246846 6781201 6370378 5425144 5031730 5059665
2060E059665O9235l33594m20623r832o85195l31020K84579L17481n67915l04991
$$ 5059665 5128900 4795306 4374683 4364851 3679656 3348636 3633215 3950696 3382781 3077790
2050C077790o3581J57781k24164m6958o0539J68087l67863Q6015J9519n44024
$$ 3077790 3014209 3171990 2947826 2900868 2840329 3008416 2640553 2726568 2746087 2202063
2040B202063j56808O60260m04520k99611K69803p63133M64610p9981q1897K10022
$$ 2202063 2045255 2705515 2300995 2001384 2271187 1508054 1972664 1892683 1810786 2020808
2030B020808m37082K25231K74863L91682p1256m61774k48828n8528j44002L4254
$$ 2020808 1583726 1808957 2083820 2475502 2404246 1942472 1693644 1635116 1491114 1525368
2020A525368K30548l74233N3318L92156j82957o11675j05369J49218J5989q3330
$$ 1525368 1755916 1381683 1435001 1827157 1644200 1032525 927156 1076374 1092363 1009033
2010A009033k74484K16832K47137l81209n3608m57376j8912J52602R6669k08624
$$ 1009033 734549 951381 1198518 817309 763701 306325 287413 440015 536684 328060
2000C28060J26715K12692j81851Q12j44698j88170l9476P1835J41572R0988k55894
$$ 328060 454775 667467 485616 486428 341730 153560 114084 185919 327491 418479 162585
1989A62585K89069k01554J06854K85599O135l50419k96117Q2963K87144L2603
$$ 162585 451654 250100 356954 642553 648688 298269 2152 85115 372259 404862
1979D04862K3621j74442q3995k0055m0887L29410J52532k79199j62227j13350
$$ 404862 428483 254041 170046 149991 109104 438514 591046 311847 149620 36270
1969C6270j83864K9191J39695J84503q5346J43990k67662K26172l91397K17297
$$ 36270 -147594 -118403 21292 205795 120449 264439 -3223 222949 -168448 48849
1959D8849K82296k80092K07566J14595k44j94951j31377K62325k88574j1846J71499
$$ 48849 331145 51053 258619 373214 372970 178019 46642 308967 20393 8547 180046
1948A80046m54173N24849M9558n5695J67668m02230m6292L02649j65874q1513
$$ 180046 -274127 250722 300280 244585 412253 10023 -36269 266380 100506 18993
1938A8993J91800n9934J89253K07616m11721j78387K23332L9711l1288Q5513J51232
$$ 18993 210793 150859 340112 547728 136007 -42380 180952 220663 189375 274888 426120
1927D26120k12082j86884n1294L9848K39281m08660J53244P8977K20408K2802
$$ 426120 214038 27154 -24140 15708 254989 -153671 -427 78550 298958 321760
1917C21760J50381m5365o07756k50977k4310o2632M93188M01629K80628j28026
$$ 321760 472141 426776 -180980 -431957 -456267 -518899 -25711 375918 656546 528520
1907E28520n99471K75900o10554J4288J99892l7740N34738j78229m87037P0912
$$ 528520 -70951 204949 -405605 -391317 -191425 -229165 305573 127344 -359693 -288781
1897b88781J89442j23159o5477K45762J11318J22122j01212k07934k8348k03058
$$ -288781 -99339 -222498 -287975 -42213 69105 191227 90015 -117919 -146267 -349325
1887c49325Q9987l00331J38838M024J20535r7694P2174M88248q8520L59473k3702
$$ -349325 -259338 -559669 -420831 -416807 -296272 -393966 -321792 166456 77936 437409 413707
1876D13707j67005k04335k83495K90247k4697K44216J81296k29794k10481K37000
$$ 413707 246702 42367 -241128 49119 24422 268638 449934 220140 9659 246659
1866B46659k0239k84469M50087m48k10272J98104k31189p5644J57413P367l04338
$$ 246659 226420 -58049 392038 391590 181318 379422 148233 72589 230002 237369 -66969
1855f6969k23277m5634L59489K4420k84321j77581P0664M21323o4354K00971M9222
$$ -66969 -290246 -335880 23609 48029 -236292 -413873 -343209 78114 13760 214731 263953
1844B63953J59389j18233n2059l21269K00258l1419J26502M8990j32463J23838
$$ 263953 423342 305109 253050 -68219 132039 100620 227122 276112 143649 267487
1834B67487n35601k33100J39691J28827j46576o4655J73509K18526j00861O9564
$$ 267487 -268114 -501214 -361523 -232696 -379272 -443927 -270418 -51892 -152753 -83189
1824h3189L95287J29954R2182j30619M3674J78074L6574l03679J02553l30387
$$ -83189 312098 442052 534234 403615 447289 625363 661937 358258 460811 130424
1814A30424m66913O366L9797K36107O6417k85604M0699K16276n04982J46544J94087
$$ 130424 -336489 -330123 -290326 -54219 12198 -273406 -232707 -16431 -521413 -374869 -180782
1803a80782J5004J11773P8509J08973m0942p5602j08099k79194l33318K89657
$$ -180782 -165778 -54005 24504 133477 92535 16933 -91166 -370360 -703678 -414021
1793d14021K03483L78126o4788k40465m8078m80647J68464n5761o6504K03318
$$ -414021 -210538 167588 102800 -137665 -185743 -666390 -497926 -553687 -620191 -416873
1783d16873L86477j15413l68608N49091L607j79507L23206l82715m48526L46424
$$ -416873 -30396 -145809 -514417 34674 38281 -141226 181980 -200735 -649261 -302837
1773c02837J30840l7734l36639R0312J23770J19521j7233j18143j08502j33613
$$ -302837 -171997 -209731 -546370 -456058 -332288 -212767 -230000 -348143 -456645 -590258
1763e90258J26837L02845K73079n1217R6532l24198j84897K32741J18161J40982
$$ -590258 -463421 -160576 112503 61286 157818 -166380 -351277 -118536 -375 140607
1753A40607J45719N6796J70733k84180k43140l45652l8715M4482J87599j31000
$$ 140607 286326 343122 513855 229675 -13465 -359117 -397832 -353350 -165751 -296751
1743b96751J06136J07869j90873O8276J08588k14612J9364K4625j00613Q7302
$$ -296751 -190615 -82746 -273619 -205343 -96755 -311367 -292003 -267378 -367991 -280689
1733b80689r1607M1481K02360o997N2969p3907j28223L5387K14018k25748p4244
$$ -280689 -372296 -330815 -128455 -135452 -82483 -156390 -284613 -249226 -35208 -260956 -335200
1722c35200L27067k26241j84894J70008L58183j62860l11141N8795P0249j29503
$$ -335200 -8133 -234374 -419268 -249260 108923 -53937 -365078 -306283 -236034 -365537
1712c65537M21693K40652J57310k67941j33080j14196P6262J55063j25082l03778
$$ -365537 56156 296808 454118 186177 53097 -61099 15163 170226 45144 -258634
1702b58634K06573N8481k85277L95958k1804j48477j00683l14618J87578o4844
$$ -258634 -52061 6420 -278857 117101 95297 -53180 -153863 -468481 -280903 -345747
1692c45747J33775M83031j65495k70822k07748J43762n1731j50644k45L07101
$$ -345747 -211972 271059 105564 -165258 -373006 -229244 -280975 -431619 -431864 -124763
1682a24763L75913K9654o31933Q9990M30655q4652L23505l83523k89887N413J0195
$$ -124763 251150 280804 -351129 -261139 169516 84864 408369 24846 -265041 -259628 -249433
1671b49433j68758L77230L71840l83702l91161j2281J55130k0080J56928l56887
$$ -249433 -418191 -40961 330879 -52823 -443984 -456265 -301135 -321215 -164287 -521174
1661e21174N20787j55264K17218j23483m95990N23187R9838j2280p8141k0562
$$ -521174 -387 -155651 61567 -61916 -557906 -34719 65119 52839 -25302 -45864
1651d5864n6211j76858j86043K2449J22937j39827J30893N0774j81848K73451
$$ -45864 -102075 -278933 -464976 -442527 -319590 -459417 -328524 -277750 -459598 -186147
1641a86147j59827J57944L29134Q8792k86563K38064K73673k73500J33666k82125
$$ -186147 -345974 -188030 141104 229896 -56667 181397 455070 181570 315236 33111
1631C3111k16770j71423k28617o9682J68034R7975L18550J54434j41461j7509
$$ 33111 -183659 -355082 -583699 -653381 -485347 -387372 -68822 85612 -55849 -73358
1621g3358q922M8271l11622k33441L36586k45550L6192M79572k54372k2803Q094
$$ -73358 -82280 -34009 -345631 -579072 -242486 -488036 -451844 27728 -226644 -249447 -241353
1610b41353J83847J5702k12967K63176R0369j25135l55714j9741J77417m9552
$$ -241353 -57506 -41804 -254771 8405 98774 -26361 -382075 -401816 -224399 -273951
1600b73951Q3087M68695j51846j9104j71203j19229K73814n6297j18681k89085
$$ -273951 -190864 277831 125985 106881 -64322 -183551 90263 33966 -84715 -373800
1590c73800J35936O0809Q6277k76358j7220M6748j35740K30351L10027l04146
$$ -373800 -237864 -177055 -90778 -367136 -384356 -337608 -473348 -242997 67030 -237116
1580b37116M3193L2493J26622L6956p3747j32816k32059j23057N52059o750K76336
$$ -237116 -193923 -161430 -34808 2148 -71599 -204415 -436474 -559531 -7472 -14222 262114
1569B62114J30247m26204k10255L4097P0514N8312J28062j61495k58731K0922
$$ 262114 392361 -33843 -244098 -210001 -139487 -81175 46887 -114608 -373339 -352417
1559c52417k4117M8818K63743l25042J98047K94450j98867j14672O8920k14021
$$ -352417 -376534 -327716 -63973 -389015 -190968 103482 -95385 -210057 -141137 -355158
1549c55158l5805O7792P5110L32599n0606l78484J38747l66299k7077K30019j5564
$$ -355158 -390963 -323171 -248061 84538 33932 -344552 -205805 -572104 -599181 -369162 -384726
1538c84726j09254M792J63890Q2281j14002k52483J79470P5818L19155o1370l00526
$$ -384726 -493980 -489188 -325298 -243017 -357019 -609502 -430032 -354214 -35059 -96429 -396955
1527c96955J69677L17026j75343j17766O6448L79529N9956k63237R5399l01963
$$ -396955 -227278 89748 -85595 -203361 -136913 242616 302572 39335 134734 -167229
1517a67229j91579P2236K34710M605q1124k38826P3310K25663j84166L29471o1664
$$ -167229 -358808 -286572 -51862 -47257 -128381 -367207 -293897 -68234 -252400 77071 15407
1506A5407M11606J08562o94816j99494L36173J46014j16150j0898l86175k00389
$$ 15407 427013 535575 -159241 -358735 -22562 123452 7302 -3596 -389771 -590160
1496e90160M582O40246p3174k04427J15995p4L08368l6918m60245J80588N5690
$$ -590160 -585578 54668 -18506 -222933 -106938 -107012 201356 164438 -295807 -115219 -59529
1485e9529l6273L3137l27946J00203J23067l03267M0870n0136R0271N8543J66080
$$ -59529 -95802 -62665 -390611 -290408 -167341 -470608 -429738 -479874 -389603 -331060 -164980
1474a64980j596j53789j9155k22353k65497M90576o551K72285J34826l0571J91523
$$ -164980 -166576 -320365 -339520 -561873 -827370 -336794 -343345 -71060 63766 33195 224718
1463B24718P637m21839r3466j39561K99465r1374j60394M70078j61737M2327j25008
$$ 224718 232355 -189484 -282950 -422511 -123046 -214420 -374814 95264 -66473 -24146 -149154
1452a49154r7784J55628J64430k61773K75474J11592K13432J9710j56718J24328
$$ -149154 -246938 -91310 73120 -188653 86821 198413 411845 431555 274837 399165
1442C99165k57630k97615J69959j25874j64904J79966J68159r3187L10633k78381
$$ 399165 141535 -156080 13879 -111995 -276899 -96933 71226 -21961 288672 10291
1432A0291l70361M4074j31668L51787N11049k64229k40738j59159K6270K70546
$$ 10291 -360070 -315996 -447664 -95877 415172 150943 -89795 -248954 -222684 47862
1422D7862r0488m51112J43970J98478J12709P2276l14966N9077R2487J25186j97737
$$ 47862 -42626 -493738 -349768 -151290 -38581 33695 -281271 -222194 -129707 -4521 -202258
1411b02258L5847L51477J04250k74342p6426k34479j60632K51136L52023k73855
$$ -202258 -166411 185066 289316 14974 -61452 -295931 -456563 -205427 146596 -127259
1401a27259k92403M30981m20595L16948K42985j68177M5792L4466q3594m29078
$$ -127259 -419662 11319 -409276 -92328 150657 -17520 28272 62738 -20856 -449934
1391d49934k04193L32871K57493p9826J32882k9509k41751N9237M9919k09753
$$ -449934 -654127 -321256 -63763 -143589 -10707 -40216 -281967 -222730 -172811 -382564
1381c82564j86210L79096K30883j81766r4384K0846J53694J37136l6893k14267
$$ -382564 -568774 -189678 41205 -140561 -234945 -214099 -60405 76731 39838 -174429
1371a74429K66999p2957r9320J5937j56909J2070M20769k2417m47508K85441K87141
$$ -174429 92570 19613 -79707 -63770 -220679 -208609 212160 189743 -257765 27676 314817
1360C14817j43518l39713k9163K43224J61827P3121j19781J92732j23455J96958
$$ 314817 171299 -168414 -197577 45647 207474 280595 160814 353546 230091 427049
1350D27049k53372l66081j3718k17434J18116j79915J3070R7786L85292K8740
$$ 427049 173677 -192404 -206122 -423556 -305440 -485355 -472285 -374499 10793 39533
1340C9533j42445j13366J20931j85224J87179j0743j61875K18824n8848m49196
$$ 39533 -102912 -216278 -95347 -280571 -93392 -104135 -266010 -47186 -106034 -555230
1330e55230j6443k384J00436J9207K36403k37681K23971k7695j97665K58035j3601
$$ -555230 -571673 -574057 -473621 -454414 -218011 -455692 -231721 -259416 -457081 -199046 -212647
1319b12647K88927l42190K7001j49610J40309J98231o3627r1349M7393K34649
$$ -212647 76280 -265910 -238909 -388519 -248210 -49979 -113606 -204955 -157562 77087
1309G7087l42564J03784J2137q923P433R838J48711k33073N63803k15087m01157
$$ 77087 -265477 -161693 -149556 -158479 -151046 -141208 7503 -225570 338233 123146 -278011
1298b78011J68071k29329p6747J42465L1206J2068r8596K42714j02461k30048
$$ -278011 -109940 -339269 -416016 -273551 -242345 -230277 -328873 -86159 -188620 -418668
1288d18668Q311p1883k45730l2758P4051M60215J13047j8305m0085j78817j01008
$$ -418668 -410357 -482240 -727970 -760728 -686677 -226462 -113415 -131720 -171805 -350622 -451630
1277d51630J35011j15807N91063M5211n59622j08999M34006L33739m64425k63972
$$ -451630 -316619 -432426 158637 203848 -355774 -464773 -30767 302972 -161453 -425425
1267d25425L11748j44435j05448K3234Q8218Q3872L7982j51168m85713L34851
$$ -425425 -113677 -258112 -363560 -340326 -252108 -168236 -130254 -281422 -767135 -432284
1257d32284J21514R2925J07098m83544L63930J39545J65889j98091k35269K55025
$$ -432284 -310770 -217845 -110747 -594291 -230361 -90816 75073 -123018 -358287 -103262
1247a03262J97347o4491Q8337k69389l3580n2851q4078J01334o967J4559J32164
$$ -103262 94085 29594 117931 -151458 -185038 -237889 -321967 -220633 -227600 -213041 -80877
1236h0877K01589j97506J16214P5711k06274j32778M73736O7589K2751k40656
$$ -80877 120712 -76794 39420 115131 -91143 -223921 249815 317404 340155 99499
1226I9499J57250m60366K12844p2134K23087J58850k08565j68345j63370j10468
$$ 99499 256749 -203617 9227 -62907 160180 319030 110465 -57880 -221250 -331718
1216c31718J97537L7344K20752k75418j37868J68953j2974j45395n0259J65754
$$ -331718 -134181 -96837 123915 -151503 -289371 -120418 -133392 -278787 -329046 -163292
1206a63292K0917K84677k59709K63225m72472j5696r3606J49632K27549r913p467
$$ -163292 -142375 142302 -117407 145818 -326654 -342350 -435956 -286324 -58775 -68688 -76155
1195g6155M0163K82044j15520k09053L4179l12634J86757L17609j78462m02719
$$ -76155 -35992 246052 130532 -78521 -44342 -356976 -170219 147390 -31072 -433791
1185d33791j02899M38806M6559j41703J55727R5413q0187P3974M21320k97791
$$ -433791 -536690 -97884 -51325 -193028 -37301 58112 -22075 51899 473219 175428
1175A75428l97256J83005k40124L7594P5537J95851p247L34116K35135n48652
$$ 175428 -221828 -38823 -278947 -241353 -165816 30035 22788 356904 592039 43387
1165D3387l71741O9655k22303N91007J4793j96573L1904K31900K38115k14557
$$ 43387 -328354 -258699 -481002 110005 124798 -71775 -39871 192029 430144 215587
1155B15587q5144l58219p9176m1972j70604K57033N11533J74473o8358K8495k84316
$$ 215587 130443 -227776 -306952 -348924 -519528 -262495 249038 423511 355153 383648 99332
1144I9332k92490K66782J82211l03327J88809N8933M354K17400j73257j23906
$$ 99332 -193158 73624 255835 -47492 141317 200250 204604 422004 248747 124841
1134A24841N37856l38971o6361j68642J05693n9411L43892J16459l15240j67075
$$ 124841 662697 323726 257365 88723 194416 135005 478897 595356 280116 113041
1124A13041O6904k28393O6115L12480k06370k29268p2149M0450j86073L72745
$$ 113041 179945 -48448 17667 330147 123777 -105491 -177640 -137190 -323263 49482
1114D9482J16656J76038j17812o6167k24250k96510k0555K52266r1062j90693
$$ 49482 166138 342176 224364 158197 -66053 -362563 -383118 -130852 -221914 -412607
1104d12607K5687M352K0127L36556j4993k4019j74845k05705q1687K77106K65727
$$ -412607 -386920 -382568 -362441 -25885 -40878 -64897 -239742 -445447 -527134 -250028 15699
1093A5699j30918K36881N7640j68729J81688n36891j10785m0097L22066k27246
$$ 15699 -115219 121662 179302 10573 192261 -344630 -455415 -495512 -173446 -400692
1083d00692J5700J90185L56857l1450m4821K11440K83469l39569m87373M185M19103
$$ -400692 -384992 -194807 162050 130600 85779 297219 580688 241119 -246254 -242069 177034
1072A77034K25406k54990r0957J24458J7668K78016J55278k20169j29178J17076
$$ 177034 402440 147450 56493 180951 198619 476635 631913 411744 282566 399642
1062C99642r9018k53780K7905j23635J03487Q4444n3543R229j49173j28251j34183
$$ 399642 300624 46844 74749 -48886 54601 139045 85502 94731 -54442 -182693 -316876
1051c16876j13530K26108K22840M95031J28828m69489J6523M8208P6073l72175
$$ -316876 -430406 -204298 18542 513573 642401 172912 189435 237643 313716 -58459
1041e8459M32819p717k03275M6327k88917J73008j7360K1332q5221j82511J91448
$$ -58459 374360 366643 163368 209695 -79222 93786 76426 97758 12537 -169974 21474
1030B1474R433j71050J76091q9940K08007k88053J18917M6309j05793P9558l9355
$$ 21474 30907 -140143 35948 -53992 154015 -134038 -15121 31188 -74605 4953 -34402
1019c4402K0279L18668j48047J14830j22426M19408o81069j07557K44625Q5659
$$ -34402 -14123 304545 156498 271328 148902 568310 -112759 -220316 24309 109968
1009A09968L57777k90961l5369l98571J16345L48252P5822j38078j05809o0904
$$ 109968 467745 176784 141415 -257156 -140811 207441 283263 145185 39376 -21528
999b1528J82986M18190j95230k53515j17745k93041j57110N00129M6018K27500
$$ -21528 161458 579648 384418 130903 13158 -279883 -436993 63136 109154 336654
989C36654J53683l86765p7382j65629K9184J63042O53004j96734m37549J23499
$$ 336654 490337 103572 26190 -139439 -110255 52787 705791 509057 71508 195007
979A95007N7386K16923j22213l49208L7358m7477j51920r7391J628Q751L43180
$$ 195007 252393 469316 347103 -2105 35253 -12224 -164144 -261535 -259907 -251156 92024
968I2024L46542j90244r1063q569P1777r1558j78698j5241J35885p8308K20811
$$ 92024 438566 248322 157259 148690 220467 128909 -49789 -65030 70855 -7453 213358
957B13358L3590j62299J346m34376R9102J36754M7431L25465K4278r033k12945
$$ 213358 246948 84649 85995 -348381 -249279 -112525 -65094 260371 284649 275616 62671
946F2671o8874p58857k6463N54740J433O1533J20529k13584j10598K98499K83225
$$ 62671 -6203 -765060 -791523 -236783 -235350 -173817 -53288 -266872 -377470 -78971 204254
935B04254K16221l17740m20449J92856k45041J06443M44051k041J02661M167L1587
$$ 204254 420475 102735 -317714 -124858 -369899 -263456 180595 178554 281215 285382 316969
924C16969R3456p7722J28924n0768p1584l31250Q7823M96524k60711o09827j32958
$$ 316969 410425 332703 461627 410859 339275 8025 95848 592372 331661 -278166 -411124
913d11124L58822J23704l55042J57538K74839n07133K94525L5259Q5154m42843
$$ -411124 -52302 71402 -283640 -126102 148737 -358396 -63871 -28612 56542 -386301
903c86301L48107K20049j55815K42383q76j35540l30653J376j89771J77834M5057
$$ -386301 -38194 181855 26040 268423 267547 132007 -198646 -197270 -387041 -209207 -164150
892a64150N8971N4922r7412j44194k76542k1916L02019L90009n57432L16044J08465
$$ -164150 -105179 -50257 -147669 -291863 -568405 -590321 -288302 101707 -455725 -139681 -31216
881c1216J38353m9041j40377L11072l42279l2024l1279K37643L18910k03856q9951
$$ -31216 107137 58096 -82281 228791 -113488 -145512 -176791 60852 379762 175906 85955
870H5955l4850K4030j27338k2310m483l5069J26123o03245K19538J48810m358
$$ 85955 51105 75135 -52203 -74513 -78996 -114065 12058 -591187 -371649 -222839 -227197
859b27197L93442J83997j78386l77108K00850n943j06728k06209R0986Q8354M30556
$$ -227197 166245 350242 171856 -205252 -4402 -10345 -117073 -323282 -232296 -143942 286614
848B86614l58572k24229J17440K06372j37898K89310j04472j97442q0331K96025
$$ 286614 -71958 -296187 -178747 27625 -110273 179037 74565 -122877 -203208 92817
838I2817k7501l76106j5176M91918L92503j96104m4206m04492P7889q3631m89688
$$ 92817 65316 -310790 -325966 165952 558455 362351 318145 -86347 -8458 -92089 -581777
827e81777L68272J11046k29470M925K42468K35774o5277q0522n5561R2213K46946
$$ -581777 -213505 -102459 -331929 -327004 -84536 151238 85961 5439 -50122 42091 289037
816B89037J38085k71344k49850m5459J70741N8772o7414j04445K45373m64532
$$ 289037 427122 155778 -94072 -139531 31210 89982 22568 -81877 163496 -301036
806c01036J35572J08347Q9457k87918J41005N0786J99741j81864Q1362j44201
$$ -301036 -165464 -57117 32340 -255578 -114573 -63787 135954 -45910 35452 -108749
796a08749J06731J61709J66452N8000l91130j27015O2066K54776J54002j19078
$$ -108749 -2018 159691 326143 384143 -6987 -134002 -71936 182840 336842 217764
786B17764l91043J01802O2486J56957J51496l44846l04205j28705l4588M69716
$$ 217764 -173279 -71477 -8991 147966 299462 -45384 -349589 -478294 -512882 -43166
776d3166Q9967J38424o3397j9487J12144J47509J11698m30013J63858o0774j19557
$$ -43166 46801 185225 121828 102341 214485 361994 473692 43679 207537 146763 27206
765B7206J0081K28821k14601K298J63839Q2269m1140r3839R297J60968J9279k01273
$$ 27206 37287 266108 51507 53805 217644 299913 258773 164934 174231 335199 354478 153205
753A53205m7064J88970k00848J96411j72234p0302K29195L52125l62699n62643
$$ 153205 106141 295111 94263 290674 118440 48138 277333 629458 266759 -295884
743b95884K86334j82375k86285L58721K85360k50155J67275K39752j61650j48425
$$ -295884 -9550 -191925 -478210 -119489 165871 -84284 82991 322743 161093 12668
733A2668K04240j54146K10399q6646K0546l69378j7941L7082M81958k4619l09863
$$ 12668 216908 62762 273161 186515 207061 -162317 -180258 -143176 338782 314163 4300
722D300J43337J73900N2942L1953k03003j01902q8350k8257J56609k28345p1930
$$ 4300 147637 321537 374479 406432 203429 101527 13177 -15080 141529 -86816 -158746
711a58746O4705K31908k49951k41587K44881L06880J6069q0899L03782O6354n6293
$$ -158746 -94041 137867 -112084 -353671 -108790 198090 214159 133260 437042 503396 447103
700D47103j36966O3243K00851J67247m67493k56603M3435J39582j26768p0705
$$ 447103 310137 373380 574231 741478 273985 17382 60817 200399 73631 2926
690B926J2781L55676L02132k06782l06123K41527j98483k33588j37240N6340J93933
$$ 2926 15707 371383 673515 466733 160610 402137 203654 -29934 -167174 -110834 83099
679H3099L15768k45561k19773q8034l4141l7430M3074K94526k80277Q5196J04013
$$ 83099 398867 153306 -66467 -154501 -188642 -226072 -182998 111528 -168749 -83553 20460
668B0460J96901J10955J9670j79968l03771j45692N6268p27N35844J7134j92032
$$ 20460 217361 328316 347986 168018 -135753 -281445 -225177 -225904 309940 327074 135042
657A35042m68544M55205o9377n9128N63391j44751k09167j59777j83845J09122
$$ 135042 -333502 121703 52326 -6802 556589 411838 202671 42894 -140951 -31829
647c1829k53697K55353J89879J23729M5029J17935p2691o40068R2881L71327K35911
$$ -31829 -285526 -30173 159706 283435 328464 446399 373708 -266360 -173479 197848 433759
636D33759o7853k75723K863J48380j44712R3086L88319k63056k22885L82083k21220
$$ 433759 365906 90183 93046 241426 96714 189800 578119 315063 92178 474261 253041
625B53041l3612j97754J13217k32957o7063m4218L66146J62827J13621n10387
$$ 253041 219429 21675 134892 -98065 -165128 -209346 156800 319627 433248 -77139
615g7139Q5302m6678n60N67992M81125l89921q09355J28787j92420J94513K92449
$$ -77139 8163 -38515 -39075 528917 1010042 620121 -189234 -60447 -252867 -58354 234095
604B34095J1869j49779P3031M7784M6071l38124J86087L97117J6412m76779k96854
$$ 234095 245964 96185 169216 217000 263071 -75053 111034 508151 524563 47784 -249070
593b49070m33569J09316j41986K79446K90854j13569K00110j17266j93455L07564
$$ -249070 -682639 -573323 -715309 -435863 -145009 -258578 -58468 -175734 -369189 -61625
583f1625r5033M69639j95580j36556K5121k20735K20148J87895L55313j27689
$$ -61625 -156658 312981 117401 -19155 5966 -214769 5379 193274 548587 420898
573D20898m29374p7803l3897K12871O68115M2691o41089n51535M92427L19351
$$ 420898 -8476 -86279 -120176 92695 760810 803501 162412 -389123 103304 422655
$$ [...]
##END NTUPLES=NMR SPECTRUM
##END=
