##TITLE=1H_TG-2341-A21
 CDCl3
 8 sc, 
 29.08.2022
##JCAMPDX= 6.0         $$ Bruker NMR JCAMP-DX V2.0
##DATA TYPE= NMR SPECTRUM
##DATA CLASS= NTUPLES
##ORIGIN= UXNMR, Bruker Analytische Messtechnik GmbH
##OWNER= root
$$ XWIN-NMR		Version 3.5
$$ Mon Aug 29 10:08:59 2022 Russian Standard Time (UT+4h)  she@DPX200
##.OBSERVE FREQUENCY= 200.1313499994
##.OBSERVE NUCLEUS= ^1H
##.ACQUISITION MODE= SIMULTANEOUS
##.ACQUISITION SCHEME= undefined
##.AVERAGES= 8
##.DIGITISER RES= 18
##SPECTROMETER/DATA SYSTEM= spect
##.PULSE SEQUENCE= zg30
##.SOLVENT NAME= DMSO
##.SHIFT REFERENCE= (INTERNAL, DMSO, 0, 15.7469)
##AUDIT TRAIL= $$ (NUMBER, WHEN, WHO, WHERE, WHAT)
$$ ##TITLE= Audit trail, XWIN-NMR		Version 3.5
$$ ##JCAMPDX= 5.01
$$ ##ORIGIN= Bruker BioSpin GmbH
$$ ##OWNER= she
$$ F:/spectra/data/she/nmr/H-F/1/pdata/1/auditp.txt
$$ ##AUDIT TRAIL=  $$ (NUMBER, WHEN, WHO, WHERE, WHAT)
(   1,<2022-08-29 10:07:41.17 +0400>,<she>,<DPX200>,
      <created by zg, POWCHK disabled, PULCHK disabled
       configuration hash MD5:
       00 E9 B6 7A A2 85 ED C7 34 08 36 98 17 FE 4E 26
       data hash MD5: 16K
       44 95 81 1D 67 76 C0 BB 3C D9 24 CC 69 10 1B D5>)
(   2,<2022-08-29 10:07:43.53 +0400>,<she>,<DPX200>,
      <Start of raw data processing
       efp BC_mod = 2 LB = 0.24 FT_mod = 6 PKNL = 1 PHC0 = -18034.88 PHC1 = 7.600691 SI = 16K 
       data hash MD5: 16K
       41 DC C1 83 8F 48 06 A3 7D 89 8A BD DA BC 22 AD>)
(   3,<2022-08-29 10:08:02.56 +0400>,<she>,<DPX200>,
      <pk PHC0 = -1.138021 PHC1 = 3.2 
       data hash MD5: 16K
       35 86 27 76 E8 30 B4 4D 56 DE CB 69 7A 6A A4 13>)
(   4,<2022-08-29 10:08:05.57 +0400>,<she>,<DPX200>,
      <abs ABSG = 5 
       data hash MD5: 16K
       AE 0E A3 62 97 1A B8 1B 8D 5D FF 2C F1 96 6B E3>)
$$ ##END=
$$ 
$$ hash MD5
$$ 24 D5 DB DC A4 89 CD 19 43 20 BD 61 FA 56 E6 D8
##$RELAX= 
##$RELAX= 
##$RELAX= 
##$RELAX= 
##$RELAX= 
##$RELAX= 
$$ Bruker specific parameters
$$ --------------------------
##$DU= <F:/spectra>
##$EXPNO= 1
##$NAME= <H-F>
##$PROCNO= 1
##$TYPE= <nmr>
##$USER= <she>
##$AMP= (0..31)
100 100 100 100 100 100 100 100 100 100 100 100 100 100 100 100 100 100 
100 100 100 100 100 100 100 100 100 100 100 100 100 100 
##$AQSEQ= 0
##$AQ_mod= 1
##$AUNM= <au_zg>
##$AUTOPOS= <>
##$BF1= 200.13
##$BF2= 200.13
##$BF3= 200.13
##$BF4= 200.13
##$BF5= 200.13
##$BF6= 200.13
##$BF7= 200.13
##$BF8= 200.13
##$BYTORDA= 1
##$CFDGTYP= 0
##$CFRGTYP= 5
##$CHEMSTR= <none>
##$CNST= (0..31)
1 1 145 1 1 1 1 1 1 1 1 1 1 1 1 1 1 1 1 1 1 1 1 1 1 1 1 1 1 1 1 1 
##$CPDPRG= <>
##$CPDPRG1= <>
##$CPDPRG2= <>
##$CPDPRG3= <>
##$CPDPRG4= <mlev>
##$CPDPRG5= <mlev>
##$CPDPRG6= <mlev>
##$CPDPRG7= <mlev>
##$CPDPRG8= <mlev>
##$CPDPRGB= <>
##$CPDPRGT= <>
##$D= (0..31)
0 1.2 0 0 0 0 0 0 0 0.06 0 0.03 0 0 0 0 0.0002 0 0 0 0 0 0 0 0 0 0 0 0 
0 0 0 
##$DATE= 1661753260
##$DBL= (0..7)
120 120 120 120 120 120 120 120 
##$DBP= (0..7)
150 150 150 150 150 150 150 150 
##$DBP07= 0
##$DBPNAM0= <>
##$DBPNAM1= <>
##$DBPNAM2= <>
##$DBPNAM3= <>
##$DBPNAM4= <>
$$ [...]
##$SUBNAM3= <"">
##$SUBNAM4= <"">
##$SUBNAM5= <"">
##$SUBNAM6= <"">
##$SUBNAM7= <"">
##$SUBNAM8= <"">
##$SUBNAM9= <"">
##$SW= 18.0517283424941
##$SWIBOX= (0..15)
0 0 2 0 0 0 0 0 0 0 0 0 0 0 0 0 
##$SW_h= 3612.71676300578
##$TD= 16384
##$TD0= 1
##$TE= 0
##$TE2= 300
##$TE3= 300
##$TEG= 300
##$TL= (0..7)
0 120 120 120 120 120 120 120 
##$TP= (0..7)
150 150 150 150 150 150 150 150 
##$TP07= 0
##$TPNAME0= <>
##$TPNAME1= <>
##$TPNAME2= <>
##$TPNAME3= <>
##$TPNAME4= <>
##$TPNAME5= <>
##$TPNAME6= <>
##$TPNAME7= <>
##$TPOAL= (0..7)
0.5 0.5 0.5 0.5 0.5 0.5 0.5 0.5 
##$TPOFFS= (0..7)
0 0 0 0 0 0 0 0 
##$TUNHIN= 0
##$TUNHOUT= 0
##$TUNXOUT= 0
##$USERA1= <user>
##$USERA2= <user>
##$USERA3= <user>
##$USERA4= <user>
##$USERA5= <user>
##$V9= 5
##$VALIST= <valist>
##$VCLIST= <CCCCCCCCCCCCCCC>
##$VD= 0
##$VDLIST= <DDDDDDDDDDDDDDD>
##$VPLIST= <PPPPPPPPPPPPPPP>
##$VTLIST= <TTTTTTTTTTTTTTT>
##$WBST= 1024
##$WBSW= 4
##$XGAIN= (0..3)
0 0 0 0 
##$XL= 0
##$YL= 0
##$YMAX_a= 674260
##$YMIN_a= -1034048
##$ZGOPTNS= <>
##$ZL1= 120
##$ZL2= 120
##$ZL3= 120
##$ZL4= 120
##$ABSF1= 15.75681
##$ABSF2= -2.295039
##$ABSG= 5
##$ABSL= 3
##$ALPHA= 0
##$AQORDER= 0
##$ASSFAC= 0
##$ASSFACI= 0
##$ASSFACX= 0
##$ASSWID= 0
##$AUNMP= <proc_1d>
##$AZFE= 0.1
##$AZFW= 0.1
##$BCFW= 0
##$BC_mod= 2
##$BYTORDP= 0
##$COROFFS= 0
##$CY= -3
##$DATMOD= 1
##$DC= 0
##$DFILT= <>
##$DTYPP= 0
##$F1P= 0
##$F2P= 0
##$FCOR= 1
##$FTSIZE= 16384
##$FT_mod= 6
##$GAMMA= 0
##$GB= 0
##$INTBC= 1
##$INTSCL= 1.705223e-09
##$ISEN= 128
##$LB= 0.24
##$LEV0= 0
##$LPBIN= 0
##$MAXI= 10000
##$MC2= 0
##$MEAN= 0
##$ME_mod= 0
##$MI= 1.114404
##$NCOEF= 0
##$NC_proc= -5
##$NLEV= 6
##$NOISF1= 3.799351
##$NOISF2= 2.8
##$NSP= 0
##$NTH_PI= 0
##$NZP= 0
##$OFFSET= 15.74689
##$PC= 1
##$PHC0= -18036.02
##$PHC1= 10.80069
##$PH_mod= 1
##$PKNL= yes
##$PPARMOD= 0
##$PSCAL= 0
##$PSIGN= 0
##$REVERSE= no
##$SF= 200.13000493269
##$SI= 16384
##$SIGF1= 3
##$SIGF2= 2
##$SINO= 5.538805
##$SIOLD= 16384
##$SREGLST= <1H.CDCl3>
##$SSB= 0
##$STSI= 16384
##$STSR= 0
##$SW_p= 3612.71676300578
##$SYMM= 0
##$S_DEV= 0
##$TDeff= 16384
##$TDoff= 0
##$TI= <>
##$TILT= no
##$TM1= 0
##$TM2= 0
##$TOPLEV= 0
##$USERP1= <user>
##$USERP2= <user>
##$USERP3= <user>
##$USERP4= <user>
##$USERP5= <user>
##$WDW= 1
##$XDIM= 16384
##$YMAX_p= 300400078
##$YMIN_p= -889315
$$ End of Bruker specific parameters
$$ ---------------------------------
##NTUPLES= NMR SPECTRUM
##VAR_NAME=  FREQUENCY,     SPECTRUM/REAL,   SPECTRUM/IMAG
##SYMBOL=    X,             R,               I
##VAR_TYPE=  INDEPENDENT,   DEPENDENT,       DEPENDENT
##VAR_FORM=  AFFN,          ASDF,            ASDF
##VAR_DIM=   16384,         16384,           16384
##UNITS=     HZ,            ARBITRARY UNITS, ARBITRARY UNITS
##FACTOR=    0.220516191357247, 1,           1
##FIRST=     3151.42518699421, 0,            0
##LAST=      -461.291576011566, 0,           0
##MIN=       -461.291576011566, -889315,     0
##MAX=       3151.42518699421, 300400078,    0
$$ Real data points
##PAGE= N=1
##DATA TABLE= (X++(R..R)), XYDATA
$$ [...]
7226C47996n2525k5299K7433O1582J3401L8733k0585J1826J6794k0378p249j7261
$$ 347996 295471 270172 297605 359187 372588 411321 390736 402562 419356 398978 391729 374468
7214C74468Q616o62J9757j6852J7083k890J2328M2583k3311l6741L2440N2714
$$ 374468 383084 382422 402179 385327 402410 399520 411848 454431 431120 394379 426819 479533
7202D79533k9768j2949M6085M7228j2489J3615m75J6236K4625j5265L5893J8888
$$ 479533 449765 436816 482901 530129 517640 531255 530780 547016 571641 556376 592269 611157
7190F11157L5928k1243K7364N4858K3812O33M284m763k4053J2439M924J6327K4566
$$ 611157 647085 625842 653206 708064 731876 732509 736793 732030 707977 720416 725340 741667 766233
7177G66233k5205k426K042l4634P1388j1669k0142M3576L4476m522J8225O3798
$$ 766233 741028 738602 740644 706010 777398 765729 745587 789163 823639 819117 837342 901140
7165I01140J0627M9447M069j8539L8886L6335P7260M3519J5881L781J1995O3765
$$ 901140 911767 961214 965283 946744 985630 1021965 1099225 1142744 1158625 1162406 1174401 1238166
7153A238166Q7803M3941K4505P6962O9172k3832J6730K1966J6907L3198O0872
$$ 1238166 1325969 1369910 1394415 1471377 1540549 1516717 1533447 1555413 1572320 1605518 1666390
7142A666390O0525K1674L5082N2979L0373j7399L6588M7761L4716P5836R3137
$$ 1666390 1726915 1748589 1783671 1836650 1867023 1849624 1886212 1933973 1968689 2044525 2137662
7131B137662J8395n768P3865M8729J2975J05901P3182n015O9290J02075O9158
$$ 2137662 2156057 2150289 2224154 2272883 2285858 2391759 2464941 2459926 2529216 2631291 2700449
7120B700449M3013Q8408J22650Q7643O4044J2068P1806K07629R5976P0995J04171
$$ 2700449 2743462 2831870 2954520 3042163 3106207 3118275 3190081 3397710 3493686 3564681 3668852
7109C668852Q8463J22162J59662J31397J15000J94973J62308J19716J84261K12318
$$ 3668852 3757315 3879477 4039139 4170536 4285536 4480509 4642817 4762533 4946794 5159112
7099E159112J82151K63411K57065K26696K69035K93314L31184K48222K27875J28243
$$ 5159112 5341263 5604674 5861739 6088435 6357470 6650784 6981968 7230190 7458065 7586308
7089G586308Q3260J01185N1832L2145J69314J70295J68575K27108K70129L06189
$$ 7586308 7669568 7770753 7822585 7854730 8024044 8194339 8362914 8590022 8860151 9166340
7079I166340L21751L43215L20286M11418L56690M90690N40709M83994N97982Q17251
$$ 9166340 9488091 9831306 10151592 10563010 10919700 11410390 11951099 12435093 13033075 13850326
7069A3850326R69751J023940J208177J474447J681175J983977K279968K600914
$$ 13850326 14820077 15844017 17052194 18526641 20207816 22191793 24471761 27072675
7061B7072675K999396L259018L742765M069050M015472L267482K008326N89789
$$ 27072675 30072071 33331089 37073854 41142904 45158376 48425858 50434184 51023973
7053E1023973q25310j849368k681110l437274m072910m246070m077029l411942
$$ 51023973 50198663 48349295 45668185 42230911 38158001 33911931 29834902 26422960
7045B6422960k684268k064879j514704j097687q77333o25133m15501k92172j34241
$$ 26422960 23738692 21673813 20159109 19061422 18184089 17558956 17143455 16851283 16717042
7036A6717042m6976J01413K81433M49989O03633P82190R77602J179310J480823
$$ 16717042 16670066 16771479 17052912 17502901 18106534 18888724 19866326 21045636 22526459
7027B2526459J745329K030085K338543K743945L082964L491631L599142L358278
$$ 22526459 24271788 26301873 28640416 31384361 34467325 37958956 41558098 44916376
7019D4916376K819957K233625J550174N21061n30877j725010k781055l522372
$$ 44916376 47736333 49969958 51520132 52041193 51510316 49785306 47004251 43481879
7011D3481879l908244m152950m082225l907202l548825l086292k546172j965745
$$ 43481879 39573635 35420685 31338460 27431258 23882433 20796141 18249969 16284224
7003A6284224j589997j303097j145906r75623q33049p70804o07416n57232m98495
$$ 16284224 14694227 13391130 12245224 11269601 10436552 9665748 9058332 8501100 8002605
6994H002605m58570m27269l81648l57682k94580l12335k65621k09083k12291k67755
$$ 8002605 7544035 7116766 6735118 6377436 6082856 5770521 5504900 5295817 5083526 4815771
6984D815771k08684j71989j45038k15532j69986j89734j00945o9858j46195j85831
$$ 4815771 4607087 4435098 4290060 4074528 3904542 3714808 3613863 3544005 3397810 3211979
6974C211979j27751n0604m5514k9930r9630q0821p8334l7076r2279k210k4813
$$ 3211979 3084228 3033624 2988110 2958180 2858550 2777729 2699395 2662319 2570040 2567830 2543017
6963B543017n9301J5848L356j9386M4573J6437O89K1879M1346O8769J33708J01696
$$ 2543017 2483716 2499564 2502920 2483534 2528107 2544544 2545233 2567112 2608458 2677227 2810935 2912631
6951B912631J10291J56423R8827P7014R1587J3209o5818o9703j22988j52131j30746
$$ 2912631 3022922 3179345 3278172 3355186 3446773 3459982 3394164 3324461 3201473 3049342 2918596
6940B918596j59315k10604k86595k22853j25252j43563j56699j20256k4985q4364
$$ 2918596 2759281 2548677 2262082 2039229 1913977 1770414 1613715 1493459 1468474 1384110
6930A384110j06662k0744o2217l6392m8701j6345k0223o0299k6714j2463m6774
$$ 1384110 1277448 1256704 1194487 1158095 1109394 1093049 1072826 1012527 985813 973350 926576
6919I26576k7215l4262J6004m8826l8885J0264J8300j571n7698j3794l0776l0133
$$ 926576 899361 865099 881103 832277 793392 803656 821956 820385 762687 748893 718117 687984
6907F87984j3021m9443K5000J9920q577p830J8932m2204m4021k5982j6066L5584
$$ 687984 674963 625520 650520 670440 661863 654033 672965 630761 586740 560758 544692 580276
6895E80276k2692j0365J0049n2895k6632p327m398K3824k2818J7275j0338n0274
$$ 580276 557584 547219 557268 504373 477741 470414 466016 489840 467022 484297 473959 423685
6883D23685r74l001m8890k2858q611k2962J1419K1920r259N633j2633n0714R694
$$ 423685 422711 419710 370820 347962 339351 316389 327808 349728 340469 346102 333469 282755 292449
6870B92449L3174K6553o837o9319J5974J661l7763n906N9967K9736K6428o0402
$$ 292449 325623 352176 345339 276020 291994 293655 255892 249986 309953 339689 366117 305715
6858C05715m8424m2170r449j095l0516R137o021k5028J6146j7252l7256L073L1674
$$ 305715 257291 215121 205672 204577 174061 183198 177177 152149 168295 151043 113787 116860 148534
6845A48534L6723L4439Q48k3000p1865k0677J3439L0732L008j2781J9286l3439
$$ 148534 185257 219696 220544 197544 125679 105002 118441 149173 152181 139400 158686 125247
6833A25247j5825J2934O518J3507k5565J3293K8615l2837J84N748j8840K20l4024
$$ 125247 109422 122356 128874 142381 116816 130109 158724 125887 126071 131819 112979 113199 79175
6820G9175N7584l0510J2243J7591k8662j3488J3008l7270m551K2676K0812j5120
$$ 79175 136759 106249 118492 136083 107421 93933 106941 69671 65120 87796 108608 93488
6808I3488k5783k9400P241j5716K2447J7220n1859K6171P2384l3237J0805P2914
$$ 93488 67705 38305 45546 29830 52277 69497 17638 43809 116193 82956 93761 166675
6796A66675j23924k10K1430n4368l9108O5963q892K9125n895k724M0925j0686
$$ 166675 42751 42541 63971 9603 -29505 36458 27566 56691 50796 48072 88997 78311
6784G8311m696j1208p562L2750q875k2000j1959M9021j3302r703m632J3911k7860
$$ 78311 73615 62407 54845 87595 78720 56720 44761 93782 80480 70777 66145 80056 52196
6771E2196l7232p91M4264J7741J0876P942m9995J8239l7367n154L3409M527j4261
$$ 52196 14964 14173 58437 76178 87054 94996 45001 63240 25873 20719 54128 58655 44394
6758D4394r966J5295J7697Q084o2334Q265J8054m2367L0697J2227J176l0033n082
$$ 44394 34428 49723 67420 75504 13170 21435 39489 -2878 27819 40046 41222 11189 6107
6745F107k3715K3533J5427N4995k2192o7779r647l5158O8665M4634n0490N401
$$ 6107 -17608 5925 21352 76347 54155 -13624 -23271 -58429 10236 54870 4380 9781
6733I781M9975J9565O946j5530L1626o1795l1730K2404K0410O452K107j1834K3828
$$ 9781 59756 79321 86267 70737 102363 40568 8838 31242 51652 58104 60211 48377 72205
6720G2205j0147m4351j7856L1684m960K3037l4918L4844J522o0020K8594k6865
$$ 72205 62058 17707 -149 31535 26575 49612 14694 49538 51060 -8960 19634 -7231
6708g231J6232M1716k4233k0166k4366R2046k1212k6736K2073o787J6211K3243
$$ -7231 9001 50717 26484 6318 -18048 73998 52786 26050 48123 41336 57547 80790
6696H0790l611Q065m8065K5645j006j1738m322k2906K763M8270j4052j264O4549
$$ 80790 77179 85244 37179 62824 61818 50080 45758 22852 25615 73885 59833 58569 123118
6683A23118n0751l6562l4943J554L4670k3791J3071O0094l4360j4097j7648P656
$$ 123118 72367 35805 862 2416 37086 13295 26366 86460 52100 38003 20355 28011
6671B8011J5024M2980l3144L2847m4129k6419P0161J3512J9498M2291K2948N4551
$$ 28011 43035 86015 52871 85718 41589 15170 85331 98843 118341 160632 183580 238131
6659B38131j9901M6234j4803r776l1896O4423o790j6682k732j3910J4349n1554
$$ 238131 218230 264464 249661 239885 207989 272412 265622 248940 246208 232298 246647 195093
6647A95093J6978R314n1610l6241l6268R832j6528m161l8247j3120P3156J3997
$$ 195093 212071 221385 169775 133534 97266 107098 90570 86409 48162 35042 108198 122195
6635A22195Q376l6303J5090N3157m365k4503j1110K9856J8112o353J1349L6454
$$ 122195 130571 94268 109358 162515 158150 133647 122537 152393 170505 164152 175501 211955
6623B11955J3992p153J931L5425j1368j9560O5027K3487k1944M603m5046J0685
$$ 211955 225947 218794 220725 256150 244782 225222 290249 313736 291792 296395 251349 262034
6611B62034j8843l8872k4226J0142l0230l6176j6682K0888N290k1227j1284m4683
$$ 262034 243191 204319 180093 190235 160005 123829 107147 128035 133325 112098 100814 56131
6599E6131l7212K7119K693p698M8373l3016k57J7058o83Q998J1665k5216o9567
$$ 56131 18919 46038 48731 41033 89406 56390 56133 73191 72508 81506 93171 67955 -1612
6586a612k3737K6358k3879J6485K1256M7057q4726k7082M7957q557K2748j8093
$$ -1612 -25349 1009 -22870 -6385 14871 61928 -22798 -49880 -1923 -10480 12268 -5825
6574e825l53K3914o186j5526J7932M9335J8947k3909m1812l531o0618j4015q882
$$ -5825 -6178 17736 11550 -3976 13956 63291 82238 58329 16517 12986 -47632 -61647 -70529
6561g0529L6156R549o352j2491M5147k5494j0403l0340L6274M5787j4691m510
$$ -70529 -34373 -24824 -31176 -43667 1480 -24014 -34417 -64757 -28483 17304 2613 -1897
6549a897n9514k5344M1109K7953k6932j7519j2345o1336L6518M5738l7087r267
$$ -1897 -61411 -86755 -45646 -17693 -44625 -62144 -74489 -135825 -99307 -53569 -90656 -99923
6537i9923J8362J71j7413j0197j6846N4002O396j9558J149J7327j5478N0678n7259
$$ -99923 -81561 -81390 -98803 -109000 -125846 -71844 -65448 -85006 -83857 -66530 -82008 -31330 -88589
6524h8589n2174R016N0890M5721K6271k7428k3940L182K1340j7461j6160k1130
$$ -88589 -140763 -131747 -80857 -35136 -8865 -36293 -60233 -57051 -35711 -53172 -69332 -90462
6512i0462j4974O8164K0307J5293l8943m3191j9319P285r151N7507L6538j4909
$$ -90462 -105436 -37272 -16965 -1672 -40615 -83806 -103125 -95840 -104991 -47484 -10946 -25855
6500b5855j2211M7668l5734k4705m7741L801O435o827O340K2735L5743m3795j9508
$$ -25855 -38066 9602 -26132 -50837 -98578 -94777 -88342 -95169 -88829 -66094 -30351 -74146 -93654
6487i3654O493L6768p703R970J858N0J7499n4185l744M2497J9151j0625j4706
$$ -93654 -87161 -50393 -58096 -48126 -46268 -46218 -28719 -82904 -86648 -44151 -25000 -35625 -50331
6474e0331M4355L7468O520n965P435J9590n5659L7706J3454L8333r877Q663K3521
$$ -50331 -5976 31492 38012 32047 39482 59072 3413 41119 54573 92906 83029 91692 115213
6461A15213l9123j1233j7165R811j2829j1555n5124J8015K9897n882l5942j8875
$$ 115213 76090 64857 47692 57503 44674 33119 -22005 -3990 25907 20025 -15917 -34792
6449c4792M908L7708K0509R043k8003O1545n6911r480J6366L5169N683K447m053
$$ -34792 -29884 7824 28333 37376 9373 70918 14007 4527 20893 56062 61745 64192 60139
6436F0139N669l0081m0084j30l10J5912O514L5452m8461n9309J5200q031P72M581
$$ 60139 65808 35727 -4357 -4487 -4797 11115 17629 53081 4620 -54689 -39489 -47520 -46748 -42167
6422d2167M720m15R709N6982L1066n7876L3L2974j6405L41P457m5405o314L0764
$$ -42167 -37447 -37862 -28153 28829 59895 2019 2052 35026 18621 18962 26419 -18986 -25300 5464
6408E464L4069P281j8310L684n5093p940K3683J0403k0391j5399J6252J6241K0628
$$ 5464 39533 46814 28504 32188 -22905 -30845 -7162 3241 -17150 -32549 -16297 -56 20572
6395B0572K7495J4483j2890Q590K6890l440j2464j5280K8849O024j9365J3325
$$ 20572 48067 62550 49660 58250 85140 81700 69236 53956 82805 88829 69464 82789
6383H2789n809m4261n586J0140k7394L9452M8177q623j1182l4781K2062o295k3365
$$ 82789 76980 32719 27133 37273 9879 49331 97508 88885 77703 42922 64984 58689 35324
6370C5324m1062L1032N8708k3789l3427k1263J8628J1865O153J30P879K5900k1733
$$ 35324 -5738 25294 84002 60213 26786 5523 24151 36016 42169 42299 50178 76078 54345
6357E4345m8864J4785k2681N4037M4616j077l2595L803K3883m783N5807m5157
$$ 54345 5481 20266 -2415 51622 96238 95161 62566 66369 90252 85469 141276 96119
6345I6119j9156J4828J6443O059l8837l1111K3005l384M1129j9527k4032K5428
$$ 96119 76963 91791 108234 114293 75456 44345 67350 63966 105095 85568 61536 86964
6333H6964K0205k2699j4120K9357J8926L4679j6705k5526N4477n8243L8564N8409
$$ 86964 107169 84470 70350 99707 118633 153312 136607 111081 165558 107315 145879 204288
6321B04288q026q3416K069L3065J9283J5896n5833L1448J2800k9068K0816q853
$$ 204288 196262 112846 114915 147980 167263 183159 127326 158774 171574 142506 163322 154469
6309A54469R08m916K356J8035k0687l5833j5301K9516j8163K7687L6775N9058
$$ 154469 155377 150461 152817 170852 150165 114332 99031 128547 110384 138071 174846 233904
6297B33904l0661L658r965n1989L3379k493J560l920P757L7256k6934K4243l0370
$$ 233904 203243 206901 196936 144947 178326 175833 177393 173473 181230 218486 191552 215795 185425
6284A85425j1039K7181L7635o3983j0127J3402L5172K624j846L3760M786l4314
$$ 185425 174386 201567 239202 175219 165092 178494 213666 216290 214444 248204 252990 218676
6272B18676m6894K8650R041L2522J5212l2352k4889M4049l4445K0020j3953k6198
$$ 218676 171782 200432 209473 241995 257207 224855 199966 244015 209570 229590 215637 189439
6260A89439N338P7L7288K798K4033N3791k1422J0847K4775L4964K3883R722m4379
$$ 189439 194777 194854 232142 234940 258973 312764 291342 302189 326964 361928 385811 395533 351154
6247C51154l2072N2236o818L1731L1418l5997l4803J7751L1720l4522l8899K3279
$$ 351154 319082 371318 364500 396231 427649 391652 356849 374600 406320 371798 332899 356178
6235C56178M8524L668k071j2304J8974M2585j5987j2340k0837K1981l0028N8592
$$ 356178 404702 408370 406299 393995 412969 455554 439567 427227 406390 428371 398343 456935
6223D56935j519n6199l951M982J9015m0950p00M0162l2998k6024j3055q190Q239
$$ 456935 455416 399217 395266 400248 419263 378313 377613 417775 384777 358753 345698 337508 345747
6210C45747J9269l5448k0530M7610q7738O564K7824J0231O12j0574j206N494P704
$$ 345747 365016 329568 309038 356648 268910 275474 303298 313529 314141 303567 302361 307855 315559
6197C15559K6368m905J2471K5051N010j0555k9267m519j1224p812M3603L6978
$$ 315559 341927 337022 349493 374544 379554 368999 339732 335213 323989 316177 359780 396758
6185C96758n1519k693J2825K4382K9760J8664J4104k5720m3945M1076M9336J3433
$$ 396758 345239 342546 355371 379753 409513 428177 442281 416561 372616 413692 463028 476461
6173D76461j3700M018l2475k2912R766K4237m354k2702j0387L5610n825j0605
$$ 476461 462761 466779 434304 411392 421158 445395 441041 418339 407952 443562 437737 427132
6161D27132N8663m356j5548K0908j6251M2334K7763L4562n2763k2936O1738N452
$$ 427132 485795 481439 465891 486799 470548 512882 540645 575207 522444 499508 561246 566698
6149E66698j5292J2030j8770n902Q229m2698K8762j0508k2540J6032P8187j5879
$$ 566698 551406 563436 544666 538764 546993 504295 533057 522549 500009 516041 594228 578349
6137E78349j1316J2659L5658o122j9353L5247J7180k2343j2215O815M5196K3452
$$ 578349 567033 579692 615350 609228 589875 625122 642302 619959 607744 614559 659755 683207
6125F83207K4278N737n1810j6420O0031N2970K681Q617k4345j4674P2305l1295
$$ 683207 707485 713222 661412 644992 705023 757993 760674 769291 744946 730272 802577 771282
6113G71282q228N8157j7555N9860k4797p570N0729l253j2640j5064J4943J6543
$$ 771282 763054 821211 803656 863516 838719 831149 881878 878625 865985 850921 865864 882407
6101H82407l211o5418O8056L3015k4737J0350K750M5635J477J3705L8697M4097
$$ 882407 879196 813778 881834 914849 890112 900462 903212 948847 950324 964029 1002726 1046823
6089A046823l9095K5531N767j3936N79L536l7308M5543K5970k3405K0443J7602
$$ 1046823 1007728 1033259 1039026 1025090 1025669 1029205 991897 1037440 1063410 1040005 1060448 1078050
6077A078050m6628L2436M9937l7137K4392J0209l407N999O5144m4299j3990L2039
$$ 1078050 1031422 1063858 1113795 1076658 1101050 1111259 1107852 1113851 1178995 1134696 1120706 1152745
6065A152745j6771p0659M3746M1974R696J6819l7038M634J7124M2300K8773M166
$$ 1152745 1135974 1065315 1109061 1151035 1160731 1177550 1140512 1145146 1162270 1204570 1233343 1237509
6053A237509q215K6696N0402q288p416K957j7347L5187l2956l3761L8931J6316
$$ 1237509 1229294 1255990 1306392 1298104 1290688 1293645 1276298 1311485 1278529 1244768 1283699 1300015
6041A300015M077J65Q460L8317L7607m2286j6266q435K9885L2680j249j4347j9668
$$ 1300015 1304092 1304257 1312717 1351034 1388641 1346355 1330089 1321654 1351539 1384219 1382970 1368623 1348955
6028A348955O9657j4793l9028L3351l318L3021L4572j19j0635K6754j1025P1940
$$ 1348955 1418612 1403819 1364791 1398142 1394824 1427845 1462417 1462298 1451663 1478417 1467392 1539332
6016A539332N0819Q235j4548k6623J7257M8998r186k1907K462k8141j7555P1966
$$ 1539332 1590151 1598386 1583838 1557215 1574472 1623470 1614284 1592377 1594839 1566698 1549143 1621109
6004A621109R0826L4576J333o4694L6677L1264K8011J2704K6924R8631k2418R623
$$ 1621109 1711935 1746511 1747844 1683150 1719827 1751091 1779102 1791806 1818730 1917361 1894943 1904566
5992A904566P8639p212J2364K9943J0238K5099M7443n158J7745l376L0283L9065
$$ 1904566 1983205 1975993 1988357 2018300 2028538 2053637 2101080 2095922 2113667 2110291 2140574 2179639
5980B179639J09k2643K7721N1842K0100p845K1696L7231J6407j6488P9793J5912
$$ 2179639 2179748 2157105 2184826 2236668 2256768 2248923 2270619 2307850 2324257 2307769 2387562 2403474
5968B403474k6352J5769l7568L2941j1586K7981K4667L0762N1712j1493J4498
$$ 2403474 2377122 2392891 2355323 2388264 2376678 2404659 2429326 2460088 2511800 2500307 2514805
5957B514805L0105l981O9189O6747J6037j0901o104M9577R7462J04274L9790N8897
$$ 2514805 2544910 2540929 2610118 2676865 2692902 2682001 2675897 2725474 2822936 2927210 2967000 3025897
5945C025897K8749q306m2336P826M3495k1527K4531L1116l1908J9080J8586k074
$$ 3025897 3054646 3046340 3004004 3011830 3055325 3033798 3058329 3089445 3057537 3076617 3095203 3093129
5933C093129K8460K8846P8410N5341M7449Q7012l979N4519N2918Q3528l4017O023
$$ 3093129 3121589 3150435 3228845 3284186 3331635 3418647 3414668 3469187 3522105 3605633 3571616 3577639
5921C577639N0941l389M4969J45806M0135m2190M3981P3280N7594P047J2085J0271
$$ 3577639 3628580 3625191 3670160 3815966 3856101 3813911 3857892 3931172 3988766 3995813 4007898 4018169
5909D018169M3274Q672O9324L1144K7526m9872j1518M7288K2184L992M3663m6002
$$ 4018169 4061443 4070115 4139439 4170583 4198109 4148237 4136719 4184007 4206191 4210183 4253846 4207844
5897D207844L7163K924m21j0039k4O5713L2132Q814K6806P3617K1715L0416O5846
$$ 4207844 4245007 4247931 4247510 4237471 4237447 4303160 4335292 4344106 4370912 4444529 4466244 4496660 4562506
5884D562506K3950K2077k306M8761l8073l0137K5442m1467L7391l1350n6484l1529
$$ 4562506 4586456 4608533 4606227 4654988 4616915 4586778 4612220 4570753 4608144 4576794 4520310 4488781
5872D488781k2211P861N9120o1352O8557K2900k2784J1622J019L4424Q6536P6419
$$ 4488781 4466570 4474431 4533551 4472199 4540756 4563656 4540872 4552494 4553513 4587937 4674473 4750892
5860D750892M6248M88P0805K2585k0671M3408L4215L531M5623P9720m3299O2103
$$ 4750892 4797140 4797628 4868433 4891018 4870347 4913755 4947970 4951501 4997124 5076844 5033545 5095648
5848E095648M6018J3529L2155M8483N2526O6536P0691L3008P0953Q3507M0032
$$ 5095648 5141666 5155195 5187350 5235833 5288359 5354895 5425586 5458594 5529547 5613054 5653086
5837E653086N2945M9673O9700P1382O0506Q7511R3619J19621O9155P9284Q8887
$$ 5653086 5706031 5755704 5825404 5896786 5957292 6044803 6138422 6258043 6327198 6406482 6495369
5826F495369M0594R3858J02287J45726Q1367N0739J14681J41723J60205J10523
$$ 6495369 6535963 6629821 6732108 6877834 6959201 7009940 7124621 7266344 7426549 7537072
5816G537072J29355J17397J04210J40090J58114J15083J48009J52887J37757J48800
$$ 7537072 7666427 7783824 7888034 8028124 8186238 8301321 8449330 8602217 8739974 8888774
5806H888774J26204N7203Q2185J56769J40424J32387J05950J20903J58644J08165
$$ 8888774 9014978 9072181 9154366 9311135 9451559 9583946 9689896 9810799 9969443 10077608
5796A0077608K18272K02742J90653K17835K28980K16005K35601K63617K62563
$$ 10077608 10295880 10498622 10689275 10907110 11136090 11352095 11587696 11851313 12113876
5787A2113876L06344L41412L16778K61111L55698L42819L90149L16374M41522
$$ 12113876 12420220 12761632 13078410 13339521 13695219 14038038 14428187 14744561 15186083
5778A5186083M04198M59339M31921M60129N14835M65460M79952N35570N18464
$$ 15186083 15590281 16049620 16481541 16941670 17456505 17921965 18401917 18937487 19455951
5769A9455951M61539N62320N75077N94139O69348O17790O80474P42221Q82888
$$ 19455951 19917490 20479810 21054887 21649026 22318374 22936164 23616638 24358859 25241747
5760B5241747J018702J016717J116900J252420J381665J510984J595291J717583
$$ 25241747 26260449 27277166 28394066 29646486 31028151 32539135 34134426 35852009
5752C5852009J806799J856688J995605J989689J835778J620815J359131J071626
$$ 35852009 37658808 39515496 41511101 43500790 45336568 46957383 48316514 49388140
5744D9388140P75522M22778R8482k12671l84062m98171m66626l51495k63084l5855
$$ 49388140 50163662 50586440 50684922 50472251 50088189 49590018 49123392 48771897 48508813 48472958
5734D8472958K80349N74792Q97991J210017J581091J776520K043310K222172K230910
$$ 48472958 48753307 49328099 50226090 51436107 53017198 54793718 56837028 59059200 61290110
5725F1290110K047697J581422R59332L15678m44141j053116j630022k122744k517774
$$ 61290110 63337807 64919229 65878561 66194239 65750098 64696982 63066960 60944216 58426442
5716E8426442k917324l020011k900622k609711k313984k039657j660786j420533
$$ 58426442 55509118 52489107 49588485 46978774 44664790 42625133 40964347 39543814
5708C9543814j174996q77059o77726m52491l28468j98589q551J31504J36300J33726
$$ 39543814 38368818 37491759 36814033 36361542 36033074 35834485 35825934 35957438 36093738 36227464
5698C6227464O5496l1303p9481j30642l9641j02756j41005q475J12153J41479
$$ 36227464 36292960 36261657 36182176 36051534 36011893 35909137 35768132 35759657 35871810 36013289
5688C6013289K01491K13921K61402K82707K91405K74714J95073J57453P9194J42068
$$ 36013289 36214780 36428701 36690103 36972810 37264215 37538929 37734002 37891455 37970649 38112717
5678C8112717J07016Q4421J39029J40636K28067L15932L80345N30841N78561O43844
$$ 38112717 38219733 38304154 38443183 38583819 38811886 39127818 39508163 40039004 40617565 41261409
5668D1261409P66453P88425P58871P37430O50537N60454N32041M40069K82449
$$ 41261409 42027862 42816287 43575158 44312588 44963125 45523579 46055620 46495689 46778138
5659D6778138J76413J24101Q3818L2637K5518L8849O1469J67163K12640L07339
$$ 46778138 46954551 47078652 47162470 47195107 47220625 47259474 47320943 47488106 47700746 48008085
5649D8008085L35442M07096L81080M02631M70904M94029M80321O11280P11736
$$ 48008085 48343527 48750623 49131703 49534334 50005238 50499267 50979588 51590868 52302604
5640E2302604O69290Q43084Q89182R33645J026259J041900J040317R86296J014382
$$ 52302604 52971894 53814978 54704160 55637805 56664064 57705964 58746281 59732577 60746959
5631F0746959R12378P06560N55588L57600J45354j08511k91738n65762p45031
$$ 60746959 61659337 62365897 62921485 63279085 63424439 63315928 63024190 62458428 61713397
5622F1713397q70336j034224j098812j217816j289002j308006j327088j265050
$$ 61713397 60843061 59808837 58710025 57492209 56203207 54895201 53568113 52303063
5614E2303063j221914j110980j099953j040340r70857r28394q69438p71174p84807
$$ 52303063 51081149 49970169 48870216 47829876 46859019 45930625 45061187 44290013 43505206
5605D3505206p22090o73593p21579o68783o56877n89226n35054n04615m15372
$$ 43505206 42783116 42109523 41387944 40719161 40062284 39473058 38938004 38433389 38018017
5596C8018017l60693l25217l10759j69476j36541j73799r8229j41758j03501j25416
$$ 38018017 37657324 37332107 37021348 36851872 36715331 36541532 36443303 36301545 36198044 36072628
5586C6072628j36868j93961k78055l18790l09126l69821m02154m31220m85041
$$ 36072628 35935760 35741799 35463744 35144954 34835828 34466007 34063853 33632633 33147592
5577C3147592m11097m51397m36722l97614m14653m49973l51723l45447l09446
$$ 33147592 32736495 32285098 31848376 31450762 31036109 30586136 30234413 29888966 29579520
5568B9579520l66362l26496k46931k23790k89762k89744k45596k51531k61477
$$ 29579520 29213158 28886662 28639731 28415941 28126179 27836435 27590839 27339308 27077831
5559B7077831k58889k80882k78126j61727k47817k71091k61962k01303j78593
$$ 27077831 26818942 26538060 26259934 26098207 25850390 25579299 25317337 25116034 24937441
5550B4937441k01008j68739k10693j70822j73413k33889j64679j20426j24611
$$ 24937441 24736433 24567694 24357001 24186179 24012766 23778877 23614198 23493772 23369161
5541B3369161j20241j46196j56657r4800r3050j43373j45852j69510r9799j35472
$$ 23369161 23248920 23102724 22946067 22851267 22758217 22614844 22468992 22299482 22199683 22064211
5531B2064211o3431k4742j32416j12191l3947o0457j01786j10666o196l1587n5863
$$ 22064211 22000780 21976038 21843622 21731431 21697484 21637027 21535241 21424575 21418379 21386792 21330929
5520B1330929l8360p7038l8717l9307n5469j0601J0945o564o379n2067J0424m8853
$$ 21330929 21292569 21215531 21176814 21137507 21082038 21071437 21082382 21075818 21069439 21017372 21027796 20978943
5508B0978943r976n0944n4547n8392n6726j24918q6955k4452p0303k5333L4953
$$ 20978943 20968967 20918023 20863476 20805084 20748358 20623440 20536485 20512033 20441730 20416397 20451350
5497B0451350o1719j1139o1396m4331J5642J4088R590Q2055j9996o4113k0353
$$ 20451350 20389631 20378492 20317096 20272765 20288407 20302495 20312085 20394140 20374144 20310031 20289678
5486B0289678q0562j35476j44677q3505j87180k24421j73606j49658j99342j99908
$$ 20289678 20209116 20073640 19928963 19845458 19658278 19433857 19260251 19110593 18911251 18711343
5476A8711343j24150q6733r1723j21672q0387j09634j57718o8367p8019j03257
$$ 18711343 18587193 18500460 18408737 18287065 18206678 18097044 17939326 17870959 17792940 17689683
5466A7689683j17416j31199j29256j08616j34098j00684q3595j17690r8645j09886
$$ 17689683 17572267 17441068 17311812 17203196 17069098 16968414 16884819 16767129 16668484 16558598
5456A6558598j08015j14550j35184j16149j48864j34651j30586q2715j49990j32190
$$ 16558598 16450583 16336033 16200849 16084700 15935836 15801185 15670599 15587884 15437894 15305704
5446A5305704j14688q7048r3084j07786r3369j43912r3739r5119j01714p8588
$$ 15305704 15191016 15103968 15010884 14903098 14809729 14665817 14572078 14476959 14375245 14296657
5436A4296657p4069j42787j07095q7604q2053j24718j21729n9304j46632r2020
$$ 14296657 14222588 14079801 13972706 13885102 13803049 13678331 13556602 13497298 13350666 13258646
5426A3258646q0221q7174j07120j22l5360j39323j08506j40671m2594j25901j03811
$$ 13258646 13178425 13091251 12984131 12984009 12948649 12809326 12700820 12560149 12517555 12391654 12287843
5415A2287843o3287q5354j40244j53825j78367n0886j01205j45193n6721j13988
$$ 12287843 12224556 12139202 11998958 11845133 11666766 11615880 11514675 11369482 11312761 11198773
5405A1198773p5532j3994n5126j47798q8345q9600j3249n7893n8036n2469j05601
$$ 11198773 11123241 11109247 11054121 10906323 10817978 10728378 10715129 10657236 10599200 10546731 10441130
5394A0441130N4323P0509o395j083m706q7722j03032n4622j05322j32678j62723
$$ 10441130 10495453 10565962 10559567 10558484 10553778 10466056 10363024 10308402 10203080 10070402 9907679
5383I907679j12124j09566j85732k24776j97064j78202j24181j43025q3184o5571
$$ 9907679 9795555 9685989 9500257 9275481 9078417 8900215 8776034 8633009 8549825 8484254
5373H484254q2860r6302j25460o5142m7645J6464j0871o2802n8472l9438j1134
$$ 8484254 8401394 8305092 8179632 8114490 8066845 8083309 8072438 8009636 7951164 7911726 7900592
5362G900592L4991N3131Q0916m383O626l0896j50633r5473k6170o9769p2343m6065
$$ 7900592 7935583 7988714 8069630 8065247 8071873 8040977 7890344 7794871 7768701 7698932 7626589 7580524
5350G580524j15931k43597k05993j44009j79022q4893j07861j15924n5539k2838
$$ 7580524 7464593 7220996 7015003 6870994 6691972 6607079 6499218 6383294 6327755 6304917
5340F304917o2544r5980o6775n5435n8972j2968J3179m8058p8612k8042m2343
$$ 6304917 6242373 6146393 6079618 6024183 5965211 5952243 5965422 5917364 5838752 5810710 5768367
5329E768367l0349K1718L2925q9329n6481m9036r459N640n1756p2604j04172l5941
$$ 5768367 5738018 5759736 5792661 5703332 5646851 5597815 5588356 5593996 5542240 5469636 5365464 5329523
5317E329523o2074j20711p1429k7085l4976n4836j14431m9142M844q1339J8322
$$ 5329523 5267449 5146738 5075309 5048224 5013248 4958412 4843981 4794839 4799683 4718344 4736666
5306D736666p7515q3030n4395m5846o2904J0077n5147k0094o205n8981l177p2653
$$ 4736666 4659151 4576121 4521726 4475880 4412976 4423053 4367906 4347812 4341607 4282626 4279449 4206796
5294D206796n4700r877l603p569o7508j5126k9003o5113p2469j3772K7732o4106
$$ 4206796 4152096 4142219 4138616 4131047 4063539 4048413 4019410 3954297 3881828 3868056 3895788 3831682
5282C831682p4679J2951K6297n2422m0281n5625n5960j108J7965l6979l8962r8860
$$ 3831682 3757003 3769954 3796251 3743829 3703548 3647923 3591963 3590855 3608820 3571841 3532879 3434019
5270C434019K1191j2776k4439l0084l8094k5402L6913m4128K552k8963n7540m7092
$$ 3434019 3455210 3442434 3417995 3387911 3349817 3324415 3361328 3317200 3319752 3290789 3233249 3186157
5258C186157K749K2539k0717j5652l5219n5715l054p339k7860j830k7014l9137
$$ 3186157 3188906 3211445 3190728 3175076 3139857 3084142 3081088 3073749 3045889 3044059 3017045 2977908
5246B977908j8545n4780M1231R459l215p8300j2022P011k9938r078n703m2478
$$ 2977908 2959363 2904583 2945814 2955273 2952058 2873758 2861736 2868747 2838809 2829731 2824028 2781550
5234B781550m3601j9063o368o2598k6957r68M0483k7147m8170R507J2162k8439
$$ 2781550 2737949 2718886 2712518 2649920 2622963 2621995 2662478 2635331 2587161 2596668 2608830 2580391
5222B580391N087J5990p5408n738N12J8567k1845j049j7741l3032P8705r164k08
$$ 2580391 2585478 2601468 2526060 2520322 2520834 2539401 2517556 2516507 2498766 2465734 2544439 2535275 2535067
5209B535067P6029J5223M2739j768L8916O4118Q1461J6703m129l8932r0854p5275
$$ 2535067 2611096 2626319 2669058 2667290 2706206 2770324 2851785 2868488 2864359 2825427 2734573 2659298
5197B659298o6639p7807o3514j02479q9633m0635j6268j8449m1147Q063q421l7678
$$ 2659298 2592659 2514852 2451338 2348859 2259226 2218591 2202323 2183874 2142727 2150790 2142369 2104691
5185B104691j5146j5412O648l4387L6356q4080k6499m8809O956O768n3844m9621
$$ 2104691 2089545 2074133 2080781 2046394 2082750 1998670 1972171 1923362 1930318 1937086 1883242 1833621
5173A833621N350M3241k7992l178R809l0893j5677L4003k4726j5081O337q8826
$$ 1833621 1838971 1882212 1854220 1851042 1860851 1829958 1814281 1848284 1823558 1808477 1814814 1725988
5161A725988L4394L9970j019n0777m6188R037p536k523K3725m3840k8824N2119
$$ 1725988 1760382 1800352 1799333 1748556 1702368 1711405 1703869 1701346 1725071 1681231 1652407 1704526
5149A704526n02K1037l7345q463M668m3932P701L7419m822k6770J2679l2350j9329
$$ 1704526 1704024 1725061 1687716 1679253 1683921 1639989 1647690 1685109 1680287 1653517 1666196 1633846 1614517
5136A614517q331N507L370N5859n386m5331N4394J5960n7881O577k4693j734M5444
$$ 1614517 1606186 1611693 1615063 1670922 1665536 1620205 1674599 1690559 1632678 1639255 1614562 1612828 1658272
5123A658272n832l3212q9478J6717o3284k8384K5222L38J0504J065n0650k2881
$$ 1658272 1652440 1619228 1529750 1546467 1483183 1454799 1480021 1480359 1490863 1491928 1441278 1418397
5111A418397J2550K7135L8918o9063q1383k869O659L5514o121j4388N9201j3742
$$ 1418397 1430947 1458082 1497000 1427937 1346554 1343685 1350344 1385858 1379737 1365349 1424550 1410808
5099A410808o1128l5908K3659L3467k121j235k9019j212M0449o028M1564P229
$$ 1410808 1349680 1313772 1337431 1370898 1368777 1367542 1338523 1337311 1377760 1371732 1413296 1420525
5087A420525m0339M3382M9041m6771m8897l216J6503M5454l8311k1977k5781m5114
$$ 1420525 1380186 1423568 1472609 1425838 1376941 1373725 1390228 1435682 1397371 1375394 1349613 1304499
5075A304499L8078J6877p697j8086j8275M1216k5195J4892J3946l4811j4743N052
$$ 1304499 1342577 1359454 1351757 1333671 1315396 1356612 1331417 1346309 1360255 1325444 1310701 1315753
5063A315753K0448K3289k4427P077K4373j5385k14Q9867k2777p315o164j437K8447
$$ 1315753 1336201 1359490 1335063 1342140 1366513 1351128 1350914 1440781 1418004 1410689 1404525 1403088 1431535
5050A431535L6716k5989k1826K5189J275m6k1932q650l3000M0137L5004R635n47
$$ 1431535 1468251 1442262 1420436 1445625 1446900 1446854 1424922 1416272 1383272 1423409 1458413 1468048 1467501
5037A467501M5522L3604j8130j98O175J3152j790K8591l7861M2925j8722J3443
$$ 1467501 1513023 1546627 1528497 1528299 1534474 1547626 1545836 1574427 1536566 1579491 1560769 1574212
5025A574212M7769j2274M4332J3529k5528L7517j0292J2056K3224k8517J4237
$$ 1574212 1621981 1609707 1654039 1667568 1642040 1679557 1669265 1681321 1704545 1676028 1690265
5014A690265n4577Q4880J192J0881N0828L6679L4241k5531m730M1179O5472M1570
$$ 1690265 1635688 1720568 1721760 1732641 1783469 1820148 1854389 1828858 1824128 1865307 1930779 1972349
5002A972349j6353l2373K4206O5940p561O0404m504p206M783P5776Q3173J4819
$$ 1972349 1955996 1923623 1947829 2013769 2006208 2066612 2062108 2054902 2059685 2135461 2218634 2233453
4990B233453M885L0819j2581L4036J27649j3450P5062K9908K9581M0641O0594
$$ 2233453 2238338 2269157 2256576 2290612 2418261 2404811 2479873 2509781 2539362 2580003 2640597
4979B640597K4175K3757Q2198M3275L6160N7494M9017P3876J16169J06612J12199
$$ 2640597 2664772 2688529 2770727 2814002 2850162 2907656 2956673 3030549 3146718 3253330 3365529
4968C365529J20016J00785J03601J15379J50213J76247J47776J58830J90969J82569
$$ 3365529 3485545 3586330 3689931 3805310 3955523 4131770 4279546 4438376 4629345 4811914
4958D811914K30321K14040K42626J99089K12373K47965K02580K11938J14680J61573
$$ 4811914 5042235 5256275 5498901 5697990 5910363 6158328 6360908 6572846 6687526 6849099
4948F849099J27920P1473K1167O2974N1444k4700K2373o0173m2816l5465q0638
$$ 6849099 6977019 7048492 7069659 7132633 7184077 7159377 7181750 7121577 7078761 7043296 6962658
4937F962658r2861p4951j06571j68735j63250k56784k69467j85197k03496k02251
$$ 6962658 6869797 6794846 6688275 6519540 6356290 6099506 5830039 5644842 5441346 5239095
4927E239095j40200k03905o6671j31620j27902p6970q7804q0212r1431r9091l7038
$$ 5239095 5098895 4894990 4828319 4696699 4568797 4491827 4404023 4323811 4232380 4133289 4096251
4916D096251k2907n1480n3698p31m514r038k0319l992J7057J3244J6408O3931
$$ 4096251 4073344 4021864 3968166 3967435 3962921 3953883 3933564 3929572 3946629 3959873 3976281 4040212
4904D040212R1814J2846J4163J26243J35171Q4884J28704J16314J65096J56513
$$ 4040212 4132026 4144872 4159035 4285278 4420449 4505333 4634037 4750351 4915447 5071960
4894E071960K13645K17604J99377K52153K70130K31263K80037K84170L09911K89175
$$ 5071960 5285605 5503209 5702586 5954739 6224869 6456132 6736169 7020339 7330250 7619425
4884G619425K20687J67972J49984J56574J27139K8840j9336J4489l6746j28241
$$ 7619425 7840112 8008084 8158068 8314642 8441781 8470621 8451285 8465774 8429028 8300787
4874H300787o5240j40239k21906k13974k15514k51828l05791k53008k59236k81798
$$ 8300787 8235547 8095308 7873402 7659428 7443914 7192086 6886295 6633287 6374051 6092253
4864F092253l28960k70518k02806k29492k68340k39637j81612j88301j19930j49174
$$ 6092253 5763293 5492775 5289969 5060477 4792137 4552500 4370888 4182587 4062657 3913483
4854C913483j30042j13015r6974j18598j13584r9807j08856r0779k7205k5014
$$ 3913483 3783441 3670426 3573452 3454854 3341270 3241463 3132607 3041828 3014623 2989609
4844B989609o1265k0838m2014k7933l6097K275J2558j855k7876n462M1239K2585
$$ 2989609 2928344 2907506 2865492 2837559 2801462 2803737 2816295 2814440 2786564 2781102 2822341 2844926
4832B844926n4316J7468J08209l0069L4756j0836j7352M4544l0997M330k1056
$$ 2844926 2790610 2808078 2916287 2886218 2920974 2910138 2892786 2937330 2906333 2910663 2889607
4821B889607Q597q692o214m3318j9677J2810k0492o58P413K0619o1976n9154M5187
$$ 2889607 2898204 2889512 2883298 2839980 2820303 2833113 2812621 2811963 2819376 2839995 2778019 2718865 2764052
4808B764052M928l5143m1378N1359o01J8114L5942l5720k0260l1736m7373m9191
$$ 2764052 2768980 2733837 2692459 2743818 2743217 2761331 2797273 2761553 2741293 2709557 2662184 2612993
4796B612993q4288l4319k2614q0233o1124n9640q0702n8317k5396l1638l9845
$$ 2612993 2528705 2494386 2471772 2391539 2330415 2270775 2190073 2131756 2106360 2074722 2034877
4785B034877K0021L796j4098p4065k8125N3840L513k6358J4426K5448k0570k183
$$ 2034877 2054898 2058694 2044596 1970531 1942406 1996246 1999759 1973401 1987827 2013275 1992705 1990522
4773A990522j2829K712k0069j9777o9082K4178j924J8150N8137o145m7301k0997
$$ 1990522 1977693 1980405 1960336 1940559 1871477 1895655 1893731 1911881 1970018 1963873 1916572 1895575
4761A895575K7498L8248l796J6562o2250K181J9729k423r328J518K239J0787L2146
$$ 1895575 1923073 1961321 1957525 1974087 1911837 1914018 1933747 1931324 1921996 1923514 1925753 1936540 1968686
4748A968686P180k3330L6844J4952j2026M4033r317r300j0448M7509k3082J5951
$$ 1968686 1975866 1952536 1989380 2004332 1992306 2036339 2027022 2017722 2007274 2054783 2031701 2047652
4736B047652P8640M9110q056m2507K4151j023K8167j6002P3369K1971L4484L7911
$$ 2047652 2126292 2175402 2167346 2124839 2148990 2147967 2176134 2160132 2233501 2255472 2289956 2327867
4724B327867J1471M4415q541K8652k383O0100N1610N1360l07K8120K6710O4193
$$ 2327867 2339338 2383753 2375212 2403864 2401481 2461581 2513191 2564551 2564244 2592364 2619074 2683267
4712B683267M2195N9649N1280l6346M690M5345M9814J6010l2894M1752L3595N3421
$$ 2683267 2725462 2785111 2836391 2800045 2804735 2850080 2899894 2915904 2883010 2924762 2958357 3011778
4700C011778O3979Q007J0284M8367M8838K9780n381N9976M4419J17864P3009R251
$$ 3011778 3075757 3083764 3094048 3142415 3191253 3221033 3215652 3275628 3320047 3437911 3510920 3520171
4688C520171N880L6401K6802K7265P9734J15028O5512K0462N7099Q4213Q5396
$$ 3520171 3526051 3562452 3589254 3616519 3696253 3811281 3876793 3897255 3954354 4038567 4123963
4677D123963o09O2271Q5828J10066R9042J25307Q9580J20507Q5967J18204J67302
$$ 4123963 4123354 4185625 4271453 4381519 4480561 4605868 4695448 4815955 4901922 5020126 5187428
4666E187428J10748J50676J29168J61560K31374J70761J87334K23538K74025K26962
$$ 5187428 5298176 5448852 5578020 5739580 5970954 6141715 6329049 6552587 6826612 7053574
4656G053574L10154L46347L24257M06397M31894M60423M42972N67377N66411N84815
$$ 7053574 7363728 7710075 8034332 8440729 8872623 9333046 9776018 10343395 10909806 11494621
4646A1494621N25830M85640N04996M55114L21491L00167K96864K04564J70104
$$ 11494621 12020451 12506091 13011087 13466201 13787692 14087859 14384723 14589287 14759391
4637A4759391R4959L5624L9550M7137O9658Q6560J01624K03649K43314J93066
$$ 14759391 14854350 14889974 14929524 14976661 15046319 15132879 15234503 15438152 15681466 15874532
4627A5874532J42111J44222p117p9522j55413k42341k73890l19423m19457m99931
$$ 15874532 16016643 16160865 16153748 16074226 15918813 15676472 15402582 15083159 14663702 14163771
4617A4163771n07308m90391l56787l67911k97085j98570j37282j38933m9651P1932
$$ 14163771 13656463 13166072 12809285 12441374 12144289 11945719 11808437 11669504 11619853 11691785
4607A1691785O3647J41117J33373K11865K75261L36489M19678M80023N42848N21594
$$ 11691785 11755432 11896549 12029922 12241787 12517048 12853537 13273215 13753238 14296086 14817680
4597A4817680O99021P16764P83500Q60463Q72567Q93827Q08489Q27779O61686
$$ 14817680 15516701 16233465 17016965 17877428 18749995 19643822 20452311 21280090 21941776
4588B1941776N34471M10534K70397K59623J97451J32696K0975O1180P0372M3288
$$ 21941776 22476247 22886781 23157178 23416801 23614252 23746948 23767923 23829103 23899475 23942763
4578B3942763J51815K04300L03208L57458L54805L09748J54189Q8132j7957k61879
$$ 23942763 24094578 24298878 24602086 24959544 25314349 25624097 25778286 25866418 25848461 25586582
4568B5586582m43676m67116o02466p72368q19997q99201r54018q43548q55430
$$ 25586582 25142906 24675790 24073324 23300956 22480959 21581758 20627740 19784192 18928762
4559A8928762q41529p96570p26770o68772o72261o89622o32004n33840n29088
$$ 18928762 18087233 17290663 16563893 15895121 15222860 14533238 13901234 13367394 12838306
4550A2838306m97509m31733l75914l45092l46804l24799k72505k40073k21785
$$ 12838306 12340797 11909064 11533150 11188058 10841254 10516455 10243950 10003877 9782092
4541I782092k04875j71714k18953q2492j03726j22652r2111L89k6225J4532l8881
$$ 9782092 9577217 9405503 9186550 9104058 9000332 8877680 8785569 8785958 8759733 8774265 8735384
4530H735384N2756K4177L0281P6450J45070J78179M3655J27014K31501K72828
$$ 8735384 8788140 8812317 8842598 8919048 9064118 9242297 9285952 9412966 9644467 9917295
4520I917295L43461L23174L96677M40002M56960M97876O11811P42744P91069P82602
$$ 9917295 10260756 10583930 10980607 11420609 11877569 12375445 12987256 13730000 14521069 15303671
4510A5303671P55347P85705P49913N54650L65914J09875p7023k62403m03858n53192
$$ 15303671 16059018 16844723 17594636 18149286 18515200 18625075 18548052 18285649 17881791 17328599
4500A7328599o41670o64603o17495o24734m64311l81130l66551j94701j71318
$$ 17328599 16686929 16022326 15404831 14780097 14315786 13934656 13568105 13373404 13202086
4491A3202086j00460l9130P8477J20729J61768J47423K49342L11372L94625M75676
$$ 13202086 13101626 13062496 13140973 13261702 13423470 13570893 13820235 14131607 14526232 15001908
4481A5001908N16155N53759O43502P49559Q42890Q02385Q34252Q43870P84332
$$ 15001908 15518063 16071822 16715324 17464883 18307773 19110158 19944410 20788280 21572612
4472B1572612P24074M70794K09631O6480j93223l77955o35383o58217p59950p43551
$$ 21572612 22296686 22767480 22977111 23043591 22850368 22472413 21837030 21178813 20418863 19675312
4462A9675312p19379o51897n20898l86076k78455k30034r5151j18694l7629L3165
$$ 19675312 18955933 18304036 17783138 17397062 17118607 16888573 16793422 16674728 16637099 16670264
4452A6670264l8712j60502k23976k46036l75878l55709l98183l98500m02127l83010
$$ 16670264 16631552 16471050 16247074 16001038 15625160 15269451 14871268 14472768 14070641 13687631
4442A3687631l92919k37928j07044o8425o1131l4086O9323J17059M7005J65140
$$ 13687631 13294712 13056784 12949740 12881315 12820184 12786098 12855421 12972480 13019485 13184625
4432A3184625J70181J40253J54098J88615L00182K15488J93973K53777K23485
$$ 13184625 13354806 13495059 13649157 13837772 14137954 14353442 14547415 14801192 15024677
4423A5024677K39518K76914K83186K72605J33372J14991l2542j67140k61092l68404
$$ 15024677 15264195 15541109 15824295 16096900 16230272 16345263 16312721 16145581 15884489 15516085
4413A5516085m40625n12533n39360n48247n55869m61450m18492m26351l49173
$$ 15516085 15075460 14562927 14023567 13475320 12919451 12458001 12039509 11613158 11263985
4404A1263985l31342l53838k68832k78051k52646j80446k15800k53395k03732
$$ 11263985 10932643 10578805 10309973 10031922 9779276 9598830 9383030 9129635 8925903
4395H925903j93236j16473j29493j04465p7310r2599j26717j44916n0688j03253
$$ 8925903 8732667 8616194 8486701 8382236 8304926 8212327 8085610 7940694 7890006 7786753
4385G786753q8259j25785p1170j10196n5768r217o7913n5903k9497k3646Q693
$$ 7786753 7698494 7572709 7501539 7391343 7335575 7326358 7258445 7202542 7173045 7149399 7158092
4374G158092J354k7322J10981M8840M5716j2728O3910N8128K642K1620M8031p152
$$ 7158092 7159446 7132124 7243105 7291945 7337661 7324933 7388843 7446971 7449613 7471233 7519264 7512112
4362G512112p1217o5514l9156n2527n5714o4170j07917j59691j05564j62328l8489
$$ 7512112 7440895 7375381 7336225 7283698 7227984 7163814 7055897 6896206 6790642 6628314 6589825
4351F589825l3828o7398j08983p5164J4966l4017o3593n6320l8261J0373k016
$$ 6589825 6555997 6488599 6379616 6304452 6319418 6285401 6221808 6165488 6127227 6137600 6135584
4340F135584j687j7280M6326l2987J0609K4165l9642Q6448M3701J5447j0949L5691
$$ 6135584 6133897 6116617 6162943 6129956 6140565 6164730 6125088 6211536 6255237 6270684 6259735 6295426
4328F295426M6459K9710j1915R9166Q964P5914J26327O4796J30028N7539J01470
$$ 6295426 6341885 6371595 6359680 6458846 6467810 6543724 6670051 6734847 6864875 6922414 7023884
4317G023884J12787J58311J47057J33150J53666J43291J44766J03476J31845J68750
$$ 7023884 7136671 7294982 7442039 7575189 7728855 7872146 8016912 8120388 8252233 8420983
4307H420983J36207J49973Q5603K1414J07707P7880N8783L9007K551l5841L067
$$ 8420983 8557190 8707163 8792766 8814180 8921887 8999767 9058550 9097557 9100108 9064267 9067334
4296I067334k1757j1352m4875o9382r5749l5687r88o8752k6728q0299K672k8435
$$ 9067334 9045577 9034225 8989350 8919968 8824219 8788532 8787544 8718792 8692064 8611765 8614437 8586002
4284H586002j3801K1357L5257R9393Q071j8073J37328J57959J16239J02084R7485
$$ 8586002 8572201 8593558 8628815 8728208 8736279 8718206 8855534 9013493 9129732 9231816 9329301
4273I329301J44242J54222J27379J12333J53779K02467J50668J09147J04304R3244
$$ 9329301 9473543 9627765 9755144 9867477 10021256 10223723 10374391 10483538 10587842 10681086
4263A0681086R4472R0470J02352N2395M6903J2750Q100K68L5723n6454N5948J0513
$$ 10681086 10775558 10866028 10968380 11020775 11067678 11080428 11088528 11088796 11124519 11068065 11124013 11134526
4251A1134526k5625M3210N0387O7902M7156Q8390J11792Q8640J06760R6938J26935
$$ 11134526 11108901 11152111 11202498 11270400 11317556 11405946 11517738 11606378 11713138 11810076 11937011
4240A1937011N6641J10631J27317J13557Q9684J92251J30866J43664J52404J44907
$$ 11937011 11993652 12104283 12231600 12345157 12434841 12627092 12757958 12901622 13054026 13198933
4230A3198933P2139J04088J61266P2588J59322J02291J71615J43881J33235Q4254
$$ 13198933 13271072 13375160 13536426 13609014 13768336 13870627 14042242 14186123 14319358 14403612
4220A4403612J70153J33476J10000P8020R9640J39925J39937K00645J94381J64034
$$ 14403612 14573765 14707241 14817241 14895261 14994901 15134826 15274763 15475408 15669789 15833823
4210A5833823K31844K46014K91085J67793K51466L21203K78492K59170K51391
$$ 15833823 16065667 16311681 16602766 16770559 17022025 17343228 17621720 17880890 18132281
4201A8132281K23480J36907J71979J11327J62502J69297J42051J67387J85607
$$ 18132281 18355761 18492668 18664647 18775974 18938476 19107773 19249824 19417211 19602818
4192A9602818J61790K10713J52880J82796J14554J77498K08932K13555K57800
$$ 19602818 19764608 19975321 20128201 20310997 20425551 20603049 20811981 21025536 21283336
4183B1283336K55998L04215L94651L99393M24442M94140N49781O36495O65983
$$ 21283336 21539334 21843549 22238200 22637593 23062035 23556175 24105956 24742451 25408434
4174B5408434P57020Q32081Q76109Q69985J011070J039028J006218J102144J117833
$$ 25408434 26165454 26997535 27873644 28743629 29754699 30793727 31799945 32902089 34019922
4165C4019922J206090J217632J287376J402268J427303J513454J677672J802464
$$ 34019922 35226012 36443644 37731020 39133288 40560591 42074045 43751717 45554181
4157D5554181J863596K028339K177022K394597K599728K893695L212450L672497
$$ 45554181 47417777 49446116 51623138 54017735 56617463 59511158 62723608 66396105
4149F6396105M180813M799563N519086O292425P199746Q368453R646519J1078995
$$ 66396105 70576918 75376481 80895567 87187992 94387738 102756191 112402710 123481705
4141A23481705J2899253J4985307J7256619J9585965K1970368K3789746K3824221
$$ 123481705 136380958 151366265 168622884 188208849 210179217 233968963 257793184
4134B57793184K0662595J4784383P159916j295546r608352j7059496k2158732
$$ 257793184 278455779 293240162 300400078 299104532 289496180 272436684 250277952
4127B50277952k5018490k5402435k3860996k1406599j8343763j5076581j2102508
$$ 250277952 225259462 199857027 175996031 154589432 136245669 121169088 109066580
4120A09066580r767640q025376o746522n972242n433282m925421m563828m243873
$$ 109066580 99298940 91273564 84527042 78554800 73121518 68196097 63632269 59388396
4112E9388396l906489l634644l197186k802024k476040k200299j989040j837755
$$ 59388396 55481907 51847263 48650077 45848053 43372013 41171714 39182674 37344919
4104C7344919j607788j537121j502988j395629j335450j212985j181528j034987
$$ 37344919 35737131 34200010 32697022 31301393 29965943 28752958 27571430 26536443
4096B6536443r93814r11347q64975p70933p40261n86233o07794o17523n82333
$$ 26536443 25542629 24631282 23766307 22995374 22255113 21668880 21061086 20443563 19861230
4087A9861230n15005n15514n63715m61009m68152m64998m22562l10618l42036
$$ 19861230 19346225 18830711 18266996 17805987 17337835 16872837 16450275 16139657 15797621
4078A5797621k85915k56551k92170k27782k22553k47765k28769k39985k29611
$$ 15797621 15511706 15255155 14962985 14735203 14512650 14264885 14036116 13796131 13566520
4069A3566520k00945k04422j51443j08960j53194j95187j74941j77419j77410
$$ 13566520 13365575 13161153 13009710 12900750 12747556 12552369 12377428 12200009 12022599
4060A2022599j51693j27939j45270j38281j35325r6704j04281p6213m4626o6075
$$ 12022599 11870906 11742967 11597697 11459416 11324091 11227387 11123106 11046893 11002267 10936192
4050A0936192l7664r1844p011L549n8939n7434K1j9609o3817J6670M2722K5820
$$ 10936192 10898528 10806684 10799673 10803222 10744283 10686849 10686870 10667261 10603444 10620114 10662836 10688656
4038A0688656P2459K5673J1948O8337M2000Q2405J03641M1944R2327J11058K8407
$$ 10688656 10761115 10786788 10798736 10867073 10909073 10991478 11095119 11137063 11229390 11340448 11368855
4027A1368855K8417L4784J3494M6357O1355O5250r914N8034Q1233K0465R3243
$$ 11368855 11397272 11432056 11445550 11491907 11553262 11618512 11608598 11666632 11747865 11768330 11861573
4016A1861573Q5507N5866Q0566J06877J13786J14302R4051J43300O4953M2078
$$ 11861573 11947080 12002946 12083512 12190389 12304175 12418477 12512528 12655828 12720781 12762859
4006A2762859O8665J03031J23494J20390J79040J80829J85646J81190J74164K19348
$$ 12762859 12831524 12934555 13058049 13178439 13357479 13538308 13723954 13905144 14079308 14298656
3996A4298656K24800K32816K73541K97626L11415L60878L69327M06930L74018
$$ 14298656 14523456 14756272 15029813 15327439 15638854 15999732 16369059 16775989 17150007
3987A7150007M37636M02687M65791N75475M60960M67459N46402N68273N47305
$$ 17150007 17587643 17990330 18456121 19031596 19492556 19960015 20506417 21074690 21621995
3978B1621995O06212O32981O31055P17436P43940P85984P66657Q61731R49380
$$ 21621995 22228207 22861188 23492243 24209679 24953619 25739603 26506260 27367991 28317371
3969B8317371R38253J077533J118248J166263J184133J185194J266393J298682
$$ 28317371 29255624 30333157 31451405 32617668 33801801 34986995 36253388 37552070
3961C7552070J459078J436299J493437J569717J595355J581044J653120J726420
$$ 37552070 39011148 40447447 41940884 43510601 45105956 46687000 48340120 50066540
3953E0066540J732761J738274J792648J789021J783711J788909J787226J694225
$$ 50066540 51799301 53537575 55330223 57119244 58902955 60691864 62479090 64173315
3945F4173315J664727J614322J584166J538007J448638J382362J285398J287529
$$ 64173315 65838042 67452364 69036530 70574537 72023175 73405537 74690935 75978464
3937G5978464J201267J119540J044602R42852Q39171P97708N53250M73535L53892
$$ 75978464 77179731 78299271 79343873 80286725 81125896 81923604 82476854 82950389 83304281
3928H3304281K30256J41990O0859j02538r3860k88233l50342l76416n56380o42065
$$ 83304281 83534537 83676527 83737386 83634848 83540988 83252755 82902413 82525997 81969617 81327552
3918H1327552o45414p52226q66078r79924j094008j095433j203470j182018j214921
$$ 81327552 80682138 79929912 79063834 78083910 76989902 75894469 74690999 73508981 72294060
3909G2294060j293358j288693j314860j401123j415885j390041j503192j466742
$$ 72294060 71000702 69712009 68397149 66996026 65580141 64190100 62686908 61220166
3901F1220166j431291j509873j505453j548435j546768j561794j505444j516514
$$ 61220166 59788875 58279002 56773549 55225114 53678346 52116552 50611108 49094594
3893D9094594j490987j495312j454219j469316j408113j408709j362769j389246
$$ 49094594 47603607 46108295 44654076 43184760 41776647 40367938 39005169 37615923
3885C7615923j290091j291440j232885j206605j231946j133652j152037j066138
$$ 37615923 36325832 35034392 33801507 32594902 31362956 30229304 29077267 28011129
3877B8011129j102186r79798r40761r39462r02169q14890q39127p97487p58405
$$ 28011129 26908943 25929145 24988384 24048922 23146753 22331863 21492736 20695249 19936844
3868A9936844o95550o84737n90253n68413o08617n98886n09075m62857m32044
$$ 19936844 19241294 18556557 17966304 17397891 16789274 16190388 15681313 15218456 14786412
3859A4786412l60986l60224l40399l30050l21275k51868k87451k03068j77415
$$ 14786412 14425426 14065202 13724803 13394753 13073478 12821610 12534159 12331091 12153676
3850A2153676j20203k01047j40787n0302q2616p2635j9840o8404j31163j81747
$$ 12153676 12033473 11832426 11691639 11641337 11558721 11486086 11466246 11397842 11266679 11084932
3840A1084932k02539k17706k05028k65301k77703k15042j67851k25905k69807
$$ 11084932 10882393 10664687 10459659 10194358 9916655 9701613 9533762 9307857 9038050
3831I038050j23153j04787k11882j37177j46228j05523m6844j40160j33882q4988
$$ 9038050 8914897 8810110 8598228 8461051 8314823 8209300 8162456 8022296 7888414 7803426
3821G803426l7199j24199m5716o0005n3504r7914k4576o1794j9734l2547J1231
$$ 7803426 7766227 7642028 7596312 7536307 7482803 7384889 7360313 7298519 7278785 7246238 7257469
3810G257469l0946k7372k3621j8535J4329L218j3333l6321j9927j041k6013r298
$$ 7257469 7226523 7199151 7175530 7156995 7171324 7174542 7161209 7124888 7104961 7103920 7077907 7068609
3798G068609P3833m1997k8708L1200P959j0413j4843j5218k6819L3272k5588L1767
$$ 7068609 7142442 7100445 7071737 7102937 7110896 7100483 7085640 7070422 7043603 7076875 7051287 7083054
3786G083054K77K3215L595m488J8997P2064j5504n5245K2286N3237M381j3782
$$ 7083054 7083331 7106546 7110141 7105653 7124650 7196714 7181210 7125965 7148251 7201488 7205869 7192087
3774G192087k1989p3055j2552K5346L1084m9161k3711J161l9154o986l5381J2553
$$ 7192087 7170098 7097043 7084491 7109837 7140921 7091760 7068049 7069210 7030056 7023070 6987689 7000242
3762G000242O80n6018k187K9965k5523m5235N7665k7053p6070q862K368k4890
$$ 7000242 7000922 6944904 6942717 6972682 6947159 6901924 6959589 6932536 6856466 6847604 6849972 6825082
3750F825082L848l785N2939M1370Q715j2250K480J7445N3936J00924k4170q444
$$ 6825082 6828930 6825145 6878084 6919454 6928169 6915919 6918399 6935844 6989780 7090704 7066534 7058090
3738G058090M4176J5666K0894P7505M7618K5331N1470L7553l317j1570O1892Q8743
$$ 7058090 7102266 7117932 7138826 7216331 7263949 7289280 7340750 7378303 7374986 7363416 7425308 7514051
3726G514051J4957L5669K176O3009L4903J6236O8362P5128K1534j129K1438O7336
$$ 7514051 7529008 7564677 7566853 7629862 7664765 7681001 7749363 7824491 7846025 7844896 7866334 7933670
3714G933670K2242M2052O2995M8818Q4294Q1522O6000J7149J05727M9881J3155
$$ 7933670 7955912 7997964 8060959 8109777 8194071 8275593 8341593 8358742 8464469 8514350 8527505
3703H527505J2423J11684J34435J06835Q2406R6711J10189Q9380Q9677R3030J28754
$$ 8527505 8539928 8651612 8786047 8892882 8975288 9071999 9182188 9271568 9361245 9454275 9583029
3692I583029R7764O7652J61816R8078Q7256Q5922J76373J51298J16560J49270
$$ 9583029 9680793 9748445 9910261 10008339 10095595 10181517 10357890 10509188 10625748 10775018
3682A0775018P3142Q8429J46344J76278J87786J47594J29416J54142J83134J84646
$$ 10775018 10848160 10936589 11082933 11259211 11446997 11594591 11724007 11878149 12061283 12245929
3672A2245929K41880K21409K47737J34694J99619K39366K16509K54424K74434
$$ 12245929 12487809 12709218 12956955 13091649 13291268 13530634 13747143 14001567 14276001
3663A4276001K51144K43830K46981L13508L68137L37600L04063L11369L62428
$$ 14276001 14527145 14770975 15017956 15331464 15699601 16037201 16341264 16652633 17015061
3654A7015061L16594L66674L63763L95608M06700M57369N21566L86797N12770
$$ 17015061 17331655 17698329 18062092 18457700 18864400 19321769 19843335 20230132 20742902
3645B0742902N75455N52297N99449N87030O89390O74244O55754Q27170Q14898
$$ 20742902 21318357 21870654 22470103 23057133 23746523 24420767 25076521 25903691 26718589
3636B6718589Q48873Q83875R23623R79918R88230J038375R99852R63921J021624
$$ 26718589 27567462 28451337 29374960 30354878 31343108 32381483 33381335 34345256 35366880
3627C5366880J048838J027178R86946R99232J018855J025509R80115R02649Q70247
$$ 35366880 36415718 37442896 38429842 39429074 40447929 41473438 42453553 43356202 44226449
3618D4226449Q42126Q04080Q01007P74681O53779O57196M69594N02448M35989
$$ 44226449 45068575 45872655 46673662 47448343 48102122 48759318 49228912 49731360 50167349
3609E0167349L85375L88613L16187K97726L14194L79067L34040L44121L86862
$$ 50167349 50552724 50941337 51257524 51555250 51869444 52248511 52582551 52926672 53313534
3600E3313534L60678M19304M12811M77151M85719N88602O03900O85020P85778
$$ 53313534 53674212 54093516 54506327 54983478 55469197 56057799 56661699 57346719 58132497
3591E8132497Q22757R86222J129416J182581J317561J423391J569309J641007
$$ 58132497 58955254 59941476 61070892 62253473 63571034 64994425 66563734 68204741
3583F8204741J788134J934993K005267K133528K186344K299782K411395K453817
$$ 68204741 69992875 71927868 73933135 76066663 78253007 80552789 82964184 85418001
3575H5418001K485918K459045K395838K412844K357816K264764K182023K128808
$$ 85418001 87903919 90362964 92758802 95171646 97529462 99794226 101976249 104105057
3567A04105057K024125J858398J831014J763144J617508J519627J305861J067772
$$ 104105057 106129182 107987580 109818594 111581738 113199246 114718873 116024734 117092506
3559A17092506Q21091P38088N17030L23019J94264n2239k19992l03744l10229
$$ 117092506 117913597 118651685 119168715 119491734 119685998 119633759 119413767 119110023 118799794
3550A18799794m29734m97661m85419m47853m37555l89888l55343l71924k35957
$$ 118799794 118370060 117872399 117386980 116939127 116501572 116111684 115756341 115384417 115148460
3541A15148460r4748L513J80116L35366M35430O85842Q20867J007234J164822
$$ 115148460 115053712 115057225 115237341 115572707 116008137 116693979 117514846 118522080 119686902
3532A19686902J280406J466155J561212J706501J807615J842548J865271J967890
$$ 119686902 120967308 122433463 123994675 125701176 127508791 129351339 131216610 133184500
3524A33184500J948733J974102K019517J993067K096021K081322K058879K162368
$$ 133184500 135133233 137107335 139126852 141119919 143215940 145297262 147356141 149518509
3516A49518509K171983K183860K189412K223368K247183K366148K407661K448850
$$ 149518509 151690492 153874352 156063764 158287132 160534315 162900463 165308124 167756974
3508A67756974K616763K876565L092996L398565L676711L970703M264503M509934
$$ 167756974 170373737 173250302 176343298 179741863 183418574 187389277 191653780 196163714
3500A96163714M681900M816477M695666M400152M099416L541900K899065K213700
$$ 196163714 200845614 205662091 210357757 214757909 218857325 222399225 225298290 227511990
3492B27511990J483187P05892J81006m48474r89600j366964j679047k010924k359027
$$ 227511990 228995177 229701069 229882075 229433601 228444001 227077037 225397990 223387066 221028039
3483B21028039k735753l223416l634636m106702m626432n088015n643287n961822
$$ 221028039 218292286 215068870 211434234 207327532 202701100 197613085 191969798 186007976
3475A86007976o195017o326530o403828o382142o163254n807268n503932n058239
$$ 186007976 179812959 173486429 167082601 160700459 154537205 148729937 143226005 138167766
3467A38167766m775932m331476l901009l578587l196251k903431k644084k429240
$$ 138167766 133391834 129060358 125159349 121580762 118384511 115481080 112836996 110407756
3459A10407756k236409k118037k002129j947332j920608j903575j852346j827889
$$ 110407756 108171347 106053310 104051181 102103849 100183241 98279666 96427320 94599431
3451I4599431j853943j794656j871949j744149j782350j803610j703981j732446
$$ 94599431 92745488 90950832 89078883 87334734 85552384 83748774 82044793 80312347
3443H0312347j725712j742613j694257j670760j684000j729820j699194j669664
$$ 80312347 78586635 76844022 75149765 73479005 71795005 70065185 68365991 66696327
3435F6696327j688984j631395j543530j615029j534714j502599j460646j449594
$$ 66696327 65007343 63375948 61832418 60217389 58682675 57180076 55719430 54269836
3427E4269836j323878j310091j284291j242035j204220j091524j082720j064268
$$ 54269836 52945958 51635867 50351576 49109541 47905321 46813797 45731077 44666809
3419D4666809r42242r16098q79734q65319q06640q25709p56364o62159o41888
$$ 44666809 43724567 42808469 41928735 41063416 40256776 39431067 38674703 38012544 37370656
3410C7370656o14993n93301n09484n37680m99083m51970m55430m28420m42943
$$ 37370656 36755663 36162362 35652878 35115198 34616115 34164145 33708715 33280295 32837352
3401C2837352m73638m29870l66191l81970l64072l73065m24749m34930m05552
$$ 32837352 32363714 31933844 31567653 31185683 30821611 30448546 30023797 29588867 29183315
3392B9183315m15949m67518m39544m45416n20749m56757m87150m74539m97295
$$ 29183315 28767366 28299848 27860304 27414888 26894139 26437382 25950232 25475693 24978398
3383B4978398m91457m97974n39579m74901m93488n57295n62899n69655n26249
$$ 24978398 24486941 23988967 23449388 22974487 22480999 21923704 21360805 20791150 20264901
3374B0264901m97701n60619m74954n27222n19906m76382n66495n63210m49961
$$ 20264901 19767200 19206581 18731627 18204405 17684499 17208117 16641622 16078412 15628451
3365A5628451m31931m45539m32576m49079l97559l71114l73189l69549l25309
$$ 15628451 15196520 14750981 14318405 13869326 13471767 13100653 12727464 12357915 12032606
3356A2032606l23824l69492l37617k80535k89718k49057k36338k40149j91879
$$ 12032606 11708782 11339290 11001673 10721138 10431420 10182363 9946025 9705876 9513997
3347I513997k22766j62692j81582j90260j75580j66319k10107j90067j09336j18514
$$ 9513997 9291231 9128539 8946957 8756697 8581117 8414798 8204691 8014624 7905288 7786774
3337G786774j10087j86327j65592j01302j59842j31772j06774r0980j32514o7681
$$ 7786774 7676687 7490360 7324768 7223466 7063624 6931852 6825078 6734098 6601584 6533903
3327F533903j01139r8631j11082p7602j57327o5854r6182q9866p0071r7740k4798
$$ 6533903 6432764 6334133 6223051 6145449 5988122 5922268 5826086 5736220 5666149 5568409 5543611
3316E543611p6078p5622l8631p3764l3738j6247m6158q6801j33806m1395k3852
$$ 5543611 5467533 5391911 5353280 5279516 5245778 5229531 5183373 5096572 4962766 4921371 4897519
3305D897519m5287n4024l1369l4065l4319j00744o847q3009l0194p829n0830q918
$$ 4897519 4852232 4798208 4766839 4732774 4698455 4597711 4590864 4507855 4477661 4469832 4419002 4410084
3293D410084M0365j3780j2891M8554Q673m7573r835l0796n1314K7303J719J4841
$$ 4410084 4450449 4436669 4423778 4472332 4481005 4433432 4423597 4392801 4341487 4368790 4370509 4385350
3281D385350o6916p8300N3115P2204J2048m8933k4464j5304K992j25768l9604
$$ 4385350 4318434 4240134 4293249 4365453 4377501 4328568 4304104 4288800 4291792 4166024 4126420
3270D126420Q477K6581o2167k9196m153j0847j7256l3638k858Q2708M7977K9116
$$ 4126420 4134897 4161478 4099311 4070115 4065962 4055115 4037859 4004221 4001363 4084071 4132048 4161164
3258D161164O8743Q293J2310L291p3250k9710j9915l1520J4605q5146k1851M7173
$$ 4161164 4229907 4238200 4250510 4253801 4180551 4150841 4130926 4099406 4114011 4028865 4007014 4054187
3246D054187K0596q293n651K139L6359j6465P4827O2260O3666R2554K0466O5443
$$ 4054187 4074783 4066490 4060839 4062978 4099337 4082872 4157699 4219959 4283625 4376179 4396645 4462088
3234D462088L1534J5447L8433k174j1661l4757q9513o1622n7404l3459k7819n3277
$$ 4462088 4493622 4509069 4547502 4545328 4533667 4498910 4409397 4347775 4290371 4256912 4229093 4175816
3222D175816q0493p2094r455j6969j3640o9658l5014o8570k3330R663l2566l4162
$$ 4175816 4095323 4023229 4013774 3996805 3983165 3913507 3878493 3809923 3786593 3796256 3763690 3729528
3210C729528N140p1049m2631J6669Q743k3550n4510m1004j5156o4631l9130K5780
$$ 3729528 3734668 3663619 3620988 3637657 3646400 3622850 3568340 3527336 3512180 3447549 3408419 3434199
3198C434199k0484m1380L5316O683j4973k0969l1401k0194n772j8494k8430j5866
$$ 3434199 3413715 3372335 3407651 3414334 3399361 3378392 3346991 3326797 3321025 3302531 3274101 3258235
3186C258235m377l5625J496j2078N3335P4118N6329J18372J07744M4442m4107
$$ 3258235 3253858 3218233 3219729 3207651 3260986 3335104 3391433 3509805 3617549 3661991 3617884
3175C617884p0132n6257q0236l0148l2324j54282r6180j64205j33577o9022k6615
$$ 3617884 3547752 3491495 3411259 3381111 3348787 3194505 3098325 2934120 2800543 2731521 2704906
3164B704906l3139m4087o6140P065o9651j3549O3773j258K0532M9191P8376N6952
$$ 2704906 2671767 2627680 2561540 2568605 2498954 2485405 2549178 2547920 2568452 2617643 2696019 2752971
3152B752971R9835J24536J41095J19402J83647K81979K34800L7916p5480n3316
$$ 2752971 2852806 2977342 3118437 3237839 3421486 3703465 3938265 3976181 3900701 3847385
3142C847385k2341j05997r5260j49175k29807k89532l01375k17915j28805j51594
$$ 3847385 3825044 3719047 3623787 3474612 3244805 2955273 2653898 2435983 2307178 2155584
3132B155584o0192j25666n2775j8485j4245k7024n7599J7227k0072L7983L2315
$$ 2155584 2095392 1969726 1916951 1898466 1884221 1857197 1799598 1816825 1796753 1834736 1867051
3121A867051M2695N5653o40o801O1796J35341J18805M2808J8528m8068q2093p3844
$$ 1867051 1909746 1965399 1964759 1957958 2019754 2155095 2273900 2316708 2335236 2287168 2205075 2131231
3109B131231j3410j271k9161j70225j96684j02772p4569j39763r3633m4592k2281
$$ 2131231 2117821 2116550 2087389 1917164 1720480 1617708 1543139 1403376 1309743 1265151 1242870
3098A242870j08792O113K0025r1122k3306j6n0198k6722q043k2526m1137m9536
$$ 1242870 1134078 1140191 1160216 1069094 1045788 1045772 995574 968852 960809 938283 897146 847610
3086H47610J4608m020K8997k0541n1774J6637p751k2524k9240m6838L9130K5148
$$ 847610 862218 858198 887195 866654 814880 831517 823766 801242 772002 725164 764294 789442
3074G89442m3655K5808j6656j0583l7247K5990n4116k7321q237L0294M5997m0090
$$ 789442 745787 771595 754939 744356 707109 733099 678983 651662 643425 673719 719716 679626
3062F79626r599j9166k9684j1974J575j0293M05k2937j2920L5213K4907n4226
$$ 679626 670027 650861 621177 609203 610778 600485 600890 577953 565033 600246 625153 570927
3050E70927k4071j1011K808N7036l1517j9419n117N010l6506o939M7080Q653P947
$$ 570927 546856 535845 538653 595689 564172 544753 539636 544646 508140 501201 548281 556934 564881
3037E64881n5442m059l0983M4861L2050m2315K5770R778j0243k4633J1645j8120
$$ 564881 509439 505380 474397 519258 551308 508993 534763 544541 534298 509665 521310 503190
3025E03190l9326K6844L8267m5068k0534m8677O5100L0564l7635L0658K7151q1663
$$ 503190 463864 490708 528975 483907 463373 414696 479796 510360 472725 503383 530534 448871
3013D48871J9106Q323m3574j7009q064M7378o1813p583M9909J8367n4971O914
$$ 448871 467977 476300 432726 415717 407653 455031 393218 385635 435544 453911 398940 405854
3001D05854k4893j3302J2867m834j8755j336M7990N4714q2426j7621k200J2063
$$ 405854 380961 367659 380526 375692 356937 355601 403591 458305 375879 358258 356058 368121
2989C68121j1599k0954k179K8737k5998K2683m179q986K6675m6712l9409L9670
$$ 368121 356522 335568 333389 362126 336128 358811 354632 345646 372321 325609 286200 325870
2977C25870J2395P935O78K0002o5052j6442J0384k0220J1387J0908R1o1276L686
$$ 325870 338265 346200 346878 366880 301828 285386 295770 275550 286937 297845 297936 236660 240346
2964B40346L5777L933J8930J6943j7525p936q489J0934k1754j1681O577K2733
$$ 240346 276123 280056 298986 315929 298404 290468 281979 292913 271159 259478 266055 288788
2952B88788K0399J3426M678m6176M633K994j3961O772l60m6071J4700N5219j7152
$$ 288788 309187 322613 327291 281115 285748 288742 274781 281553 281193 235122 249822 305041 287889
2939B87889P613K6596k41K8934j0633L839j4310J3131J2642j8810O897n778m240
$$ 287889 295502 322098 321857 350791 340158 343997 329687 342818 355460 336650 343547 337769 333529
2926C33529K2038M120l1863J3309m504J4618K9816m4208P20L6457k1450p636K244
$$ 333529 355567 359687 327824 341133 336629 351247 381063 336855 337575 374032 352582 344946 347190
2913C47190J0160Q313k5096J6351P5194p7749m4195o984N2690J5600q2236q220
$$ 347190 357350 365663 340567 356918 432112 354363 310168 303184 355874 371474 289238 281018
2901B81018Q4687o913o871J9072L801J17K7381k7657l387j9469J967P0052J8463
$$ 281018 365705 358792 351921 370993 374794 374911 402292 374635 371248 351779 353746 423798 442261
2888D42261r669M1654M179j2783l7325P943l2394M2544j1563l9189K611k1366
$$ 442261 432592 474246 478425 465642 428317 436260 403866 446410 434847 395658 398269 376903
2876C76903Q254L2910K73o149l1908k8757J1561N190j4334L1714Q2407Q218l3578
$$ 376903 385157 418067 418340 412191 380283 351526 363087 368277 353943 385657 468064 476282 442704
2863D42704M258l0032m5037j839k6154N5464n0968o928j3410P3780j5705l5535
$$ 442704 446962 416930 371893 370054 343900 399364 348396 341468 328058 401838 386133 350598
2851C50598J8389J0337K279m4952k7228k8958k481L7834m698L0730j9246k9107
$$ 350598 368987 379324 381603 336651 309423 280465 277984 315818 311120 341850 322604 293497
2839B93497N8609l6672J2946k3867J3032m478N591N682r309j7077Q3607J0018
$$ 293497 352106 315434 328380 304513 317545 313067 318658 324340 315031 297954 381561 391579
2827C91579p6509k2974J2806o465m1169J6845O0285q006m2237J3496R595o269
$$ 391579 315070 292096 304902 298437 257268 274113 334398 326392 284155 297651 307246 300977
2815C00977n5530K9940n4900m4695L8912K5944o54n6644J1658N3782o6240k1992
$$ 300977 245447 275387 220487 175792 214704 240648 239994 183350 195008 248790 182550 160558
2803A60558l8474n9131J0023L8119j8476j6501J3094j1052R259M6511n833j7478
$$ 160558 122084 62953 72976 111095 92619 76118 89212 78160 87419 133930 128097 110619
2791A10619l120J3068r388m9630l4853K0969L5055N6272k4725j675l2889l0411
$$ 110619 107499 120567 111179 61549 26696 47665 82720 138992 114267 112592 79703 49292
2779D9292K5276l3028J2712J2729L1642o896o45j5403L9315L300l0919J0233l4282
$$ 49292 74568 41540 54252 66981 98623 91727 91082 75679 114994 118294 87375 97608 63326
2766F3326l2600K8692q526J7127L0335k5717o724q618J8492l4084L4342k9529
$$ 63326 30726 59418 50892 68019 98354 72637 65913 57295 75787 41703 76045 46516
2754D6516N07J800m4290j4076N944J6382o1664k6243R088N6263O2232l418j9399
$$ 46516 47023 48823 4533 -9543 -3599 12783 -48881 -75124 -66036 -9773 52459 49041 29642
2741B9642m8062n870L4731m1638J4921M3920p6086o189M2115j9903K5578M7590
$$ 29642 -18420 -24290 10441 -31197 -16276 27644 -48442 -54631 -12516 -32419 -6841 40749
2729D0749n6617l76J2675j9348n169k3911N3874m81k4899J3932j8231l388q917
$$ 40749 -15868 -16244 -3569 -22917 -28086 -51997 1877 1396 -23503 -9571 -27802 -31190 -40107
2716d0107J0299r091J0296J9430j5478Q569j9647M1475K0068k1946l8500k3620
$$ -40107 -29808 -38899 -28603 -9173 -24651 -16082 -35729 5746 25814 3868 -34632 -58252
2704e8252j0534K3771n670R151J9178J9081k6404o6455J4933L2618L2253K1757
$$ -58252 -68786 -45015 -50685 -41534 -22356 -3275 -29679 -96134 -81201 -48583 -16330 5427
2692E427q8891J9479L362K7854K5167j9597J5661m1601L0211K594J8747O152m5441
$$ 5427 -83464 -63985 -60623 -32769 -7602 -27199 -11538 -53139 -22928 -20334 -1587 4565 -40876
2679d0876m3076n7120L5540L712K243M4549J6905J0640k3637q955J8404k2461
$$ -40876 -83952 -141072 -105532 -101820 -99577 -55028 -38123 -27483 -51120 -60075 -41671 -64132
2667f4132n2919L8933J2574k0294o64l162M4409j2371p051j5171L3689L837k9366
$$ -64132 -117051 -78118 -65544 -85838 -86502 -89664 -45255 -57626 -64677 -79848 -46159 -42322 -71688
2654g1688n719O074K4524J8255j0480j9640K5439k0081j0843N4819n4031j3470
$$ -71688 -77407 -71333 -46809 -28554 -39034 -58674 -33235 -53316 -64159 -9340 -63371 -76841
2642g6841R464j6338K2598j6210M9400l3741m749m8124P1235K0706l1472j2247
$$ -76841 -67377 -83715 -61117 -77327 -27927 -61668 -66417 -114541 -43306 -22600 -54072 -66319
2630f6319m7560k083J1137L6298M4029j1353l6640m1340J9239M0070j4399M1983
$$ -66319 -113879 -115962 -104825 -68527 -24498 -35851 -72491 -113831 -94592 -54522 -68921 -26938
2618b6938k0590n814J9916k2330k5232k7967L6678O2718K956l0486q765k2796
$$ -26938 -47528 -53342 -33426 -55756 -80988 -108955 -72277 -9559 -6603 -37089 -45854 -68650
2606f8650O655n454P388k7233M3478l3197k1331N5269k710l4839l5333M2369l1650
$$ -68650 -61995 -67449 -60061 -87294 -43816 -77013 -98344 -43075 -45785 -80624 -115957 -73588 -105238
2593a05238R022J0106P8609j86n9244m3800J3903p680K601R602j6361N800K4321
$$ -105238 -96216 -86110 -7501 -7687 -66931 -110731 -96828 -104508 -101907 -92305 -108666 -102866 -78545
2580g8545j0783J3256j7180k7374j5094J6441p90Q738l926O6699o841k6680L0072
$$ -78545 -89328 -76072 -93252 -120626 -135720 -119279 -120069 -111331 -115257 -48558 -55399 -82079 -52007
2567e2007P296m2517M822L4778m4137M5280l7701O808N3667p1777o2905P9185
$$ -52007 -44711 -87228 -82406 -47628 -91765 -46485 -84186 -77378 -23711 -95488 -158393 -79208
2555g9208J2433L4694K0550m7589k6955j0432R732M3095l6596n242o835k3629
$$ -79208 -66775 -32081 -11531 -59120 -86075 -96507 -86775 -43680 -80276 -85518 -92353 -115982
2543a15982O5585j144l4546K6224j4642l5533j1184N9540l8195o0175J9649P877
$$ -115982 -50397 -51541 -86087 -59863 -74505 -110038 -121222 -61682 -99877 -160052 -140403 -132526
2531a32526M772L0564L0784O877J3182m0775J9320l6560m7856J6632K9270L9733
$$ -132526 -127754 -97190 -66406 -59529 -46347 -87122 -67802 -104362 -152218 -135586 -106316 -66583
2519f6583k1678J5149Q358m8662M0213M5539l6022m7411l5033Q3032P626m2043
$$ -66583 -88261 -73112 -64754 -113416 -73203 -27664 -63686 -111097 -146130 -63098 -55472 -97515
2507i7515J6920n9407P543L9627L1861m7801k7599J3562k932K0515J1869m099
$$ -97515 -80595 -140002 -132459 -92832 -60971 -108772 -136371 -122809 -125741 -105226 -93357 -97456
2495i7456J6202K3928M709l2441K9967k9571q373J4120o8426K0420k9365K9179
$$ -97456 -81254 -57326 -52617 -85058 -55091 -84662 -93035 -78915 -147341 -126921 -156286 -127107
2483a27107K1908K3838N923k789n2836K505k7859L2520J964K498P371K6147p183
$$ -127107 -105199 -81361 -75438 -78227 -131063 -128558 -156417 -123897 -121933 -119435 -112064 -85917 -93100
2470i3100j1070L0513L2553J956m5329M6885L649O4457m7993k1486k8267j8883
$$ -93100 -104170 -73657 -41104 -39148 -84477 -37592 -33943 30514 -17479 -38965 -67232 -86115
2458h6115L7707K5716o2495L4867k1017n4863O3755K0654j7139m1380j0998O658
$$ -86115 -48408 -22692 -85187 -50320 -71337 -126200 -62445 -41791 -58930 -100310 -111308 -104650
2446a04650P230k2772K1936J7584j496J8045j1063l9609j55P9358l8018k6516
$$ -104650 -97420 -120192 -98256 -80672 -82168 -64123 -75186 -114795 -114950 -35592 -73610 -100126
2434a00126O688l9294L8076J8950q755r553M2125l493M638k6251J622J9732j321
$$ -100126 -93438 -132732 -94656 -75706 -84461 -94014 -51889 -55382 -50744 -76995 -75373 -55641 -56962
2421e6962j4112j404n8368M9949K6345k3337n098o5453N2892J6895P949o216l7253
$$ -56962 -71074 -72478 -130846 -80897 -54552 -77889 -82987 -148440 -95548 -78653 -70704 -76920 -114173
2408a14173J4515j944j366L171L9187K5775O157j026q8j6768l4615K8202l5111
$$ -114173 -99658 -101602 -102968 -99797 -60610 -34835 -28678 -29704 -29792 -46560 -81175 -52973 -88084
2395h8084L0301j7985P881j8412J1868K8704r770P237L93k6816j3062j0925j1041
$$ -88084 -57783 -75768 -67887 -86299 -74431 -45727 -55497 -48260 -47867 -74683 -87745 -98670 -109711
2382a09711O20L2870J2360N2540J5155j8215n1392j1209P06M581M3504j2849j3161
$$ -109711 -109091 -76221 -63861 -11321 3834 -14381 -65773 -76982 -76276 -71695 -28191 -41040 -54201
2369e4201j3221m290q915M242N048M631J533M5863j1876P090M2119J517k3726
$$ -54201 -67422 -71712 -80627 -76385 -71337 -66706 -65173 -19310 -31186 -24096 18023 19540 -4186
2356d186j7327O917l6981Q450K8946k8878j9430K4384K0895n16O438j9737L666
$$ -4186 -21513 -14596 -51577 -43127 -14181 -43059 -62489 -38105 -17210 -17726 -11288 -31025 -27359
2343b7359o2197k61R066q412j8343J9163q502p905L5275L960J1147j4688K069
$$ -27359 -89556 -89817 -80751 -89163 -107506 -88343 -96845 -104750 -69475 -65515 -54368 -69056 -66987
2330f6987K018L0621Q792k3546j3231k1876J6205L672o4l932o690O0896o49k6555
$$ -66987 -64969 -34348 -25556 -49102 -62333 -84209 -68004 -64332 -64396 -68328 -75018 -14122 -14771 -41326
2316d1326k9433K332J9111m135L1624J6832K0190k5642l9698Q801R032k3400p064
$$ -41326 -70759 -68427 -49316 -53451 -21827 -4995 15195 -10447 -50145 -41344 -32312 -55712 -62776
2303f2776R538j5806K0152k6348J9385L5540k7238k730M2600k7353j6922K6246
$$ -62776 -53238 -69044 -48892 -75240 -55855 -20315 -47553 -50283 -7683 -35036 -51958 -25712
2291b5712K0321j8770m751o242j9638J0574K19J4984l1106k5013K7000N6697n038
$$ -25712 -5391 -24161 -28912 -35154 -54792 -44218 -43999 -29015 -60121 -85134 -58134 -1437 -6475
2278f475K2002L5177j5332m7506j6761M0096j631k2398L1893K5681m3561O45j0667
$$ -6475 15527 50704 35372 -12134 -28895 11201 9570 -12828 19065 44746 1185 1830 -8837
2265h837J1348R834j1824j3086m792J4601K766j4079j5556K609k5595r704J9766
$$ -8837 2511 12345 521 -12565 -17357 -2756 10 -14069 -29625 -27016 -52611 -62315 -42549
2252d2549J0700j2713m418j2671p911M043K282L9978K5038k6079J7294m0202J7048
$$ -42549 -31849 -44562 -48980 -61651 -69562 -65519 -63237 -23259 1779 -24300 -7006 -47208 -30160
2239c0160l4239J276K1191Q649m423M7125M000j1575k1255q302K4834J9422m0386
$$ -30160 -64399 -63123 -41932 -33283 -37706 9419 13419 1844 -19411 -27713 -2879 16543 -23843
2226b3843l2010M0111P122m794n946N3485J1525j0579J7531J7691O415l1841R708
$$ -23843 -55853 -15742 -8620 -13414 -19360 34125 45650 35071 52602 70293 76708 44867 54575
2213E4575m473k2510l4755J1053r560P0160J2316l9926P518N806l0040k1197L1147
$$ 54575 50102 27592 -7163 3890 -5670 64490 76806 36880 44398 50204 20164 -1033 30114
2200C0114M5841o5415R285O9719j4122k690k5377O3050j5131P678m845j7047l967
$$ 30114 75955 10540 19825 89544 75422 72732 47355 110405 95274 102952 98107 81060 77093
2187G7093L5704L3187L5982R54L6463L6229n294p2635j6465L6030P898m0003J5908
$$ 77093 112797 145984 181966 182920 219383 255612 250318 177683 161218 197248 205146 165143 181051
2174A81051K6840L7501M0337m9797k9726J9358r5K1984o376M7229L574n239m8796
$$ 181051 207891 245392 285729 235932 206206 225564 225469 247453 241077 288306 291880 286641 237845
2161B37845o707L6929j6243J919J5251M3029Q0573m8303L635M6395p6894M291
$$ 237845 231138 268067 251824 253743 268994 312023 392596 344293 347928 394323 317429 321720
2149C21720L5760J5629N0655l247q272M0210J3479P5077k1016m8979N3289K1897
$$ 321720 357480 373109 423764 420517 412245 452455 465934 541011 519995 471016 524305 546202
2137E46202M9507L29j8615K7806P1258r567O2052K5125N0793O5399N3319O7936
$$ 546202 595709 596038 577423 605229 676487 666920 728972 754097 804890 870289 923608 991544
2125I91544N6498M7018N7540K1439Q3507M5876J1323Q3939M1500R3321Q8356L7340
$$ 991544 1048042 1095060 1152600 1174039 1257546 1303422 1314745 1398684 1440184 1533505 1621861 1659201
2113A659201Q8187R5651J34293K00412J38943J22679J77640J77574J79789J88068
$$ 1659201 1747388 1843039 1977332 2177744 2316687 2439366 2617006 2794580 2974369 3162437
2103C162437L45075M13684M14511N44493O02599P61452J125795J428265J648390
$$ 3162437 3507512 3921196 4335707 4880200 5482799 6244251 7370046 8798311 10446701
2094A0446701J970444K310866J489869o22359j598877k025343j678783j800864
$$ 10446701 12417145 14728011 16217880 15595521 13996644 11971301 10292518 8491654
2086H491654j804630j305761r27458o38489m24477l71094k53348j36262r9312
$$ 8491654 6687024 5381263 4453805 3815316 3390839 3019745 2766397 2630135 2530823
2077B530823j57945k20603j70564j11494j35105k16525r9868j42722q3938j26911
$$ 2530823 2372878 2152275 1981711 1870217 1735112 1518587 1418719 1275997 1192059 1065148
2067A065148p5134l4854l7956j7127n57p4759o2895p0365l6276M1650l2815r8902
$$ 1065148 990014 955160 917204 900077 899520 824761 761866 691501 655225 696875 664060 565158
2055E65158n2849q112n6956k473K697n3230j791j4068J2258n748R13j0824m9910
$$ 565158 512309 504197 447241 444768 447465 394235 392444 378376 390634 384886 385799 374975 325065
2042C25065n3514M193j7507l5529k8793N2596N800q4515M2216j8898j007J4285
$$ 325065 271551 275744 258237 222708 193915 246511 252311 167796 210012 191114 190107 204392
2030B04392K1800m2411k5036K5320J2529K2690m7116k6952n602q363J6992j2222
$$ 204392 226192 183781 158745 184065 196594 219284 172168 145216 139614 131251 148243 136021
2018A36021K5327j0699l5155j0671J6503k2947j9838J3014J3047l2505k9474L7890
$$ 136021 161348 150649 115494 104823 121326 98379 78541 91555 104602 72097 42623 80513
2006H0513O073k4469O632M0070j0287K6724l9574k2828P600L0109L379Q341J768
$$ 80513 86586 62117 68749 108819 98532 125256 85682 62854 70454 100563 103942 112283 114051
1993A14051j8667j9990K1223j1096k3759k1015m0118M5849K5377K0799j9873j3580
$$ 114051 95384 75394 96617 85521 61762 40747 629 46478 71855 92654 72781 59201
1981E9201m6297m5775N8635L0923j3147j233k4023l6116L5489M0183m6010o8714
$$ 59201 12904 -32871 25764 56687 43540 42307 18284 -17832 17657 57840 11830 -56884
1969e6884J4659K4633l5783K3591N5575n1228J7635m892K9763q83n2808j3062
$$ -56884 -42225 -17592 -53375 -29784 25791 -25437 -7802 -12694 17069 16186 -36622 -49684
1957d9684O1295l1487q741N3666k0102J9362J349l3721j7432l2973N641N7777
$$ -49684 11611 -19876 -28617 25049 4947 24309 25658 -8063 -25495 -58468 -52827 4950
1945D950J5066k5511j9061Q367K9926j5721L2018J2037p367J1418j2501K2857
$$ 4950 20016 -5495 -24556 -16189 13737 -1984 30034 42071 34704 46122 33621 56478
1933E6478p2049l1170K5224j9288k3259P32N0256r565q614L3808k1033r462L0747
$$ 56478 -15571 -46741 -21517 -40805 -64064 -63332 -13076 -22641 -31255 2553 -18480 -27942 2805
1920B805n2958o1503L1630O5634L6054m2621m3857K370K6479K4154k8445M2657
$$ 2805 -50153 -111656 -80026 -14392 21662 -20959 -64816 -62446 -35967 -11813 -40258 2399
1908B399M6545m4430J414N873l9305J906M6995k4403k4703M764r034J1163J6440
$$ 2399 48944 4514 5928 11801 -27504 -25598 21397 -3006 -27709 -22945 -31979 -20816 -4376
1895d376j0528m9978L2686P849p9645o6754K2936O5793K173J8130N5940J4598
$$ -4376 -14904 -64882 -32196 -24347 -103992 -170746 -147810 -82017 -79844 -61714 -5774 8824
1883H824K8414j844p2610o122K2397K0480m7008m799J2281k6641J3756J2631j1283
$$ 8824 37238 35394 -37216 -43338 -20941 -461 -47469 -52268 -39987 -66628 -52872 -40241 -51524
1870e1524l9630R143K7371L062L0545l068k2523J8080N3696m098j9028m9961J4333
$$ -51524 -91154 -82011 -54640 -51578 -21033 -24101 -46624 -28544 25152 21054 2026 -47935 -33602
1857c3602j8382L1315m4042l3265N9607Q007p0005K7038L611J7009K9158j7712
$$ -33602 -51984 -20669 -64711 -97976 -38369 -30362 -100367 -73329 -69718 -52709 -23551 -41263
1845d1263P3404j0666k5280L0699l2074K3460r969k1954l3048O739K0733j1353
$$ -41263 32141 21475 -3805 26894 -5180 18280 8311 -13643 -46691 -39952 -19219 -30572
1833c0572L1280J1655j953l050J4052l2805q395R088N9703J6210O098J2026o097
$$ -30572 708 12363 10410 7360 21412 -11393 -19788 -10700 49003 65213 71311 83337 77240
1820G7240k9140k9492r388n4261L9746L4528m5651k2650j9835J7310r808m112
$$ 77240 48100 18608 9220 -45041 -5295 29233 -16418 -39068 -58903 -41593 -51401 -55513
1808e5513K0762K2463M1344n1447k3801m3714M4154L6793m5540L924l8476j6262
$$ -55513 -34751 -12288 29056 -22391 -46192 -89906 -45752 -8959 -54499 -50575 -89051 -105313
1796a05313j3710J8529Q237L0860l482K7912K9629j1079j3742J1529O23n8684
$$ -105313 -119023 -100494 -92257 -61397 -64879 -36967 -7338 -18417 -32159 -20630 -20007 -78691
1784g8691j0900O2287K900m3541j4010Q1002R359Q154l0972k7916N737J0216m2586
$$ -78691 -89591 -27304 -24404 -67945 -81955 -953 8406 16560 -14412 -42328 -36591 -26375 -68961
1771f8961L9901P2671m2185n0720J6494K6157l889r252M1981j6656n5401J1879
$$ -68961 -29060 43611 1426 -49294 -32800 -6643 -10532 -19784 22197 5541 -49860 -37981
1759c7981k2837K0078M0717J9953r723m764q1713k0288K7607J1919l5857K1192
$$ -37981 -60818 -40740 -23 19930 10207 5443 -76270 -96558 -68951 -57032 -92889 -71697
1747g1697K9067J6665p765k6716J5642M436M9690r754R913M3131k6578l284o7971
$$ -71697 -42630 -25965 -33730 -60446 -44804 -40368 9322 -432 9481 52612 26034 22750 -45221
1734d5221K2162K2712n8802N1624l2441j7617J0185R876l0841j1977k614m604
$$ -45221 -23059 -347 -59149 -7525 -39966 -57583 -47398 -37522 -68363 -80340 -82954 -87558
1722h7558R476j6984Q631L5544p991N084K428j1609O1212J8533m6150j3887k6932
$$ -87558 -78082 -95066 -86435 -50891 -58882 -53798 -51370 -62979 -1767 16766 -29384 -43271 -70203
1709g0203L686k6418l785Q645J0471J7906k8598j089J4668L7963M2637J8242q0699
$$ -70203 -66517 -92935 -96720 -88075 -77604 -59698 -88296 -89385 -74717 -36754 5883 24125 -56574
1696e6574l4698L4030m552O021K5542K9414j1891R17M2356O848j0970m6285k830
$$ -56574 -91272 -57242 -61794 -55773 -30231 -817 -12708 -11791 30565 37413 26443 -19842 -22672
1683b2672J451l114J3722o1569M1701j2492j1417L6954K2339n4108m5971O2277
$$ -22672 -21221 -24335 -10613 -72182 -30481 -42973 -54390 -17436 4903 -49205 -95176 -32899
1671c2899m087k2899L0805N5041j2119l861o5936J4597K8292k9532j2519N7197
$$ -32899 -36986 -59885 -29080 25961 13842 9981 -55955 -41358 -13066 -42598 -55117 2080
1659B080M3k8236m7001k6693r445M6221o44j134M4047r241Q529m7683j2252K2480
$$ 2080 2123 -26113 -73114 -99807 -109252 -63031 -63675 -64809 -20762 -30003 -21474 -69157 -81409 -58929
1645e8929J311K1952N4806L2407n9739P203k9261K3562j703n4820J7433J3615
$$ -58929 -57618 -35666 19140 51547 -8192 -989 -30250 -6688 -8391 -63211 -45778 -32163
1633c2163p99J3544j4713J937O2442L2862o3957n3095J3578r304j154K9664L7882
$$ -32163 -32962 -19418 -34131 -32194 30248 63110 -847 -53942 -40364 -49668 -50822 -21158 16724
1620A6724j7901k879P161l4395k4350O0971r471n3493j3228J3925K5290K51K42
$$ 16724 -1177 -4056 3105 -31290 -55640 5331 -4140 -57633 -70861 -56936 -31646 -31395 -31153
1607c1153L0266j5954r0P638j7729p94J3552j0892k6266j4490M1238J9928k1992
$$ -31153 -887 -16841 -16931 -9293 -27022 -27816 -14264 -25156 -51422 -65912 -24674 -4746 -26738
1594b6738n818k1561O0932r437k7798k079j7747M2220j8902L0372r422l7063Q452
$$ -26738 -32556 -54117 6815 -2622 -30420 -32499 -50246 -8026 -26928 3444 -5978 -43041 -34589
1581c4589j1367K7594J22j7140L9774k9524j1151j4436K5876o036J8685N259Q017
$$ -34589 -45956 -18362 -18240 -35380 4394 -25130 -36281 -50717 -24841 -30877 -12192 -6933 1084
1568A084l0378O4570k1402k0757N4858o2350K506q520p967j7670O438j8149m0761
$$ 1084 -29294 35276 13874 -6883 47975 -14375 -11869 -20389 -28356 -46026 -39588 -57737 -98498
1555i8498M4903N0033j5519l5984K9390N5278m668J6362l2083l8905j1122j4250
$$ -98498 -53595 -3562 -19081 -55065 -25675 29603 24935 41297 9214 -29691 -40813 -55063
1543e5063j6839K7279K0802K6149k712K125J9952m5345j1803R340J5334J4959
$$ -55063 -71902 -44623 -23821 2328 -384 1741 21693 -23652 -35455 -26115 -10781 4178
1531D178l5501k0587l470J4596K9065j3295m986J5469k65r913k3145J2971k0663
$$ 4178 -31323 -51910 -55380 -40784 -11719 -25014 -30000 -14531 -14796 -24709 -47854 -34883 -55546
1518e5546m663J3157j3331J7242j1710J0301K9365j6672K3603J3400K0829Q686
$$ -55546 -60209 -47052 -60383 -43141 -54851 -44550 -15185 -31857 -8254 5146 25975 34661
1506C4661j0943k2041j3715n7973K1398J8170J9616L3559J2958L583l3806J1547
$$ 34661 23718 1677 -12038 -70011 -48613 -30443 -10827 22732 35690 39273 5467 17014
1494A7014O786j6566L5402r1260J9993J3394l1697o544M4211k0789K56p754k8620
$$ 17014 23800 7234 42636 -48624 -28631 -15237 -46934 -53478 -9267 -30056 -29800 -37554 -66174
1481f6174O471J2035J5945r356K6881k0163k8184N787O776K9927K8746m0143J6353
$$ -66174 -59703 -47668 -31723 -41079 -14198 -34361 -62545 -56758 -49982 -20055 8691 -31452 -15099
1468a5099j5263o0232O8301P4418M005m3868m2115j7400j8744P2680Q056Q509
$$ -15099 -30362 -90594 -22293 52125 56130 12262 -29853 -47253 -65997 6683 14739 23248
1456B3248l3012j34o418K0775O555J389r446J0974p9006K1750Q6756p880m0906
$$ 23248 -9764 -9898 -16316 4459 11014 12403 2957 13931 -65075 -43325 43431 35551 -5355
1443e355K6372k5087J2168k0917O5135o5276J5667k7272n5800J9532O8898k2882
$$ -5355 21017 -4070 8098 -12819 52316 -12960 2707 -24565 -80365 -60833 8065 -14817
1431a4817j5221L4122n0846L0016K3100r486m904J637j9200M2016k6251m094l683
$$ -14817 -30038 4084 -46762 -16746 6354 -3132 -8036 -6399 -25599 16417 -9834 -13928 -17611
1418a7611k139K0451m084r329r023J3313l3720K0271Q1563k3032j4236m0935j0052
$$ -17611 -19750 701 -3383 -12712 -21735 -8422 -42142 -21871 59692 36660 22424 -18511 -28563
1405b8563M258M8837j3676r175n244o293N826L7282l9400k1553q21n1688M3199
$$ -28563 -24305 24532 10856 1681 -3563 -9856 -4030 33252 -6148 -27701 -28522 -80210 -37011
1392c7011M2317j0934K4779l9299l047R282k3864l013L3402j8161K9294m7037
$$ -37011 5306 -5628 19151 -20148 -23195 -13913 -37777 -40790 -7388 -25549 3745 -43292
1380d3292j5645M1991l785p840P488j7591M3415J6335r734l373l7365J7238O6493
$$ -43292 -58937 -16946 -20731 -28571 -21083 -38674 4741 21076 11342 7969 -29396 -12158 54335
1367E4335P459l781k4819j3947m5468J5520L6748o2262N631M8203J1791J1918
$$ 54335 61794 58013 33194 19247 -26221 -10701 26047 -36215 -30584 17619 29410 41328
1355D1328o628j7664K3530p218l954K36l106l2954j7441r270j3751j4071M1283
$$ 41328 34700 17036 40566 33348 29394 29630 26524 -6430 -23871 -33141 -46892 -60963 -19680
1342a9680J2606M487l6294M7330l1786m160j3377M7757M4945p9087P320j4409
$$ -19680 -7074 -2587 -38881 8449 -23337 -27497 -40874 6883 51828 -27259 -19939 -34348
1330c4348j8331q024R824M6879J8215m0057J0174L8547J1081j7213J8535L869
$$ -34348 -52679 -60703 -50879 -4000 14215 -25842 -15668 22879 33960 16747 35282 39151
1318C9151j7539j974k419k497K0354j0684J6155l9182r59k5082j7649l3093L6084
$$ 39151 21612 19638 17219 14722 35076 24392 40547 1365 406 -24676 -42325 -75418 -39334
1305c9334N9173l725k9004K9810k208j9766m6300K6090L8739m9760K1771R859
$$ -39334 19839 16114 -12890 16920 14712 -5054 -51354 -25264 13475 -36285 -14514 -4655
1293d655Q935J476M4950m4177n3852L1038o637K0167J688l6432P803J6544L0264
$$ -4655 4280 5756 50706 6529 -47323 -16285 -22922 -2755 -1067 -37499 -29696 -13152 17112
1280A7112L357K6237k3958l4697j8668M651j539l8594k0116R3126J1350P445n7161
$$ 17112 20469 46706 22748 -11949 -30617 -25966 -27505 -66099 -86215 6911 18261 25706 -31455
1267c1455R333K8486k974L1338j4344q3032J5566L2755l521K2828K8002n8521
$$ -31455 -22122 6364 3390 34728 20384 -62648 -47082 -14327 -17848 4980 32982 -25539
1255b5539q987K6523J1164K8550M5932O255j0617m2291n7064m288j3367J3694
$$ -25539 -34526 -8003 3161 31711 77643 83898 73281 30990 -26074 -30362 -43729 -30035
1243c0035p350K061J4338M222N6012L394k5949J6471l004n1957q41Q7015m2359
$$ -30035 -37385 -35324 -20986 -16764 39248 42642 16693 33164 30160 -21797 -22638 64377 22018
1230B2018l0824Q116R687J1669r243k0040k2857N3775j4394m6210j4389J5652
$$ 22018 -8806 -690 8997 20666 11423 -8617 -31474 22301 7907 -38303 -52692 -37040
1218c7040L3881J0556k8288K1108M6206l8411o3517p447L2532J1012j206k8105
$$ -37040 -3159 7397 -20891 217 46423 8012 -55505 -62952 -30420 -19408 -20614 -48719
1206d8719O7977L0959J2258k2024j9927m7946m0075p76q277M5181J9299M395L2939
$$ -48719 19258 50217 62475 40451 20524 -27422 -67497 -68273 -76550 -31369 -12070 -7675 25264
1193B5264q80k3785M476J6742j4204l029m3448J3669j6887j1516L351P452K6199
$$ 25264 24384 599 5075 21817 7613 4584 -38864 -25195 -42082 -53598 -50247 -42795 -16596
1180a6596k2608J5814l980Q786J9793k4360j6833J0122J7087j0099M9659k4615
$$ -16596 -39204 -23390 -27370 -18584 1209 -23151 -39984 -29862 -12775 -22874 26785 2170
1168B170l2653J8647K4161L6976n9200J6261L4641k9493j3155K7727m625L20P290
$$ 2170 -30483 -11836 12325 49301 -9899 6362 41003 11510 -1645 26082 21457 21777 29067
1155B9067j5874J8653m2284N8002K0400j8979l2842r141P849p473k8436J0262
$$ 29067 13193 31846 -10438 47564 67964 48985 16143 7002 14851 7378 -21058 -10796
1143a0796J7550k6796L8260j5939n5671j2263M6496O304q552L0055l3844j2494
$$ -10796 6754 -20042 18218 2279 -53392 -65655 -19159 -12855 -21407 8648 -25196 -37690
1131c7690K4042Q58J8907J585j8081K0393m148K1546j6820K0612M022n2621L1381
$$ -37690 -13648 -12790 6117 7702 -10379 10014 5866 27412 10592 31204 35226 -17395 13986
1118A3986k6634m9675N5869L7366M0260K0549N555l59k0145p3066l3126q7Q924
$$ 13986 -12648 -62323 -6454 30912 71172 91721 97276 96917 76772 3706 -29420 -29507 -20583
1105b0583M3522J3645p967k0147O5688m6746m658p2944R058J6112J9956k2324
$$ -20583 22939 36584 28617 8470 74158 27412 22754 -50190 -41132 -25020 -5064 -27388
1093b7388p359M7576L5340Q670k9461k7921M2698J9911k4999o0444L6782j0480
$$ -27388 -34747 12829 48169 56839 27378 -543 42155 62066 37067 -23377 13405 2925
1081B925n381N0602m5533q146l0861N020M6813J1193o864k1140l046l0101j6794
$$ 2925 -2456 48146 2613 -5533 -36394 -31374 15439 26632 19768 -1372 -4418 -34519 -51313
1068e1313O9570K7115R453m3512J6631l0191J407P137j8886K3314J349Q570L6593
$$ -51313 18257 45372 54825 11313 27944 -2247 -840 6297 -12589 10725 12074 20644 57237
1055E7237l5721j6967M1283k5315R90o8304M6073P9995m7714m6279k7686N7625
$$ 57237 21516 4549 45832 20517 21507 -46797 -724 79271 31557 -14722 -42408 15217
1043A5217k3635m0594l853J13934K5425k1615l6050n6031L1120r944K7583m4422
$$ 15217 -8418 -49012 -52865 61069 86494 64879 28829 -27202 3918 -6026 21557 -22865
1031b2865j8859K6292J0656R02j756M0576K2515k3531K2689p805J8076L699k3110
$$ -22865 -41724 -15432 -4776 -3874 -5630 34946 57461 33930 56619 48814 66890 70589 47479
1018D7479K6631m6196J0809j5204J5974q042K3926M418k291j6489l6731m204M3511
$$ 47479 74110 27914 38723 23519 39493 31451 55377 59795 57504 41015 4284 80 43591
1005D3591r792n244K6157n9695N050K4928j7342o2552K6906L3162m5217l6117
$$ 43591 33799 28555 54712 -4983 67 24995 7653 -54899 -27993 5169 -40048 -76165
993g6165L5091k3256J6739Q0407M9227l2081k2724j1931k7921n5431L7919K2406
$$ -76165 -41074 -64330 -47591 32816 82043 49962 27238 15307 -12614 -68045 -30126 -7720
981g720j9367L5382M5460k5269k9879q910M126M243M3573j3444J7826N7639m1656
$$ -7720 -27087 8295 53755 28486 -1393 -10303 -6177 -1934 41639 28195 46021 103660 62004
968F2004p8992j5987N87K9301n77k4861k8161K0805L6816J5395r955P961J5583
$$ 62004 -16988 -32975 -32388 -3087 -3664 -28525 -56686 -35881 935 16330 6375 14336 29919
955B9919j5357l5967J4852P3928l4319j8695N853k770l7511O897J2031J6000o0338
$$ 29919 14562 -21405 -6553 67375 33056 14361 20214 17444 -20067 -13170 -1139 14861 -45477
942d5477R548j3783M2494p030L7415l7320j7553j5063p878J4779l757j4218M1142
$$ -45477 -35929 -49712 -7218 -14248 23167 -14153 -31706 -46769 -54647 -39868 -43625 -57843 -16701
$$ [...]
##END NTUPLES=NMR SPECTRUM
##END=
