##TITLE=1H_TG-2341-A1
 CDCl3
 8 sc, 
 16.12.2021
##JCAMPDX= 6.0         $$ Bruker NMR JCAMP-DX V2.0
##DATA TYPE= NMR SPECTRUM
##DATA CLASS= NTUPLES
##ORIGIN= UXNMR, Bruker Analytische Messtechnik GmbH
##OWNER= root
$$ XWIN-NMR		Version 3.5
$$ Thu Dec 16 11:57:39 2021 Russian Standard Time (UT+4h)  she@DPX200
##.OBSERVE FREQUENCY= 200.131346
##.OBSERVE NUCLEUS= ^1H
##.ACQUISITION MODE= SIMULTANEOUS
##.ACQUISITION SCHEME= undefined
##.AVERAGES= 8
##.DIGITISER RES= 18
##SPECTROMETER/DATA SYSTEM= spect
##.PULSE SEQUENCE= zg30
##.SOLVENT NAME= CDCl3
##.SHIFT REFERENCE= (INTERNAL, CDCl3, 0, 15.7381)
##AUDIT TRAIL= $$ (NUMBER, WHEN, WHO, WHERE, WHAT)
$$ ##TITLE= Audit trail, XWIN-NMR		Version 3.5
$$ ##JCAMPDX= 5.01
$$ ##ORIGIN= Bruker BioSpin GmbH
$$ ##OWNER= she
$$ F:/spectra/data/she/nmr/H-F/1/pdata/1/auditp.txt
$$ ##AUDIT TRAIL=  $$ (NUMBER, WHEN, WHO, WHERE, WHAT)
(   1,<2021-12-16 11:56:15.98 +0400>,<she>,<DPX200>,
      <created by zg, POWCHK disabled, PULCHK disabled
       configuration hash MD5:
       00 E9 B6 7A A2 85 ED C7 34 08 36 98 17 FE 4E 26
       data hash MD5: 16K
       29 CE F1 84 39 22 69 D8 BC F9 76 07 41 C1 24 5B>)
(   2,<2021-12-16 11:56:18.39 +0400>,<she>,<DPX200>,
      <Start of raw data processing
       efp BC_mod = 2 LB = 0.24 FT_mod = 6 PKNL = 1 PHC0 = -15870.7 PHC1 = 13.60079 SI = 16K 
       data hash MD5: 16K
       27 43 6A E8 EB A0 DA 0F 12 1B 53 C0 C2 0E 37 B0>)
(   3,<2021-12-16 11:56:38.98 +0400>,<she>,<DPX200>,
      <pk PHC0 = 2.573631 PHC1 = -4.8 
       data hash MD5: 16K
       77 E0 F3 E4 75 70 17 AC A0 9A EC 6F EF 73 EC BB>)
(   4,<2021-12-16 11:56:42.18 +0400>,<she>,<DPX200>,
      <abs ABSG = 5 
       data hash MD5: 16K
       7C 57 16 82 9E 27 60 62 FA 90 73 4C 30 CA D3 D6>)
$$ ##END=
$$ 
$$ hash MD5
$$ D7 36 97 17 E5 9B AC 59 E4 6C 58 F4 65 10 90 F7
##$RELAX= 
##$RELAX= 
##$RELAX= 
##$RELAX= 
##$RELAX= 
##$RELAX= 
$$ Bruker specific parameters
$$ --------------------------
##$DU= <F:/spectra>
##$EXPNO= 1
##$NAME= <H-F>
##$PROCNO= 1
##$TYPE= <nmr>
##$USER= <she>
##$AMP= (0..31)
100 100 100 100 100 100 100 100 100 100 100 100 100 100 100 100 100 100 
100 100 100 100 100 100 100 100 100 100 100 100 100 100 
##$AQSEQ= 0
##$AQ_mod= 1
##$AUNM= <au_zg>
##$AUTOPOS= <>
##$BF1= 200.13
##$BF2= 200.13
##$BF3= 200.13
##$BF4= 200.13
##$BF5= 200.13
##$BF6= 200.13
##$BF7= 200.13
##$BF8= 200.13
##$BYTORDA= 1
##$CFDGTYP= 0
##$CFRGTYP= 5
##$CHEMSTR= <none>
##$CNST= (0..31)
1 1 145 1 1 1 1 1 1 1 1 1 1 1 1 1 1 1 1 1 1 1 1 1 1 1 1 1 1 1 1 1 
##$CPDPRG= <>
##$CPDPRG1= <>
##$CPDPRG2= <>
##$CPDPRG3= <>
##$CPDPRG4= <mlev>
##$CPDPRG5= <mlev>
##$CPDPRG6= <mlev>
##$CPDPRG7= <mlev>
##$CPDPRG8= <mlev>
##$CPDPRGB= <>
##$CPDPRGT= <>
##$D= (0..31)
0 1.2 0 0 0 0 0 0 0 0.06 0 0.03 0 0 0 0 0.0002 0 0 0 0 0 0 0 0 0 0 0 0 
0 0 0 
##$DATE= 1639641375
##$DBL= (0..7)
120 120 120 120 120 120 120 120 
##$DBP= (0..7)
150 150 150 150 150 150 150 150 
##$DBP07= 0
##$DBPNAM0= <>
##$DBPNAM1= <>
##$DBPNAM2= <>
##$DBPNAM3= <>
##$DBPNAM4= <>
$$ [...]
##$SUBNAM2= <"">
##$SUBNAM3= <"">
##$SUBNAM4= <"">
##$SUBNAM5= <"">
##$SUBNAM6= <"">
##$SUBNAM7= <"">
##$SUBNAM8= <"">
##$SUBNAM9= <"">
##$SW= 18.0517287032376
##$SWIBOX= (0..15)
0 0 2 0 0 0 0 0 0 0 0 0 0 0 0 0 
##$SW_h= 3612.71676300578
##$TD= 16384
##$TD0= 1
##$TE= 0
##$TE2= 300
##$TE3= 300
##$TEG= 300
##$TL= (0..7)
0 120 120 120 120 120 120 120 
##$TP= (0..7)
150 150 150 150 150 150 150 150 
##$TP07= 0
##$TPNAME0= <>
##$TPNAME1= <>
##$TPNAME2= <>
##$TPNAME3= <>
##$TPNAME4= <>
##$TPNAME5= <>
##$TPNAME6= <>
##$TPNAME7= <>
##$TPOAL= (0..7)
0.5 0.5 0.5 0.5 0.5 0.5 0.5 0.5 
##$TPOFFS= (0..7)
0 0 0 0 0 0 0 0 
##$TUNHIN= 0
##$TUNHOUT= 0
##$TUNXOUT= 0
##$USERA1= <user>
##$USERA2= <user>
##$USERA3= <user>
##$USERA4= <user>
##$USERA5= <user>
##$V9= 5
##$VALIST= <valist>
##$VCLIST= <CCCCCCCCCCCCCCC>
##$VD= 0
##$VDLIST= <DDDDDDDDDDDDDDD>
##$VPLIST= <PPPPPPPPPPPPPPP>
##$VTLIST= <TTTTTTTTTTTTTTT>
##$WBST= 1024
##$WBSW= 4
##$XGAIN= (0..3)
0 0 0 0 
##$XL= 0
##$YL= 0
##$YMAX_a= 781271
##$YMIN_a= -1094262
##$ZGOPTNS= <>
##$ZL1= 120
##$ZL2= 120
##$ZL3= 120
##$ZL4= 120
##$ABSF1= 15.7557
##$ABSF2= -2.296149
##$ABSG= 5
##$ABSL= 3
##$ALPHA= 0
##$AQORDER= 0
##$ASSFAC= 0
##$ASSFACI= 0
##$ASSFACX= 0
##$ASSWID= 0
##$AUNMP= <proc_1d>
##$AZFE= 0.1
##$AZFW= 0.1
##$BCFW= 0
##$BC_mod= 2
##$BYTORDP= 0
##$COROFFS= 0
##$CY= -3
##$DATMOD= 1
##$DC= 0
##$DFILT= <>
##$DTYPP= 0
##$F1P= 0
##$F2P= 0
##$FCOR= 1
##$FTSIZE= 16384
##$FT_mod= 6
##$GAMMA= 0
##$GB= 0
##$INTBC= 1
##$INTSCL= 0
##$ISEN= 128
##$LB= 0.24
##$LEV0= 0
##$LPBIN= 0
##$MAXI= 10000
##$MC2= 0
##$MEAN= 0
##$ME_mod= 0
##$MI= 1.114404
##$NCOEF= 0
##$NC_proc= -5
##$NLEV= 6
##$NOISF1= 3.799351
##$NOISF2= 2.8
##$NSP= 0
##$NTH_PI= 0
##$NZP= 0
##$OFFSET= 15.73808
##$PC= 1
##$PHC0= -15868.13
##$PHC1= 8.80079
##$PH_mod= 1
##$PKNL= yes
##$PPARMOD= 0
##$PSCAL= 0
##$PSIGN= 0
##$REVERSE= no
##$SF= 200.130002697086
##$SI= 16384
##$SIGF1= 3
##$SIGF2= 2
##$SINO= 5.538805
##$SIOLD= 16384
##$SREGLST= <1H.CDCl3>
##$SSB= 0
##$STSI= 16384
##$STSR= 0
##$SW_p= 3612.71676300578
##$SYMM= 0
##$S_DEV= 0
##$TDeff= 16384
##$TDoff= 0
##$TI= <>
##$TILT= no
##$TM1= 0
##$TM2= 0
##$TOPLEV= 0
##$USERP1= <user>
##$USERP2= <user>
##$USERP3= <user>
##$USERP4= <user>
##$USERP5= <user>
##$WDW= 1
##$XDIM= 16384
##$YMAX_p= 360925071
##$YMIN_p= -1561044
$$ End of Bruker specific parameters
$$ ---------------------------------
##NTUPLES= NMR SPECTRUM
##VAR_NAME=  FREQUENCY,     SPECTRUM/REAL,   SPECTRUM/IMAG
##SYMBOL=    X,             R,               I
##VAR_TYPE=  INDEPENDENT,   DEPENDENT,       DEPENDENT
##VAR_FORM=  AFFN,          ASDF,            ASDF
##VAR_DIM=   16384,         16384,           16384
##UNITS=     HZ,            ARBITRARY UNITS, ARBITRARY UNITS
##FACTOR=    0.220516191357247, 1,           1
##FIRST=     3149.66199779402, 0,            0
##LAST=      -463.054765211763, 0,           0
##MIN=       -463.054765211763, -1561044,    0
##MAX=       3149.66199779402, 360925071,    0
$$ Real data points
##PAGE= N=1
##DATA TABLE= (X++(R..R)), XYDATA
$$ [...]
6397e6301M6807n4320N1274j1131O997o6147n2008J03854P262K2901k7576O337
6385b2051l0539J00321N377m5032L2509l6334j2455k8458N4529J9823J2898L72
6373E0960l5722p30L2008n4456P0225J9261j47520J32191p5186m371J2101M6556
6361D5317K6766J303l1762K4070o0642o3934M2839J5968k865n7948R3956L699
6349C6767K891m4233m2899n906L2152l1080O0536L6375J8109o9528L2007M7052
6337G2243m5418k7350m0660j4490L4562j8629L8842Q3680m2888m8790L2317l6505
6325a3086L040K8218O2355l2681l006l2179L8969l983n3798K190k0139q49k39
6312b5188j1216M1962L6076R1092n0309l4791J0667r7976P9063J2394j9505K0835
$$ y = [-56301, -9494, -63814, -12540, -23671, -16674, -82821, -134829, -30975, -23713, -812, -28388, -22051, -52590, 47731, 53108, 8076, 40585, 4251, -8204, -36662, 17867, 37690, 50588, 50960, 15238, 14508, 46516, -7940, 62285, 81546, -65974, 66217, -8969, -13340, -1239, 45317, 72083, 73386, 41624, 65694, 5052, -58882, -16043, -75, -2940, -60888, 33068, 36767, 39658, -4575, -47474, -53380, -21228, -52308, 8228, 44603, 62712, -6816, 25191, 72243, 26825, -525, -41185, -55675, -21113, -39742, -900, 82780, 39892, -8898, 23419, -13086, -10046, 18172, 80527, 47846, 44840, 12661, 51630, 47647, -6151, -3961, -24100, -24949, -25188, -36404, 5558, 41634, 132726, 82417, 47626, 58293, -39683, 39380, 51774, 32269, 53104]
6300E3104j0712l9812R3019n8848O4462p4853Q3677q587q63M1246l6387k3503
6288H1943N307J8340O0482q6516m8409R6818n6099R71N9674l4589K3491J6486
6276A37899p631Q951L4321n1163l791q7335l899L7602K172P533m4469N7522m2213
6263D5499N1900k2600O6283j411K0541J23777j08549L4308O6164l4185P0065M3301
6251C55093j63480P1241o894m6481J36779p9989M4095L4073o4013N565P7373n8376
6239C04986K6828L7871O013J5213q199r0319M3973J4754Q474k8307p1627j3332
6227B46328j03660L2328q49o32l6037N6993r7669Q8505o031q1934O0553j45402
6215A2493P5986l0367K0508l8705J11335m9978m3695r045M5227o089M5356K1284
$$ y = [53104, 42392, 2580, 95599, 36751, 101213, 26360, 110037, 101450, 100587, 141833, 105446, 81943, 87250, 105590, 166072, 79556, 31147, 127965, 71866, 72837, 132511, 97922, 121413, 137899, 130268, 139219, 173540, 122377, 118586, 31251, 27352, 64954, 67126, 74659, 30190, 87712, 45499, 97399, 74799, 141082, 139671, 160212, 283989, 175440, 209748, 275912, 241727, 311792, 355093, 191613, 262854, 255960, 209479, 346258, 266269, 310364, 344437, 280424, 285989, 363362, 304986, 331814, 369685, 375698, 390911, 382712, 292393, 336366, 351120, 359594, 331287, 259660, 246328, 142668, 174996, 174147, 173515, 137478, 194471, 96802, 185307, 179276, 97342, 157895, 12493, 88479, 58112, 78620, 39915, 151250, 101272, 57577, 48532, 93759, 87670, 133026, 154310]
6203A54310j6755L6140j41435N629M9288N115P2875l0622o9356J7378K3716r4650
6191A1633R0738m5823o3974K9787M0468k2125M0788K8334k920L7280m2715k5900
6179G5571l6310O4751k205J00557q2497K1550L6355m8905L7577l4156J192M1913
6167A75393p9886K8400q8975P4066R2154m6317J5190K1249j66447P4117m6338
6156E2606O5138P1395k4757L4969J5381p1399m7384P478K0392J23796m3969K478
6144B06124k6092o2327k8572R1032N2829r699k9684m7556O108Q632M6845L6717
6132B44357p678N7437J9068k4855M1420L879k5768J27783l7084P4343J1407o1943
6120D22366j0157L8510J9671l3532P060P49R912j6214M0425p345M0330j731N2504
$$ y = [154310, 137555, 173695, 32260, 37889, 87177, 92292, 165167, 134545, 65189, 82567, 106283, 11633, 102371, 56548, -7426, 22361, 62829, 40704, 81492, 109826, 106906, 144186, 101471, 75571, 39261, 104012, 101807, 202364, 119867, 141417, 177772, 128867, 166444, 132288, 133480, 175393, 95507, 123907, 34932, 108998, 201152, 154835, 170025, 191274, 24827, 98944, 52606, 117744, 189139, 164382, 199351, 214732, 143333, 95949, 103427, 123819, 247615, 203646, 206124, 180032, 117705, 89133, 180165, 232994, 223295, 193611, 146055, 152163, 160795, 207640, 244357, 236679, 294116, 313184, 288329, 329749, 333628, 307860, 435643, 398559, 472902, 484309, 422366, 412209, 450719, 470390, 436858, 443918, 444667, 454579, 438365, 478790, 471445, 511775, 510044, 562548]
6107E62548K5076K0960Q0195n4760l5866J764l1164J3882N1183K6789J5843N0058
6095G26508m743n6649q942m0705L5552P3358o2362l8344p1436J0181J6574j2332
6083E66660R2917m299p4353Q6017o3817k6528N0861j9769N6914M5206l6668N461
6071F78602P5353J5309N3768M3434p8619l0717l7878L6625L5659k242J0999M0809
6059H41102q4394K8346M6063k0857K1996L2474n9619j17680O0222p9912Q8609
6048G56350N0040L4047j14504N5746L0026j184N347M314m6948j5742q0687k4016
6036F52789M6757r0578M0597l669k0241n244j07148O9400R919k7238L2303L0990
6024F28637M0454O0617m5472L790K9225m1331M3765N899L1713K5280P4666P4752
$$ y = [562548, 587624, 608584, 688779, 634019, 598153, 599917, 568753, 582635, 633818, 660607, 676450, 726508, 721765, 665116, 656174, 615469, 651021, 724379, 662017, 623673, 552237, 562418, 578992, 566660, 659577, 655278, 580925, 666942, 603125, 576597, 627458, 607689, 664603, 709809, 673141, 678602, 753955, 769264, 823032, 866466, 787847, 757130, 719252, 755877, 791536, 789294, 800293, 841102, 756708, 785054, 831117, 810260, 832256, 864730, 805111, 687431, 747653, 667741, 756350, 806390, 840437, 725933, 781679, 811705, 810521, 815868, 820182, 773234, 757492, 676805, 652789, 699546, 608968, 649565, 645896, 625655, 620411, 513263, 582663, 592582, 565344, 597647, 628637, 669091, 729708, 684236, 688026, 717251, 675920, 719685, 725584, 757297, 782577, 857243, 931995]
6012I31995Q6261P9299K7204m4233J7958J00641Q3328m0359O8248j1522K5342
6001A324162R490K1974q1862J06005k0024j02092N9171P4258l7141P5081J07995
5990A537017j31133m3531M7282j9741n4979M0290q4539O6191q1158m9195O8957
5979A295461j4340M4069K1926o3213j2707j9108p0358M3603j0953K0851m6878
5968A188353l6010m3907K0217N478k8077P5295p317J9633n7919m7102L7142O3475
5956A189261J2722J04704p5407j6496N7724o9493K7902K0808j07156R3304o5368
5945A172505o9361J21285m8588k2624J27436L5451p1142j6860N0085q5926l7844
5934A154417J14762K2606J7853m512q233J02428n5710P1133Q6128J201K7641j8625
$$ y = [931995, 1018256, 1097555, 1124759, 1080526, 1098484, 1199125, 1282453, 1242094, 1310342, 1298820, 1324162, 1333652, 1355626, 1273764, 1379769, 1359745, 1257653, 1316824, 1391082, 1353941, 1429022, 1537017, 1405884, 1362353, 1409635, 1389894, 1334915, 1375205, 1290666, 1356857, 1275699, 1226504, 1295461, 1281121, 1325190, 1347116, 1283903, 1271196, 1252088, 1181730, 1225333, 1214380, 1235231, 1188353, 1152343, 1108436, 1128653, 1134131, 1106054, 1181349, 1174032, 1193665, 1135746, 1088644, 1125786, 1189261, 1201983, 1306687, 1231280, 1214784, 1272508, 1203015, 1230917, 1251725, 1144569, 1237873, 1172505, 1103144, 1224429, 1175841, 1153217, 1280653, 1316104, 1244962, 1228102, 1278187, 1192261, 1154417, 1269179, 1291785, 1309638, 1305126, 1296893, 1399321, 1343611, 1414744, 1500872, 1502073, 1529714, 1511089]
5922A511089N6898k8712N3621J377j2493K7249q489J7896q661p7750L5450l7025
5910A530450p6544P5307L2989P7158j2388K5688M3027q1403O1970p031M7583j5368
5898A701438P6739M694L9193M7954K8671K1527P7310o8105N0091m15j06111N1082
5886A924068M4314o7397M7619J3280k1466N4320N8765k2414l760J24122k3600
5875B127851N4299R3046m8365P8176J06494J9976J4747N2354m4714M2616N5221
5864B551701M0452J47676O6329J301L8456O6493J3706Q6696J9714R1754Q2159
5853C206437N0485J7714K3083J29406l1484J85082P9043n0486J19790J05257Q1415
5842C915742R4395J54637P366J75839L2444J48872J06493P3142J83506P0093J78621
$$ y = [1511089, 1567987, 1539275, 1592896, 1594273, 1581780, 1609029, 1600540, 1618436, 1609775, 1532025, 1567475, 1530450, 1453906, 1529213, 1562202, 1639360, 1626972, 1652660, 1695687, 1614284, 1676254, 1669223, 1716806, 1701438, 1778177, 1782871, 1822064, 1870018, 1898689, 1920216, 1997526, 1929421, 1979512, 1979097, 1872986, 1924068, 1968382, 1900985, 1948604, 1961884, 1940418, 1994738, 2053503, 2031089, 2027329, 2151451, 2127851, 2182150, 2275196, 2226831, 2305007, 2411501, 2431477, 2446224, 2498578, 2453864, 2496480, 2551701, 2592153, 2739829, 2806158, 2807459, 2845915, 2912408, 2926114, 3012810, 3032524, 3124278, 3206437, 3256922, 3274636, 3297719, 3427125, 3395641, 3580723, 3659766, 3609280, 3729070, 3834327, 3915742, 4010137, 4164774, 4172140, 4347979, 4380423, 4529295, 4635788, 4708930, 4892436, 4962529, 5141150]
5831E141150J89532Q6212K00641J37953J10068K70974K01682K27017J98099K28215
5821F991543J96529K16370J29209K11014K98041K00097J48041K31374J90918L22724
5811I135860K29388K49626L77196K16548L65511K73015K90955L35283M20154L47908
5801A2241444M59533L03157L09427N14234M80568M08923N30789N32851O08539
5792A6389465O50906O92453P18913P82715Q35546J125100J054091J310349J450833
5783B5010371J607755J829858J970809K235261K579295K710750K880825L185118
5775D4010042L792465M206258M244529L879677L469099L342317L426029L352344
5767G3722760L272590K822920K035048J047294N0791q98444j832757k483759k623160
$$ y = [5141150, 5330682, 5416894, 5617535, 5755488, 5865556, 6136530, 6338212, 6565229, 6763328, 6991543, 7188072, 7404442, 7533651, 7744665, 8042706, 8242803, 8390844, 8622218, 8813136, 9135860, 9365248, 9614874, 9992070, 10208618, 10574129, 10847144, 11138099, 11473382, 11893536, 12241444, 12700977, 13004134, 13313561, 13827795, 14308363, 14717286, 15248075, 15780926, 16389465, 17040371, 17732824, 18451737, 19234452, 20069998, 21195098, 22249189, 23559538, 25010371, 26618126, 28447984, 30418793, 32654054, 35233349, 37944099, 40824924, 44010042, 47802507, 52008765, 56253294, 60132971, 63602070, 66944387, 70370416, 73722760, 76995350, 79818270, 81853318, 82900612, 82951403, 82052959, 80220202, 77736443, 75113283]
5758G5113283k249293j815578r68257k19410O43404J457954K270802L041981L578977
5749H0853863M172685M426045M270979L900180L185336K983650K538521J680558
5741A08011817L0000k726379n559455p169320q040000p734353p073055o295132
5733F3444123n515273m790725m118328l639857l207381k849139k540723k021566
5725C4761131j936963j656669j401874j304609j097171r14829r71843p80059q10825
5716B3886289p81241o65744o04017o17453m67733n42243m46390l58688m61777
5707A8941003m33772k07729j95685k70225k13394k43953j01747p4860O687o41
5697A7205684J20816K3718K1345N5421J34420J96534K95942K98860K23283K58362
$$ y = [75113283, 72863990, 71048412, 70080155, 69860745, 70504149, 71962103, 74232905, 77274886, 80853863, 85026548, 89452593, 93723572, 97623752, 100809088, 103792738, 106331259, 108011817, 108041817, 105315438, 99755983, 92586663, 84546663, 76812310, 69739255, 63444123, 57928850, 53138125, 49019797, 45379940, 42172559, 39323420, 36782697, 34761131, 32824168, 31167499, 29765625, 28461016, 27363845, 26449016, 25477173, 24697114, 23886289, 23105048, 22439304, 21835287, 21217834, 20750101, 20207858, 19761468, 19402780, 18941003, 18507231, 18299502, 18103817, 17833592, 17620198, 17376245, 17274498, 17199638, 17206325, 17205684, 17326500, 17350218, 17371563, 17426984, 17561404, 17757938, 18053880, 18352740, 18576023, 18834385]
5687A8834385L05755M52892L76125N15498M53991M09231L30947L04854J45979
5678B2129657n3397k3928j87927m4995Q487J16348K26089L17953L97502O25526
5668B3511315O95541P24414Q95854Q84118R91240R12324O33914M60393K69652
5659B9978765k1282p7839j08220k67474j1606L7264P7920K98495L61702M49517
5649C0717242O12077O04104O95483N58623N22425M52826K61541K6870j6251k73968
5639C4160972l30602l11213l18919k01120j37293j29404l2323j00839P7078K65504
5629C2941841K61770L60579L32193K58849J24198r4956l96604n82916p76262q36197
5619C1592495p90738q19389p25785o88594o47179n89372m08580l83363j56213
$$ y = [18834385, 19140140, 19593032, 19969157, 20484655, 20938646, 21347877, 21678824, 21983678, 22129657, 22076260, 22052332, 21864405, 21819410, 21827897, 21944245, 22170334, 22488287, 22885789, 23511315, 24206856, 24931270, 25827124, 26711242, 27702482, 28614806, 29248720, 29709113, 29978765, 29957483, 29879644, 29771424, 29503950, 29492344, 29529608, 29607528, 29906023, 30267725, 30717242, 31329319, 31933423, 32628906, 33187529, 33709954, 34162780, 34424321, 34451191, 34434940, 34160972, 33830370, 33519157, 33200238, 32999118, 32861825, 32732421, 32700098, 32599259, 32676337, 32941841, 33203611, 33564190, 33896383, 34155232, 34279430, 34184474, 33787870, 33204954, 32428692, 31592495, 30801757, 29982368, 29256583, 28567989, 27920810, 27331438, 26922858, 26539495, 26383282]
5610B6383282j1917m3650J92802K12186J1926L9913k32217l46467l49884n94163
5600B5261811o69484o29566q03498p74381q95463q97877q00743p82017p56467
5591A8252315o92464o49509o81404m99907l95143m20017k90660k83964l93921
5582A3945326j29315n00085l31456l95638m73621n09552m48785m61593m63498
5573A0231783l16447k77789l21024k21378j91318l70880j35670k12495k14412
5564G970370j56338j06318j29339k32986j66932n323r4005j09326p4718j33984
5554F761101p4546o3888j28625L5803p847j42739j9738o1759o4355J198M1599
5543F276204r3151l3692R7751j03999k5592J2198o4362J11543P8329M8202J65991
$$ y = [26383282, 26371365, 26327715, 26520517, 26732703, 26744629, 26784542, 26552325, 26205858, 25855974, 25261811, 24592327, 23962761, 23159263, 22384882, 21489419, 20591542, 19790799, 19008782, 18252315, 17559851, 16910342, 16228938, 15729031, 15333888, 14913871, 14623211, 14339247, 13945326, 13816011, 13315926, 12984470, 12588832, 12115211, 11605659, 11156874, 10695281, 10231783, 9915336, 9637547, 9316523, 9095145, 8903827, 8532947, 8397277, 8184782, 7970370, 7814032, 7707714, 7578375, 7345389, 7178457, 7173134, 7079129, 6969803, 6895085, 6761101, 6686555, 6622667, 6494042, 6529845, 6521998, 6379259, 6359521, 6297762, 6233407, 6234605, 6276204, 6183053, 6149361, 6247112, 6143113, 6117521, 6129719, 6065357, 6176900, 6255229, 6303431, 6469422]
5532F469422J02538J09638L00662L18588M76493N08045N91795P15752P39232N04623
5522A0836788K13351K50913N09521Q89476P52439l5033r76052j398602j287812
5513I754989j030891p85910n35331l95466l72864k31151k81309j93145j21413
5504E807509q8011q6421n8890n14m3992l1881K4999k0871o7954k72283l28747
5493D832944k09287k08620k50568r4139r9552k45678p03m4282j54745P048r1503
5482C440915q7085l8332p7788K3156l9567q0361j7188l028m7927o5332n3742q4603
5470B869118n1989O37n2931O9034o9457m4548L5180q2555r723m6554o2930P7736
5458B631018o4046N569Q193m9004M3627j04709O8916Q6869k6793k9529K9787k0326
$$ y = [6469422, 6571960, 6681598, 6982260, 7300848, 7777341, 8285386, 8877181, 9592933, 10332165, 10836788, 11050139, 11301052, 11810573, 12700049, 13452488, 13417455, 12441403, 11042801, 9754989, 8724098, 7938188, 7402857, 7007391, 6634527, 6403376, 6122067, 5928922, 5807509, 5719498, 5633077, 5574187, 5573673, 5529681, 5497800, 5522799, 5501928, 5433974, 5161691, 4832944, 4623657, 4415037, 4164469, 4070330, 3970778, 3725100, 3724397, 3680115, 3525370, 3532418, 3440915, 3353830, 3315498, 3237710, 3260866, 3221299, 3140938, 3123750, 3120722, 3072795, 3007463, 2953721, 2869118, 2817129, 2817766, 2764835, 2833869, 2764412, 2719864, 2755044, 2672489, 2662766, 2616212, 2553282, 2631018, 2566972, 2572541, 2580734, 2531730, 2575357, 2470648, 2539564, 2626433, 2599640, 2570111, 2599898, 2579572]
5446B579572O6590M8703O7576N9297R67J1084p088K5938J1265N7230J10481R3575
5434C125190N9482O6535J7761K2733l7499j06201O5801p9638k3125j00247r6450
5423B914342l8067j7595r262M850k5755q121L212o2446L5940M1303j0525K5413
5411B853289J55344L1184P9559J41826M2246Q8096K6541p3916Q91Q032L1824J10938
5399C495854L5358j88936j51700k37370k4782k4241j47030j35532j48662j38423
5389B334536l8143q0799L9137N6704Q81l9761K4923m3718L6530Q4150m062Q5159
5377B455537J91659m970J02805K719m860N0498Q5591R8944J36725L9393K7137
5366C181178j68998j89427j24439m6067j19607j59420P8310j18992j00224O9031
$$ y = [2579572, 2646162, 2694865, 2762441, 2821738, 2822705, 2833789, 2826701, 2852639, 2863904, 2921134, 3031615, 3125190, 3184672, 3251207, 3268968, 3291701, 3254202, 3148001, 3213802, 3134164, 3111039, 3010792, 2914342, 2876275, 2858680, 2849418, 2854268, 2828513, 2820392, 2823604, 2761158, 2797098, 2838401, 2827876, 2853289, 3008633, 3039817, 3119376, 3261202, 3303448, 3391544, 3418085, 3344169, 3345060, 3353092, 3384916, 3495854, 3531212, 3342276, 3190576, 2953206, 2928424, 2904183, 2757153, 2621621, 2472959, 2334536, 2296393, 2215594, 2254731, 2311435, 2312316, 2272555, 2297478, 2253760, 2290290, 2374440, 2370378, 2455537, 2647196, 2642226, 2745031, 2747750, 2742890, 2793388, 2878979, 2977923, 3114648, 3154041, 3181178, 3012180, 2822753, 2698314, 2652247, 2532640, 2373220, 2451530, 2332538, 2232314, 2301345]
5356B301345o3699k3526M1735j14902J11831m5181j0198M6634L3418K565l9615
5345B240407Q1812l8288L6585N8142l4023K8421K7895J6372O2795J0867k8520
5334B462465l8360o8442p9846p5435L0379o8299l8935l0686l8672N5930j6648
5323B093451n2770r519l287k286n0533R1055Q614O0200j296n027Q2829m7774n9958
5310B103699R6674o3894R2131l3869n3446M7861j1648m8840Q4697k9169K2210
5299B206406q2313J0159o197J0505L1890o5381K6914J9859J245m2393j700K9875
5287B138869J1666j4025N7748k7020m7370P4828m3352m5925J41843k4891n2780
5276B169591j8075j13632N5739M0121k6335N0369N1196k9135j0000n3485l5595
$$ y = [2301345, 2237646, 2214120, 2255855, 2140953, 2252784, 2207603, 2197405, 2244039, 2277457, 2280022, 2240407, 2322219, 2283931, 2320516, 2378658, 2344635, 2373056, 2400951, 2417323, 2480118, 2490985, 2462465, 2424105, 2355663, 2275817, 2200382, 2230761, 2162462, 2123527, 2092841, 2054169, 2110099, 2093451, 2040681, 2031162, 2027875, 2025589, 1975056, 2066111, 2074725, 2134925, 2133629, 2128602, 2211431, 2163657, 2103699, 2200373, 2136479, 2228610, 2194741, 2141295, 2189156, 2177508, 2128668, 2213365, 2184196, 2206406, 2124093, 2134252, 2128055, 2138560, 2170450, 2105069, 2131983, 2151842, 2153087, 2110694, 2108994, 2138869, 2150535, 2136510, 2194258, 2167238, 2119868, 2194696, 2151344, 2105419, 2247262, 2222371, 2169591, 2151516, 2037884, 2093623, 2133744, 2107409, 2157778, 2208974, 2179839, 2169839, 2116354, 2080759]
5265B080759o001M9801O5431o7783P4817o7572L8987l9284m0157J33197m563j3293
5253B204339j0575L7397l5303k1500n811J8130o0735J6470J718L6528L6016n7098
5241B159576K4021r4982M0162j8868Q8162k8672J09929m7535j4162N0973j4714
5230B253890L0950K4575M8695N9649M5821L2565O2886N4867J05076R0645J11229
5219B920848J15832Q8939N9800J34389R8530P1361J43784J43372R4201j79451
5209C691605j28693k95418j73129k2266j07565j14469j822J0009k8947o2904M125
5198B770526j7543n2243P725m7846J0901n4569K5452P2459j8266N7750l9697M6202
5186B760851J09o7416q906J09362q4117J43203M2807n8591J21134K3891k2681
$$ y = [2080759, 2074758, 2124559, 2189990, 2122207, 2197024, 2129452, 2168439, 2129155, 2088998, 2222195, 2217632, 2204339, 2193764, 2231161, 2195858, 2174358, 2168547, 2186677, 2125942, 2142412, 2144130, 2180658, 2216674, 2159576, 2183597, 2088615, 2128777, 2109909, 2198071, 2169399, 2279328, 2231793, 2217631, 2268604, 2253890, 2284840, 2309415, 2358110, 2417759, 2463580, 2496145, 2559031, 2613898, 2718974, 2809619, 2920848, 3036680, 3125619, 3185419, 3319808, 3418338, 3489699, 3633483, 3776855, 3871056, 3691605, 3562912, 3267494, 3094365, 3072099, 2964534, 2850065, 2848243, 2858252, 2829305, 2766401, 2770526, 2752983, 2700740, 2708465, 2660619, 2671520, 2616951, 2642403, 2714862, 2696596, 2754346, 2714649, 2760851, 2760960, 2693544, 2684638, 2794000, 2709883, 2853086, 2895893, 2837302, 2958436, 2982327, 2959646]
5175B959646K4145L0996j21643J01609n5138n245J1331Q6977j07946J30515O180
5164C061427o1266R8499K8991l3092K0100P6483Q5222N6862r507L3009J03065
5153C459793J6801J12901J88316J24088J24297J36996o5146L833K8356J31587
5143D261822J44129J84289J26565q0185p2734j42588j02007n8993m8018p7906
5133D134374R240m6973L572o8313J11687J7146m0875P0158j72234K3453Q8007
5122D129242j774j3908P9473n3922J58168j3418L1116J07531j7484J769J531l3946
5110D374378o6991J43177N5840K7523N5062M9728j0319J08216m034P7397Q1680
5099D891657K0323N3344M8446K2642J15671L4890N6877l0398j9734q4761q2504
$$ y = [2959646, 2983791, 3014787, 2893144, 2994753, 2939615, 2934370, 2945701, 3032678, 2924732, 3055247, 3061427, 3000161, 3098660, 3127651, 3094559, 3114659, 3191142, 3276364, 3333226, 3323719, 3356728, 3459793, 3476594, 3589495, 3777811, 3901899, 4026196, 4163192, 4098046, 4101879, 4130235, 4261822, 4405951, 4590240, 4716805, 4636620, 4563886, 4421298, 4319291, 4260298, 4212280, 4134374, 4143614, 4096641, 4100213, 4031900, 4143587, 4160733, 4119858, 4190016, 4017782, 4041235, 4129242, 4127468, 4113560, 4193033, 4139111, 4297279, 4283861, 4314977, 4422508, 4405024, 4406793, 4408324, 4374378, 4307387, 4450564, 4506404, 4533927, 4588989, 4638717, 4628398, 4736614, 4732580, 4809977, 4891657, 4911980, 4965324, 5013770, 5036412, 5152083, 5186973, 5243850, 5213452, 5193718, 5108957, 5026453]
5088E026453J07723m89k3471j9375m8048L2783J04490k0095j9497M3005Q76J4397
5076E198752M2489p929m3O9157Q6692K0505l9151l4629K0302N0692N6201M7328
5064E510366p760P6906K6902k8163n0735N4374P5630O1020K658K2467j3984O7403
5052E797084O2387N2080J06727J0166N7016Q6399j1126J28334O7613O2200R3846
5041F512726P8293q436m365j12193L0945K0264M4944k5131M8353P7807j06999
5030F556208K13251J12040K1120J04907J23062J7734K08190L5567J19712Q9858
5020G601649J7321J19184J71146O2901N7443N1625k4988Ll4589j53332o27l1133
5008G836603l6060J14799k1492q6285J66294j3774O2198J78232K3401Q8520N5471
$$ y = [5026453, 5134176, 5133687, 5110216, 5090841, 5042793, 5075576, 5180066, 5159971, 5140474, 5183479, 5184355, 5198752, 5241241, 5233312, 5233269, 5302426, 5389118, 5409623, 5370472, 5335843, 5356145, 5406837, 5463038, 5510366, 5502606, 5579512, 5606414, 5578251, 5527516, 5581890, 5657520, 5718540, 5721198, 5743665, 5729681, 5797084, 5859471, 5911551, 6018278, 6028444, 6085460, 6171859, 6160733, 6289067, 6356680, 6418880, 6512726, 6591019, 6582583, 6578218, 6466025, 6496970, 6517234, 6562178, 6537047, 6585400, 6663207, 6556208, 6769459, 6881499, 6902619, 7007526, 7130588, 7148322, 7356512, 7392079, 7511791, 7601649, 7618970, 7738154, 7909300, 7972201, 8029644, 8081269, 8056281, 8056284, 8021695, 7868363, 7867736, 7836603, 7800543, 7915342, 7893850, 7807565, 7973859, 7960085, 8022283, 8200515, 8223916, 8312436, 8367907]
4997H367907k8807P4385O4953J9091K57629m6687O2974J11905o0221K8695L3861
4986H885685n322m3501N8943l9374J24414Q8893K3212J36444J78310M2078M3405
4975I493187K8854l9118J33659L4019J4286P9507m1271J37913J8204K7364J10130
4964I996734K0265n860M3028k8298L3435M6772N9420J17648J3231P2123M945J40105
4952A0513548N756J15991J40956K3807R7506L2012O6382J10923J16064J21037
4942A1343982M1397J7015J03922P1077J28236J09933J25743O8747L6683O3339
4932A2110074P3153Q5360R7271L7994N6390N2309j9523Q4323R7929J21460Q8856
4921A2885596J5551R6678P5891Q3894J11502P2533M0634O1541K8751M0248J18425
$$ y = [8367907, 8339100, 8413485, 8478438, 8497529, 8755158, 8708471, 8771445, 8883350, 8823129, 8851824, 8885685, 8880363, 8836862, 8895805, 8856431, 8980845, 9069738, 9092950, 9229394, 9407704, 9449782, 9493187, 9522041, 9482923, 9616582, 9650601, 9664887, 9744394, 9703123, 9841036, 9859240, 9886604, 9996734, 10016999, 10011139, 10054167, 10025869, 10059304, 10106076, 10165496, 10283144, 10296375, 10368498, 10373443, 10513548, 10519304, 10635295, 10776251, 10800058, 10897564, 10929576, 10995958, 11106881, 11222945, 11343982, 11385379, 11402394, 11506316, 11577393, 11705629, 11815562, 11941305, 12010052, 12046735, 12110074, 12183227, 12268587, 12365858, 12403852, 12460242, 12512551, 12493028, 12577351, 12675280, 12796740, 12885596, 12901147, 12997825, 13073716, 13157610, 13269112, 13341645, 13382279, 13443820, 13472571, 13512819, 13631244]
4910A3631244Q504J1048L5275N3977p1907K08399q2620K3573P229l0900K7171
4899A3820993P4890p2076j2681L9603q7500P840j5539L995o9134o2179L4115l0019
4887A3632308P6616k137l1988r923n5599n0777Q4991n7951j9338K8788j35415
4876A3459575N0058p166P146n4716K3807k6179q1792l76J4592p243K9217m5964
4864A3360959J3038j2532O323K2239q7l0331o8073l7311J6727n4594N4826n7460
4852A3213724p267Q5640n0828J9486j4472k7971p4840M4840n935j5343K4972l5661
4840A3156345l2868l4854L4215r2096k15K4831q5804M9318K892r0192L303P1l9039
4827A2895907l5363p6304K4275J8830k0401o5769P25o827k3999M2248j14849o0501
$$ y = [13631244, 13639748, 13650796, 13686071, 13740048, 13668141, 13876540, 13793920, 13817493, 13824722, 13793822, 13820993, 13895883, 13823807, 13811126, 13850729, 13763229, 13771069, 13755530, 13759525, 13690391, 13628212, 13662327, 13632308, 13708924, 13706787, 13674799, 13664876, 13609277, 13558500, 13643491, 13585540, 13566202, 13594990, 13459575, 13509633, 13502467, 13509613, 13454897, 13478704, 13452525, 13370733, 13370357, 13384949, 13377706, 13406923, 13360959, 13373997, 13361465, 13367788, 13390027, 13389940, 13359609, 13291536, 13254225, 13270952, 13216358, 13271184, 13213724, 13206457, 13292097, 13241269, 13260755, 13246283, 13218312, 13143472, 13188312, 13182377, 13167034, 13192006, 13156345, 13123477, 13088623, 13122838, 13030742, 13030527, 13055358, 12969554, 13018872, 13021764, 12931572, 12934875, 12934946, 12895907, 12860544, 12784240, 12808515, 12827345, 12806944, 12741175, 12741900, 12735073, 12711074, 12753322, 12638473, 12577972]
4815A2577972L8450q1764l0700l5438n6869J2850m770q2683l2277k130j01927
4804A2200714m0342K1208p8910q2784K882n1783n9568j02259p4843k7092J942
4793A1709165m5012M095j31658m1292K6570r3203R544K384j74739M0082j10909
4782A1195027m9981N0738j0353k9745P771r2053n4755l0045k8525L6221m6142
4771A0948158j54671J2110j78038n6786m2898K058n4174J1855p7796k9195l8721
4760A0341902q2911L4142j9247r0095r107M856j15175O8911o1099o9082q3812
4749I919283k5224j5502j24570J617o6152p1102L9385j45280K3210r1829l8482
4738I405354N5891L5894n4176j2539p7641m1574o2980N2563K4092n1545J0365
$$ y = [12577972, 12616422, 12534658, 12503958, 12468520, 12411651, 12424501, 12419731, 12337048, 12304771, 12302641, 12200714, 12160372, 12181580, 12102670, 12019886, 12022768, 11970985, 11911417, 11809158, 11734315, 11707223, 11709165, 11664153, 11668248, 11536590, 11495298, 11521868, 11428665, 11438209, 11440593, 11265854, 11305936, 11195027, 11145046, 11195784, 11185431, 11155686, 11163457, 11071404, 11016649, 10986604, 10958079, 10994300, 10948158, 10793487, 10805597, 10627559, 10570773, 10527875, 10529933, 10475759, 10487614, 10409818, 10380623, 10341902, 10258991, 10293133, 10273886, 10183791, 10174684, 10179540, 10064365, 10133276, 10072177, 10003095, 9919283, 9894059, 9878557, 9753987, 9755604, 9689452, 9618350, 9657735, 9512455, 9535665, 9443836, 9405354, 9461245, 9497139, 9442963, 9430424, 9352783, 9311209, 9248229, 9300792, 9324884, 9273339, 9283704]
4727I283704q6324K8598O8387j23383J81858p2053R816P3363j7334j8277l746
4716I324609j3637K4363l4089J05222n8476M67l0208j13400O5075m196m4224L9770
4704I261276l9716m230J09942J06314J18914L6331J32810L7682Q1500J07027J9256
4693I967106R5996J09002J30168N0232q6582M760K8354j6115N5611J1945R8387
4682A0448864Q4576J20570J30124J67710R2211J51756K86042K25348K46716K68240
4672A2222157K93415L66808L31754L36961M44167M62382N97237P56399P30313
4663A6541593Q76191R27520Q63522J028592Q57879O97060P26804P35289O24007
4654B3878457O03206K89026q0098k88730m64470n17313k21932j08429m7170K50301
$$ y = [9283704, 9197380, 9225978, 9294365, 9170982, 9352840, 9280787, 9290603, 9363966, 9346632, 9328355, 9324609, 9310972, 9335335, 9301246, 9406468, 9347992, 9348459, 9318251, 9204851, 9269926, 9265730, 9221506, 9261276, 9221560, 9217330, 9327272, 9433586, 9552500, 9588831, 9721641, 9759323, 9840823, 9947850, 9967106, 10063102, 10172104, 10302272, 10352504, 10265922, 10270682, 10299036, 10282921, 10338532, 10350477, 10448864, 10533440, 10654010, 10784134, 10951844, 11044055, 11195811, 11481853, 11707201, 11953917, 12222157, 12515572, 12882380, 13214134, 13551095, 13995262, 14457644, 15054881, 15811280, 16541593, 17417784, 18345304, 19208826, 20237418, 21095297, 21792357, 22519161, 23254450, 23878457, 24481663, 24770689, 24690591, 24401861, 23937391, 23420078, 23198146, 23089717, 23042547, 23292848]
4644B3292848L41105M38680N26142M62064M39703L59893L85579L41322L18483
4635B6905819O0464l49589p72109r02582j125417r77442r04585q19671o50403
4626B0464485m60258l10216j80426o9912K4214R8076O3140L08290L77151M19348
4616B0733892M57895N27641P37255Q18666Q81263J182632J249183J361604J680872
4607B9630903J552724J690671J674514J536108J425040J434939J309356J127080
4599D1381335O95828K50322l43289p58794r94951r28303p71055n28892k62069
4590C7740132R191K11451L66814K79401L19698K40628Q1303P8575n0126l95427
4580C8881640q90218j408990j845745k046012k033194j897816j819977j558351
$$ y = [23292848, 23633953, 24072633, 24598775, 25060839, 25500542, 25860435, 26246014, 26587336, 26905819, 26966283, 26616694, 25844585, 24942003, 23816586, 22839144, 21934559, 21114888, 20464485, 20004227, 19694011, 19513585, 19443673, 19467887, 19565963, 19629103, 19937393, 20314544, 20733892, 21191787, 21719428, 22456683, 23275349, 24156612, 25339244, 26588427, 27950031, 29630903, 31183627, 32874298, 34548812, 36084920, 37509960, 38944899, 40254255, 41381335, 42077163, 42327485, 41984196, 41225402, 40230451, 39302148, 38531093, 38002201, 37740132, 37749323, 37960774, 38327588, 38606989, 38926687, 39167315, 39248618, 39327193, 39277067, 38881640, 37991422, 36582432, 34736687, 32690675, 30657481, 28759665, 26939688, 25381337]
4572B5381337j430618j269434j109254j013474r09234o33697p88115p16811n17765
4563A6992935o25120m48280k67964l42528k51288k53615k65533k08757j89247
4554A4140603j97354j00984j84603j66159j30570j03754j20013Q33r0936M5372
4544A3092435m4906N5601M4117M8911J16106J55946k5172J28097J07893K4387
4534A3703415J24963K57178J89431J49520J17212K10566K44677L61722L20166
4525A5678850M45789N28737M88255P16501Q23020Q92624J035716J326877J394426
4516B3330795J416582J607428J729072J655877J775305J399034J283353J009674
4508C5207120P21743K70505m24773j179415j578331j908107j857109j756277j468956
$$ y = [25381337, 23950719, 22681285, 21572031, 20558557, 19649323, 19015626, 18227511, 17510700, 16992935, 16367815, 15919535, 15651571, 15309043, 15057755, 14804140, 14538607, 14329850, 14140603, 13943249, 13842265, 13657662, 13491503, 13360933, 13257179, 13137166, 13137999, 13047063, 13092435, 13047529, 13103130, 13147247, 13196158, 13312264, 13468210, 13443038, 13571135, 13679028, 13703415, 13828378, 14085556, 14274987, 14424507, 14541719, 14752285, 14996962, 15358684, 15678850, 16124639, 16653376, 17141631, 17858132, 18681152, 19573776, 20609492, 21936369, 23330795, 24747377, 26354805, 28083877, 29739754, 31515059, 32914093, 34197446, 35207120, 35928863, 36199368, 35774595, 34595180, 33016849, 31108742, 29251633, 27495356, 26026400]
4499B6026400j229811j131747j019932p38303n83247n19172l36569k39751j65301
4490B0062567P9491J16144K22484M13125M32017P32340P68998Q76246J149731
4481B4853143J198477J286307J425326J500597J452805J258702J179321J040634
4473C5195312P51818M09979j31480p74317j330367j610674j567326j414646j239256
4464B8289043r52682o82606m91867k54484k5959M7450P5893K71653J90274J25981
4454B6592696J44203J9524l09522o07817r99790j163227j161988j063344j000918
4445B0449817q30685o15881o25602m31406m01188l32739j63351j97969j11790
4436A6739206k4014J4508R1145J30707J31531J89903L8215K35720K81367L58237
$$ y = [26026400, 24796589, 23664842, 22644910, 21906607, 21323360, 20804188, 20467619, 20227868, 20062567, 20142058, 20258202, 20480686, 20893811, 21325828, 22058168, 22827166, 23703412, 24853143, 26051620, 27337927, 28763253, 30263850, 31716655, 32975357, 34154678, 35195312, 35947130, 36357109, 36225629, 35451312, 34120945, 32510271, 30942945, 29528299, 28289043, 27336361, 26653755, 26161888, 25907404, 25881445, 25928895, 26004788, 26276441, 26466715, 26592696, 26736899, 26756423, 26446901, 25839084, 24839294, 23676067, 22514079, 21450735, 20449817, 19619132, 19003251, 18377649, 17946243, 17545055, 17212316, 17048965, 16850996, 16739206, 16715192, 16729700, 16820845, 16951552, 17083083, 17272986, 17311201, 17546921, 17828288, 18186525]
4426A8186525O17956M90709N97205O31625M86107M85633M11376K56366K34854
4417B2398356q5407n82614r07975j252829j296425j172337j148270j044803p08259
4408A4199437q35112o87712m43015o03209m32710m27727m20238k84940k41352
4399I823422l65965j99539k78613k59150j56210j21946j38795j45376k04190j17620
4389G836018j52560j48967M4364j98484m2506j0324k71426r6479j46220k13106
4379F600310j2349j37920j50141J201j62009j60425R400j35430j09211m9862q6107
4368E607457l9942j56974n1783o8122r6999k8658n8620m0701l3145r1518o0736
4357D880259q4363p9379k0725k707q4770l6024M6181j34432j18524L9508j28127
$$ y = [18186525, 18804481, 19295190, 19892395, 20524020, 21010127, 21495760, 21907136, 22163502, 22398356, 22312949, 21730335, 20822360, 19569531, 18273106, 17100769, 15952499, 14907696, 14199437, 13364325, 12676613, 12233598, 11630389, 11197679, 10769952, 10349714, 10064774, 9823422, 9457457, 9257918, 8979305, 8720155, 8563945, 8441999, 8303204, 8157828, 7953638, 7836018, 7683458, 7534491, 7578855, 7380371, 7337865, 7327541, 7056115, 6959636, 6813416, 6600310, 6587961, 6450041, 6299900, 6301101, 6139092, 5978667, 5988067, 5852637, 5743426, 5693564, 5607457, 5567515, 5410541, 5358758, 5290636, 5193637, 5164979, 5106359, 5065658, 5032513, 4940995, 4880259, 4795896, 4716517, 4695792, 4693085, 4608315, 4572291, 4618472, 4484040, 4365516, 4405024, 4276897]
4346D276897n0556Q3820r6325R0244o8996p137J0444j20133N8452K4302J6803
4335D217815N3158o6720Qn1858J0238J17063r219J5709K6834j12m9912p552j4678
4322D240774r8353l9625j9251k9823L8798o7846M0439o1977n943k6234L4575n3006
4310C952528L5703M9694k7255J0039J8128J5235J40632K5547K1371P1860r5315
4299D218167K7192L7380N107P0903K5182P6508l9163j8243Q7780p7936L3046R0878
4287D536801N404M300O3012n2686N7297M8728K487J19888J12644j95249N7457
4276D760083O7507j00861N7467J17021n8583J87819k0363L078J37405k7038Q5501
4265E209036J26433p2143J9655J22679m9319J59975O0581O6043J39793o3255K5716
$$ y = [4276897, 4226341, 4310161, 4213836, 4304080, 4235084, 4227947, 4238391, 4118258, 4176710, 4201012, 4217815, 4270973, 4204253, 4204261, 4152403, 4162641, 4279704, 4270485, 4286194, 4313028, 4312916, 4263004, 4255452, 4240774, 4142421, 4102796, 4083545, 4053722, 4092520, 4024674, 4065113, 4003136, 3997193, 3970959, 4005534, 3952528, 3988231, 4037925, 4010670, 4020709, 4038837, 4054072, 4194704, 4220251, 4241622, 4313482, 4218167, 4245359, 4282739, 4287846, 4358749, 4383931, 4460439, 4421276, 4403033, 4490813, 4412877, 4445923, 4536801, 4542205, 4546505, 4609517, 4556831, 4614128, 4662856, 4665343, 4785231, 4897875, 4702626, 4760083, 4827590, 4726729, 4784196, 4901217, 4842634, 5030453, 5010090, 5013168, 5150573, 5123535, 5209036, 5335469, 5263326, 5282981, 5405660, 5356341, 5516316, 5576897, 5642940, 5782733, 5719478, 5745194]
4254E745194J07012N4034O0162Q8207J7776N3186O0509O6876M7744O9354P6736
4243F446790M338M6541O2065P7723O5261L1035J12760J29956J57213J51977P1136
4232G356795J44055J34939J23240J56362J94830J42891J89443J19752K23133K22595
4222I008035J77098J54653K41965J87002K34031K03758J31539K81379J94374J59018
4212A0972852K73714K88880K65085L05343K30025K79117K79799K63703L37556
4203A3496074L91793K85628L07606L41720L91241M65369N40164M01829M21851
4194A7043275L70634M72541M37242M96977O03028N74948N20062O35968O50287
4185B1804962O92497Q08645Q38078Q85542P84297Q26657Q25068Q49875R05848
$$ y = [5745194, 5852206, 5906240, 5966402, 6054609, 6072385, 6125571, 6186080, 6252956, 6300700, 6370054, 6446790, 6451128, 6497669, 6559734, 6637457, 6702718, 6733753, 6846513, 6976469, 7133682, 7285659, 7356795, 7500850, 7635789, 7759029, 7915391, 8110221, 8253112, 8442555, 8562307, 8785440, 9008035, 9185133, 9339786, 9581751, 9768753, 10002784, 10206542, 10338081, 10619460, 10813834, 10972852, 11246566, 11535446, 11800531, 12105874, 12335899, 12615016, 12894815, 13158518, 13496074, 13887867, 14173495, 14481101, 14822821, 15214062, 15679431, 16219595, 16621424, 17043275, 17413909, 17886450, 18323692, 18820669, 19423697, 19998645, 20518707, 21154675, 21804962, 22497459, 23306104, 24144182, 25029724, 25814021, 26640678, 27465746, 28315621, 29221469]
4176B9221469J050324J154658J180100J340916J508592J653899J783024K000858
4168D0893840K244590K424391K770282L149227L528539M092222M447781N035554
4160F8586426N931218P022076Q566931J0310691J2461341J4699039J6877636J9106528
4152A63561886K1100024K2982132K3894718K2223852J9670455J8124357J8001636
4145C09559060J2098732k884933k0860475l2082990l3321605k9011199k3735696
4138A79760894j9567586j6619446j4625111j3042508j1456050r726714q162704
4131H6560775o904568n926848n208426m595136m117128l688191l235852k909340
4123D9975286k611206k245884k027881j802468j634560j432712j434031j349399
$$ y = [29221469, 30271793, 31426451, 32606551, 33947467, 35456059, 37109958, 38892982, 40893840, 43138430, 45562821, 48333103, 51482330, 55010869, 59103091, 63550872, 68586426, 74517644, 81539720, 90106651, 100417342, 112878683, 127577722, 144455358, 163561886, 184661910, 207644042, 231538760, 253762612, 273433067, 291557424, 309559060, 321657792, 318772859, 297912384, 265829394, 232507789, 203496590, 179760894, 160193308, 143573862, 128948751, 115906243, 104450193, 94723479, 86560775, 79656207, 73729359, 68520933, 63925797, 59808669, 56120478, 52884626, 49975286, 47364080, 45118196, 43090315, 41287847, 39653287, 38220575, 36786544, 35437145]
4115C5437145j215458j195489j033747j015887j002738r67944r04356q69890o48803
4106B6582833p78841o27120n97965o93292o84221n67552n94371n07352m63001
4097B1069118n92268l88009m44032m33796m04609l50314m45407m34142m58241
4088A7118300n81692m65688n22003m55093n01495m06082l43832l04340l32098
4079A3205977k26934k48409k26366k85639k42947k82096k86001j84251k13122
4070A1010212j88161k04498j70100k32379j25977j45069j16348j45337j10771
4061I571572j38148j5776m0479n2161N4884k6438r675l1272j00016K0335Q4451
4050I317277n1796K0824R4854o4923J31452J14621r170R0793R459k8779P2314
$$ y = [35437145, 34221687, 33026198, 31992451, 30976564, 29973826, 29005882, 28101526, 27231636, 26582833, 25803992, 25176872, 24578907, 23885615, 23201394, 22633842, 22039471, 21532119, 21069118, 20476850, 20088841, 19644809, 19211013, 18806404, 18456090, 18010683, 17576541, 17118300, 16536608, 16070920, 15548917, 15093824, 14592329, 14186247, 13842415, 13538075, 13205977, 12979043, 12730634, 12504268, 12218629, 11975682, 11693586, 11407585, 11223334, 11010212, 10822051, 10617553, 10447453, 10215074, 10089097, 9944028, 9827680, 9682343, 9571572, 9433424, 9417648, 9377169, 9325008, 9379892, 9353454, 9343779, 9312507, 9212491, 9232826, 9317277, 9265481, 9286305, 9381159, 9316236, 9447688, 9562309, 9553139, 9643932, 9653391, 9624612, 9696926]
4039I696926P8673n3363q5437p6368j2593j32707N4245l9832J7566J57078J3994
4028I618182R2575J17584n53K4006K01825M9481R2637K13302O7467J18823K68247
4017A0863576J42564J56791L27333J46777K52032K39578K02737K77480K93566
4008A2902434L30422L21981K69693M45907L18752M68695M96194M56403N13936
3999A6524417M61009M82195O23765N66480O88838P53401P46342Q08033Q12824
3990B2467304R27210R15067J055170J095445J275731J271969J278281J398699
3982C1684876J604533J618443J725973J855714J953199K053255K069939K275292
3974D6841224K356235K391097K451138K586212K755052K733789K886039L023701
$$ y = [9696926, 9775599, 9722236, 9636799, 9560431, 9547838, 9415131, 9469376, 9429544, 9447110, 9604188, 9618182, 9710757, 9828341, 9827788, 9851794, 10053619, 10103100, 10195737, 10409039, 10476506, 10595329, 10863576, 11006140, 11162931, 11490264, 11637041, 11889073, 12128651, 12331388, 12608868, 12902434, 13232856, 13554837, 13824530, 14270437, 14589189, 15057884, 15554078, 16010481, 16524417, 16985426, 17467621, 18091386, 18657866, 19346704, 20100105, 20846447, 21654480, 22467304, 23394514, 24309581, 25364751, 26460196, 27735927, 29007896, 30286177, 31684876, 33289409, 34907852, 36633825, 38489539, 40442738, 42495993, 44565932, 46841224, 49197459, 51588556, 54039694, 56625906, 59380958, 62114747, 65000786, 68024487]
3966F8024487K986981L018270L090808L079854L158475L072181L135884L049630
3958I2616570L043268K985393K762200K735245K666144K464415K343965K120759
3950A13737959J976466J914994J596341J504812J342157J107038Q91244O97433
3942A24768444K83184M7741k91171o42625p75462j009535j276992j300036j583778
3933A18219770j879625j750752k015713k293397k366430k511322k697618k811669
3925I9893244k934386l094681l113166l137032l062635l111052l077030k993230
3917G5370032k937582k890035k963356k887045k757086k731088k619041k565939
3909E3018860k601294k482938k294452k136052k120613j939165j898935j825212
$$ y = [68024487, 71011468, 74029738, 77120546, 80200400, 83358875, 86431056, 89566940, 92616570, 95659838, 98645231, 101407431, 104142676, 106808820, 109273235, 111617200, 113737959, 115714425, 117629419, 119225760, 120730572, 122072729, 123179767, 124071011, 124768444, 125051628, 125099369, 124808198, 124165573, 123390111, 122380576, 121103584, 119803548, 118219770, 116340145, 114589393, 112573680, 110280283, 107913853, 105402531, 102704913, 99893244, 96958858, 93864177, 90751011, 87613979, 84551344, 81440292, 78363262, 75370032, 72432450, 69542415, 66579059, 63692014, 60934928, 58203840, 55584799, 53018860, 50417566, 47934628, 45640176, 43504124, 41383511, 39444346, 37545411, 35720199]
3901C5720199j674527j662271j570168j401576j419974j212515j111998j120211
3893B4546959j093183r80500r48657q56324p62293p48560o18029o51106p42087
3884A7146220n09000n65746n05901l81804m17299n80391l56167n06284l93455
3875A2930173k60202l02496l09036k77787k56069k97420k59589j98515j75967
3866A0593092q7484j28769j92711p3312j65496q1996Q9680m4810j45278r9822
3856I663094n6776q6293r3086k27056l10351k44842k90293k08354j93935k38059
3846G714049k14761j47800j37438k25474j97976j23160j56011m8252j39697j03724
3836F219756j47486q5117L7271j42346j07452q3875j11239n8492l7896m3132j8596
$$ y = [35720199, 34045672, 32383401, 30813233, 29411657, 27991683, 26779168, 25667170, 24546959, 23453776, 22473276, 21524619, 20668295, 19906002, 19157442, 18539413, 17888307, 17146220, 16637220, 16071474, 15565573, 15183769, 14766470, 14186079, 13829912, 13323628, 12930173, 12669971, 12367475, 12058439, 11780652, 11524583, 11227163, 10967574, 10769059, 10593092, 10505608, 10376839, 10184128, 10110816, 9945320, 9863324, 9953004, 9908194, 9762916, 9663094, 9606318, 9520025, 9426939, 9199883, 8889532, 8644690, 8354397, 8146043, 7952108, 7714049, 7499288, 7351488, 7214050, 6988576, 6790600, 6667440, 6511429, 6463177, 6323480, 6219756, 6072270, 5987153, 6024424, 5882078, 5774626, 5690751, 5579512, 5521020, 5483124, 5439992, 5421396]
3825E421396p2077q0249O8538p3204n9187k7732L054l1125k1277o8119O341q0057
3813D986302l5326j4914m7017j09320l2607K5552r7855M2006L3218j43192Q8351
3802D695198m5477K2793L3783j8843K5670O8093j1211O3141j1518L0085P9352
3791D931066q022N3105M9592L2287Q9516J7644k765L6807N7629K7884M8226l180
3779E329789p9009l5787K25694q3324J1192j9263j884K9446m5869K7042m1648
3768E316379N9052n9070K5o6324l752n7107k7616m2139m0985r4167J7210P185
3756E008691r0461R6237j4489r1764l9103M7600n905Q4706J5862l1623m929n4484
3744D920338L0125N5479n830M6611O0787l5778M5789J6292M4670Q6131n5346L7194
$$ y = [5421396, 5349319, 5269070, 5337608, 5264404, 5205217, 5177485, 5180539, 5149414, 5128137, 5060018, 5066359, 4986302, 4950976, 4936062, 4889045, 4779725, 4747118, 4772670, 4674815, 4716821, 4750039, 4606847, 4695198, 4649721, 4672514, 4706297, 4687454, 4713124, 4781217, 4770006, 4833147, 4821629, 4851714, 4931066, 4923044, 4976149, 5025741, 5058028, 5147544, 5165188, 5162423, 5199230, 5256859, 5284743, 5332969, 5329789, 5250780, 5214993, 5440687, 5357363, 5368555, 5349292, 5347408, 5376854, 5330985, 5358027, 5316379, 5375431, 5316361, 5316386, 5250062, 5246310, 5189203, 5161587, 5119448, 5078463, 4984296, 5001506, 5008691, 4918230, 5014467, 4999978, 4908214, 4869111, 4916711, 4910806, 4995512, 5011374, 4979751, 4974822, 4920338, 4950463, 5005942, 5000112, 5046723, 5107510, 5071732, 5117521, 5133813, 5178483, 5264614, 5209268, 5246462]
3732E246462L8127N9157N0284J05761n580P3040R5172K6912R8407J3679P9334
3721E880755M9374J25039J5243J34688M5031M7967L8514K50710k3684O1509J30380
3710F755526N3210P0677P1123P6422R4363J00306J47283N7579K2231p990K45328
3699G686058O3841M0360J93553J34775Q1366K55670L6153J84248J28414J08208
3689H912646J47054J57039J57724K51432K22951J35883J66798K23238J37617K29586
3679A0741968K76113J63066J62736L22136K85649K74042K20287L30778K77479
3670A3054254K62581L23558L26467M47200L33934M13220M25743M84348M51183
3661A6522488N89621N09432O80138O08923P46391P49259P91157P96052R54100
$$ y = [5246462, 5284589, 5343746, 5394030, 5499791, 5494211, 5567251, 5662423, 5689335, 5787742, 5801421, 5880755, 5930129, 6055168, 6070411, 6205099, 6250130, 6298097, 6336611, 6587321, 6563637, 6625146, 6755526, 6808736, 6879413, 6950536, 7026958, 7121321, 7221627, 7368910, 7426489, 7448720, 7440730, 7686058, 7749899, 7790259, 7983812, 8118587, 8199953, 8455623, 8491776, 8676024, 8804438, 8912646, 9059700, 9216739, 9374463, 9625895, 9848846, 9984729, 10151527, 10374765, 10512382, 10741968, 11018081, 11181147, 11343883, 11666019, 11951668, 12225710, 12445997, 12776775, 13054254, 13316835, 13640393, 13966860, 14414060, 14747994, 15161214, 15586957, 16071305, 16522488, 17112109, 17621541, 18301679, 18910602, 19656993, 20406252, 21197409, 21993461, 22947561]
3652B2947561R84200J052715J222409J209575J274339J359100J348497J344773
3644C2743169J526497J469989J393747J445430J362143J417448J404598J332028
3636D4095049J275152J272186J214656J201560J069379J040178J021581Q69411
3628E3059152P64076O84600M60474M19599K62830J50846K82p2548o7324j00185
3618E5561802j60081j71533j58007o7947j72197j03500r9690J9557K1360n6272
3608E4613492J35405L30410L23782N36257P14570P55762J098891J244598J475091
3599F1228258J816931J839108K285012K554065K670088K941045L177717L424078
3591H1936302L625492L867950L979628M096024M175566M155443M139332M007233
$$ y = [22947561, 23931761, 24984476, 26206885, 27416460, 28690799, 30049899, 31398396, 32743169, 34269666, 35739655, 37133402, 38578832, 39940975, 41358423, 42763021, 44095049, 45370201, 46642387, 47857043, 49058603, 50127982, 51168160, 52189741, 53059152, 53823228, 54507828, 54968302, 55387901, 55650731, 55801577, 55801859, 55729311, 55661987, 55561802, 55401721, 55230188, 55072181, 55004234, 54832037, 54728537, 54628847, 54648404, 54669764, 54613492, 54748897, 55079307, 55403089, 55939346, 56653916, 57409678, 58508569, 59753167, 61228258, 63045189, 64884297, 67169309, 69723374, 72393462, 75334507, 78512224, 81936302, 85561794, 89429744, 93409372, 97505396, 101680962, 105836405, 109975737, 113982970]
3583A13982970M047771L942721L874229L732744L551128L390340L343708K980215
3575A42845826K950411K602754K126312J909404J309533R96375P01823J24215
3567A55566653q7642k96052n76346o35959o49123q19920p34995o33789p29738
3558A50403089o17996n41077n22956k39344k33203o4844K94208M48653Q20453
3549A49746983R56081J296182J607076J763413K043500K095337K223135K457767
3541A64189474K289735K437981K505032K422595K377291K382685K261939K338846
3533A83205578K192092K027200J865542J594952J332846J161895Q46519N45273
3525A94771897L50870K23123J49173J56361J51218L98152M73836J018698J446470
$$ y = [113982970, 118030741, 121973462, 125847691, 129580435, 133131563, 136521903, 139865611, 142845826, 145796237, 148398991, 150525303, 152434707, 153744240, 154740615, 155442438, 155566653, 155479011, 155182959, 154606613, 153970654, 153321531, 152501611, 151766616, 151132827, 150403089, 149785093, 149244016, 148721060, 148481716, 148248513, 148183669, 148477877, 148926530, 149746983, 150703064, 151999246, 153606322, 155369735, 157413235, 159508572, 161731707, 164189474, 166479209, 168917190, 171422222, 173844817, 176222108, 178604793, 180866732, 183205578, 185397670, 187424870, 189290412, 190885364, 192218210, 193380105, 194226624, 194771897, 195122767, 195345890, 195495063, 195651424, 195802642, 196200794, 196674630, 197693328, 199139798]
3516A99139798J939905K499090L326552L995373M914658N866579O783161P733640
3508B36198756Q639711R494620J0303719J1038505J1335671J1472474J1282043
3501C09765499J0664298R916603Q543225P107615N632978M219731K852918J658035
3493C60360902N64169j37954p94259j603954k233533l270679m260948n530730
3485C43093014o900764q438231r985323j1281358j2408586j3305318j3689216
3478B67084218j3835862j3579753j3076673j2496860j1608214j0842860j0108015
3471A81535981r382567q697786q032614p586258o957640o500840o056019n614770
3463A22707487n246999m839166m471586m317328l971113l781245l656664l362935
$$ y = [199139798, 201079703, 203578793, 206905345, 210900718, 215815376, 221681955, 228465116, 236198756, 244838467, 254333087, 264636806, 275675311, 287010982, 298483456, 309765499, 320429797, 330346400, 338889625, 345997240, 351630218, 355849949, 358702867, 360360902, 360925071, 360787117, 359992858, 358388904, 356155371, 352884692, 348623744, 343093014, 336192250, 327754019, 317768696, 306487338, 294078752, 280773434, 267084218, 253248356, 239668603, 226591930, 214095070, 202486856, 191643996, 181535981, 172153414, 163455628, 155423014, 147836756, 140879116, 134378276, 128322257, 122707487, 117460488, 112621322, 108149736, 103832408, 99861295, 96080050, 92423386, 89060451]
3455H9060451l308240l147510k967076k881427k772905k620151k528559k326707
3447F6507876k265602k104646k002938j943607j753985j812727j625492j599630
3439E1399249j452679j376986j352104j360193j268919j256934j189366j122343
3431D1019725j147405j037086j093657j029643j007987j103042r32246r08608
3423C2760051r47432q98116r34119q58136q31113q53626p06032q46174o92601
3414B5192702o40610p24792n35557n76797o50224n26310m76452n53828m30849
3405B0077283m77526m94210l95305l73785l87689l45955l25632m09150l40037
3396A6527994l68279k60630k99020l04568l68733k73225k58690k94599k38347
$$ y = [89060451, 85752211, 82604701, 79637625, 76756198, 73983293, 71363142, 68834583, 66507876, 64242274, 62137628, 60134690, 58191083, 56437098, 54624371, 52998879, 51399249, 49946570, 48569584, 47217480, 45857287, 44588368, 43331434, 42142068, 41019725, 39872320, 38835234, 37741577, 36711934, 35703947, 34600905, 33668659, 32760051, 31812619, 30914503, 29980384, 29122248, 28291135, 27437509, 26731477, 25885303, 25192702, 24552092, 23827300, 23291743, 22714946, 22064722, 21538412, 21061960, 20508132, 20077283, 19599757, 19105547, 18710242, 18336457, 17948768, 17602813, 17277181, 16868031, 16527994, 16159715, 15899085, 15600065, 15295497, 14926764, 14653539, 14394849, 14100250, 13861903]
3387A3861903k72947k84392k94771k40331j92372k02867l47180k23310k94059
3378A1509674k50605k09928k04936j89582k61341r1460k42341k58084j45800k15499
3368I440098j81171j59820j38992q4189j50187j39404j01104k07464l0916j28763
3358H118088j38687j51477j79453r2147p4047j01252J3030l8345j33589m5917
3348G176204j10089j18530q7962q3301m3818k2406j20522j83043N023n8154m5876
3337F307526o1127q8807r5058r1548p1908L842J150j02587P7545n3361j10444
3326E715223J682K8049L2128J5669j1895l5704J597K8446l3296j2409L6414P4292
3314E840196j3690M721p5819Q0923j5114K0913r789k7151p2106J3956N3850R4879
$$ y = [13861903, 13588956, 13304564, 13009793, 12769462, 12577090, 12374223, 12027043, 11803733, 11509674, 11259069, 11049141, 10844205, 10654623, 10393282, 10301822, 10059481, 9801397, 9655597, 9440098, 9258927, 9099107, 8960115, 8875926, 8725739, 8586335, 8485231, 8277767, 8246851, 8118088, 7979401, 7827924, 7648471, 7556324, 7482277, 7381025, 7394055, 7355710, 7222121, 7176204, 7066115, 6947585, 6859623, 6776322, 6732504, 6710098, 6589576, 6406533, 6411556, 6353402, 6307526, 6246399, 6157592, 6062534, 5970986, 5899078, 5902920, 5904070, 5801483, 5879028, 5825667, 5715223, 5716905, 5744954, 5777082, 5792751, 5780856, 5745152, 5746749, 5775195, 5741899, 5729490, 5765904, 5840196, 5826506, 5831227, 5755408, 5836331, 5821217, 5842130, 5832341, 5805190, 5733084, 5747040, 5800890, 5895769]
3302E895769J1394K6284K6935N0455P373N5716O5985J9213j8511P9730R082K9926
3290F259351L8618l4693J48137m0817L4173J06535j2832n5379Q3723K002K9777
3279F558595M761L502l5192N7917P174J05575P8570O561Q7184l9938o7914J54244
3267F921039p166J14324J49917j7792N8387j4216L2670J41604J09075J56147J13255
3256G757244J09888J05653K23725L20034K27267K26927K63506K36571L23440J89225
3246I983480L21006K08416K0490J37047R1686j18334j83315j02976k95302l63675
3236I698523l13019l11803l30009j32733l32348j76457r7559l02008j03054j47189
3226G452344j62934m629n8207j67143p0277j07128l6946p4350m4159K5836O1828
$$ y = [5895769, 5907163, 5933447, 5960382, 6010837, 6018210, 6073926, 6139911, 6159124, 6140613, 6220343, 6229425, 6259351, 6297969, 6263276, 6411413, 6370596, 6404769, 6511304, 6498472, 6443093, 6526816, 6528818, 6558595, 6563356, 6566858, 6531666, 6589583, 6596757, 6702332, 6780902, 6787463, 6874647, 6834709, 6766795, 6921039, 6913873, 7028197, 7178114, 7160322, 7218709, 7204493, 7237163, 7378767, 7487842, 7643989, 7757244, 7867132, 7972785, 8196510, 8516544, 8743811, 8970738, 9234244, 9470815, 9794255, 9983480, 10304486, 10512902, 10533392, 10670439, 10762125, 10643791, 10460476, 10357500, 10062198, 9698523, 9385504, 9073701, 8743692, 8610959, 8278611, 8102154, 8004595, 7702587, 7599533, 7452344, 7289410, 7284781, 7226574, 7059431, 6989154, 6882026, 6845080, 6770730, 6726571, 6752407, 6814235]
3215F814235p6881O0784n5010j337R726K2992n6048K8974l4121N4405m5195P3224
3203F795748N7347K0604L5126K557J7686M0120P4144J37373N9604q9425k9969
3192G120915k8962P9350J70069k3959k21315j71881l25764j78497j40981j04213
3182F174762j240l0798k7475K4993j6115P4552J53333J78050O3304K36665K26290
3171G056321L46746M68909N41163P38488R51477Q37436J027072R65001N55010
3162A3487623K44220M98119J023214J365235P56868q34641j799776j786240j427590
3153A1527032j064576q09403o40966n27811l48627l15909j24369r4722L3463n3805
3143G580307K05417K75323L87797M72640P17441O08512Q34146O21440L52656K45238
$$ y = [6814235, 6737354, 6798138, 6743128, 6741791, 6751517, 6774509, 6718461, 6747435, 6713314, 6767719, 6722524, 6795748, 6853095, 6873699, 6908825, 6911382, 6929068, 6969188, 7043332, 7180705, 7240309, 7150884, 7120915, 7091953, 7171303, 7341372, 7317413, 7096098, 6924217, 6598453, 6419956, 6278975, 6174762, 6173522, 6142724, 6115249, 6140242, 6124127, 6198679, 6352012, 6530062, 6593366, 6830031, 7056321, 7403067, 7871976, 8413139, 9151627, 10103104, 10940540, 11967612, 12932613, 13487623, 13731843, 14229962, 15253176, 16618411, 17375279, 16540638, 14740862, 12954622, 11527032, 10462456, 9653053, 9012087, 8484276, 8135649, 7819740, 7695371, 7600649, 7634112, 7580307, 7785724, 8061047, 8448844, 8921484, 9638925, 10247437, 11081583, 11703023, 12055679, 12300917]
3133A2300917N61288R33451J085172J29986j139338j578092j315214j049008r24290
3124I004872o70510q14049o11685m64203m48579l48766k64480k99983j62630j48147
3114D771840j74121j85206j11916k04778O751o6098j46758m9349k2660k30529
3104C587176k8677r2295j65594M556j27269j19301j520j07793n3950J037j06719
3093B789651j13263J2892q2135n6949L1404r4269q1437P0210q8231j5522q900
3082B363451j00186m4625k9034j06281M572J3113o2441l8070R7432q9971l1821
3071A976139k3107o5452N6080n6964J2567P753O510l0401m068K7695k7393n7202
3059A822157L1188n3181j6690q481j4494p195j866J26882r6371k0512K1405o0002
$$ y = [12300917, 12862205, 13795656, 14880828, 15010814, 13871476, 12293384, 10978170, 9929162, 9004872, 8334362, 7520313, 6908628, 6444425, 5995846, 5647080, 5382600, 5082617, 4919987, 4771840, 4597719, 4412513, 4300597, 4095819, 4102570, 4036472, 3889714, 3840365, 3817705, 3587176, 3558499, 3466204, 3300610, 3305166, 3177897, 3058596, 3057076, 2949283, 2895333, 2896370, 2789651, 2676388, 2689280, 2607145, 2550196, 2581600, 2487331, 2405894, 2476104, 2387873, 2372351, 2363451, 2263265, 2218640, 2189606, 2083325, 2087897, 2101010, 2038569, 2000499, 2097931, 2007960, 1976139, 1953032, 1887580, 1943660, 1886696, 1899263, 1907016, 1913526, 1883125, 1879057, 1906752, 1879359, 1822157, 1853345, 1800164, 1783474, 1774993, 1760499, 1753304, 1751438, 1878320, 1781949, 1761437, 1782842, 1722840]
3047A722840o592L7087l8255N7695M5463l0928l1151R749m2354r226Q9067l4818
3035A768577l2105L9860K0950O5523l1069J0253r1016k2875K4858O0180n3773
3024A759363O2215o0555K2770r4688Q2786o3861q1465R6043M2344p3550o4794
3013A626608M9875p6400P2381J2110R922k0979O5703r8368M8765j082j17795N8498
3001A629238L2017j5268M5412k1195k5194m244j1004j7760J800k0637K9525n8782
2989A563908N2286J1516J844l5484J3347m2735N8566M4768O662r29j6135j7220
2977A640394P385J26171m3933L2783L4161o5983L8449N720o2437J24277R055p0606
2965A775436P9792p1039l1941q854k2414J8482J6248p6383L0603M6217j06554
$$ y = [1722840, 1716248, 1753335, 1715080, 1772775, 1818238, 1787310, 1756159, 1765908, 1723554, 1714328, 1803395, 1768577, 1736472, 1776332, 1797282, 1862805, 1831736, 1841989, 1750973, 1728098, 1752956, 1813136, 1759363, 1821578, 1761023, 1783793, 1689105, 1771891, 1708030, 1626565, 1722608, 1764952, 1691402, 1626608, 1676483, 1600083, 1672464, 1684574, 1694496, 1673517, 1739220, 1640852, 1689617, 1688535, 1570740, 1629238, 1661255, 1645987, 1691399, 1670204, 1645010, 1640766, 1629762, 1612002, 1613802, 1593165, 1622690, 1563908, 1616194, 1627710, 1629554, 1594070, 1607417, 1564682, 1623248, 1668016, 1674678, 1673749, 1657614, 1640394, 1647779, 1773950, 1730017, 1762800, 1796961, 1730978, 1769427, 1775147, 1712710, 1836987, 1846042, 1775436, 1855228, 1784189, 1752248, 1743394, 1720980, 1739462, 1755710, 1679327, 1709930, 1756147, 1649593]
2954A649593K3072K7127q6338N9002J8276p5719J61527r101j3858R3526M517k7743
2942A823881O7061j0842Q743J8896L6062R5480l4894P2745M3229k6556M2383O612
2930B142800j6220N381k8066M8547j0074R9683L62j4376Q8584l5239K5804K7875
2918B335061n6395K3186N2366K765K9033P1969M3320O2428J00652J11931k1232
2907B755084O5938L321K20215J20203J15362Q5839J3224J0417L8826k9981j509
2896C396939o20j6944k7285p8529q3085j16580l5249k3988Q6997K6080m6966L4596
2884C115366j3653N9489K2142K8836q455J04447q6640Q1773L3331L8499N842l7090
2872C343887K1184m5642L231k2835r2405j35450l7533n8461l8609j52587j8869
$$ y = [1649593, 1672665, 1699792, 1613454, 1672456, 1690732, 1615013, 1776540, 1767439, 1753581, 1847107, 1851624, 1823881, 1890942, 1880100, 1888843, 1907739, 1943801, 2039281, 2004387, 2077132, 2120361, 2093805, 2136188, 2142800, 2126580, 2131961, 2103895, 2152442, 2142368, 2242051, 2242413, 2228037, 2316621, 2281382, 2307186, 2335061, 2278666, 2301852, 2354218, 2356983, 2386016, 2457985, 2501305, 2563733, 2664385, 2776316, 2755084, 2821022, 2824343, 3044558, 3164761, 3280123, 3365962, 3379186, 3389603, 3428429, 3398448, 3396939, 3396319, 3379375, 3352090, 3273561, 3190476, 3073896, 3038647, 3014659, 3101656, 3127736, 3080770, 3115366, 3101713, 3161202, 3183344, 3212180, 3203725, 3308172, 3221532, 3303305, 3336636, 3375135, 3380977, 3343887, 3365071, 3319429, 3322660, 3299825, 3207420, 3071970, 3034437, 2975976, 2937367, 2784780, 2765911]
2861B765911m460j03477j0666n4659r0210J6252n5844n2770N4038p3824p7599
2850B312692j7238j14638l5547l7046L7511j37558Q180j21870j00882j00846m6325
2839A646433q1172J01701j14352j5107j6231p8691L3937q2442K7878k9626q0049
2828A312279k2688n0269L654K1201k6480r8195Q829k6614J9088j54939Q2994j16408
2816I52452K5313O43m7020K0310m9212o7736L5333l5175l7340R531q9748P0804
2804G88155K460M9779l2005j35761Q675K2345p2438J3439P681l0058J6344n1007
2792E87609N3328k5689n7052N6991m48j5701k2113K0571L557o7303j1874J4123
2780E35999o2353Q3021k7801p0785j1519m5811L538K6854o0230J3393K2656R671
$$ y = [2765911, 2761451, 2657974, 2647308, 2592649, 2502439, 2518691, 2462847, 2410077, 2464115, 2390291, 2312692, 2295454, 2180816, 2145269, 2108223, 2145734, 2008176, 2016356, 1894486, 1793604, 1692758, 1646433, 1565261, 1666962, 1552610, 1537503, 1521272, 1442581, 1476518, 1394076, 1421954, 1392328, 1312279, 1289591, 1239322, 1242976, 1264177, 1237697, 1139502, 1148331, 1121717, 1140805, 985866, 1068860, 952452, 977765, 978408, 931388, 951698, 902486, 834750, 870083, 834908, 797568, 807099, 717351, 788155, 790615, 840394, 808389, 672628, 681303, 703648, 631210, 644649, 652330, 622272, 638616, 587609, 640937, 615248, 558196, 615187, 614739, 599038, 576925, 597496, 601053, 533750, 521876, 535999, 473646, 556667, 528866, 458081, 446562, 400751, 404289, 431143, 370913, 384306, 406962, 416633]
2768D16633m0474L694j0389p9080M0102k9894l9694L7212m0996L9800N5705m375
2756C48244m0714j7633L4480n0328l94J0782l3606M7637M612l9863K3171K0988
2744C07376n9927m884K880l5314N9747l5161m2925M6855n5816Q6192o3498r088
2732A96437N1524l3351n4324P1613j29902J18243r1212J8440K7193j8299k9934
2721A26428J24106j06485N4494Q4541j01720N550k8971p979N8988l7597p0104
2710A01251Q7381m1001J1048J06235j10132N9740M4404m4736m8373L4479j08926
2699I1370M0615N0123k2604O7886J6755q590k9448q2039J2615l279o5969Q215
2687G5650l30J1398k8066J5717j1541J8993L5377l3858n6141k3554k2329J06627
$$ y = [416633, 376159, 379853, 369464, 290384, 330486, 300592, 260898, 298110, 257114, 296914, 352619, 348244, 307530, 289897, 324377, 274049, 273655, 284437, 250831, 298468, 303080, 263217, 286388, 307376, 247449, 242565, 245445, 210131, 269878, 234717, 191792, 238647, 182831, 269023, 205525, 196437, 247961, 214610, 160286, 231899, 101997, 220240, 129028, 147468, 174661, 156362, 126428, 250534, 144049, 198543, 283084, 181364, 186914, 157943, 149964, 208952, 171355, 101251, 188632, 147631, 158679, 264914, 154782, 214522, 258926, 214190, 165817, 200296, 91370, 131985, 182108, 159504, 227390, 244145, 235555, 206107, 124068, 136683, 133404, 67435, 75650, 75320, 86718, 58652, 74369, 62828, 81821, 117198, 83340, 27199, 3645, -18684, 87943]
2675H7943j2446K8048N503L536l6765J4786k5456k375N5707L1425n9722N7873
2663A48057K5377k9204J0022k6783m9510K5905L8446r496L9459k128j26613P0423
2651A13955m8498J2929l3700P9887N1128N3210j37188K5871K0639m3001p579L2992
2639A20645N2258p010m9096L2133l1625L8114K9657J8551l3534j6284l3106k798
2627A17905Q498j7838L5373K4965n6390j4260P8425J9533J8003O6517p6985q4980
2615A18766j1226j7918K4457O9910J2575J0054o9641J4918j599q3600Q3441J2402
2603A62539K7950l0817j7826o1836R285M3304K373J2078L1433p9301j1515J4093
2591A01760Q178J15289m6095n1758m757l4444J4549K6916O0920k4044K9162K8580
$$ y = [87943, 75497, 103545, 109048, 112584, 75819, 90605, 65149, 62774, 118481, 149906, 90184, 148057, 173434, 144230, 154252, 127469, 77959, 103864, 142310, 132814, 172273, 170145, 43532, 113955, 65457, 78386, 44686, 124573, 175701, 228911, 91723, 117594, 138233, 95232, 87653, 120645, 172903, 165893, 116797, 148930, 117305, 155419, 185076, 203627, 170093, 153809, 120703, 117905, 126403, 108565, 143938, 168903, 112513, 98253, 176678, 196211, 214214, 280731, 203746, 118766, 107540, 89622, 114079, 183989, 196564, 206618, 136977, 151895, 150296, 66696, 150137, 162539, 190489, 159672, 141846, 80010, 89295, 132599, 134972, 147050, 178483, 99182, 87667, 101760, 109938, 225227, 179132, 127374, 122617, 88173, 102722, 129638, 190558, 166514, 195676, 224256]
2579B24256m6530j277K2018k3986P9310j7958o9296N901M481k1288Q4590l1389
2567B08832k4735N7729r1231R61M0266j55163J17667L503o8845L4998J267j7810
2555A07439P2971L4515q0560J2120P31k1756M4062j5302j14703R3083J953n1614
2543H2939L8059K6069k0882m5539P3914p7712m7215R998K5239o6322N9673l1967
2531B6254L2579N6447n5890K4695Q0936j07683R15K854q8372M8786M048m6295
2519b0726N3808K038P731o1174m1868J2478L9694J3862r8958L7658n5493N938
2507a05012K9470J6199P2327K1074j48721R2896l0938k8395J4976J7385K7323
2496b1416p2817N4216k2733M711K3810j2932o8624m6368J443q274J4914K7052
$$ y = [224256, 177726, 176449, 198467, 174481, 253791, 235833, 166537, 172438, 176919, 155631, 240221, 208832, 184097, 241826, 150595, 151556, 191822, 36659, 154326, 157829, 88984, 123982, 125249, 107439, 180410, 214925, 134365, 146485, 147216, 125460, 169522, 154220, 39517, 132600, 134553, 82939, 120998, 147067, 126185, 80646, 154560, 76848, 29633, 39631, 64870, -1452, 58221, 26254, 58833, 115280, 59390, 84085, 165021, 57338, 58253, 61107, -27265, 21521, 25569, -20726, 33082, 35120, 42851, -18323, -60191, -47713, -8019, 5843, -93115, -55457, -110950, -105012, -75542, -59343, 12984, 34058, -114663, -21767, -52705, -81100, -66124, -48739, -21416, -94233, -40017, -62750, -58039, -34229, -47161, -115785, -162153, -160710, -168984, -154070, -127018]
2484a27018Q3083r2656P9417O5300q0392k0813L7940n6804N406q772p2853J78175
2472i987j10361R203R8370j26235M0720O0483q499R102L9888p6680R2980m169
2460A4815k8048L9486k2786n0870M1032j01332L5022N5060m2402P3649m3272J9364
2448a0282p267k160m1451l966J8708N535l5117M075l8329M613M9721k2192J9147
2435e8965N804m4209J773O8600k203o6918L6145L0764r1338L7082P6170k0126
2423b7421l3177n7578Q7609j02393j8402O4866p5425k715L5848J0305O232J3972
2411i8279j9080q318J8067m9697M854j1932J5533M5574K0067m6221Q043j6135
2399a37524j05200P4347j4071n699N4976J1346l9915j344l5049J77633M1110m8239
$$ y = [-127018, -43935, -136591, -57174, 8126, -72266, -93079, -55139, -111943, -106537, -115309, -188162, -9987, -120348, -111145, -12775, -139010, -98290, -37807, -46306, -37204, 2684, -73996, 18984, 14815, -13233, 26253, 3467, -47403, -6371, -107703, -72681, -17621, -60023, 13626, -29646, -10282, -17549, -19709, -61160, -65126, -46418, -40883, -76000, -71925, -110254, -105641, -55920, -78112, -58965, -53161, -97370, -95597, -26997, -29200, -96118, -59973, -29209, -120547, -83465, -7295, -27421, -60598, -118176, -30567, -132960, -151362, -86496, -161921, -164636, -128788, -118483, -112251, -98279, -117359, -125677, -107610, -157307, -152453, -164385, -148852, -103278, -83211, -129432, -121389, -137524, -242724, -168377, -182448, -188147, -133171, -121825, -161740, -163084, -198133, -20500, 20610, -27629]
2387b7629j0641n7305N0044m2263L3744R3927m1005k9097Q3653l5825M0183n5166
2375B620j2043J05790l1559n3053N38k0700K5413Q3863N1218k4762J0652k2845
2363A15132O506q2835n980K5041m0620o4004k2226O0242J5384k2854K0984O448
2351A1218k7235J3710n1442O9998J1303O2008j11650N048J4788k2263L0085J4398
2339A9966m3664P6068j0822j35883K9081J4234N5952N4006j3144k0743m3233L8855
2327B0673n7924R4032o8864n1557P7728p581R159N8617p8839L1102j7293n1661
2315d2408J43455j46889J0061J04851n1852j02122L4884n4830n6169J02665k0694
2304g9048r164N2191O4812n6501m4733l7247J6206N0449n4315K5788o3046M8915
$$ y = [-27629, -38270, -95575, -45531, -87794, -54050, 39877, -1128, -30225, 53428, 17603, 57786, 2620, -9423, 96367, 64808, 11755, 12293, -8407, 17006, 100869, 152087, 127325, 137977, 115132, 121638, 38803, 32823, 57864, 17244, -46760, -68986, -8744, 6640, -16214, 4770, 11218, -16017, -2307, -53749, 16249, 27552, 89560, -22090, -17042, -2254, -24517, 5568, 19966, -23698, 52370, 41548, -94335, -65254, -51020, 4932, 58938, 45794, 25051, -18182, 20673, -37251, 56781, -12083, -63640, 14088, 6507, 15666, 74283, -4556, 26546, 9253, -42408, 101047, -45842, -35781, 69070, 17218, -84904, -50020, -104850, -161019, -58354, -79048, -88212, -36021, 28791, -27710, -72443, -109690, -93484, -43035, -97350, -71562, -134608, -85693]
2292h5693N5170L3792m552l9077j21015Q1939o4828n0715L7851l6428R6088J013
2280i6455k4076j20174O8165K5069J3511K381m5913l6060j2317M4812K679N9189
2268a19189o8709k1352q1168O1872J18292j12749Q8494k398m0525P2003j8895
2257a24324k6666K2015p4643J27021p508q7961J18176p3484N0114J3662k2271
2246h5869p0036N8031J0490L5121J5927K8586n3293L7914l7658K8956N3680l1687
2234i838r21j6632l6206M6909j2816M8169Q7360j19259N9933o760o2783k1851
2222d4695j5894J1783M7974J9848j7933m3679P9206K071J865J3726m3137K6390
2210C7525p1702k0129L2551J1019O1360l2852J9472j4370j51035Q0209N8196r5142
$$ y = [-85693, -30523, 3269, -1283, -40360, -161375, -79436, -144264, -194979, -157128, -193556, -97468, -96455, -120531, -240705, -172540, -147471, -133960, -131579, -177492, -213552, -225869, -181057, -178378, -119189, -187898, -209250, -290418, -228546, -110254, -223003, -134509, -136907, -177432, -105429, -124324, -150990, -128975, -203618, -76597, -84105, -172066, -53890, -127374, -77260, -63598, -85869, -155905, -97874, -87384, -52263, -36336, -7750, -61043, -23129, -60787, -31831, 21849, -9838, -10759, -27391, -63597, -16688, -29504, 18665, 106025, -13234, 46699, 39939, -22844, -44695, -60589, -48806, -832, 19016, 1083, -42596, 36610, 38681, 40546, 54272, 11135, 37525, -34177, -54306, -21755, -10736, 50624, 17772, 37244, 22874, -128161, -47952, 10244, -84898]
2198h4898J66482p98j20448J7441J0616K4270R6487l7427l3532P6501p9595k2626
2186A2473R6312M8590J8887j23m137P6359o0373P3856L0405J7352R780l2615m5141
2173B41625P3997L4812n327O4385r6503L3827O2733j05448K9719J14847l1130
2162D17537O1626j1967l1292P9849J9581N6332L776k9606P0000K8291K4819K5079
2150G14025K3577L6395j8781M3943O4854j2684P0436l411Q0232J1036l6630P3588
2138A046580Q9211J07626O2819q687L4729O226L1561Q5446O3176Q8603P3903K9448
2126A710641J81468J55643Q6209J47062J64331R4228K84744J84729K95988K51467
2116C556510K98036L98849K85350L90492N64291O93818J041842J180879J229675
$$ y = [-84898, 81584, 80786, -39662, -22221, -11605, 12665, 109152, 71725, 38193, 114694, 35099, 12473, 108785, 157375, 176262, 176139, 172002, 248361, 187988, 261844, 292249, 309601, 319381, 286766, 241625, 315622, 350434, 345107, 409492, 312989, 346816, 409549, 304101, 333820, 448667, 417537, 479163, 467196, 435904, 515753, 535334, 591666, 595442, 565836, 635836, 664127, 688946, 714025, 737602, 773997, 755216, 799159, 864013, 851329, 921765, 918354, 998586, 1009622, 972992, 1046580, 1135791, 1243417, 1306236, 1297549, 1332278, 1338504, 1370065, 1455511, 1518687, 1607290, 1681193, 1710641, 1892109, 2047752, 2133961, 2281023, 2445354, 2539582, 2824326, 3009055, 3305043, 3556510, 3854546, 4253395, 4538745, 4929237, 5493528, 6187346, 7229188, 8410067, 9639742]
2107I639742J460599J572146K192901K342680J438582J039433K584935J576036
2099B3847054k381108l848993l740964k636008j647904j302701j050448p20753
2091F518175p55881n40118m43585l96379k80818k64851j30727l34624l13538l52449
2081B705205j98748j78963j20019j36014j37850j26069j39717n1285l0990q3725
2071A501825q2690o8419q4358q59q4018q4537j8184n6066j13085o673J5315j38156
2059G80095R0516N314j50957N3826q8890m4193J8317n6775m1981L0587o4428m7136
2047D84295N8967o6122P4249m1571K4089j01173n8535J5804j2267K4096k578m5945
2035C53309L5493o2150j3676j2012p8760k0272O3782m3483N8080l0653m3378m8685
$$ y = [9639742, 11100341, 12672487, 14865388, 17208068, 18646650, 19686083, 22271018, 23847054, 21465946, 17616953, 13875989, 11239981, 9592077, 8289376, 7238928, 6518175, 5762294, 5222176, 4778591, 4382212, 4101394, 3836543, 3705816, 3371192, 3057654, 2705205, 2506457, 2327494, 2207475, 2071461, 1933611, 1807542, 1667825, 1616540, 1585550, 1501825, 1419135, 1350716, 1266358, 1265499, 1181481, 1096944, 1078760, 1022694, 909609, 902936, 918251, 780095, 870611, 875925, 724968, 778794, 689904, 645711, 664028, 607253, 565272, 595859, 531431, 484295, 543262, 477140, 551389, 509818, 533907, 432734, 374199, 390003, 377736, 401832, 399254, 353309, 388802, 326652, 312976, 300964, 222204, 201932, 265714, 222231, 280311, 249658, 206280, 157595]
2023A57595N3127m1759l8395j5455l4295Q5430j3106p8951P4484k4998R003j2233
2011A20447l6291k4586Q491q2297P7177n1781R2816L5388j25449l0515M288K3944
1999A1632j4749O7469k3541p5264Q5567l4218o5588O6486q5179P5142L5724j16275
1987g2794K9195j1408o4325N5556Q5874m268l2645k2179n6425J06390p2749l051
1975f2829Q9002j52547j8405J32980j20169O6214m0047k6564M9127l1589q6144
1964b00971J02417n3325L9827R3084m9753j6287K7413l2897K1169L7885j5334
1953d6772o0496Q278k7471N4231j6711l3575O5625l0156o9627O6387k8357L0629
1941h8015n6017k2736O6512o3266O5748n382m053Q0132o3844o053L3863n9661
$$ y = [157595, 210722, 168963, 130568, 115113, 80818, 166248, 153142, 74191, 148675, 123677, 132680, 120447, 84156, 59570, 68061, -14236, 62941, 11160, 103976, 139364, 13915, -16600, -12312, 11632, -3117, 64352, 40811, -34453, 51114, 16896, -48692, 17794, -67385, 7757, 43481, -72794, -43599, -55007, -119332, -63776, 22098, 17830, -14815, -36994, -93419, 12971, -59778, -62829, 26173, -126374, -144779, -11799, -131968, -65754, -105801, -132365, -83238, -114827, -200971, -98554, -151879, -112052, -18968, -68721, -85008, -57595, -90492, -69323, -31438, -46772, -107268, -98990, -126461, -72230, -88941, -122516, -56891, -87047, -156674, -90287, -118644, -88015, -144032, -166768, -100256, -163522, -97774, -103156, -107209, -27077, -90921, -96974, -63111, -122772]
1929a22772P8589j9853m2479K535L5550N761m3816J19948j3823L768L1860j43320
1917a08052R198O640r0126J85714p9305q2400J18396n7197j5412L2247m9035O2221
1905f7111m7127k8051j1641L5239L4301K5413M3231r5370q53K5259k5576K1074
1893i1212o3951J7438Q8199M451K2378n0255m8455N2713o3685N5410Q6479j26449
1881a16939O8648l265o7283L7557N4867p8451R9190n0118m4418M7892o44M6323
1869f641k6831l9279j7714J9999m8674K7323j6838Q953K0926L4057l026K5240
1857b2505M0300p7936L9842k1273K7336n6157J0095k4396P1825n467l1209R306
1845d0239M0131l0527L7083j3334j2248P0190m3392k9733L1436R793J8720l8381
$$ y = [-122772, -44183, -64036, -106515, -103980, -68430, -62669, -106485, 13463, -360, 3408, 35268, -108052, -98854, -92214, -182340, 3374, -75931, -158331, -39935, -97132, -112544, -80297, -129332, -67111, -114238, -142289, -153930, -118691, -84390, -58977, -15746, -111116, -111969, -86710, -112286, -91212, -155163, -137725, -49526, -45075, -22697, -72952, -121407, -68694, -132379, -76969, 9510, -116939, -48291, -51556, -118839, -81282, -26415, -104866, -5676, -55794, -100212, -52320, -52964, -6641, -33472, -72751, -90465, -70466, -119140, -91817, -108655, -99702, -78776, -44719, -47745, -22505, 17795, -60141, -20299, -41572, -14236, -70393, -60298, -84694, -12869, -18336, -49545, -40239, -108, -30635, 6448, -6886, -19134, 51056, 7664, -22069, 9367, 19160, 37880, -501]
1833e01Q5331M658P6741q7205o8688l0629j1682q5116N7532l9126J0569L3502
1821e4614l7065K0008J1305N4323k4120j1110o4833J03343l3012k4034L7450L1768
1809I409o3900Q7086M3865j15104M4218k7835n5518Q387k8755k4190N4726N1159
1797a6452q2359M2483j8637m5432M6693J36909j54265M0327M5132j13036l8932
1786a57569J12256p6994J05974j7909n1313O8958l9334k5082j9532M0501n4934
1775a14978N4029O3760j01418N7352M4023p0922l0799N232o3349k310j5735L5826
1763a39289P251M7006j6458J6480M5602p9105R8203r198j3830L204k9064k3633
1751i2831K7484k0503N8774j941m1043K9750n8501K9796K5575l7963p120P5532
$$ y = [-501, 84830, 89488, 166229, 79024, 10336, -20293, -31975, -117091, -59559, -98685, -88116, -54614, -91679, -71671, -60366, -6043, -30163, -41273, -106106, -2763, -35775, -59809, -22359, 9409, -54491, 32595, 76460, -38644, 5574, -22261, -77779, -69392, -98147, -122337, -67611, -16452, -98811, -56328, -74965, -120397, -73704, 63205, -91060, -50733, -5601, -118637, -157569, -45313, -122307, -16333, -34242, -85555, -16597, -55931, -81013, -100545, -60044, -114978, -60949, 2811, -98607, -41255, 2768, -68154, -98953, -93721, -157070, -159380, -175115, -139289, -132038, -85032, -101490, -85010, -39408, -118513, -20310, -29508, -43338, -40134, -69198, -92831, -65347, -85850, -27076, -29017, -70060, -40310, -98811, -69015, -43440, -81403, -88523, -12991]
1739a2991k7619k3510R513n4478J28230j05896O6811J8473m1213Q757K1254r9416
1727a12085M8071m566m1435L9189K3932n8482J42973l5374q0017O4671m9027j8914
1715h1064J11898k6695n6352L2402l9626l7634R743m6907K7098J25102r2601l5461
1703a10097J7301l410n5618J11686N1365o0083j7837n1600L6707N3831q2203P1346
1691c8612q35m2938L2816j2233k5670M6488J3618j6237m2639k2914m0205K6181
1679a23180J1528L0451R05m0695n6581N3743K9768J458N973m206m360k8739o5915
1666a89850l6842R1068N084N805M5944j05482k5697L7178L6596L4809L2687m4842
1654a13542K5195n3325K9484N4980q511k6171j0792K2966M8615j2480q129J3926
$$ y = [-12991, -40610, -64120, -54607, -109085, 19145, -86751, -19940, -1467, -42680, -33923, -12669, -112085, -64014, -68580, -110015, -70826, -46894, -105376, 37597, 2223, -77794, -13123, -62150, -81064, 30834, 4139, -52213, -19811, -59437, -97071, -87328, -134235, -107137, 17965, -74636, -110097, -92796, -96206, -151824, -40138, 11227, -48856, -66693, -118293, -81586, -27755, -109958, -38612, -39447, -82385, -49569, -61802, -87472, -40984, -27366, -43603, -86242, -109156, -149361, -123180, -111652, -81201, -80296, -120991, -177572, -123829, -94061, -92603, -86630, -90836, -95196, -123935, -189850, -226692, -135624, -130540, -124735, -78791, -184273, -209970, -172792, -136196, -101387, -68700, -113542, -88347, -141672, -112188, -57208, -65719, -91890, -102682, -79716, -31101, -43581, -51710, -37784]
1642c7784r5067r975R863N1415r6531O0110K6236J037j5455o5668J7810m9278
1630b03287L5419N9024m6712j50522N7454k6524r222P5169O3523q7390P3512K0241
1618a39315j49768J09024j6760o3157J24601l7549o0221L2460n7689k7969R0035
1607a96308k5898J6671K7221n7107q1068N026m4409P1077O3846j03755J12107
1596b12597l6151m1944O8396M9270N536p998k4700P4674p8689n071Q0274m2376
1584a71376J4865k2508n3240L9471j6620J1759k458L325o3072K5196l6958l1659
1572c03275O4851P5550p3198O3537n4547k3612q076L6165n34O8643R388r926j1181
1559a66215K2653M5117l2753L0430n3933m9654L5824k646l8333J22019o7819q5827
$$ y = [-37784, -132851, -142826, -132963, -81548, -178079, -117969, -91733, -90696, -106151, -171819, -154009, -203287, -167868, -108844, -155556, -306078, -248624, -275148, -284370, -209201, -145678, -233068, -159556, -139315, -289083, -180059, -196819, -259976, -135375, -172924, -233145, -200685, -258374, -286343, -196308, -222206, -205535, -178314, -235421, -316489, -311463, -355872, -284795, -220949, -324704, -212597, -248748, -290692, -222296, -173026, -167490, -175488, -200188, -125514, -204203, -209274, -129000, -171376, -156511, -179019, -232259, -192788, -209408, -197649, -200107, -196782, -259854, -234658, -271616, -303275, -238424, -162874, -236072, -172535, -227082, -250694, -258770, -222605, -223139, -154496, -145108, -155034, -166215, -143562, -98445, -131198, -100768, -154701, -204355, -168531, -171177, -209510, -87491, -155310, -241137]
1547b41137P6516m8655N0587M5851l9998j5674j1212n7151R322M1312p2020O3036
1535a99223K1026k3932O0289m1148q0750L4610J1336K642P6985M1483l6098q163
1523a40943m2670n0557L3734o661l1327O673M9576M7355m469J1255r4773m1542
1511b64349M4031k4819R9707L4049j06601M5710m0218k9478l5487M4679Q1915
1500a50861O6856J7180j38524l6365L1201M399M5247P1485p543j13451N8096O82
1488a51598k5337O5298p2483m7390J19152j55484M2601R3461o8235O4841M1826
1477i3348j00217N9813N8381j43738N8416j1712l3886j3788N6040n709O0121l38
1465a09965k1381Q299k8060r461r006N2667o0388R5984o8405K1312J0664m968
$$ y = [-241137, -164621, -213276, -162689, -116838, -156836, -172510, -183722, -240873, -231551, -190239, -262259, -199223, -178197, -202129, -141840, -182988, -263738, -229128, -217792, -215150, -138165, -96682, -132780, -140943, -183613, -234170, -200436, -207097, -238424, -231751, -182175, -134820, -139289, -128034, -222807, -264349, -220318, -245137, -145430, -111381, -217982, -172272, -212490, -241968, -277455, -232776, -150861, -84005, -66825, -205349, -241714, -210513, -206114, -160867, -89382, -96925, -210376, -152280, -151598, -176935, -111637, -184120, -231510, -112358, -267842, -225241, -131780, -200015, -135174, -93348, -193565, -133752, -75371, -219109, -160693, -172405, -206291, -220079, -164039, -169748, -109627, -109965, -131346, -123047, -151107, -160568, -169574, -116907, -177295, -81311, -149716, -128404, -117740, -122708]
1453a22708L1132O289N2190j5201k4204r771L5103m0164J445M6047m9722k5572
1441a15136o9358L1355m926O5143J1041O6035l5465r0746N4562K1248N9606o8820
1429g5461j513J6982J1441k1754N0471K6204Q455L4140j8433k7492n4183K7561
1417b3582N041k250J5736l7183K2615j1261o841l0930Q3710k7824P5631O2185
1405A25047j27584K6759N0791j07208m007N4917p9825J01963k6541L4636l8264
1394A0684J6058j9079m7167m278o2558J28662n8238r128P7958o7277l6103M1881
1382b8585k2164M0830l9883r100K2815r4841M9363q635L7043j3166m2672K3954
1370h5041r3380P9836p185K4760L8744k9954J3826m0490M3675p604j4163J4935
$$ y = [-122708, -91576, -85287, -33097, -48298, -72502, -82273, -47170, -87334, -85889, -39842, -89564, -115136, -184494, -153139, -158065, -92922, -81881, -15846, -51311, -142057, -87495, -66247, -6641, -75461, -76974, -59992, -48551, -70305, -19834, 6370, 14825, 48965, 30532, 3040, -51143, -23582, -18541, -20791, -5055, -42238, -19623, -30884, -37725, -68655, 15055, -12769, 62862, 125047, -2537, 24222, 75013, -32195, -36202, 18715, -61110, 40853, 14312, 48948, 10684, 26742, 7663, -39504, -43782, -106340, 22322, -35916, -45044, 32914, -34363, -70466, -28585, -50749, -9919, -49802, -58902, -36087, -130928, -81565, -90200, -53157, -66323, -108995, -85041, -178421, -98585, -105770, -81010, -42266, -72220, -58394, -98884, -55209, -62813, -76976, -62041]
1358f2041j821n5652R4632k7817J0977R426j3072O845J1558N190j3006l6548K793
1345f8536K2243m3909J44544j9631k3656J05927l0921j0345K4984r156m5385j1930
1333C4229K5816l1318O2138l6141n9623k272j4097K1607P9069j06249K0262K1310
1321A4731j3503l600m1975K9538O7855j36920Q6745k1530l812l9681J31719n2019
1309A7548M770L905j7230n5100j5048j5152L0244J492j3225O4865o9418o581O6130
1296b800m8997k9074m33k5263L4101j04275K8600N1728o1989J651O0350r781J1742
1283i4440J243m8861M3156K3761j9656K3829M3897o597L4586m3046j05812Q901
1271a39039N3324N929j9836K9862o0715N2549o6950J16122n3056P290J1493N5365
$$ y = [-62041, -63862, -119514, -24882, -52699, -41722, -32296, -45368, -38523, -26965, -21775, -34781, -71329, -68536, -46293, -90202, 54342, 34711, 11055, 116982, 86061, 75716, 100700, 91544, 46159, 34229, 60045, 28727, 90865, 54724, -4899, -7171, -21268, 339, 79408, -26841, -6579, 14731, 1228, -2372, -44347, -14809, 53046, -83874, 2871, -18659, -22471, -62152, 69567, 17548, 22318, 26223, 8993, -46107, -61155, -76307, -46063, -44571, -57796, 7069, -62349, -68930, -2800, -51797, -80871, -81304, -106567, -72466, -176741, -148141, -96413, -158402, -156751, -96401, -106182, -94440, -93197, -142058, -98902, -75141, -94797, -70968, -27071, -33668, 918, -42128, -147940, -139039, -85715, -79786, -99622, -69760, -130475, -77926, -144876, -28754, -81810, -74520, -63027, -7662]
1259g662n6668l0324l8842l920j659P8343j0231N0851K365Q899J8065p4673p319
1246g2775N894j8558L4211N928R0844k6434r8964N2727k9015k4503K0514o3993
1234a24124O0682o0933R658L1079l1760L5889l1745J0747m596K2159L028l4550
1222a14466K6771J2209k8877K8537N58j1484k0592j1907l963O953O0588o656l9284
1209a01613L9313j22240J2490Q6696m2331m8595Q7011j91m0110L70j12185M2336
1197a99049l3919P8116k664J16370m9030n4925J2406k1128m3880J32094o5027
1186a30636N1688K5282j32036j0174P5162K8819j4520L8750N66M7929j09096l173
1174a31439M2699j0421j7454O2720n0332r062m3281M0449K3525J3356k7505M3536
$$ y = [-7662, -64330, -94654, -133496, -137416, -139075, -60732, -70963, -20112, -17747, -8848, 9217, -65456, -72775, -66881, -85439, -51228, -45300, 45544, 19110, -79854, -27127, -56142, -80645, -60131, -124124, -63442, -124375, -114717, -83638, -115398, -79509, -111254, -100507, -105103, -82944, -79916, -114466, -87695, -75486, -104363, -75826, -75268, -86752, -107344, -119251, -123214, -116261, -55673, -62329, -101613, -62300, -184540, -172050, -85354, -127685, -176280, -89269, -89460, -129570, -129200, -241385, -199049, -232968, -154852, -157516, -41146, -90176, -145101, -132695, -153823, -197703, -65609, -130636, -78948, -53666, -185702, -195876, -120714, -91895, -106415, -67665, -67099, -19170, -128266, -131439, -88740, -99161, -116615, -53895, -104227, -113289, -156570, -116121, -92596, -79240, -106745, -63209]
1162f3209k0854j2901J6462L8857j06610M4709K3576J8240p4063R5067M0225n2969
1150e3470n8525J08247n7770k3620n32l949o086K9926p1804P6933m220m8328P2002
1137d1196m2552M5025O016l7423o6782Q1755n09n5415N4377o2475K025J17461
1125C07j35497j1416N2043p2960J24764k8402K9116O5712j19596k0957M5572m0457
1113a11771O3685L9508J8881L3816K0467j06564r373K9356k6684J14063m1986
1102B3398k6320Q5054p8181o3467R8830J0521q581K1437J5993o2742r000K694
1090I636P1632q420K3888O563p8757k984J7315j4916Q7682M65k9636J4404K401
1077I9273l2254k7558O4154o2310J3186O756p6560J01559l3644N5539N0576j01240
$$ y = [-63209, -84063, -96964, -80502, -41645, -148255, -103546, -79970, -61730, -135793, -40726, -501, -53470, -111995, -3748, -61518, -85138, -85670, -89619, -95705, -65779, -137583, -60650, -64870, -113198, -41196, -83748, -38723, -32707, -70130, -136912, -55157, -55666, -111081, -56704, -119179, -117154, 307, -135190, -146606, -94563, -167523, -42759, -71161, -42045, 23667, -95929, -116886, -71314, -111771, -48086, -8578, 10303, 44119, 64586, -41978, -51351, -21995, -48679, 65384, 23398, -2922, 82132, 3951, -59516, 39314, 49835, 41254, 62691, 78684, 15942, 6942, 9636, 81268, 72848, 96736, 103299, 24542, 21558, 38873, 23957, 111639, 112104, 82468, 96872, 99273, 67019, 39461, 103615, 41305, 54491, 61247, -15313, 86246, 52602, 108141, 158717, 57477]
1065E7477k2825N4377j7860P7676n9597m1675j8817k8478K2218k1582O0432N9430
1053A20776r0845l2827j3101K0299Q5071m7525K6379J2466r5384M4591k5718J9720
1041B3902L4420J5462K1841j8335M7564m2832k3488Q9050o3865j1203K8898l742
1029I7672L246O2616n2557K8836o9393l0428L574p353L0987L832M8114K1452J6207
1016A56805q2643Q208O3011q6590M742Q9953q8871O91L8532l6413N7954L4894
1004A60273m2133R926p6935j0671R332O3957N7258m9770K320N611r138O7551k8579
991A59002n2366M2794p6029l4590K198P6319r2347M3160M9574K6861j4523r1320
979C8733l9639k0991M6507q1257J047J3632R363Q909M3290k4422J3610n341N0763
$$ y = [57477, 34652, 89029, 71169, 148845, 89248, 47573, 28756, 278, 22496, 914, 61346, 120776, 29931, -2896, -15997, 4302, 89373, 41848, 68227, 80693, -14691, 29900, 4182, 23902, 58322, 73784, 95625, 77290, 124854, 82022, 58534, 147584, 83719, 72516, 101414, 97672, 100918, 163534, 110977, 139813, 70420, 39992, 43566, 36213, 67200, 71032, 119146, 140598, 156805, 74162, 82370, 145381, 58791, 63533, 153486, 64615, 65306, 103838, 67425, 125379, 160273, 118140, 128066, 51131, 40460, 49792, 113749, 171007, 121237, 123557, 129168, 120030, 187581, 159002, 106636, 149430, 73401, 38811, 41009, 117328, 24981, 68141, 117715, 144576, 130053, 38733, -906, -21897, 24610, -56647, -55600, -41968, -32605, -23696, 19594, -4828, 8782, 3441, 54204]
966E4204q9868J16335l282L7875r285l8900J3809n5527n2233L8446N9166N853
954G6593k9331k8088j1856k975P5881l2624k9089K6812o3499M7723l6902L3224
942B5869L0163p8192P257p0808J5521J1643k7884l5839R9419K6094N8158m7721
930A3680o1587l4714K8294m0536N9105P136q8477O6708L3072j4413L5990k5119
918b0861r4900M612K1326k730R999J8672J3065o4416J03355n7011L7102K0763
906a1024l9758P6384o5197j2537o8813P9420L4388k3260J5267j9184n9927N4476
894c9765j608K7847o6906M789N2766q032k7097p543O0273j8231l8605R9955j0056
881B7787l2489K5315j0795K9369q2767j4090J0294M1531N3022L8343m0183o8136
$$ y = [54204, -35664, 80671, 77389, 115264, 105979, 67079, 80888, 25361, -26872, 11574, 70740, 76593, 47262, 19174, 7318, 4343, 80224, 47600, 18511, 45323, -18176, 29547, -7355, 25869, 56032, -22160, -14903, -85711, -70190, -58547, -86431, -122270, -22851, 3243, 61401, 13680, -47907, -82621, -54327, -94863, -35758, -28622, -117099, -50391, -17319, -31732, 4258, -20861, -115761, -111149, -89823, -92553, -82554, -63882, -50817, -115233, -11878, -68889, -31787, -11024, -50782, 25602, -39595, -52132, -120945, -41525, -7137, -30397, -15130, -34314, -94241, -39765, -41373, -13526, -80432, -75643, -22877, -30909, -58006, -65549, -5276, -23507, -62112, 37843, 27787, -4702, 20613, 9818, 39187, -43580, -57670, -47376, -5845, 47177, 85520, 45337, -22799]
869b2799J6536n6716O9806J2781j1682J3700l0165m6888M2068q2179K6859M4490
857b4189k180J3318r2919P7220j1881q7501Q5595J28563k7249n5822o764m9598
845e3407K3279q854K123M9801n6264K3530K03N9439k5047l9488j3295J6348n5682
832g7314Q6821r9246p719N2044M2463M0927p0332N1703l685R768n7017L2549m9470
819d8508l0966K1524M5587k632Q9361l1817m6035r506L104O1401j9508j59420
807a27415M1465k045j4023J25662k5200j4876R8130q4814L0073K5242j00743N5369
795F825m6201j056J08579m9300k1754N2236r921k4039O4720k5714p4427O1232
783D1180l1998J645J8020j0284n0671N3291K3074l122p5845Q0408o6063K9454
$$ y = [-22799, -6263, -62979, 6827, 19608, 7926, 21626, -8539, -55427, -13359, -95538, -68679, -24189, -26369, -13051, -105970, -28750, -40631, -128132, -42537, 86026, 58777, 2955, -3809, -53407, -30128, -38982, -36859, 12942, -43322, -19792, -19589, 39850, 14803, -24685, -37980, -21632, -77314, 9507, -89739, -97458, -45414, -2951, 37976, -32356, 19347, 15662, 25430, -31587, 962, -48508, -79474, -57950, -12363, -14995, 74366, 42549, -3486, -12992, -9888, 51513, 32005, -127415, -85950, -87995, -102018, 23644, -1556, -16432, 81698, -3116, 26957, 52199, -48544, 6825, -39376, -40432, 68147, 18847, -2907, 49329, 39408, 15369, 80089, 54375, -20052, 41180, 9182, 10827, 28847, 18563, -32108, 21183, 44257, 41135, -34710, 45698, -20365, 9089]
771I089R5023q8224k4069P4086K378K6632J1774k3779J4694N5640r8875J13308
759A67677J6329q1740J6980j3015K0826M8814j0841l8754J231K7326m3353l3804
747G7676j8057J0493K9132j9205o118J30737j43287j6440O5614m3691j0549N0454
735A06759m4014P037M5444p7470P6541K1808m5088P4667M74n2483m9266l0134
723C4275M0780k4351N5578n0230k6252M1646Q0653n8355M6947j0018P935Q205
711A46813m0394o2273N2256j2975J8035M6550p4243Q049L5137q3988j2966P650
699B7651L8783J8466K9875m673K6K5966p4219O52J3851n4845N5177O616o9548
686A3778Q1638m629R812o977J6077p841N1805R446m1569M5351o6081J8353Q8920
$$ y = [9089, 104112, 15888, -8181, 65905, 68283, 94915, 106689, 82910, 97604, 153244, 54369, 167677, 184006, 102266, 119246, 106231, 127057, 175871, 165030, 126276, 127507, 154833, 111480, 77676, 59619, 70112, 99244, 80039, 73921, 204658, 61371, 44931, 110545, 66854, 56305, 106759, 62745, 69782, 115226, 37756, 114297, 136105, 91017, 165684, 166158, 113675, 64409, 34275, 75055, 50704, 106282, 56052, 29800, 71446, 152099, 93744, 140691, 130673, 138608, 146813, 106419, 44146, 96402, 83427, 101462, 148012, 73769, 81818, 116955, 32967, 20001, 27651, 66434, 84900, 114775, 110102, 110128, 136094, 61875, 62527, 76378, 21533, 76710, 83326, 13778, 95416, 90787, 100599, 93622, 109699, 101858, 153663, 163109, 121540, 166891, 100810, 119163, 208083]
673B08083o5897q1650L3642o2843L3910m1679Q8417J8265p5811O1494K8430q1512
661F2849R7969n2969m3062N2663p2307M4339L6573o9969R7650k5937m4390K2757
649A06166m0620M331L9489o8445j7238K3412K1518j8627K8730J7457r4209J03539
637A05503k948o9405Q9619j4278k8295L1645r1912J1358J22684p1825L5954N8616
625A76716J8873j04602M7299k6152n6264O5224m3136J4921J8104J6259m5799J2479
613I3922j841Q361j10082O4881k2690L1770J4119l107J7972M1486q8157J251M5304
600I3189j6873m9031p04J5560L3419O4046o891L3265m9599J8587k9150K14n0136
587E5896l87p3q1186L9796K7467j10935R8559l5738k7437J53244p6597q374J269
$$ y = [208083, 142186, 60536, 94178, 31335, 65245, 23566, 111983, 130248, 54437, 115931, 144361, 62849, 160818, 107849, 64787, 117450, 45143, 89482, 126055, 56086, 153736, 127799, 83409, 106166, 65546, 69877, 109366, 40921, 23683, 47095, 68613, 49986, 78716, 96173, 1964, 105503, 102555, 33150, 122769, 108491, 80196, 111841, 19929, 31287, 153971, 82146, 118100, 176716, 195589, 90987, 138286, 112134, 55870, 121094, 77958, 92879, 110983, 127242, 81443, 93922, 92081, 100442, -9640, 55241, 32551, 64321, 78440, 75333, 93305, 134791, 46634, 47885, 93189, 76316, 27285, 26581, 42141, 75560, 139606, 132715, 165980, 116381, 134968, 105818, 106032, 55896, 55509, 55436, -25750, 14046, 41513, -69422, 29137, -6601, -34038, 119206, 42609, 34235, 35504]
574C5504K3677j2680N1069p2675k3479K0538L956J8569L5957K3222k3999J9555
562I9214p1676o706R04k4278l4619L6610N6134j11432j2988K1697l1633L7175
550d1598R4683o6548K6002K5549l1972L1229P1048p8204J7518l6900m795l3312
538b7300Q3125k25o5r867k4142l055q938j3434R7502p8995n0011J01143q2742
525a7004k4431J06005o8479K9589O3187j28446R095N0592j5116N0217N1673n0338
513E6544M182J1181n5092K7353M6473r8061P6422N9557r0658J7265K221m8168
501I219P9777l1118k863M7909J0382m0574J6567p7215o430m0375J9860P9519N240
488F9898q1854Q4565m0130m409N1200n4125o146L1037m3049J6163j0630L490r707
$$ y = [35504, 59181, 46501, 97570, 24895, 1416, 21954, 25910, 44479, 80436, 103658, 79659, 99214, 27538, 20832, 21736, -2542, -37161, -551, 55583, -55849, -68837, -47140, -78773, -41598, 53085, -13463, 12539, 38088, 6116, 37345, 108393, 30189, 47707, 10807, 6012, -27300, 55825, 55600, 55535, 45668, 21526, 18471, 9533, -3901, 93601, 14606, -35405, 65738, -17004, -41435, 64570, -3909, 25680, 88867, -39579, -30484, 20108, 4992, 55209, 106882, 56544, 60726, 71907, 16815, 44168, 90641, -7420, 69002, 128559, 37901, 55166, 57387, 9219, 88996, 57878, 55015, 102924, 113306, 72732, 89299, 12084, 5654, -34721, -14861, 64658, 69898, -11956, 72609, 32479, 28070, 79270, 25145, 18999, 50036, 6987, 23150, 12520, 16010, 6303]
475F303N8857k0906n950J678q3363O1062n7221K7848Q521L9769j543L0431n3816
462A1670j6246J06151p6106J10016o016p8631k847J8699l0489K8038J0811M1325
450A16375l113j2638k2091q7157N8917L0158k5828K8447J7062k1364k5509L4837
438H8096o3177R9014l5502J7606m68n14m7536O3840j12902K7709O5861o9441J1180
425D3766M6054q8025K3023J6750j7215K4763n8785j4433O4489k9565j4099Q1638
413G8361n0620o3509Q8717k2247o8756J04637r3346P4204J0382m6470j8192M1544
401C4705j1546P906p3552J9222k9535J1453k3580L3618j7657K4248k184q7256
389a14158J13735K519n7065L1362r376k1343Q8858K0042l5035L5531j8866k6774
$$ y = [6303, 65160, 44254, 38304, 39982, -43381, 17681, -39540, -11692, -3171, 36598, 35055, 65486, 11670, -4576, 101575, 25469, 135485, 129469, 50838, 47991, 66690, 36201, 64239, 75050, 116375, 113262, 100624, 78533, -8624, 50293, 80451, 54623, 83070, 100132, 78768, 53259, 88096, 24919, 123933, 88431, 106037, 105569, 105055, 57519, 121359, 8457, 36166, 102027, 32586, 43766, 89820, 1795, 24818, 41568, 24353, 49116, -9669, -24102, 40387, 10822, -3277, 78361, 27741, -35768, 52949, 30702, -38054, 66583, -26763, 47441, 57823, 11353, -6839, 34705, 23159, 31065, -42487, -23265, -52800, -41347, -64927, -31309, -48966, -24718, -26902, -114158, -423, 2096, -54969, -23607, -32983, -54326, 34532, 54574, 19539, 55070, 36204, 9430]
377I430k1576P5688L98L1420r1107J1033n2695J13717k8637M3258M0759Q127r8647
364D1168J7132L268p1604P5215K8146r8891j3326J6178J9856K9495p616l4175
352D846o161N204K9872q477k0327L209Q9101O1377j28582N3560K7725n2913M5937
339A04371q027k7480l47n8852N7425k4068p9189N3495l4463q1248k8370O2827
327f3926r267J1665P3259p8186K2339M63J9670J1838N7081l8299j2678k8829o5015
314i9885M3255M6028n3044k3234O9184k4207O8296n3036r085J17270o677K0115
302I4980j00786l5361j5258M5379o4940R4744n5358L2270L2825j7770k6523J2272
290c526j4513O5908j3321p9806J01711m9017j4708P9764j0300n1023j9284o3184
$$ y = [9430, -12146, 63542, 63940, 95360, 4253, 15286, -37409, 76308, 47671, 90929, 131688, 139815, 41168, 58300, 61568, -10036, 65179, 93325, -5566, -18892, -2714, 17142, 46637, 39021, 4846, -1315, 3889, 33761, 25284, 4957, 8166, 97267, 158644, 30062, 83622, 111347, 58434, 104371, 96344, 68864, 68517, 9665, 67090, 43022, -36167, 17328, -17135, -98383, -126753, -63926, -73193, -61528, 11731, -66455, -44116, -43653, -23983, -12145, 44936, 6637, -6041, -34870, -99885, -56630, -10602, -63646, -86880, -17696, -41903, 26393, -26643, -35728, 81542, 74865, 94980, -5806, -41167, -56425, -11046, -75986, 18758, -36600, -4330, 28495, 10725, -15798, -3526, -18039, 47869, 34548, -45258, 56453, 7436, -7272, 72492, 62192, 11169, -8115, -71299]
278g1299J2786O7022o485L6059L2500m6737q2272J19339o3791M3772P192j13502
266f5416L5628j9182K9325j5774J16073p1910k105Q75l9257K2952o205n4840M5691
253b4145M7501j04095P7429j1542j022J0931j5873k6196l0559N1708p6398P4576
241b7685m1569J9531K5046l0032M7209L3626k8128k6161N6904o704K3038L8853
229H3928k057o1237N4293J424K977l2202k2209k622O800K1581Q19N0827l1384
216G0938p9543J7363k142L0203m2804o27L4344j4919L1399L8339J7802L924j2543
203I1734p5621J6482n0138J15256n7776N808j8320L8490k8445m9304L8799M7918
$$ y = [-71299, -58513, 8509, 2024, 38083, 70583, 23846, -58426, 60913, -2878, 40894, 48086, -65416, -29788, -48970, -19645, -35419, 80654, 8744, 6639, 7514, -31743, -8791, -14996, -69836, -24145, 23356, -80739, -3310, -14852, -15874, -4943, -20816, -47012, -77571, -25863, -102261, -27685, -69254, -49723, -24677, -54709, -7500, 26126, -2002, -28163, 28741, 22037, 45075, 83928, 81871, 20634, 74927, 76351, 79328, 47126, 24917, 22295, 29095, 50676, 51495, 102322, 70938, -8605, 8758, 6616, 36819, -5985, -6612, 27732, 12813, 44212, 82551, 100353, 104277, 91734, 16113, 32595, -17543, 97713, 39937, 45745, 27425, 65915, 37470, -11834, 26965, 74883]
$$ [...]
##END NTUPLES=NMR SPECTRUM
##END=
