##TITLE=1H_TG-2341-A
 CDCl3
 8 sc, 
 25.08.2022
##JCAMPDX= 6.0         $$ Bruker NMR JCAMP-DX V2.0
##DATA TYPE= NMR SPECTRUM
##DATA CLASS= NTUPLES
##ORIGIN= UXNMR, Bruker Analytische Messtechnik GmbH
##OWNER= root
$$ XWIN-NMR		Version 3.5
$$ Thu Aug 25 09:36:15 2022 Russian Standard Time (UT+4h)  she@DPX200
##.OBSERVE FREQUENCY= 200.1313499994
##.OBSERVE NUCLEUS= ^1H
##.ACQUISITION MODE= SIMULTANEOUS
##.ACQUISITION SCHEME= undefined
##.AVERAGES= 8
##.DIGITISER RES= 18
##SPECTROMETER/DATA SYSTEM= spect
##.PULSE SEQUENCE= zg30
##.SOLVENT NAME= CDCl3
##.SHIFT REFERENCE= (INTERNAL, CDCl3, 0, 15.7282)
##AUDIT TRAIL= $$ (NUMBER, WHEN, WHO, WHERE, WHAT)
$$ ##TITLE= Audit trail, XWIN-NMR		Version 3.5
$$ ##JCAMPDX= 5.01
$$ ##ORIGIN= Bruker BioSpin GmbH
$$ ##OWNER= she
$$ F:/spectra/data/she/nmr/H-F/1/pdata/1/auditp.txt
$$ ##AUDIT TRAIL=  $$ (NUMBER, WHEN, WHO, WHERE, WHAT)
(   1,<2022-08-25 09:35:03.23 +0400>,<she>,<DPX200>,
      <created by zg, POWCHK disabled, PULCHK disabled
       configuration hash MD5:
       00 E9 B6 7A A2 85 ED C7 34 08 36 98 17 FE 4E 26
       data hash MD5: 16K
       93 23 F8 8A 37 D1 E5 8A 49 56 21 E5 9A 50 D0 61>)
(   2,<2022-08-25 09:35:05.50 +0400>,<she>,<DPX200>,
      <Start of raw data processing
       efp BC_mod = 2 LB = 0.24 FT_mod = 6 PKNL = 1 PHC0 = -18036.43 PHC1 = 8.600692 SI = 16K 
       data hash MD5: 16K
       5C 3F 1C 48 DA 37 A8 69 D1 C3 AF 5A 5D 57 0F E3>)
(   3,<2022-08-25 09:35:22.98 +0400>,<she>,<DPX200>,
      <pk PHC0 = -1.207091 PHC1 = 5 
       data hash MD5: 16K
       DB F8 7B 53 91 64 19 63 99 EB 31 69 85 F3 7D A9>)
(   4,<2022-08-25 09:35:26.23 +0400>,<she>,<DPX200>,
      <abs ABSG = 5 
       data hash MD5: 16K
       EA C7 FA 2D 6E 9F 73 EA 5E 98 EA 69 3D 31 7F 6A>)
$$ ##END=
$$ 
$$ hash MD5
$$ F9 E2 33 FA 64 38 32 7C 95 A3 93 38 87 95 E2 49
##$RELAX= 
##$RELAX= 
##$RELAX= 
##$RELAX= 
##$RELAX= 
##$RELAX= 
$$ Bruker specific parameters
$$ --------------------------
##$DU= <F:/spectra>
##$EXPNO= 1
##$NAME= <H-F>
##$PROCNO= 1
##$TYPE= <nmr>
##$USER= <she>
##$AMP= (0..31)
100 100 100 100 100 100 100 100 100 100 100 100 100 100 100 100 100 100 
100 100 100 100 100 100 100 100 100 100 100 100 100 100 
##$AQSEQ= 0
##$AQ_mod= 1
##$AUNM= <au_zg>
##$AUTOPOS= <>
##$BF1= 200.13
##$BF2= 200.13
##$BF3= 200.13
##$BF4= 200.13
##$BF5= 200.13
##$BF6= 200.13
##$BF7= 200.13
##$BF8= 200.13
##$BYTORDA= 1
##$CFDGTYP= 0
##$CFRGTYP= 5
##$CHEMSTR= <none>
##$CNST= (0..31)
1 1 145 1 1 1 1 1 1 1 1 1 1 1 1 1 1 1 1 1 1 1 1 1 1 1 1 1 1 1 1 1 
##$CPDPRG= <>
##$CPDPRG1= <>
##$CPDPRG2= <>
##$CPDPRG3= <>
##$CPDPRG4= <mlev>
##$CPDPRG5= <mlev>
##$CPDPRG6= <mlev>
##$CPDPRG7= <mlev>
##$CPDPRG8= <mlev>
##$CPDPRGB= <>
##$CPDPRGT= <>
##$D= (0..31)
0 1.2 0 0 0 0 0 0 0 0.06 0 0.03 0 0 0 0 0.0002 0 0 0 0 0 0 0 0 0 0 0 0 
0 0 0 
##$DATE= 1661405702
##$DBL= (0..7)
120 120 120 120 120 120 120 120 
##$DBP= (0..7)
150 150 150 150 150 150 150 150 
##$DBP07= 0
##$DBPNAM0= <>
##$DBPNAM1= <>
##$DBPNAM2= <>
##$DBPNAM3= <>
##$DBPNAM4= <>
$$ [...]
##$SUBNAM3= <"">
##$SUBNAM4= <"">
##$SUBNAM5= <"">
##$SUBNAM6= <"">
##$SUBNAM7= <"">
##$SUBNAM8= <"">
##$SUBNAM9= <"">
##$SW= 18.0517283424941
##$SWIBOX= (0..15)
0 0 2 0 0 0 0 0 0 0 0 0 0 0 0 0 
##$SW_h= 3612.71676300578
##$TD= 16384
##$TD0= 1
##$TE= 0
##$TE2= 300
##$TE3= 300
##$TEG= 300
##$TL= (0..7)
0 120 120 120 120 120 120 120 
##$TP= (0..7)
150 150 150 150 150 150 150 150 
##$TP07= 0
##$TPNAME0= <>
##$TPNAME1= <>
##$TPNAME2= <>
##$TPNAME3= <>
##$TPNAME4= <>
##$TPNAME5= <>
##$TPNAME6= <>
##$TPNAME7= <>
##$TPOAL= (0..7)
0.5 0.5 0.5 0.5 0.5 0.5 0.5 0.5 
##$TPOFFS= (0..7)
0 0 0 0 0 0 0 0 
##$TUNHIN= 0
##$TUNHOUT= 0
##$TUNXOUT= 0
##$USERA1= <user>
##$USERA2= <user>
##$USERA3= <user>
##$USERA4= <user>
##$USERA5= <user>
##$V9= 5
##$VALIST= <valist>
##$VCLIST= <CCCCCCCCCCCCCCC>
##$VD= 0
##$VDLIST= <DDDDDDDDDDDDDDD>
##$VPLIST= <PPPPPPPPPPPPPPP>
##$VTLIST= <TTTTTTTTTTTTTTT>
##$WBST= 1024
##$WBSW= 4
##$XGAIN= (0..3)
0 0 0 0 
##$XL= 0
##$YL= 0
##$YMAX_a= 234334
##$YMIN_a= -314153
##$ZGOPTNS= <>
##$ZL1= 120
##$ZL2= 120
##$ZL3= 120
##$ZL4= 120
##$ABSF1= 15.7502
##$ABSF2= -2.301649
##$ABSG= 5
##$ABSL= 3
##$ALPHA= 0
##$AQORDER= 0
##$ASSFAC= 0
##$ASSFACI= 0
##$ASSFACX= 0
##$ASSWID= 0
##$AUNMP= <proc_1d>
##$AZFE= 0.1
##$AZFW= 0.1
##$BCFW= 0
##$BC_mod= 2
##$BYTORDP= 0
##$COROFFS= 0
##$CY= -3
##$DATMOD= 1
##$DC= 0
##$DFILT= <>
##$DTYPP= 0
##$F1P= 0
##$F2P= 0
##$FCOR= 1
##$FTSIZE= 16384
##$FT_mod= 6
##$GAMMA= 0
##$GB= 0
##$INTBC= 1
##$INTSCL= 1.705223e-09
##$ISEN= 128
##$LB= 0.24
##$LEV0= 0
##$LPBIN= 0
##$MAXI= 10000
##$MC2= 0
##$MEAN= 0
##$ME_mod= 0
##$MI= 1.114404
##$NCOEF= 0
##$NC_proc= -7
##$NLEV= 6
##$NOISF1= 3.799351
##$NOISF2= 2.8
##$NSP= 0
##$NTH_PI= 0
##$NZP= 0
##$OFFSET= 15.72816
##$PC= 1
##$PHC0= -18037.64
##$PHC1= 13.60069
##$PH_mod= 1
##$PKNL= yes
##$PPARMOD= 0
##$PSCAL= 0
##$PSIGN= 0
##$REVERSE= no
##$SF= 200.130008682029
##$SI= 16384
##$SIGF1= 3
##$SIGF2= 2
##$SINO= 5.538805
##$SIOLD= 16384
##$SREGLST= <1H.CDCl3>
##$SSB= 0
##$STSI= 16384
##$STSR= 0
##$SW_p= 3612.71676300578
##$SYMM= 0
##$S_DEV= 0
##$TDeff= 16384
##$TDoff= 0
##$TI= <>
##$TILT= no
##$TM1= 0
##$TM2= 0
##$TOPLEV= 0
##$USERP1= <user>
##$USERP2= <user>
##$USERP3= <user>
##$USERP4= <user>
##$USERP5= <user>
##$WDW= 1
##$XDIM= 16384
##$YMAX_p= 411658916
##$YMIN_p= -601887
$$ End of Bruker specific parameters
$$ ---------------------------------
##NTUPLES= NMR SPECTRUM
##VAR_NAME=  FREQUENCY,     SPECTRUM/REAL,   SPECTRUM/IMAG
##SYMBOL=    X,             R,               I
##VAR_TYPE=  INDEPENDENT,   DEPENDENT,       DEPENDENT
##VAR_FORM=  AFFN,          ASDF,            ASDF
##VAR_DIM=   16384,         16384,           16384
##UNITS=     HZ,            ARBITRARY UNITS, ARBITRARY UNITS
##FACTOR=    0.220516191357247, 1,           1
##FIRST=     3147.67677823592, 0,            0
##LAST=      -465.039984769861, 0,           0
##MIN=       -465.039984769861, -601887,     0
##MAX=       3147.67677823592, 411658916,    0
$$ Real data points
##PAGE= N=1
##DATA TABLE= (X++(R..R)), XYDATA
$$ [...]
$$ plain form
7092 19307015 19266015 19404353 19771765 20293302 20835237 22015520 23465455 25295926 27424457
7083 27424457 30312839 33519161 37707865 42950634 49262966 57544354 67734591 78352815
7075 78352815 87625486 92787285 91645542 84731732 73711560 62071674 51308252 43039330
7067 43039330 36229237 30910111 26970903 23767839 21345632 19337534 17620865 16077342
7059 16077342 14859959 13550164 12555681 11611512 10604621 10138242 9520554 8946923 8440790
7050 8440790 8067607 7706135 7306381 6986288 6619038 6369758 6186018 6052165 6028961 5731734
7040 5731734 5722853 5613254 5239335 4817620 4524991 4546545 4438196 4411578 4304645 4015338
7030 4015338 3943903 3889436 3922620 3756967 3725493 3366162 3267211 3227107 3266392 3306013 2970159
$$ packed form
7092A9307015m1000J38338L67412N21537N41935J180283J449935J830471K128531
7083B7424457K888382L206322M188704N242769O312332Q281388J0190237J0618224
7075G8352815R272671N161799j141743o913810j1020172j1639886j0763422q268922
7067D3039330o810093n319126l939208l203064k422207k008098j716669j543523
7059A6077342j217383j309795r94483r44169j006891m66379o17688n73631n06133
7050H440790l73183l61472l99754l20093l67250k49280j83740j33853k3204k97227
7040E731734q881j09599l73919m21715k92629K1554j08349k6618j06933k89307
7030D015338p1435n4467L3184j65653l1474l59331r8951m0104L9285L9621l35854
$$ plain form
7019 2970159 2879631 2839267 2851982 2792472 2745869 2529495 2417681 2261690 2181579 2114332 1887671
7008 1887671 1988263 1896145 1926924 1892741 1815754 1788727 1820568 1723688 1720605 1650253 1637754
6997 1637754 1721089 1700024 1715328 1614860 1601823 1491478 1413882 1565125 1586822 1660694 1451541
6986 1451541 1253705 1330068 1383192 1242517 1217971 1274312 1212080 1136458 1049044 1175019 1280416
6975 1280416 1390525 1056101 972936 901132 833904 952418 871785 830899 800640 846207 757935
6964 757935 783974 843744 886471 919313 1016635 1097726 964088 983265 1000019 915047 692450
6953 692450 541950 824647 867530 578952 616620 689310 751548 543592 771290 610754
6943 610754 556505 603246 588233 495151 671641 865089 788003 646435 771170 751899 772057
$$ packed form
7019B970159r0528m0364J2715n9510m6603k16374j11814j55991q0111o7247k26661
7008A887671J00592r2118L0779l4183p6987k7027L1841r6880l083p0352j2499
6997A637754Q3335k1065J5304j00468j3037j10345p7596J51243K1697P3872k09153
6986A451541j97836P6363N3124j40675k4546N6341o2232p5622q7414J25975J05397
6975A280416J10109l34424q3165p1804o7228J18514q0633m0886l0259M5567q8272
6964G57935K6039N9770M2727L2842R7322Q1091j33638J9177J6754q4972k22597
6953F92450j50500K82697M2883k88578L7668P2690O2238k07956K27698j60536
6943F10754n4249M6741j5013r3082J76490J93448p7086j41568J24735j9271K0158
$$ plain form
6932 772057 612573 484729 605912 484860 246955 404780 510319 376405 398884 508876
6922 508876 658030 618141 642790 632989 764584 567121 529721 410942 696220 839771 547753
6911 547753 568231 707512 948677 773117 880304 1074744 1096656 1294836 1306298 1364817
6901 1364817 1590549 1488132 1433643 1358483 1185703 1058198 1120198 1153497 1026062 1055754
6891 1055754 881567 880978 815668 894981 809139 729577 807274 567746 463282 422302 410338
6880 410338 267546 295034 366849 225994 267787 402168 434708 339132 121761 341405 478558
6869 478558 309432 317341 370899 398090 479898 347382 413317 397693 223774 158643 47472
6858 47472 28857 125068 285897 384933 366411 397965 460856 319705 442561 535602 555996
$$ packed form
6932G72057j59484j27844J21183j21052k37905J57825J05539j33914K2479J09992
6922E08876J49154l9889K4649r801J31595j97463l7400j18779K85278J43551k92018
6911E47753K0478J39281K41165j75560J07187J94440K1912J98180J1462N8519
6901A364817K25732j02417n4489p5160j72780j27505O2000L3299j27435K9692
6891A055754j74187n89o5310P9313q5842p9562P7697k39528j04464m0980j1964
6880D10338j42792K7488P1815j40855M1793J34381L2540r5576k17371K19644J37153
6869D78558j69126P909N3558K7191Q1808j32516O5935j5624j73919o5131j11171
6858D7472j8615R6211J60829R9036j8522L1554O2891j41151J22856R3041K0394
$$ plain form
6847 555996 640998 523159 313128 411282 361494 552240 574512 451637 399652 459476 492947
6836 492947 392219 215704 148476 178658 150065 94233 132593 228707 121165 133012 50249
6825 50249 263952 192747 119449 269705 215667 409579 366403 228224 182085 387602 462412
6814 462412 350740 342425 590934 498421 360450 370550 239756 377481 304601 328922 467176
6803 467176 292334 154915 414783 659746 461388 356491 326317 459385 627151 547129
6793 547129 544071 520283 508835 505717 480648 464186 425511 364947 347940 595657 470828 555397
6781 555397 730146 813700 778890 653733 534442 603736 643370 701618 741549 533088 608843
6770 608843 690562 536421 729968 666370 594631 721195 605818 608049 610614 773719 862689
$$ packed form
6847E55996Q5002j17839k10031R8154m9788J90746K2272j22875n1985N9824L3471
6836D92947j00728j76515o7228L0182k8593n5832L8360R6114j07542J1847q2763
6825E0249K13703p1205p3298J50256n4038J93912m3176j38179m6139K05517P4810
6814D62412j11672q315K48509r2513j37971J0100j30794J37725p2880K4321J38254
6803D67176j74842j37419K59868K44963j98358j04897l0174J33068J67766q0022
6793E47129l058k3788j1448l118k5069j6462l8675o0564j7007K47717j24829Q4569
6781E55397J74749Q3554l4810j25157j19291O9294L9634N8248L9931k08461P5755
6770F08843Q1719j54141J93547o3598p1739J26564j15377K231K565J63105Q8970
$$ plain form
6759 862689 1000202 873670 733407 688241 713962 820725 1054977 1128743 1052084 989587 796908
6748 796908 715052 754416 777446 541172 607734 690685 678529 557657 643479 693224 507815
6737 507815 566214 730964 869688 866291 798597 633926 739125 846047 809209 555789 702837
6726 702837 854960 792450 813403 763904 594297 487671 498868 467366 497151 678042 520429
6715 520429 577639 691548 647570 403947 447947 596495 419086 505165 522432 635079 546643
6704 546643 548242 962307 902345 791561 687122 612280 458213 446275 621839 681779 566327
6693 566327 435935 457494 628868 782910 748959 831345 896088 931447 900197 901023 983956
6682 983956 1007081 1279351 1228481 1251268 1184143 1179901 1212794 1263957 1183835 1206032 1344448
$$ packed form
6759H62689J37513j26532j40263m5166K5721J06763K34252P3766p6659o2497j92679
6748G96908q1856L9364K3030k36274O6562Q2951j2156j20872Q5822M9745j85409
6737E07815N8399J64750J38724l397o7694j64671J05199J06922l6838k53420J47048
6726G02837J52123o2510K0953m9499j69607j06626J1197l1502K9785J80891j57613
6715E20429N7210J13909m3978k43623M4000J48548j77409Q6079J7267J12647q8436
6704E46643J599M14065n9962j10784j04439p4842j54067j1938J75564N9940j15452
6693E66327j30392K1559J71374J54042l3951Q2386O4743L5359l1250Q26Q2933
6682I83956K3125K72270n0870K2787o7125m242L2893N1163q0122K2197J38416
$$ plain form
6671 1344448 1241561 1163885 889956 905877 931294 1169130 1308436 1032449 804598 1100497
6661 1100497 1230288 1208527 1469453 1418183 1324950 1213782 1320218 1430775 1493070 1575971
6651 1575971 1739244 1484489 1400811 1414926 1325897 1158164 921870 729624 682519 882846
6641 882846 885326 909204 874164 959617 906092 1016518 889876 900005 986043 1022353 987300
6630 987300 1316475 1222173 1003499 1041337 1192408 1081393 908677 917456 934809 856367 534767
6619 534767 521884 439066 512378 459122 324267 432419 392251 522855 611848 679288 730473
6608 730473 826662 786743 622207 646480 724981 816595 663735 481473 461572 127349 309598
6597 309598 497848 599372 513299 298598 243192 259776 160868 408426 451313 199944 144119
$$ packed form
6671A344448j02887p7676k73929J5921K5417K37836J39306k75987k27851K95899
6661A100497J29791k1761K60926n1270r3233j11168J06436J10557O2295Q2901
6651A575971J63273k54755q3678J4115q9029j67733k36294j92246m7105K00327
6641H82846K480K3878l5040Q5453n3525J10426j26642J0129Q6038L6310l5053
6630I87300L29175r4302k18674L7838J51071j11015j72716Q779J7353p8442l21600
6619E34767j2883q2818P3312n3256j34855J08152m0168J30604Q8993O7440N1185
6608G30473R6189l9919j64536K4273P8501R1614j52860j82262j9901l34223J82249
6597C09598J88250J01524q6073k14701n5406J6584r8908K47558M2887k51369n5825
$$ plain form
6586 144119 149714 204876 215260 171018 165575 357898 174876 341256 318018 283452 153225
6575 153225 116444 313321 367412 376235 429877 587352 505756 485701 408468 229803 568513
6564 568513 370403 272622 247987 285369 345022 22869 74780 141655 232094 114556 42193
6553 42193 166194 40981 90809 257326 259963 251976 214718 164164 195585 308150 286295
6542 286295 283009 291554 346915 105074 127339 84781 146138 223603 326725 445467 376351
6531 376351 467673 265586 233931 67439 256634 372638 474402 458511 371526 215625
6521 215625 265203 338722 253453 315807 194660 338743 460697 332758 326743 402492 285983
6510 285983 177830 353779 509518 569597 346169 304390 286135 544805 586096 480787
$$ packed form
6586A44119N595N5162J0384m4242n443J92323j83022J66380k3238l4566j30227
6575A53225l6781J96877N4091Q823N3642J57475q1596k0055p7233j78665L38710
6564E68513j98110r7781k4635L7382N9653l22153N1911O6875R0439j17538p2363
6553D2193J24001j25213M9828J66517K637p987l7258n0554L1421J12565k1855
6542B86295l286Q545N5361k41841K2265m2558O1357P7465J03122J18742o9116
6531C76351R1322k02087l1655j66492J89195J16004J01764j5891q6985j55901
6521B15625M9578P3519q5269O2354j21147J44083J21954j27939o015P5749j16509
6510B85983j08153J75949J55739O0079k23428m1779j8255K58670M1291j05309
$$ plain form
6500 480787 306356 197553 351394 458357 465196 239355 124162 437719 670091 593547
6490 593547 536166 664675 786916 810060 849279 373576 599271 597804 700359 639270 463471
6479 463471 584896 803772 713943 611351 727307 629684 575062 539251 476925 496609 570797
6468 570797 653623 705721 513467 520032 775981 681091 690197 1065496 1318600 1297486 1146171
6457 1146171 1063332 1215931 1227754 1101424 1100676 1196826 1261505 1170549 1180071 1324227 1579937
6446 1579937 1871971 1778218 1718925 1922905 2208214 2161174 1993489 1959262 1862654 1749917
6436 1749917 1429965 1199542 1067973 1216457 1346813 1500895 1431684 1407455 1121104 1047181
6426 1047181 1252940 1251740 1230729 1218955 1210124 1137048 1112692 1004630 1091054 1234616 1336575
$$ packed form
6500D80787j74431j08803J53841J06963O839k25841j15193L13557K32372p6544
6490E93547n7381J28509J22241K3144L9219m75703K25695j467J02555o1089j75799
6479D63471J21425K18876q9829j02592J15956r7623n4622l5811o2326J9684P4188
6468E70797Q2826N2098j92254O565K55949r4890R106L75299K53104k1114j51315
6457A146171q2839J52599J1823j26330p48R6150O4679r0956R522J44156K55710
6446A579937K92034r3753n9293K03980K85309m7040j67685l4227r6608j12737
6436A749917l19952k30423j31569J48484J30356J54082o9211k4229k86351p3923
6426A047181K05759j200k1011j1774q831p3076k4356j08062Q6424J43562J01959
$$ plain form
6415 1336575 1572973 1857074 2066279 2080947 2391178 2369886 2400563 2481494 2468233 2444534 2197263
6404 2197263 2030111 2106628 1731151 1726724 1611635 1481763 1346020 1260097 1053818 953113
6394 953113 998537 868828 973518 959053 1125764 1003735 1088461 1049342 1035536 962141 1000723
6383 1000723 1057169 1043843 1128529 1264251 1473502 1628060 1662608 1707971 1726129 1816704 1711814
6372 1711814 1424348 1230838 1093370 1072631 1085415 1080612 1024343 942413 894602 879054 880832
6361 880832 803277 895381 994876 875600 889913 811891 773210 646511 742365 840442 890456
6350 890456 899176 942458 1021065 986995 1044246 817728 909876 996063 910371 1020756 921180
6339 921180 684516 800094 869753 916807 770623 722944 756084 783842 739881 867240 803106
$$ packed form
6415A336575K36398K84101K09205J4668L10231k1292L0677Q0931j3261k3699k47271
6404B197263j67152P6517l75477m427j15089j29872j35743q5923k06279j00705
6394I53113M5424j29709J04690j4465J66711j22029Q4726l9119j3806p3395L8582
6383A000723N6446j3326Q4686J35722K09251J54558L4548M5363J8158R0575j04890
6372A711814k87466j93510j37468k0739J2784m803n6269q1930m7811j5548J778
6361H80832p7555R2104R9495j19276J4313p8022l8681j26699R5854R8077N0014
6350H90456Q720M3282P8607l4070N7251k26518R2148Q6187q5692J10385r9576
6339I21180k36664J15578O9659M7054j46184m7679L3140K7758m3961J27359o4134
$$ plain form
6328 803106 870965 939716 945317 1096907 1109062 1283821 1285906 1174220 1328811 1225782 1288157
6317 1288157 1323535 1376170 1308792 1185171 1274556 1175492 1055180 1160611 1067565 975164 1003328
6306 1003328 1018999 905544 917935 966912 864103 865306 839663 741381 859802 1020460 993042
6295 993042 1237447 1138701 1311221 1393115 1444978 1553980 1549051 1446290 1462670 1335119 1096514
6284 1096514 1028625 1216494 1223254 1187859 1339736 1274441 1161393 965344 745223 781705 1106456
6273 1106456 1059229 1195528 1089935 919647 969648 1027556 1071964 1016711 915501 1168037
6263 1168037 1357694 1581503 1849997 1958455 2018948 1720839 1478481 1480648 1260353 1155678
6253 1155678 1389359 1437073 1354282 1212824 1255105 1229707 1273314 1276995 1182252 1052895 1207365
$$ packed form
6328H03106O7859O8751N601J51590J2155J74759K085j11686J54591j03029O2375
6317A288157L5378N2635o7378j23621Q9385r9064j20312J05431r3046r2401K8164
6306A003328J5671j13455J2391M8977j02809J203k5643r8282J18421J60658k7418
6295I93042K44405r8746J72520Q1894N1863J09002m929j02761J6380j27551k38605
6284A096514o7889J87869O760l5395J51877o5295j13048j96049k20121L6482L24751
6273A106456m7227J36299j05593j70288N0001N7908M4408n5253j01210K52536
6263A168037J89657K23809K68494J08458O0493k98109k42358K167k20295j04675
6253A155678K33681M7714q2791j41458M2281k5398M3607L681r4743j29357J54470
$$ plain form
6242 1207365 1171681 1228970 1273272 1028722 1038357 1153182 1198800 1181393 1257755 1376540 1433934
6231 1433934 1479792 1326948 1348139 1362653 1385106 1403857 1559043 1448164 1382894 1391365 1422207
6220 1422207 1520739 1497999 1529627 1435695 1318045 1236256 1236928 1179628 1144432 1308658 1383901
6209 1383901 1512627 1583392 1738268 1696947 1700605 1758077 1750779 1835806 1682564 1753109 1741819
6198 1741819 1738983 1928261 1836814 1624948 1394362 1260660 1470755 1401720 1290749 1426565
6188 1426565 1531519 1703977 1524886 1513401 1488079 1528540 1629814 1660956 1464700 1642631
6178 1642631 1742314 1692550 1859103 2123792 2132306 2190432 2190069 2092117 2040920 2164621 2493566
6167 2493566 2452906 2463667 2314652 2272488 2231701 2323160 2301171 2428628 2528301 2621778 2903941
$$ packed form
6242A207365l5684N7289M4302k44550R635J14825M5618j7407P6362J18785N7394
6231A433934M5858j52844K1191J4514K2453J8751J55186j10879o5270Q471L0842
6220A422207R8532k2740L1628r3932j17650q1789O72n7300l5196J64226P5243
6209A383901J28726P0765J54876m1321L658N7472p298Q5027j53242P0545j1290
6198A741819k836J89278r1447k11866k30586j33702K10095o9035j10971J35816
6188A426565J04954J72458j79091j1485k5322M0461J01274L1142j96256J77931
6178A642631R9683m9764J66553K64689Q514N8126l63r7952n1197J23701L28945
6167B493566m0660J0761j49015m2164m0787R1459k1989J27457R9673R3477K82163
$$ plain form
6156 2903941 3121891 3512978 3982677 3881206 3915404 3861102 3560564 3397842 3119954 2920325
6146 2920325 2917305 2689636 2799854 3065950 3056190 3259076 3452609 3601741 3874616 4159861
6136 4159861 4090381 4001201 3761866 3466226 3405673 3461253 3443764 3543185 3709216 3655256 3794455
6125 3794455 3665798 3795001 3905065 3701647 3220249 3108000 3077156 2980465 2814997 2801698
6115 2801698 3002097 2956913 2846542 3140330 3343047 3568558 3668276 3747169 3888657 4026063
6105 4026063 4051555 3719934 3650928 3689666 3688216 3630643 3241535 3225554 3347077 3413113 3208251
6094 3208251 3365600 3389089 3179504 3308028 3447702 3583270 3737485 3901772 4314775 4741726
6084 4741726 5050883 5096339 4791684 4534157 4089367 3895573 3924361 3850118 3859376 3754654
$$ packed form
6156B903941K17950L91087M69699j01471L4198n4302l00538j62722k77888j99629
6146B920325l020k27669J10218K66096r760K02886J93533J49132K72875K85245
6136D159861o9480q9180k39335k95640o0553N5580j7489R9421J66031n3960J39199
6125C794455j28657J29203J10064k03418m81398j12249l0844r6691j65468j3299
6115B801698K00399m5184j10371K93788K02717K25511R9718P8893J41488J37406
6105D026063K5492l31621o9006L8738j450n7573l89108j5981J21523O6036k04862
6094C208251J57349K3489k09585J28524J39674J35568J54215J64287M13003M26951
6084D741726L09157M5456l04655k57527m44790j93794K8788p4243R258j04722
$$ plain form
6074 3754654 3915564 4185518 4008991 3969781 4133808 4252791 4131708 3990096 3965138 4105251
6064 4105251 4074538 4135461 4519335 4924991 5143162 5372617 5675659 6141774 6685968 7611620
6054 7611620 8706387 9738651 10605212 10982060 10237966 9501518 8829912 8368412 7955256
6045 7955256 7290836 6736503 6278026 5905310 5790285 5681697 5454945 5296744 5306067 5153615
6035 5153615 5143678 5370765 5223448 5450131 5620349 5818337 6246567 6545621 6617923 6871594
6025 6871594 7494493 8037648 8788462 9803962 11121463 12242711 12735852 12508590 11857331
6016 11857331 10954412 10066725 9045796 8327264 7657846 7224686 6656100 6284318 6076638
6007 6076638 6035722 5906572 5817496 5898895 5784093 5709822 5731478 5868411 5880829 5872047 5835809
$$ packed form
6074C754654J60910K69954j76527l9210J64027J18983j21083j41612k4958J40113
6064D105251l0713O0923L83874M05656K18171K29455L03042M66115N44194R25652
6054G611620J094767J032264Q66561L76848p44094p36448o71606m61500m13156
6045G955256o64420n54333m58477l72716j15025j08588k26752j58201R323j52452
6035E153615r937K27087j47317K26683J70218J97988M28230K99054P2302K53671
6025F871594O22899N43155P50814J015500J317501J121248M93141k27262o51259
6016A1857331r02919q87687j020929p18532o69418m33160n68586l71782k07680
6007F076638m0916j29150q9076Q1399j14802p4271K1656J36933J2418q782l6238
$$ plain form
5996 5835809 5915451 6027848 6141995 6142774 6323998 6542110 7074581 7569669 7842666 8395167
5986 8395167 8592489 8414525 8165167 7716218 7399121 7135454 6813537 6375028 6027950 5942617
5976 5942617 5623381 5649791 5527061 5263532 5431151 5416897 5194905 5131952 5337387 5430699
5966 5430699 5649550 5745143 5746891 5964894 6115485 6219796 6291480 6232387 6298953 6214599 6238256
5955 6238256 6521568 6604999 6688684 6730428 6790080 6714221 6814232 6921563 7079579 7227554
5945 7227554 7407693 7400919 7496130 7650894 7599937 7682409 7706541 7623671 7640478 7809980 7976991
5934 7976991 8276433 8413901 8813793 9052040 9397120 9592604 9812036 9877072 10094757 10415043
5924 10415043 10504428 10576851 10719874 10951550 11006674 11179795 11408942 11702249 12138107 12607028
$$ packed form
5996E835809P9642J12397J14147P79J81224K18112N32471M95088K72997N52501
5986H395167J97322j77964k49358m48949l17097k63667l21917m38509l47078q5333
5976E942617l19236K6410j22730k63529J67619j4254k21992o2953K05435R3312
5966E430699K18851R5593J748K18003J50591J04311P1684n9093O6566q4354K3657
5955F238256K83312Q3431Q3685M1744N9652p5859J00011J07331J58016J47975
5945G227554J80139o774R5211J54764n0957Q2472K4132q2870J6807J69502J67011
5934G976991K99442J37468L99892K38247L45080J95484K19432O5036K17685L20286
5924A0415043Q9385P2423J43023K31676N5124J73121K29147K93307M35858M68921
$$ plain form
5914 12607028 13147610 13753282 14318097 15252681 16520415 17629082 18928381 20530199 22738193
5905 22738193 25112434 28273129 31735488 34089034 33830020 31317488 28605974 26290801
5897 26290801 24303583 22937791 21911769 21216624 20824830 20667939 20629029 20468348 20321778
5888 20321778 20243136 20440315 20977393 21266611 21883826 22598258 23567388 24996777 26833885
5879 26833885 28899059 31422270 34147155 37720981 42686468 48946409 56938283 67276800
5871 67276800 77833011 84978151 83764600 74587384 64782723 56027630 49114865 43647596
5863 43647596 39516871 36294855 33850836 32206588 31012789 29993953 29444804 28934621
5855 28934621 28371603 28100719 27725138 27824975 28125195 28576267 29358051 30832921 32714261
$$ packed form
5914A2607028N40582O05672N64815R34584J267734J108667J299299J601818K207994
5905B2738193K374241L160695L462359K353546k59014k512532k711514k315173
5897B6290801j987218j365792j026022o95145l91794j56891l8910j60681j46570
5888B0321778p8642J97179N37078K89218O17215P14432R69130J429389J837108
5879B6833885K065174K523211K724885L573826M965487O259941P991874J0338517
5871F7276800J0556211P145140j213551r177216r804661q755093o912765n467269
5863D3647596m130725l222016k444019j644248j193799j018836n49149n10183
5855B8934621n63018k70884l75581R9837L00220M51072P81784J474870J881340
$$ plain form
5846 32714261 34925617 37686554 41076438 45576081 51872819 59749157 69760734 80251613
5838 80251613 87160698 85461632 75806471 65581927 56561440 49396435 43705459 39166355
5830 39166355 35986313 33347384 31536962 30247976 29293703 28650696 28263902 27730074 27242884
5821 27242884 27229936 27108318 27319431 27839497 28656517 29933683 31690244 33606259 36204619
5812 36204619 39190419 42476873 46277045 49907692 53366511 56585570 57538530 55204152
5804 55204152 50404813 45421513 41207198 37755000 34750319 32920338 31575868 30660289
5796 30660289 30192408 29852550 30306647 31314679 32636163 34128241 36252121 38774537 41037854
5787 41037854 42743167 42984377 41114976 37956878 34621864 31195240 28027648 25407173
$$ packed form
5846C2714261K211356K760937L389884M499643O296738P876338J0011577J0490879
5838H0251613O909085j699066r655161j0224544r020487p165005n690976m539104
5830C9166355l180042k638929j810422j288986r54273o43007l86794n33828m87190
5821B7242884j2948j21618K11113N20066Q17020J277166J756561J916015K598360
5812C6204619K985800L286454L800172L630647L458819L219059R52960k334378
5804E5204152m799339m983300m214315l452198l004681j829981j344470r15579
5796C0660289m67881l39858M54097J008032J321484J492078K123880K522416K263317
5787D1037854J705313K41210j869401l158098l335014l426624l167592k620475
$$ plain form
5779 25407173 22972236 20998796 19331094 18100242 16930791 15887610 15140188 14596928
5771 14596928 14052215 13346194 12774413 12504385 12077159 11693261 11319509 11079061 10861514
5762 10861514 10539844 10443863 10250611 9930471 9584435 9567183 9427368 9080730 8912391 8654466
5752 8654466 8641951 8587979 8490541 8374797 8427351 8311503 8210293 8053108 7862525 7826533
5742 7826533 7864304 7772715 7707257 7719628 7729117 7411316 7266939 7459537 7557045 7361384 7403801
5731 7403801 7160044 7114772 7307487 7530874 7407101 7246667 7376963 7164179 7298055 7397953
5721 7397953 7248030 7177737 7368940 7314590 7518707 7507813 7462664 7359897 7562675 7693482
5711 7693482 7715129 7895170 7933668 8209433 8307859 8115597 8140320 8145762 8081500 8170128 8190608
$$ packed form
5779B5407173k434937j973440j667702j230852j169451j043181p47422n43260
5771A4596928n44713p06021n71781k70028m27226l83898l73752k40448k17547
5762A0861514l21670r5981j93252l20140l46036j7252j39815l46638j68339k57925
5752H654466j2515n3972r7438j15744N2554j15848j01210j57185j90583l5992
5742G826533L7771r1589o5458J2371R489l17801j44377J92598R7508j95661M2417
5731G403801k43757m5272J92715K23387j23773j60434J30296k12784J33876R9898
5721G397953j49923p0293J91203n4350K04117j0894m5149j02767K02778J30807
5711G693482K1647J80041L8498K75765R8426j92262K4723N442o4262Q8628K0480
$$ plain form
5700 8190608 8257379 8071388 7874991 7939068 7688261 7423780 7317074 7307431 7412376 7384854
5690 7384854 7405797 7523451 7715358 7936512 8141966 8567387 8761497 9006271 9301962 9589198
5680 9589198 10042859 10249519 10141524 9931680 10014074 9793215 9528019 9470620 9268241 9098565
5670 9098565 8982899 8964893 9140843 9233435 9409731 9569903 9695504 9966096 10105270 10147739
5660 10147739 10170267 10244483 10526136 10471909 10333696 10203656 9924096 9787314 9854765 9627960
5650 9627960 9606317 9876182 9947591 10141154 10390442 10540467 10942649 11066899 10818455 10843851
5640 10843851 10838022 10821129 10869613 10837750 10481920 10070819 9735578 9145643 8706577 8386854
5630 8386854 8295094 8068046 8022073 8179985 8236897 8202686 8345461 8436658 8228324 8021777
$$ packed form
5700H190608O6771j85991j96397O4077k50807k64481j06706r643J04945k7522
5690G384854K0943J17654J91907K21154K05454M25421J94110K44774K95691K87236
5680I589198M53661K06660j07995k09844Q2394k20859k65196n7399k02379j69676
5670I098565j15666j8006J75950R2592J76296J60172J25601K70592J39174M2469
5660A0147739K2528P4216K81653n4227j38213j30040k79560j36782O7451k26805
5650I627960k1643K69865P1409J93563K49288J50025M02182J24250k48444K5396
5640A0843851n829j6893M8484l1863l55830m11101l35241n89935m39066l19723
5630H386854r1760k27048m5973J57912N6912l4211J42775R1197k08334k06547
$$ plain form
5620 8021777 7728106 7506735 7430753 6805493 6557392 6459026 6092167 5828168 5688462 5659157
5610 5659157 5709195 5579622 5626266 5733618 6137514 6578055 6670515 6341258 5942350 5665417
5600 5665417 5340110 5026958 4517365 4221283 4004285 4041769 3636087 3492206 3413879 3273407
5590 3273407 3002737 2777425 2911689 3003967 2841196 2632546 2450720 2522861 2514549 2458105
5580 2458105 2487572 2590129 2441552 2645385 2432660 2332315 2408919 2551537 2603277 2560387
5570 2560387 2731311 2403734 2377033 2410452 2199404 2024778 2056841 2118072 2094464 2157524 2238776
5559 2238776 2145985 2260948 2321912 2486093 2506761 2231746 2314405 2132259 2072793 2108868 2251413
5548 2251413 2341753 2532068 2520094 2364508 2318338 2456361 2593657 2772553 2902972 2860638
$$ packed form
5620H021777k93671k21371p5982o25260k48101r8366l66859k63999j39706k9305
5610E659157N0038j29573M6644J07352M03896M40541R2460l29257l98908k76933
5600E665417l25307l13152n09593k96082k16998L7484m05682j43881p8327j40472
5590C273407k70670k25312J34264R2278j62771k08650j81826P2141q312n6444
5580B458105K9467J02557j48577K03833k12725j00345P6604J42618N1740m2890
5570B560387J70924l27577k6701L3419k11048j74626L2063O1231k3608O3060Q1252
5559B238776r2791J14963O0964J64181K0668k75015Q2659j82146n9466L6075J42545
5548B251413R0340J90315j1974j55586m6170J38023J37296J78896J30419m2334
$$ plain form
5538 2860638 3017771 3023025 2963222 2892118 2787219 2807848 2879477 2806923 2717110 2696447 2681742
5527 2681742 2679022 2532081 2412577 2673559 2747160 2581171 2800471 2723503 2872334 3051924
5517 3051924 3205647 3095388 3235442 3239207 3177237 3126426 3126594 3186148 3074616 3126748 3305377
5506 3305377 3312114 3169797 3246649 2929381 2834105 2915130 2819462 2576674 2689981 2680634 2723483
5495 2723483 2794023 2794751 2803202 2709719 2889778 3062152 3241577 3256656 3107104 3130150 2938272
5484 2938272 2994044 2772840 2921266 3031350 3190405 3277388 3302210 3288332 3461451 3425637
5474 3425637 3483979 3577230 3721444 3934221 4003248 4076543 4242548 4529289 5017846 5779401
5464 5779401 6454947 6948830 6929400 6409592 5891232 5545980 5231287 4903618 4672373 4571771
$$ packed form
5538B860638J57133N254n9803p1104j04899K0629P1629p2554q9813k0663j4705
5527B681742k720j46941j19504K60982P3601j65989K19300p6968J48831J79590
5517C051924J53723j10259J40054L765o1970n0811J68N9554j11532N2132J78629
5506C305377O737j42317P6852l17268r5276Q1025r5668k42788J13307r347M2849
5495B723483P0540P28Q451r3483J80059J72374J79425J5079j49552K3046j91878
5484B938272N5772k21204J48426J10084J59055Q6983K4822j3878J73119l5814
5474C425637N8342R3251J44214K12777O9027P3295J66005K86741M88557P61555
5464E779401O75546M93883j9430n19808n18360l45252l14693l27669k31245j00602
$$ plain form
5454 4571771 4539258 4544577 4430242 4329027 4346710 4350595 4140729 4337661 4607888 4711085 5122078
5443 5122078 5332519 5660242 6113365 6394615 6424327 6227337 5644902 5276203 4900730 4447654
5433 4447654 4298874 4113981 3934796 4002943 4073198 3726534 3500186 3505039 3511392 3532549 3357770
5422 3357770 3343681 3219542 3474716 3515531 3350404 3366977 3470441 3511886 3335593 3509880
5412 3509880 3479501 3419958 3341726 3114681 3191137 3233465 3245137 3185115 2959924 2798197 2946303
5401 2946303 2961353 2918582 3050380 3078877 3041366 3144845 3175039 3227098 2926519 3028790 3242443
5390 3242443 3144103 3201436 3167054 3157988 2754143 2858596 2859895 2700469 2575538 2715175 2419968
5379 2419968 2503415 2480665 2425915 2463799 2479915 2410878 2442655 2141335 2112498 1990162 1911096
$$ packed form
5454D571771l2513N319j14335j01215J7683L885k09866J96932K70227J03197M10993
5443E122078K10441L27723M53123K81250K9712j96990n82435l68699l75473m53076
5433D447654j48780j84893j79185O8147P0255l46664k26348M853O353K1157j74779
5422C357770j4089j24139K55174M0815j65127J6573J03464M1445j76293J74287
5412C509880l0379n9543p8232k27045P6456M2328J1672o0022k25191j61727J48106
5401B946303J5050m2771J31798K8497l7511J03479L0194N2059l00579J02271K13653
5390C242443r8340N7333l4382r066m03845J04453J299j59426j24931J39637k95207
5379B419968Q3447k2750n4750L7884J6116o9037L1777l01320k8837j22336p9066
$$ plain form
5368 1911096 1998164 2087323 1994004 1955742 2060414 2073231 1958086 1974659 2166825 2270902 2194019
5357 2194019 2134522 2060630 2032056 2106284 2043294 2105279 1955320 1945565 2012293 2005107 2064969 1960589
5345 1960589 1876487 2017178 1906788 2040393 2010720 1916956 1911616 1877622 1779445 1759315 1721305
5334 1721305 1658399 1783693 1694441 1909637 1726324 1494735 1540339 1593207 1599227 1662198 1698184
5323 1698184 1903755 1880555 1803911 1632847 1454865 1711726 1663114 1688591 1783426 1641674
5313 1641674 1619726 1711756 1801650 1789877 1674323 1809227 1698262 1636972 1715985 1689748 1616630
5302 1616630 1527968 1439436 1275916 1220841 1281405 1391206 1517323 1446472 1589839 1627134 1803571
5291 1803571 1694536 1662647 1572485 1487575 1649365 1551805 1244494 1351380 1339897 1331606 1391188
$$ packed form
5368A911096Q7068Q9159r3319l8262J04672J2817j15145J6573J92166J04077p6883
5357B194019n9497p3892k8574P4228o2990O1985j49959r755O6728p186N9862j04380
5345A960589q4102J40691j10390J33605k9673r3764n340l3994r8177k0130l8010
5334A721305o2906J25294q9252K15196j83313k31589M5604N2868O020O2971L5986
5323A698184K05571k3200p6644j71064j77982K56861m8612K5477R4835j41752
5313A641674k1948R2030Q9894j1773j15554J34904j10965o1290P9013k6237p3118
5302A616630q8662q8532j63520n5075O0564J09801J26117p0851J43367L7295J76437
5291A803571j09035l1889r0162q4910J61790r7560l07311J06886j1483q291N9582
$$ plain form
5280 1391188 1525105 1453346 1448529 1414842 1409294 1378888 1240466 1227079 1377159 1471200 1599436
5269 1599436 1641148 1578485 1529070 1426694 1655642 1526977 1342142 1622282 1680511 1525641
5259 1525641 1494961 1282615 1446318 1494688 1458355 1423012 1408601 1390800 1389675 1291726 1308793
5248 1308793 1488585 1394718 1246418 1412125 1293636 1550733 1594118 1237651 1198595 1241173
5238 1241173 1391130 1238720 1385863 1307630 1266837 1298238 1467374 1501174 1468632 1452004 1381997
5227 1381997 1436127 1521876 1392813 1436310 1285420 1267441 1163724 1194037 1364464 1405671 1388389
5216 1388389 1525621 1353456 1283709 1474857 1322606 1146316 1245868 1387435 1344727 1366640
5206 1366640 1483571 1385542 1340289 1488113 1417550 1498655 1436628 1398954 1470390 1530088 1274441
$$ packed form
5280A391188J33917p1759m817l3687n548l0406j38422j3387J50080R4041J28236
5269A599436M1712o2663m9415j02376K28948j28665j84835K80140N8229j54870
5259A525641l0680k12346J63703M8370l6333l5343j4411j7801j125r7949J7067
5248A308793J79792r3867j48300J65707j18489K57097M3385l56467l9056M2578
5238A241173J49957j52410J47143p8233m0793L1401J69136L3800l2542j6628p0007
5227A381997N4130Q5749j29063M3497j50890j7979j03717L0313J70427M1207j7282
5216A388389J37232j72165o9747J91148j52251j76290R9552J41567m2708K1913
5206A366640J16931r8029m5253J47824p0563Q1105o2027l7674P1436N9698k55647
$$ plain form
5195 1274441 1108459 1287224 1430957 1430097 1431904 1427762 1517912 1477844 1499681 1393713 1536576
5184 1536576 1523032 1595180 1734824 1577231 1530023 1585509 1434257 1353072 1458388 1441554 1501740
5173 1501740 1389862 1198675 1367265 1514697 1530358 1603914 1726130 1457836 1268974 1509652
5163 1509652 1590638 1414170 1339282 1272101 1315591 1314240 1423635 1315870 1308324 1330819 1178184
5152 1178184 1333599 1413906 1260963 1544239 1505622 1378893 1505853 1441485 1227195 1236149
5142 1236149 1248950 1233075 1357861 1586650 1551940 1489661 1507587 1565928 1441159 1468599 1558578
5131 1558578 1386827 1589667 1675826 1643771 1502433 1535073 1723353 1584801 1528368 1357060
5121 1357060 1283468 1494127 1561227 1605311 1534496 1494831 1488436 1448768 1457377 1492428 1453363 1480338
$$ packed form
5195A274441j65982J78765J43733q60J807m142R0150m0068K1837j05968J42863
5184A536576j3544P2148J39644j57593m7208N5486j51252q1185J05316j6834O0186
5173A501740j11878j91187J68590J47432J5661P3556J22216k68294j88862K40678
5163A509652Q0986j76468p4888o7181M3490j351J09395j07765p546K2495j52635
5152A178184J55415Q0307j52943K83276l8617j26729J26960o4368k14290Q954
5142A236149J2801j5875J24786K28789l4710o2279J7926N8341j24769K7440Q9979
5131A558578j71751K02840Q6159l2055j41338L2640J88280j38552n6433j71308
5121A357060p3592K10659O7100M4084p0815l9665o395l9668Q609L5051l9065K6975
$$ plain form
5109 1480338 1341266 1600793 1518057 1467679 1531790 1546937 1542566 1548641 1533770 1722734 1662687
5098 1662687 1422157 1637291 1534979 1451259 1482105 1592761 1441711 1672020 1728179 1621538
5088 1621538 1668581 1714832 1633147 1486867 1655519 1565521 1455872 1589595 1749760 1726872
5078 1726872 1550922 1556335 1704467 1688829 1706800 1750717 1728474 1566190 1705976 1550838 1579993
5067 1579993 1535890 1517791 1441091 1513499 1631578 1666402 1628740 1616179 1639855 1589025 1771478
5056 1771478 1597727 1520882 1637430 1783231 1788812 1607813 1565178 1558359 1522388 1584096 1602587
5045 1602587 1725103 1686954 1558315 1463285 1557411 1677418 1601413 1583060 1550631 1412511 1413151
5034 1413151 1579442 1679596 1708811 1565330 1641873 1815744 1913596 1908880 1918452 1927913 1796917
$$ packed form
5109A480338j39072K59527q2736n0378O4111J5147m371O075j4871J88964o0047
5098A662687k40530K15134j02312q3720L0846J10656j51050K30309N6159j06641
5088A621538M7043M6251q1685j46280J68652q9998j09649J33723J60165k2888
5078A726872j75950N413J48132j5638J7971M3917k2243j62284J39786j55138K9155
5067A579993m4103j8099p6700P2408J18079L4824l7662j2561K3676n0830J82453
5056A771478j73751p6845J16548J45801N581j80999m2635o819l5971O1708J8491
5045A602587J22516l8149j28639r5030R4126J20007p6005j8353l2429j38120O40
5034A413151J66291J00154K9215j43481P6543J73871R7852m716R572R461j30996
$$ plain form
5023 1796917 1705531 1996905 2012115 1820299 1866404 1966304 2016785 2022489 2146298 2155949 2022140
5012 2022140 2058913 2011682 1761229 1836161 1969308 1822870 1904302 2057635 2117734 2170102 1919747
5001 1919747 1807492 1897649 1902398 1871864 1887824 1985157 2152750 2177988 2144826 2183586 2246562
4990 2246562 2204079 2424589 2380517 2107087 2171513 2259330 2339045 2333351 2414238 2262030 2317983
4979 2317983 2445271 2510566 2637977 2524884 2339298 2546887 2485629 2604332 2816634 2822838
4969 2822838 2708158 2670255 2803013 2770609 2797203 2570664 2521718 2556762 2611580 2687990 2694709
4958 2694709 2662111 2646670 2758536 2902754 2843776 3059987 3014223 3148527 3256296 3446243
4948 3446243 3440229 3578890 3578742 3657004 3515023 3440647 3423663 3202440 3236188 3413764 3356605
$$ packed form
5023A796917r1386K91374J5210j91816M6105R9900N0481N704J23809R651j33809
5012B022140L6773m7231k50453P4932J33147j46438Q1432J53333O0099N2368k50355
5001A919747j12255R0157M749l0534J5960R7333J67593K5238l3162L8760O2976
4990B246562m2483K20510m4072k73430O4426Q7817P9715n694Q0887j52208N5953
4979B317983J27288O5295J27411j13093j85586K07589o1258J18703K12302O204
4969B822838j14680l7903J32758l2404K6594k26539m8946L5044N4818P6410O719
4958B694709l2598j5441J11866J44218n8978K16211m5764J34304J07769J89947
4948C446243o014J38661j48P8262j41981p4376j6984k21223L3748J77576n7159
$$ plain form
4937 3356605 3067555 3299959 3446793 3488383 3507734 3332711 3287107 3236955 3301332 3364699 3419828
4926 3419828 3254687 3202053 3165345 3191258 3325738 3362827 3477753 3430674 3417799 3366278 3379961
4915 3379961 3381263 3485924 3588848 3579775 3423974 3229256 3222294 3491491 3538548 3465305 3525657
4904 3525657 3690711 3675476 3525134 3548323 3362468 3427324 3621020 3483863 3482833 3386169 3354315
4893 3354315 3192671 3480361 3614235 3602003 3605542 3564152 3668142 3701632 3631721 3574355 3638554
4882 3638554 3699247 3665342 3595204 3676389 3950604 3818272 3878243 4036635 3907702 3886219 4198670
4871 4198670 4128228 4353011 4414983 4348652 4482830 4433308 4389883 4371718 4522232 4680765 4752962
4860 4752962 4870869 5021796 5013840 5149679 5404728 5450702 5547977 5908653 6343556 6840141
$$ packed form
4937C356605k89050K32404J46834M1590J9351j75023m5604n0152O4377O3367N5129
4926C419828j65141n2634l6708K5913J34480L7089J14926m7079j2875n1521J3683
4915C379961J302J04661J02924r073j55801j94718o962K69197M7057p3243O0352
4904C525657J65054j5235j50342K3189j85855O4856J93696j37157j030r6664l1854
4893C354315j61644K87690J33874j2232L539m1390J03990L3490o9911n7366O4199
4882C638554O0693l3905p0138Q1185K74215j32332N9971J58392j28933k1483L12451
4871D198670p0442K24783O1972o6331J34178m9522m3425j8165J50514J58533P2197
4860D752962J17907J50927p956J35839K55049M5974R7275L60676M34903M96585
$$ plain form
4850 6840141 7203253 7785941 8281693 8527367 8591338 8736154 8482246 8225065 7676287 7132781
4840 7132781 6728702 6396386 6054407 5742327 5491236 5268978 5294246 5250857 5179415 5146765
4830 5146765 5061825 5027953 4770755 4713980 4810442 4787634 4847301 4666017 4741391 4682158 4775451
4819 4775451 4757630 4696092 4751971 4715656 4700414 4621711 4752037 4742230 4808152 4721856 4770985
4808 4770985 4831891 4806490 4943174 4997240 4827119 4782010 4564641 4546582 4748781 4842786 4838913
4797 4838913 4618177 4541282 4593895 4736641 4754718 4691299 4899119 4947006 4873063 4750313 4619100
4786 4619100 4679764 4849035 4903711 4858100 5010943 5221734 5315394 5221905 5239195 5446390 5429572
4775 5429572 5345222 5560919 5523902 5580116 5537905 5600232 5696206 5641280 5550743 5712139 5548586
$$ packed form
4850F840141L63112N82688M95752K45674O3971J44816k53908k57181n48778n43506
4840G132781m04079l32316l41979l12080k51091k22258K5268m3389p1442l2650
4830E146765q4940l3872k57198n6775R6462k2808N9667j81284P5374n9233R3293
4819D775451j7821o1538N5879l6315j5242p8703J30326r807O5922q6296M9129
4808D770985O0906k5401J36684N4066j70121m5109k17369j8059K02199R4005l873
4797D838913k20736p6895N2613J42746J8077o3419K07820M7887p3943j22750j31213
4786D619100O0664J69271N4676m5611J52843K10791R3660r3489J7290K07195j6818
4775E429572q4350K15697l7017N6214m2211O2327R5974n4926r0537J61396j63553
$$ plain form
4764 5548586 5669042 5756055 5784432 5813433 5670989 5677900 5768448 5887767 5675994 5816903 5955897
4753 5955897 6007907 6102324 6139021 6303187 6266037 6432521 6407342 6483976 6542767 6539627 6625069
4742 6625069 6555232 6653377 6688382 6706112 6897610 6999351 7063377 7112915 7016524 7201588 7397376
4731 7397376 7611612 7679611 8084789 8237176 8285428 8517905 8864066 9247137 9683027 10212941
4721 10212941 10775315 11172569 11557251 11577487 11339422 10851602 10744174 10544099 10236704 10066444
4711 10066444 10096321 10225718 10153829 10307299 10547911 10857694 11210960 11386071 11893838 12366130
4701 12366130 12792828 12969754 12530096 12211645 11947975 11552269 11030538 10953580 10775736 10636179
4691 10636179 10576813 10658471 10523850 10436142 10504037 10498097 10405518 10459325 10537511 10573336 10609811
$$ packed form
4764E548586J20456Q7013K8377K9001j42444O911R0548J19319k11773J40909J38994
4753E955897N2010R4417L6697J64166l7150J66484k5179P6634N8791l140Q5442
4742F625069o9837R8145L5005J7730J91498J01741O4026M9538r6391J85064J95788
4731G397376K14236O7999M05178J52387M8252K32477L46161L83071M35890N29914
4721A0212941N62374L97254L84682K0236k38065m87820j07428k00075l07395j70260
4711A0066444K9877J29397p1889J53470K40612L09783L53266J75111N07767M72292
4701A2366130M26698J76926m39658l18451k63670l95706n21731p6958j77844j39557
4691A0636179n9366Q1658j34621q7708O7895n940r2579N3807P8186L5825L6475
$$ plain form
4680 10609811 10620123 10938413 11030687 11248683 11545869 11745758 12076578 12415384 12908951 13381409
4670 13381409 14163205 14785993 15368719 16244986 17164014 17822373 18174752 18064021 17729041
4661 17729041 16931754 16330381 15651774 15341818 15262850 15115117 15090845 14809457 14981407 15304684
4651 15304684 15596269 16169478 16611010 17270778 18095421 18329073 18358414 17954145 17351383 16656029
4641 16656029 16026229 15341257 14668021 14173358 13716442 13289748 12987987 12794524 12708845 12579653
4631 12579653 12589605 12651509 12772435 12762483 12787011 12889260 12728834 12932218 12862203 12910911 12962538
4620 12962538 13048283 13142882 13169831 13211797 13406328 13679795 13478441 13499389 13568825 13571227 13292897
4609 13292897 13312596 13451558 13847974 13917772 14082672 14039622 13950557 14042989 13986347 13990294 14152972
$$ packed form
4680A0609811J0312L18290R2274K17996K97186J99889L30820L38806M93567M72458
4670A3381409P81796O22788N82726Q76267R19028O58359L52379j10731l34980
4661A7729041p97287o01373o78607l09956p8968j47733k4272k81388J71950L23277
4651A5304684K91585N73209M41532O59768Q24643K33652K9341m04269o02762o95354
4641A6656029o29800o84972o73236m94663m56916m26694l01761j93463q5679j29192
4631A2579653R952O1904J20926r952K4528J02249j60426K03384p0015M8708N1627
4620A2962538Q5745R4599K6949M1966J94531K73467k01354K0948O9436K402k78330
4609A3292897J9699J38962L96416O9798J64900m3050q9065R2432n6642L947J62678
$$ plain form
4598 14152972 14126852 14039901 14066725 14124450 13986446 14011787 14122609 14097925 14288415 14339675 14373419
4587 14373419 14482737 14549486 14511279 14453229 14336657 14487670 14969898 15195445 14917826 15034384
4577 15034384 14962227 15057634 15169578 15267135 15295531 15391248 15748629 15963537 16245124 16431545
4567 16431545 16674617 17026556 17353952 17746756 18227123 18803533 19594061 20316294 21308287
4558 21308287 22310399 23122279 23532071 23491320 23132436 22344092 21521465 20569473 19932633
4549 19932633 19415661 18942376 18572127 18371494 18266354 18282541 17993138 18057158 17937289 17999116
4539 17999116 18026317 17844047 17824895 17935447 18290551 18282768 18441050 18594219 18747246 19023840
4529 19023840 19535777 19926425 20236203 20662560 21438402 22153594 22908833 23714730 24168298
$$ packed form
4598A4152972k6120q6951K6824N7725j38004K5341J10822k4684J90490N1260L3744
4587A4373419J09318O6749l8207n8050j16572J51013M82228K25547k77619J16558
4577A5034384p2157R5407J11944R7557K8396R5717L57381K14908K81587J86421
4567A6431545K43072L51939L27396L92804M80367N76410P90528P22233R91993
4558B1308287J002112Q11880M09792m0751l58884p88344q22627r51992o36840
4549A9932633n16972m73285l70249k00633j05140J6187k89403O4020j19869O1827
4539A7999116K7201j82270j9152J10552L55104p783J58282J53169J53027K76594
4529A9023840N11937L90648L09778M26357P75842P15192P55239Q05897M53568
$$ plain form
4520 24168298 23936766 23543339 22985854 22244032 21602273 21099653 20374583 19927352 19647170
4511 19647170 19542815 19460957 19350505 19461168 19514014 19591907 19755201 20126653 20505561 20859470
4501 20859470 21115663 21158516 21032831 20829630 20320889 19902320 19439162 19102466 18763387 18649125
4491 18649125 18564021 18394886 18560814 18412008 18214424 18407462 18454747 18528234 18645921 18929825
4481 18929825 19013684 18992255 18939675 18901696 19012668 18925639 18854011 18846224 18885514 18937991 18858701
4470 18858701 19337728 19803682 20339748 20557491 20671099 20760515 20586320 20380608 20157962 19852622
4460 19852622 19509423 19565063 19562995 19615394 19627879 19392715 19063534 18610851 18164070 17763676
4450 17763676 17396791 17391096 17298034 17016571 16925957 16734274 16484552 16540414 16317253 16313067 16315077
$$ packed form
4520B4168298k31532l93427n57485p41822o41759n02620p25070m47231k80182
4511A9647170j04355q1858j10452J10663N2846P7893J63294L71452L78908L53909
4501B0859470K56193M2853j25685k03201n08741m18569m63158l36696l39079j14262
4491A8649125q5104j69135J65928j48806j97584J93038M7285P3487J17687K83904
4481A8929825Q3859k1429n2580l7979J10972q7029p1628p787L9290N2477p9290
4470A8858701M79027M65954N36066K17743J13608Q9416j74195k05712k22646l05340
4460A9852622l43199N5640k068N2399J2485k35164l29181m52683m46781m00394
4450A7763676l66885n695r3062k81463r0614j91683k49722N5862k23161m186K010
$$ plain form
4439 16315077 16410782 16451363 16426734 16536487 16648023 16514760 16502327 16425786 16405487 16488395 16610149
4428 16610149 16597118 16515871 16604776 16614841 16585138 16476116 16509735 16449923 16561580 16796630 16887241
4417 16887241 17118195 17375789 17788981 17848376 18140698 18289712 18363369 18647975 19084425 19263153
4407 19263153 19182254 19485360 19821778 20334873 21094412 21595712 22214549 23180452 24354009
4398 24354009 25631792 27203615 29844807 33091532 37072494 41278017 44573261 44258699
4390 44258699 41112849 37635649 34934737 33036488 31760998 31121895 31110753 32478557 34546222
4381 34546222 37873183 41592021 44020190 43626763 40004698 35660944 31840048 28703125
4373 28703125 26280366 24278554 22374742 21291512 20318262 19667023 19085656 18340625 17913948
$$ packed form
4439A6315077R5705M0581k4629J09753J11536j33263j2433p6541k0299Q2908J21754
4428A6610149j3031q1247Q8905J0065k9703j09022L3619n9812J11657K35050R0611
4417A6887241K30954K57594M13192N9395K92322J49014P3657K84606M36450J78728
4407A9263153q0899L03106L36418N13095P59539N01300O18837R65903J173557
4398B4354009J277783J571823K641192L246725L980962M205523L295244l14562
4390D4258699l145850l477200k700912j898249j275490o39103j1142J367804K067665
4381C4546222L326961L718838K428169l93427l622065m343754l820896l136923
4373B8703125k422759k001812j903812j083230r73250o51239n81367p45031m26677
$$ plain form
4364 17913948 17552215 17242696 16914658 16718550 16207305 16020281 15907361 15643653 15536415
4355 15536415 15336536 15154261 15112188 15050705 14893421 14856715 14777885 14758996 14793892 14597700
4345 14597700 14495807 14715313 14815549 14668599 14536691 14695696 14564936 14282886 14187307 14193224
4335 14193224 14197510 14225791 13963276 13816232 13853625 14004458 14087096 14009917 14021999 14131564 13970614
4324 13970614 13999878 14191344 14424428 14656017 14814740 15010435 15155278 15441683 15768678 16092176
4314 16092176 16338034 16492392 16184258 15693949 15397638 15251816 15057000 15016081 14811690 14781594
4304 14781594 14990163 15096217 15307414 15507381 15565773 15679096 15892723 16168873 16143185 16013110
4294 16013110 15944252 15836525 15557992 15375573 15436081 15528009 15536258 15433759 15721754 15946293
$$ packed form
4364A7913948l61733l09519l28038j96108n11245j87024j12920k63708j07238
4355A5536415j99879j82275m2073o1483j57284l6706p8830j8889L4896j96192
4345A4597700j01893K19506J00236j46950j31908J59005j30760k82050r5579N917
4335A4193224M286K8281k62515j47044L7393J50833Q2638p7179J2082J09565j60950
4324A3970614K9264J91466K33084K31589J58723J95695J44843K86405L26995L23498
4314A6092176K45858J54358l08134m90309k96311j45822j94816m0919k04391l0096
4304A4781594K08569J06054K11197J99967N8392J13323K13627K76150k5688j30075
4294A6013110o8858j07727k78533j82419O0508R1928Q249j02499K87995K24539
$$ plain form
4284 15946293 16330416 16369109 16451922 16568093 16607970 16761113 16542003 16708938 16795984 16830955
4274 16830955 16777772 16923502 16956336 17100100 17012095 17005225 16903630 17093174 17221616 17263375
4264 17263375 17306864 17478822 17996633 18185360 18530795 18799416 18916513 19044651 18923629 19239629
4254 19239629 19428120 19478246 19608435 19899143 20275741 20713265 21024097 21440120 21870773 22220852
4244 22220852 22567123 23042266 23502230 23733116 23781618 23563669 23771724 23761532 23780961 23921753
4234 23921753 24133109 24129216 24019994 24169232 24186665 24263140 24449053 24684840 24891535 24888974
4224 24888974 25253410 25542178 25852326 26434696 26948812 27433396 27981340 28373124 28795990
4215 28795990 29185461 29428983 29930102 30563582 31240263 31881846 32433440 33100101 33963119
$$ packed form
4284A5946293L84123L8693Q2813J16171L9877J53143k19110J66935Q7046L4971
4274A6830955n3183J45730L2834J43764q8005o870j01595J89544J28442M1759
4264A7263375M3489J71958N17811J88727L45435K68621J17097J28138j21022L16000
4254A9239629J88491N0126J30189K90708L76598M37524L10832M16023M30653L50079
4244B2220852L46271M75143M59964K30886M8502k17949K08055j0192J9429J40792
4234B3921753K11356l893j09222J49238J7433P6475J85913K35787K06695k561
4224B4888974L64436K88768L10148N82370N14116M84584N47944L91784M22866
4215B8795990L89471K43522N01119O33480O76681O41583N51594O66661Q63018
$$ plain form
4206 33963119 34888985 35889789 37124661 38252630 39650711 41379033 43292591 44889793
4198 44889793 46724760 48986867 51320950 53572003 55495147 56986617 58628610 60165437
4190 60165437 61710383 63455883 65415454 67726759 70953659 74365307 78345551 83012729
4182 83012729 88203118 93819311 100849825 109186309 119538252 131351013 145487954 162825549
4174 162825549 185962166 216096757 257565780 307909692 362761189 401813402 411658916
4167 411658916 390249756 345996412 299379968 255517412 219695528 190514241 167806752
4160 167806752 149573452 135036570 122950212 113531816 105470112 98779647 93281717 88955364
4152 88955364 85076270 82241044 80076151 78783936 77984581 78361033 79185123 80968131 84146793
$$ packed form
4206C3963119R25866J000804J234872J127969J398081J728322J913558J597202
4198D4889793J834967K262107K334083K251053J923144J491470J641993J536827
4190F0165437J544946J745500J959571K311305L226900L411648L980244M667178
4182H3012729N190389N616193P030514Q336484J0351943J1812761J4136941J7337595
4174A62825549K3136617L0134591M1469023N0343912N4851497L9052213R845514
4167D11658916k1409160m4253344m6616444m3862556l5821884k9181287k2707489
4160A67806752j8233300j4536882j2086358r418396q061704o690465n497930m326353
4152H8955364l879094k835226k164893j292215p99355L76452Q24090J783008L178662
$$ plain form
4143 84146793 89144437 95302001 100883055 101728028 96152956 89134307 83141003 78254840
4135 78254840 73952834 70164956 66976213 64416139 62400863 60329720 58507787 56781723
4127 56781723 55538684 54643224 53843547 53184815 52402354 51829442 51619551 51521396 51273873
4118 51273873 51162576 51106560 51016218 51014698 51021066 50769848 50326345 49494547 48611609 47373213
4108 47373213 46098028 45000525 44020213 42991806 42153024 41428146 40603237 39811459 39161478
4099 39161478 38364187 37368233 36719047 36120388 35429396 35157820 34869814 34394311 33996452
4090 33996452 33713756 33105373 32582311 32076022 31539383 31199029 30849814 30485911 29862475
4081 29862475 29299749 29251439 28890131 28699155 28474759 28628300 28672119 28701534 28823966 28896779
$$ packed form
4143H4146793M997644O157564N581054Q44973n575072p018649n993304m886163
4135G8254840m302006l787878l188743k560074k015276k071143j821933j726064
4127E6781723j243039q95460p99677o58732p82461n72912k09891r8155k47523
4118E1273873j11297n6016r0342j520O368k51218m43503q31798q82938j238396
4108D7373213j275185j097503r80312j028407q38782p24878q24909p91778o49981
4099C9161478p97291r95954o49186n98659o90992k71576k88006m75503l97859
4090C3996452k82696o08383n23062n06289n36639l40354l49215l63903o23436
4081B9862475n62726m8310l61308j90976k24396J53541M3819K9415J22432P2813
$$ plain form
4071 28896779 29049601 29137644 29257475 29573693 29935018 30508617 31204654 32370181 33499763
4062 33499763 35165566 37057057 38155956 37198358 35663715 34256059 32616260 31978622
4054 31978622 31503566 31248888 30970009 30802148 30787332 30512080 30638544 30907098 30961423 31180024
4044 31180024 31657291 32493961 33545098 34437692 35082611 35243368 34830283 34725607 34929510
4035 34929510 35357046 35836222 35677909 34861788 33881297 33171426 32346196 31676376 31378825
4026 31378825 31204445 31039809 30842934 30516631 30452989 30610096 30477343 30660515 30648788 30770503
4016 30770503 31031714 30966450 31268439 31444035 31478963 31826539 32217907 32812558 33238568 34049158
4006 34049158 34739242 35226117 35973564 36462738 36925281 37555900 37842587 37964007 38369755
$$ packed form
4071B8896779J52822Q8043J19831L16218L61325N73599O96037J165527J129582
4062C3499763J665803J891491J098899r57598j534643j407656j639799o37638
4054C1978622m75056k54678k78879j67861j4816k75252J26464K68554N4325K18601
4044C1180024M77267Q36670J051137Q92594O44919J60757m13085j04676K03903
4035C4929510M27536M79176j58313q16121r80491p09871q25230o69820k97551
4026C1378825j74380j64636j96875l26303o3642J57107j32753J83172j1727J21715
4016C0770503K61211o5264L01989J75596L4928L47576L91368N94651M26010Q10590
4006C4049158O90084M86875P47447M89174M62543O30619K86687J21420M05748
$$ plain form
3997 38369755 38924896 39554993 40276697 41112281 41850417 42647483 43506944 44294349 45043816
3988 45043816 45871188 46911648 47783782 48395801 49269811 50263154 51004304 51764598 51892438
3979 51892438 52442120 53358259 54125414 54888279 55592152 56163490 56766376 57548600 58174992
3970 58174992 58534898 58661348 58633005 58394135 58415524 58217762 57969196 57612713 57479724 57356895
3960 57356895 56956192 56531682 55982177 55377224 54931508 54296664 53490043 52268045 51087330
3951 51087330 50150571 49164469 48288716 47504185 46696554 45792817 45023789 44141620 43317977
3942 43317977 42532252 41682745 40704931 39770809 38918846 38036882 37113536 36283457 35295894
3933 35295894 34348219 33510179 32755712 31957660 31231871 30661684 29976680 29350644 28858246
$$ packed form
3997C8369755N55141O30097P21704Q35584P38136P97066Q59461P87405P49467
3988D5043816Q27372J040460Q72134O12019Q74010R93343P41150P60294J27840
3979E1892438N49682R16139P67155P62865P03873N71338O02886P82224O26392
3970E8174992L59906J26450k8343k38870K1389j97762k48566l56483j32989j22829
3960E7356895m00703m24510n49505o04953m45716o34844q06621j221998j180715
3951E1087330r36759r86102q75753p84531q07631r03737p69028q82169q23643
3942D3317977p85725q49507r77814r34122q51963q81964r23346q30079r87563
3933C5295894r47675q38040p54467p98052p25789n70187o85004o26036m92398
$$ plain form
3924 28858246 28336443 27686269 27051137 26388423 25794121 25086971 24509589 24245101 24059021
3915 24059021 23514036 22776258 22551761 22219940 21940303 21652277 21563174 21514954 21425620 21260705
3905 21260705 21372311 21323878 21260054 21327929 21528956 21688333 21767230 21726850 21887024 22054870
3895 22054870 22442527 22512555 22418500 22558967 22619373 22807692 22610247 22453106 22601310 22726337
3885 22726337 22664942 22429470 22753579 23311394 23490771 23674673 24086362 24312164 24287350 24237904
3875 24237904 24278874 24289842 24485985 25229785 25742202 25808537 25642903 25363424 25182992 25278499
3865 25278499 25387313 25824241 26141578 26704465 27204815 27626021 28260011 28930741 29125594
3856 29125594 29545162 30211806 30644506 31329738 32103844 32859363 34012037 35397010 36886011
$$ packed form
3924B8858246n21803o50174o35132o62714n94302p07150n77382k64488j86080
3915B4059021n44985p37778k24497l31821k79637k88026q9103m8220q9334j64915
3905B1260705J11606m8433o3824O7875K01027J59377P8897m0380J60174J67846
3895B2054870L87657P0028r4055J40467O0406J88319j97445j57141J48204J25027
3885B2726337o1395k35472L24109N57815J79377J83902M11689K25802k4814m9446
3875B4237904M0970J0968J96143P43800N12417O6335j65634k79479j80432R5507
3865B5278499J08814M36928L17337N62887N00350M21206O33990O70730J94853
3856B9125594M19568O66644M32700O85232P74106P55519J152674J384973J489001
$$ plain form
3847 36886011 38543989 40534914 42827109 45221681 47650205 50142055 52528731 54438047
3839 54438047 55902994 57092696 57692439 57523123 56745867 56270311 55423583 54821788 54283857
3830 54283857 53932934 53874180 53828726 53663310 53371814 52801840 51947559 50507085 48546663
3821 48546663 46265736 43810310 40827829 38092728 35559103 33021066 30901591 29034788
3813 29034788 27728559 26522304 25245945 24370518 23377603 22526535 21946808 21335757 20669276
3804 20669276 20201934 19628068 19376041 19141918 18664169 18606833 18063837 17862849 17790699 17833885
3794 17833885 17574782 17477383 17344934 17431483 17507949 17461211 17511297 17390831 17369630 17491705
3784 17491705 17156488 16835401 16716010 16713971 16506059 16336324 16272290 16292733 16304123 16195665
$$ packed form
3847C6886011J657978J990925K292195K394572K428524K491850K386676J909316
3839E4438047J464947J189702N99743j69316p77256m75556q46728o01795n37931
3830E4283857l50923n8754m5454j65416k91496n69974q54281j440474j960422
3821D8546663k280927k455426k982481k735101k533625k538037k119475j866803
3813B9034788j306229j206255j276359q75427r92915q51068n79727o11051o66481
3804B0669276m67342n73866k52027k34123m77749n7336n42996k00988p2150M3186
3794A7833885k59103r7399j32449Q6549P6466m6738N0086j20466k1201J22075
3784A7491705l35217l21087j19391k039k07912j69735o4034K0443J1390j08458
$$ plain form
3774 16195665 16127007 16411765 16537142 16473951 16635954 16804338 16756210 16890883 16971648 17087657
3764 17087657 17377414 17706450 17745870 17815762 17984044 18210732 18537548 18827520 19256336 19450121
3754 19450121 19534889 19719191 20003302 20304931 20602098 20675285 20789514 21090690 21388825 21678651
3744 21678651 21690678 21817646 22168453 22331665 22418582 22630228 22924878 23039872 23116702 23142018
3734 23142018 23160835 23325317 23318469 23187209 23429404 23582112 23650222 23840501 24009684 24086363
3724 24086363 24136871 24244361 24255606 24365675 24518396 24603659 24818626 25163469 25452851 26090539
3714 26090539 26536905 27217465 27916695 28553985 29180474 30032237 31173352 31912802 32722717
3705 32722717 33412959 33950172 34491605 35154337 35806057 36702103 37472884 38322012 39173722
$$ packed form
3774A6195665o8658K84758J25377o3191J62003J68384m8128J34673Q0765J16009
3764A7087657K89757L29036L9420O9892J68282K26688L26816K89972M28816J93785
3754A9450121Q4768J84302K84111L01629K97167P3187J14229L01176K98135K89826
3744B1678651J2027J26968L50807J63212Q6917K11646K94650J14994P6830K5316
3734B3142018J8817J64482o848j31260K42195J52708O8110J90279J69183P6679
3724B4086363N0508J07490J1245J10069J52721Q5263K14967L44843K89382O37688
3714B6090539M46366O80560O99230O37290O26489Q51763J141115P39450Q09915
3705C2722717O90242N37213N41433O62732O51720Q96046P70781Q49128Q51710
$$ plain form
3696 39173722 40086473 40994503 42164510 42892711 43475162 44345880 45126201 46058132 47055865
3687 47055865 47933165 48781524 49538674 50303249 51021903 51601459 52184468 52653755 53082623
3678 53082623 53884720 54713753 55527180 56527318 57404177 58358079 59293756 60277734 61037515
3669 61037515 62253233 63324567 64167901 64805820 65939679 67200628 68320122 69655634
3661 69655634 70773884 71925111 72703740 73338824 74081606 74646240 74949464 75008980 74743066
3652 74743066 74962250 74969806 74920789 74770990 74789765 74858694 74790444 74230476 73750061 73400083
3642 73400083 72608985 71811489 71014995 70107773 69138688 67892752 66537308 65337682 64065881
3633 64065881 63030201 62053902 61201336 60116640 59178564 58656186 58266978 58081868 57815362
$$ packed form
3696C9173722R12751R08030J170007P28201N82451Q70718P80321R31931R97733
3687D7055865Q77300Q48359P57150P64575P18654N79556N83009M69287M28868
3678E3082623Q02097Q29033Q13427J000138Q76859R53902R35677R83978P59781
3669F1037515J215718J071334Q43334O37919J133859J260949J119494J335512
3661F9655634J118250J151227P78629O35084P42782N64634L03224N9516k65914
3652G4743066K19184P556m9017j49799J8775O8929o8250n59968m80415l49978
3642G3400083p91098p97496p96494r07222r69085j245936j355444j199626j271801
3633F4065881j035680r76299q52566j084696r38076n22378l89208j85110k66506
$$ plain form
3624 57815362 57533052 57616609 57939196 58033360 58358347 58807710 59638021 60700139 61693905 62650968
3614 62650968 63795572 65087179 66281468 67651732 69047236 70283367 71669443 72903395
3606 72903395 73817165 75189597 76521665 77568288 78918520 80208629 81422255 82761553
3598 82761553 83910564 84870366 85679274 86579157 87098112 87521168 88057730 88050346 87786490 87793763
3588 87793763 87665139 87440161 87235004 87097883 86860118 86898544 86887951 86860384 86646678 86495941
3578 86495941 86262941 86023417 85993891 85949469 85878370 85906678 86388765 86744163 86923145 87310710
3568 87310710 87795553 88492179 89287274 90055742 90791452 91402320 92150238 93280061 94326463
3559 94326463 95474963 96771405 98155918 99686577 101589709 103235023 105199761 107333607
$$ packed form
3624E7815362k82310Q3557L22587R4164L24987M49363Q30311J062118R93766R57063
3614F2650968J144604J291607J194289J370264J395504J236131J386076J233952
3606G2903395R13770J372432J332068J046623J350232J290109J213626J339298
3598H2761553J149011R59802Q08908Q99883N18955M23056N36562p384k63856P273
3588H7793763j28624k24978k05157j37121k37765L8426j0593k7567k13706j50737
3578H6495941k33000k39524k9526m4422p1099K8308M82087L55398J78982L87565
3568H7310710M84843O96626P95095P68468P35710O10868P47918J129823J046402
3559I4326463J148500J296442J384513J530659J903132J645314J964738K133846
$$ plain form
3551 107333607 109390321 111834347 114364040 117169524 120286465 123589717 127144265 130748400
3543 130748400 133984894 137183692 139881648 142143583 143971505 145150414 145728210 145598060
3535 145598060 145030529 144174950 142961958 141450920 139884031 137810255 135673657 133636570
3527 133636570 131207225 128646213 125449699 121589775 117449591 112531701 107507107 102754565
3519 102754565 97560879 92442482 87555305 83301449 79358411 75538872 72206967 69342923
3511 69342923 66617055 64324950 62332327 60514597 58932067 57445559 55896697 54941518
3503 54941518 54005113 53285683 52665525 51960978 51042256 50469040 49870165 49254634 48852379
3494 48852379 48301665 47798292 47063361 46511517 46068540 45647688 45167160 44709471 44275068
$$ packed form
3551A07333607K056714K444026K529693K805484L116941L303252L554548L604135
3543A30748400L236494L198798K697956K261935J827922J178909N77796j30150
3535A45598060n67531q55579j212992j511038j566889k073776k136598k037087
3527A33636570k429345k561012l196514l859924m140184m917890n024594m752542
3519A02754565n193686n118397m887177m253856l943038l819539l331905k864044
3511F9342923k725868k292105j992623j817730j582530j486508j548862r55179
3503E4941518r36405p19430o20158p04547r18722n73216n98875o15531m02255
3494D8852379n50714n03373p34931n51844m42977m20852m80528m57689m34403
$$ plain form
3485 44275068 43747880 43244040 42969847 42577168 42350357 42420804 42182966 42122919 42083825 42198627
3475 42198627 41763756 41016845 40263997 39586450 38912265 38591111 38473920 38204176 37869745
3466 37869745 37874055 37618139 37335930 37174420 36920343 37014349 37193991 37189786 37303697 37554375
3456 37554375 37805219 38100014 38403005 39234228 40272649 41535359 42907312 44833594 47017934
3447 47017934 49602864 52561779 56419376 61623650 68679690 77937409 89198948 100257656
3439 100257656 106535672 102796866 92952525 82940973 74493890 68077036 63067397 59216797
3431 59216797 56251348 54214476 52779016 51775423 51006348 50464090 50327815 50420331 50582774
3422 50582774 51062996 52125589 53802964 55759822 58500414 61957625 65649438 70107685
$$ packed form
3485D4275068n27188n03840k74193l92679k26811P0447k37838o0047l9094J14802
3475D2198627m34871p46911p52848o77547o74185l21154j17191k69744l34431
3466C7869745M310k55916k82209j61510k54077R4006J79642m205J13911K50678
3456C7554375K50844K94795L02991Q31223J038421J262710J371953J926282K184340
3447D7017934K584930K958915L857597N204274P056040R257719J1261539J1058708
3439A00257656O278016l738806r844341j0011552q447083o416854n009639l850600
3431E9216797k965449k036872j435460j003593p69075n42258j36275R2516J62443
3422E0582774M80222J062593J677375J956858K740592L457211L691813M458247
$$ plain form
3414 70107685 75633553 82706932 92634150 106260522 124050453 146401322 168744171 180887343
3406 180887343 170939035 150225713 130476202 113176072 100073964 89403513 81182918
3399 81182918 75145022 70729056 67403655 64940672 63017897 61820706 61059272 60075370
3391 60075370 58349015 56555560 54846031 53910610 53573858 53789078 54314158 55032605 56082774
3382 56082774 57858664 60651125 64601171 70366198 78425962 88272029 97778886 102766523
3374 102766523 98146805 88033597 78090917 69172670 62508883 57204482 53135656 50123055
3366 50123055 48184259 46875936 46467352 46588674 47242764 48106925 48429763 46803017 43937330
3357 43937330 41419770 39340345 37550115 36139000 34831145 33776985 32913049 32346267
$$ packed form
3414G0107685N525868P073379R927218J3626372J7789931K2350869K2342849J2143172
3406A80887343r948308k0713322j9749511j7300130j3102108j0670451q220595
3399H1182918o037896m415966l325401k462983j922775j197191p61434r83902
3391F0075370j726355j793455j709529r35421l36752K15220N25080P18447J050169
3382E6082774J775890K792461L950046N765027Q059764R846067R506857M987637
3374A02766523m619718j0113208r942680q918247o663787n304401m068826l012601
3366E0123055j938796j308323m08584J21322O54090Q64161L22838j626746k865687
3357D3937330k517560k079425j790230j411115j307855j054160q63936n66782
$$ plain form
3349 32346267 31636029 31231055 30790630 30181597 29867910 29807217 29790330 29448492 29242407 29360891
3339 29360891 29260460 29276727 29388299 29607173 29842247 30036327 30475848 30963763 31857525 32854014
3329 32854014 33952161 34785001 34824472 34449609 34001606 34049151 33838029 33683675 33452511 33095968
3319 33095968 32321817 31644713 30886724 30233490 30116168 29833883 29391229 29309097 29533476 29286334
3309 29286334 29283920 29140823 28955957 29207313 29474886 29417074 29547759 29622600 29670122 29759545
3299 29759545 30014628 30356477 30568343 30643485 30988744 31377320 31585538 31834036 32200816 32712512
3289 32712512 33062676 33198543 33637772 34296893 34794928 35182988 35478948 35962246 36479719
3280 36479719 37033628 37717958 38630497 39692367 40880559 42334513 43639597 44704911 45030659
$$ packed form
3349C2346267p10238m04974m40425o09033l13687o0693j6887l41838k06085J18484
3339B9360891j00431J6267J11572K18874K35074J94080M39521M87915Q93762R96489
3329C2854014J098147Q32840L9471l74863m48003M7545k11122j54354k31164l56543
3319C3095968p74151o77104p57989o53234j17322k82285m42654q2132K24379k47142
3309B9286334k414j43097j84866K51356K67573n7812J30685P4841M7522Q9423
3299B9759545K55083L41849K11866P5142L45259L88576K08218K48498L66780N11696
3289C2712512L50164J35867M39229O59121M98035L88060K95960M83298N17473
3280C6479719N53909O84330R12539J061870J188192J453954J305084J065314L25748
$$ plain form
3271 45030659 45116340 45102670 45423526 45531289 45806045 46124257 46458471 47106849 47676405 48550995
3261 48550995 49541983 50645191 51801300 53112452 54751383 56618884 58585795 60866293
3253 60866293 62947716 65382594 67826355 70052788 71902166 72771659 72496733 70649909
3245 70649909 67786621 64486469 60900363 57299361 54362605 51451059 48945586 46699188
3237 46699188 44542929 42686885 41307822 40153832 38666319 37460843 36371380 35228427
3229 35228427 34278213 33535857 32840514 32054116 31690370 31090466 30591881 30075937 29727736
3220 29727736 29315716 29106924 29405650 29783036 30039789 30085989 29463166 28264886 27170231
3211 27170231 26251069 25454507 24740212 24153638 23742281 23355103 22991688 22531497 22214725
$$ packed form
3271D5030659Q5681j3670L20856J07763K74756L18212L34214O48378N69556Q74590
3261D8550995R90988J103208J156109J311152J638931J867501J966911K280498
3253F0866293K081423K434878K443761K226433J849378Q69493k74926j846824
3245G0649909k863288l300152l586106l601002k936756k911546k505473k246398
3237D6699188k156259j856044j379063j153990j487513j205476j089463j142953
3229C5228427r50214p42356o95343p86398l63746n99904m98585n15944l48201
3220B9727736m12020k08792K98726L77386K56753M6200o22823j198280j094655
3211B7170231r19162p96562p14295n86574m11357l87178l63415m60191l16772
$$ plain form
3202 22214725 21620974 21218450 21061757 20714924 20493858 20119195 19986084 19585484 19431411
3193 19431411 19232620 19018305 18833002 18632233 18699165 18578602 18463470 18368318 18676540 18869624
3183 18869624 19081643 18921431 18395901 17927648 17484528 16958897 16514123 16362466 16238263
3174 16238263 15867205 15591846 15473788 15318045 15063995 14874358 14987879 14883008 14630648
3165 14630648 14429379 14389647 14119475 14279102 13978103 13787342 13548235 13588189 13471850 13391678
3155 13391678 13331616 13184182 13100730 13046320 13016722 12921806 12749545 12888000 12835860 12602684
3145 12602684 12477699 12430145 12415706 12343341 12031279 11806491 11713264 11643226 11491414 11458960
3135 11458960 11400236 11556869 11477341 11265254 11081057 11090782 11165761 11131494 11224859 10937007 11166702
$$ packed form
3202B2214725n93751m02524j56693l46833k21066l74663j33111m00600j54073
3193A9431411j98791k14315j85303k00769O6932j20563j15132r5152L08222J93084
3183A8869624K12019j60212n25530m68253m43120n25631m44774j51657j24203
3174A6238263l71058k75359j18058j55743k54050j89637J13521j04871k52360
3165A4630648k01269l9732k70172J59627l00999j90761k39107L9954j16339q0172
3155A3391678o0062j47434q3452n4410k9598r4916j72261J38455n2140k33176
3145A2602684j24985m7554j4439p2365l12062k24788r3227p0038j51812l2454
3135A1458960n8724J56633p9528k12087j84197R725P4979l4267R3365k87852K29695
$$ plain form
3124 11166702 11147984 11212377 11230739 11268951 11391480 11385638 11335047 11314087 11132013 10991218 11106715
3113 11106715 10975606 10616729 10518749 10284356 10277050 10129264 10066291 10100279 9941399 10087248
3103 10087248 10103478 9924665 9840195 9856936 9890785 10068070 10237783 10355095 10203493 9950243
3093 9950243 10009395 9895202 9801960 10019562 10122573 9928290 10031175 10267719 10275913 10413462
3083 10413462 10316304 10224752 10200401 10369846 10466995 10374403 10320872 10220642 10025626 9982401 9978649
3072 9978649 9911590 9931669 9670357 9704519 9616457 9592111 9724208 10053255 10259946 10269511 10000166
3061 10000166 9842949 9910808 10011899 10092473 9848717 9957092 9923422 9718334 9739712 10014006
3051 10014006 10168046 10280342 10235561 10118885 9986711 9967409 9951811 9844019 9705659 9796074
$$ packed form
3124A1166702j8718O4393J8362L8212J22529n842n0591k0960j82074j40795J15497
3113A1106715j31109l58877r7980k34393p306j47786o2973L3988j58880J45849
3103A0087248J6230j78813q4470J6741L3849J77285J69713J17312j51602k53250
3093I950243N9152j14193r3242K17602J03011j94283J02885K36544Q194J37549
3083A0413462r7158r1552k4351J69445R7149r2592n3531j00230j95016m3225l752
3072I978649o7059K0079k61312L4162q8062k4346J32097L29047K06691R565k69345
3061A0000166j57217O7859J01091Q0574k43756J08375l3670k05088K1378K74294
3051A0014006J54040J12296m4781j16676j32174j9302j5598j07792j38360R0415
$$ plain form
3041 9796074 9713477 9672902 9839812 9886198 9953942 9915581 10082450 10076793 10083004 10097845 10225060
3030 10225060 10238563 10111627 10168658 10171878 10295798 10376732 10616205 10606137 10908734 11132688
3020 11132688 11357009 11696235 11838070 12071818 12217556 12412721 12722489 13235594 13572607
3011 13572607 13920839 14024982 13902611 13537161 13235442 13003264 12907014 12890743 12707553 12689894
3001 12689894 12733662 12809394 13122791 13007793 12883146 12865538 13119459 13098473 13342901 13448364
2991 13448364 13714810 14088454 14314613 14607552 15101842 15394490 15818195 16245086 16815587
2982 16815587 17271634 17661382 18658456 19399798 19829121 19691964 19524834 19282848 18956245
2973 18956245 18514316 18211279 17710790 17529706 17267866 16826898 16690871 16410502 16350773 16226105
$$ packed form
3041I796074q2597m0575J66910M6386O7744l8361J66869n657O211J4841J27215
3030A0225060J3503j26936N7031L220J23920Q0934K39473j0068L02597K23954
3020A1132688K24321L39226J41835K33748J45738J95165L09768N13105L37013
3011A3572607L48232J04143j22371l65450l01719k32178r6250j6271j83190j7659
3001A2689894M3768P5732L13397j14998j24647j7608K53921k0986K44428J05463
2991A3448364K66446L73644K26159K92939M94290K92648M23705M26891N70501
2982A6815587M56047L89748R97074P41342M29323j37157j67130k41986l26603
2973A8956245m41929l03037n00489j81084k61840m40968j36027k80369n9729j24668
$$ plain form
2963 16226105 16410524 16462745 16438835 16284795 16311108 16675184 16839459 17170977 17442386 17773075
2953 17773075 18118580 18536277 18684183 18790316 18931742 19375318 19773674 19958174 20305501
2944 20305501 20803121 20838219 20836793 20998750 20837812 20819949 20816011 20846671 20872631 20990919 20968431
2933 20968431 21049681 21295817 21354010 21368328 21307066 21310255 21229573 21096413 21112221 21270291 21310944
2922 21310944 21370145 21475637 21776538 21884175 21995870 22283786 22671721 22995119 23370616 23901833
2912 23901833 24566385 25073026 25561307 25977537 26154256 25988713 25941572 25419020 24800706 24210975
2902 24210975 23644783 22982180 22484579 21959826 21499610 21215088 20868307 20890506 21096787 21031222
2892 21031222 20921003 20956267 21058592 21167026 21362084 21510804 21417850 21468382 21533427 21563762
$$ packed form
2963A6226105J84419N2221k3910j54040K6313L64076J64275L31518K71409L30689
2953A7773075L45505M17697J47906J06133J41426M43576L98356J84500L47327
2944B0305501M97620L5098j426J61957j60938j7863l938L0660K5960J18288k2488
2933B0968431Q1250K46136N8193J4318o1262L189q0682j33160J5808J58070M0653
2922B1310944N9201J05492L00901J07637J11695K87916L87935L23398L75497N31217
2912B3901833O64552N06641M88281M16230J76719j65543m7141n22552o18314n89731
2902B4210975n66192o62603m97601n24753m60216k84522l46781K2199K06281o5565
2892B1031222j10219L5264J02325J08434J95058J48720r2954N0532O5045L0335
$$ plain form
2882 21563762 21638755 21758505 21994942 21788243 21276958 20855172 20475115 20234207 19843768 19275959
2872 19275959 18690125 18200129 17771215 17382763 16949903 16702287 16505207 16265479 15984705
2863 15984705 15883652 15875221 15595152 15345084 15062159 14729080 14398018 14257359 14072578 13864743
2853 13864743 13478672 13135230 13108269 12567763 12247178 12068965 11751828 11340201 11006284 10839028
2843 10839028 10661769 10293252 10268150 9992642 9741309 9550117 9361067 9288653 9104388 9050790
2833 9050790 8883383 8823650 8630331 8592616 8462258 8305654 8024873 7806197 7769138 7612565
2823 7612565 7460350 7390426 7320521 7122874 7141775 6805241 6633401 6377875 6307767 6256433
2813 6256433 6150625 6221820 6354503 6151301 5941899 5683901 5730484 5636762 5576284 5354072
$$ packed form
2882B1563762P4993J19750K36437k06699n11285m21786l80057k40908l90439n67809
2872A9275959n85834m89996m28914l88452m32860k47616j97080k39728k80774
2863A5984705j01053q431k80069k50068k82925l33079l31062j40659j84781k07835
2853A3864743l86071l43442k6961n40506l20585j78213l17137m11627l33917j67256
2843A0839028j77259l68517k5102k75508k51333j91192j89050p2414j84265n3598
2833I050790j67407n9733j93319l7715j30358j56604k80781k18676l7059j56573
2823G612565j52215o9924o9905j97647J8901l36534j71840k55526p0108n1334
2813F256433j05808P1195J32683k03202k09402k57998M6583r3722o0478k22212
$$ plain form
2803 5354072 5349048 5431554 5294668 5221508 5218689 5148477 4977617 4962695 5051649 4978017 4956532
2792 4956532 4970685 4945035 4769259 4615411 4542495 4515601 4618238 4551074 4276294 4166477
2782 4166477 4111524 3989760 4134774 3980063 4022966 3966438 3810979 3769945 3799750 3828414 3586807
2771 3586807 3552908 3471832 3327496 3433234 3380159 3325011 3178083 3127467 3206752 3099839 3231998
2760 3231998 3172333 3195331 3362283 2993373 3125289 3222056 3231695 3112618 2959289 2653811
2750 2653811 2715554 2651965 2878949 2784763 2695567 2606576 2434836 2363868 2299988 2356437 2288742
2739 2288742 2238808 2311943 2350090 2166450 2187710 2227358 2123156 2074909 2048156 2099437 2269317
2728 2269317 2031331 2157852 2248785 2213759 2201872 2119776 2348509 2358109 2397674 2364645 2240246
$$ packed form
2803E354072n024Q2506j36886p3160k819p0212j70860j4922Q8954p3632k1485
2792D956532J4153k5650j75776j53848p2916k6894J02637o7164k74780j09817
2782D166477n4953j21764J45014j54711M2903n6528j55459m1034K9805K8664k41607
2771C586807l3899q1076j44336J05738n3075n5148j46928n0616P9285j06913J32159
2760C231998n9665K2998J66952l68910J31916R6767R639j19077j53329l05478
2750B653811O1743o3589K26984r4186q9196q8991j71740p0968o3880N6449o7695
2739B288742m9934P3135L8147j83640K1260L9648j04202m8247k6753N1281J69880
2728B269317k37986J26521R0933l5026j1887q2096K28733R600L9565l3029j24399
$$ plain form
2717 2240246 2134100 1959179 1900074 1961906 1870735 1671116 1843800 1870763 1890828 1958269 1696341
2706 1696341 1654492 1751266 1677450 1814941 1826234 1879794 1810447 1614353 1644778 1907976 1875246
2695 1875246 1914920 1964440 1794411 1699956 1694990 1681863 1555242 1475524 1525502 1524765 1407473
2684 1407473 1534476 1532570 1556340 1510480 1579222 1724524 1624137 1653097 1669722 1643251 1403924
2673 1403924 1445001 1566754 1647841 1698870 1652254 1792401 1681320 1534487 1752949 2024202
2663 2024202 1804536 1548414 1637456 1899829 1851718 1779687 1875726 1897233 1692370 1700371 1647184
2652 1647184 1751338 1803291 1800336 1747020 1724677 1640615 1755641 1769574 1861968 1807748 1914300
2641 1914300 1962800 1939064 1966769 1910625 1743613 1735183 2195779 2233858 2152060 2108277 2123656
$$ packed form
2717B240246j06146j74921n9105O1832r1171j99619J72684K6963K0065O7441k61928
2706A696341m1849R6774p3816J37491J1293N3560o9347j96094L0425K63198l2730
2695A875246L9674M9520j70029r4455m966j3127j26621p9718M9978p37j17292
2684A407473J27003j906K3770m5860O8742J45302j00387K8960J6625k6471k39327
2673A403924M1077J21753Q1087N1029m6616J40147j11081j46833K18462K71253
2663B024202k19666k56122Q9042K62373m8111p2031R6039K1507k04863Q001n3187
2652A647184J04154N1953k955n3316k2343q4062J15026J3933R2394n4220J06552
2641A914300M8500k3736K7705n6144j67012q430M60596L8079q1798m3783J5379
$$ plain form
2630 2123656 2196846 2329683 2207677 2028851 1941299 1959018 1999687 2021867 1934630 1884798 1878281
2619 1878281 2238103 1917531 1974065 1964329 1990455 1956717 2014702 1910607 1822542 1890547 1882773
2608 1882773 1873097 2011006 2041581 2128972 2183842 2405946 2300729 2108895 2215625 1978662
2598 1978662 2057855 2254515 2306438 2438083 2337573 2121392 2012197 1869539 1883450 1850042
2588 1850042 1983407 1969911 1968088 1956262 1950298 1581442 1709630 1775841 1696348 1671795 1697511
2577 1697511 1882503 1901566 1883070 1873546 1771062 1789959 1613904 1769550 1652540 1688767 1774475
2566 1774475 1642793 1601348 1510426 1538814 1550930 1509553 1449479 1499656 1463451 1556132 1661634
2555 1661634 1610650 1324884 1306212 1191841 1146954 1217268 1154322 1252982 1029584 888878 886230
$$ packed form
2630B123656P3190J32837j22006j78826q7552J7719M0669K2180q7237m9832o517
2619A878281L59822l20572N6534r736K6126l3738N7985j04095q8065O8005p774
2608A882773r676J37909L0575Q7391N4870K22104j05217j91834J06730k36963
2598A978662P9193J96660N1923J31645j00510k16181j09195j42658J3911l3408
2588A850042J33365j3496j823j1826n964l68856J28188O6211p9493k4553K5716
2577A697511J84992J9063j8496r524j02484J8897j76055J55646j17010L6227Q5708
2566A774475j31682m1445r0922K8388J2116m1377o0074N0177l6205R2681J05502
2555A661634n0984k85766j8672j14371m4887P0314o2946R8660k23398j40706k648
$$ plain form
2544 886230 920655 957847 952881 1167495 1053039 1010839 945421 1123391 1132712 975590 1038546
2533 1038546 968625 996386 940129 931876 816232 744635 722371 745789 773976 749671 709329
2522 709329 716527 962031 817716 683373 575850 638099 793573 855047 618233 502696
2512 502696 542265 469301 285157 298800 377417 297756 324102 363143 312515 420483 443145
2501 443145 323338 310611 601925 547140 404150 430596 399737 241080 300260 349201 399931
2490 399931 411236 304821 506851 398481 516127 458392 678792 551799 373543 475695
2480 475695 461851 380605 392038 583773 714165 506786 406622 585748 379674 291834
2470 291834 322280 259063 315611 321555 238303 273136 437517 225817 358783 544608 614909
$$ packed form
2544H86230L4425L7192m966K14614j14456m2200o5418J77970R321j57122O2956
2533A038546o9921K7761n6257q253j15644p1597k2264K3418K8187k4305m0342
2522G09329P198K45504j44315j34343j07523O2249J55474O1474k36814j15537
2512E02696L9569p2964j84144J3643P8617p9661K6346L9041n0628J07968K2662
2501D43145j19807j2727K91314n4785j42990K6446l0859j58657N9180M8941N0730
2490C99931J1305j06415K02030j08370J17646n7735K20400j26993j78256J02152
2480D75695j3844q1246J1433J91735J30392k07379j00164J79126k06074q7840
2470B91834L0446o3217N6548N944q3252L4833J64381k11700J32966J85825P0301
$$ plain form
2459 614909 588958 533363 376555 310622 234817 139988 183580 354795 276172 201738 25875
2448 25875 59039 286398 342833 522793 506443 303259 182592 294160 142285 254866
2438 254866 321208 268003 47044 102790 340822 250895 273544 200335 153353 138881 136162
2427 136162 194315 267490 475088 396417 326884 220664 367863 558329 502962 292881 298911
2416 298911 530661 422330 359402 96285 -103905 232889 472083 532499 606559 712754
2406 712754 619058 614014 393772 258498 336451 453772 367890 130992 245546 168970 83365
2395 83365 285359 503062 485997 320994 171689 223517 291859 199370 284560 509607 293042
2384 293042 199993 438398 635412 573352 628623 773738 822583 597378 449455 664576
$$ packed form
2459F14909k5951n5595j56808o5933p5805r4829M3592J71215p8623p4434j75863
2448B5875L3164K27359N6435J79960j6350k03184j20667J11568j51875J12581
2438B54866O6342n3205k20959N5746K38032q9927K2649p3209m6982j4472k719
2427A36162N8153P3175K07598p8671o9533j06220J47199J90466n5367k10081O030
2416B98911K31750j08331o2928k63117k00190L36794K39194O0416P4060J06195
2406G12754r3696n044k20242j35274P7953J17321q5882k36898J14554p6576q5605
2395H3365K01994K17703j7065j65003j49305N1828O8342r2489Q5190K25047k16565
2384B93042r3049K38405J97014o2060N5271J45115M8845k25205j47923K15121
$$ plain form
2374 664576 569113 567390 473237 437158 473928 418131 450934 538230 609353 442887 402238 413043
2362 413043 485776 439074 509422 459022 554367 313108 31417 119662 151029 93770 195563
2351 195563 361801 294605 264861 234415 178204 182821 277605 232758 352043 350589 360636 359158
2339 359158 273206 219108 430614 469422 309077 130941 168665 116997 189190 346434 138838
2328 138838 150872 210191 542065 658313 334740 290237 415254 465780 318049 413071 318986
2317 318986 268024 435519 465425 300935 337010 324984 422479 280237 259812 567038 663046
2306 663046 381807 159915 24596 74631 306250 237825 293835 309342 315736 359684 381131
2295 381131 252728 308385 484102 571718 425964 313744 552450 646726 511603 332489
$$ packed form
2374F64576r5463j723r4153l6079L6770n5797L2803Q7296P1123j66466m0649J0805
2362D13043P2733m6702P0348n0400R5345k41259k81691Q8245L1367n7259J01793
2351A95563J66238o7196k9744l0446n6211M617R4784m4847J19285j454J0047j478
2339C59158q5952n4098K11506L8808j60345j78136L7724n1668P2193J57244k07596
2328A38838J2034N9319L31874J16248l23573m4503J25017N0526j47731R5022r4085
2317C18986n0962J67495K9906j64490L6075j2026R7495j42242k0425L07226R6008
2306F63046k81239k21892j35319N0035K31619o8425N6010J5507O394M3948K1447
2295C81131j28403N5657J75717Q7616j45754j12220K38706R4276j35123j79114
$$ plain form
2285 332489 289762 430664 403637 436520 475055 295502 109302 410085 609382 537522 658678
2274 658678 568763 306731 203066 268438 369552 641905 830316 818066 511416 398147
2264 398147 435244 346952 452263 612266 476658 460578 622954 374859 330620 578091
2254 578091 599703 591269 374360 235718 420814 548120 621240 764935 666035 478208 545773
2243 545773 584135 400057 354644 453093 376938 422929 457562 505930 340633 595842 516529
2232 516529 420890 555347 507682 424938 438881 655776 558418 614047 536341 574367 754724
2221 754724 780873 778044 638761 705863 587739 683401 633928 872762 692958 472652 560214
2210 560214 593819 823143 819525 921503 836238 707330 876655 1071993 1084664 917650 741838
$$ packed form
2285C32489m2727J40902k7027L2883L8535j79553j86200L00783J99297p1860J21156
2274F58678q9915k62032j03665O5372J01114K72353J88411j2250l06650j13269
2264C98147L7097q8292J05311J60003j35608j6080J62376k48095m4239K47471
2254E78091K1612q434k16909j38642J85096J27306P3120J43695r8900j87827O7565
2243E45773L8362j84078m5413R8449p6155M5991L4633M8368j65297K55209p9313
2232E16529r5639J34457m7665q2744J3943K16895r7358N5629p7706L8026J80357
2221G54724K6149k829j39283O7102j18124R5662m9473K38834j79804k20306Q7562
2210E60214L3605K29324l618J01978q5265j28908J69325J95338J2671j67014j75812
$$ plain form
2199 741838 955241 1274538 1153557 1066891 1064732 1273153 1490287 1594950 1561262 1490541 1492299
2188 1492299 1494773 1399159 1357351 1346946 1534091 1609152 1629452 1636325 1563558 1737617 1984279
2177 1984279 1861483 1801515 1814558 1800093 1996550 1908329 1833282 1826958 1829564 1871697 1780153
2166 1780153 1818545 1817184 1862008 2020252 1992298 2008220 2203557 2228436 2224457 2301550 2475689
2155 2475689 2523186 2523289 2611404 2532295 2845713 2815827 3068883 3210977 3176933 3282135 3379645
2144 3379645 3570896 3712673 4036980 4342686 4590303 4896809 5335134 5572439 5751475 6103495
2134 6103495 6315729 6509275 6716379 7153690 7605539 8080640 8646041 9353916 9856029 10800715
2124 10800715 11601276 12394963 12939428 13868376 14973943 16658025 18496197 20867299 23383417
$$ packed form
2199G41838K13403L19297j20981q6666k159K08421K17134J04663l3688p0721J758
2188A492299K474r5614m1808j0405J87145P5061K0300O873p2767J74059K46662
2177A984279j22796n9968J3043j4465J96457q8221p5047o324K606M2133r1544
2166A780153L8392j361M4824J58244k7954J5922J95337K4879l979P7093J74139
2155B475689M7497J03Q8115p9109L13418k9886K53056J42094l4044J05202R7510
2144C379645J91251J41777L24307L05706K47617L06506M38325K37305J79036L52020
2134F103495K12234J93546K07104M37311M51849M75101N65401P07875N02113R44686
2124A0800715Q00561P93687N44465R28948J105567J684082J838172K371102K516118
$$ plain form
2115 23383417 26555854 30879912 37834433 46118673 57984423 71467819 83727406 82504396
2107 82504396 67865022 54501466 43691354 36251323 29913167 25372131 21686997 18957633
2099 18957633 16790267 15351649 13972705 13054874 12147079 11742369 11033604 10065379 9034182
2090 9034182 8525508 7886841 7245961 6778625 6513955 6134975 5760381 5411749 5301119 4903676
2080 4903676 4559784 4614556 4417307 4318177 4273678 3988923 3582313 3592735 3604962 3371766
2070 3371766 3173758 3190200 2927977 2856700 2645021 2490926 2458691 2553604 2365960 2387313
2060 2387313 2306928 2161125 2091733 2012048 2156757 2088359 1990884 2006491 1876883 1733441 1621464
2049 1621464 1623124 1670331 1546081 1369311 1353788 1312547 1337741 1488644 1559773 1393950 1157513
$$ packed form
2115B3383417L172437M324058O954521Q284240J1865750J3483396J2259587j223010
2107H2504396j4639374j3363556j0810112p440031o338156m541036l685134k729364
2099A8957633k167366j438618j378944r17831r07795m04710p08765r68225j031197
2090I034182n08674o38667o40880m67336k64670l78980l74594l48632j10630l97443
2080D903676l43892N4772j97249r9130m4499k84755m06610J0422J2227k33196
2070C371766j98008J6442k62223p1277k11679j54095l2235R4913j87644K1353
2060B387313q0385j45803o9392p9685J44709o8398r7475J5607j29608j43442j11977
2049A621464J660M7207j24250j76770j5523m1241K5194J50903P1129j65823k36437
$$ plain form
2038 1157513 1317718 1376223 1334206 1069458 1197905 1225367 1075651 969502 1097000 1105836
2028 1105836 1094445 1093835 961869 1058765 1034146 1083210 896088 996823 1107251 993025 903433
2017 903433 841760 794729 973430 949456 800767 770686 863463 742719 739687 743597 837790
2006 837790 624371 505181 453210 452428 524285 616569 638555 260007 183928 234831 506088
1995 506088 614442 515939 465267 523931 217752 204613 328791 417238 484011 342791 384435
1984 384435 365764 378338 493639 439040 535501 474072 165928 3268 216249 306772 427117
1973 427117 428384 238637 242264 271625 391512 265262 271334 338451 372766 177786 132354
1962 132354 243602 256309 306878 285596 388693 251353 110639 317487 392421 400679 257420
$$ packed form
2038A157513J60205N8505m2017k64748J28447K7462j49716j06149J27498Q836
2028A105836j1391o10j31966R6896k4619M9064j87122J00735J10428j14226q9592
2017I03433o1673m7031J78701k3974j48689l0081R2777j20744l032L910R4193
2006H37790k13419j19190n1971p82P1857R2284K1986l78548p6079N0903K71257
1995E06088J08354r8503n0672N8664l06179j3139J24178Q8447O6773j41220M1644
1984C84435j8671J2574J15301n4599R6461o1429l08144j62660K12981R0523J20345
1973D27117J267j89747L627K9361J19887j26250O072O7117L4315j94980m5432
1962A32354J11248J2707N0569k1282J03097j37340j40714K06848P4934Q258j43259
$$ plain form
1951 257420 110213 155924 246167 170448 -51174 7359 106116 256972 371003 270756 -25970
1940 -25970 -51488 240142 309807 150455 50102 53207 449838 356848 48276 105463 351307
1929 351307 311556 133768 271422 138109 117601 201347 374191 375815 300669 181009 352912
1918 352912 308537 234152 578609 459399 378264 153351 21716 218925 232907 322059 289272
1907 289272 148424 132506 218041 133003 24012 -41828 94154 177313 297426 219911 -15207
1896 -15207 104371 181460 133088 254017 135747 72115 79128 267442 377955 307200 245260
1885 245260 185053 188682 72410 254633 36785 56353 145778 15533 50799 201821 95161
1874 95161 13661 43950 307689 391847 365950 143423 50855 173115 106390 318037 253076
$$ packed form
1951B57420j47207M5711R0243p5719k21622N8533R8757J50856J14031j00247k96726
1940b5970k5518K91630O9665j59352j00353L105L96631r2990l08572N7187K45844
1929C51307l9751j77788J37654j33313k0508Q3746J72844J624p5146j19660J71903
1918C52912m4375p4385L44457j19210q1135k24913j31635J97209J3982Q9152l2787
1907B89272j40848j5918Q5535q5038j08991o5840J35982Q3159J20113p7515k35118
1896a5207J19578P7089m8372J20929j18270o3632P013J88314J10513p0755o1940
1885B45260o0207L629j16272J82223k17848J9568Q9425j30245L5266J51022j06660
1874I5161q1500L0289K63739Q4158k5897k22527r2568J22260o6725K11647o4961
$$ plain form
1863 253076 336128 171486 233194 298961 159723 193842 36504 54669 209446 160444 -38033
1852 -38033 121509 338945 237355 53899 157868 265065 230675 270985 296205 470655
1842 470655 326042 335258 437621 629548 485462 380887 271194 158804 217967 351190
1832 351190 238973 323246 296684 423682 272511 100815 39455 -109643 -56069 -38231 128967
1821 128967 99123 -15636 -4959 -65174 179330 -1046 -95254 241182 -449 49035 120085
1810 120085 257152 178705 45824 -163333 -72063 -9675 207529 236152 142722 -73701 -249271
1799 -249271 -213274 -134234 105677 6857 -13398 180304 -85854 271143 348011 488540 293528
1788 293528 74872 98445 86106 50976 -47884 31886 33327 102898 181412 151082 141612 208096
$$ packed form
1863B53076Q3052j64642O1708O5767j39238L4119j57338J8165J54777m9002j98477
1852c8033J59542K17436j01590j83456J03969J07197l4390M0310K5220J74450
1842D70655j44613R216J02363J91927j44086j04575j09693j12390N9163J33223
1832C51190j12217Q4273k6562J26998j51171j71696o1360j49098N3574J7838J67198
1821A28967k9844j14759J0677o0215K44504j80376r4208L36436k41631M9484P1050
1810A20085J37067p8447j32881k09157R1270O2388K17204K8623r3430k16423j75570
1799b49271L5997P9040K39911r8820k0255J93702k66158L56997P6868J40529j95012
1788B93528k18656K3573j2339l5130r8860P9770J441O9571P8514l0330r470O6484
$$ plain form
1776 208096 253357 153428 222377 -8723 -247180 -155751 -130049 -35820 -205159 -236623 -286079
1765 -286079 -105539 -62573 -48637 -37719 -240475 -228196 45381 2146 6749 96215 66067
1754 66067 32243 -32886 -57269 -20994 42561 -141945 45771 -1709 -55093 63122 1097
1743 1097 226335 351470 97738 -210981 -99457 -79848 -36300 261852 152375 61349 126029
1732 126029 3786 114943 12024 3513 113447 265898 144573 77006 211870 160519
1722 160519 178252 129219 -81657 106219 209430 156605 146582 69796 -9616 202275 149206
1711 149206 106169 207387 122182 48573 -43980 -22603 -77060 -78305 -17265 86339 89150 -33789
1699 -33789 -157278 -47657 177393 2644 -106268 -124426 -60110 -113147 1005 162759
$$ packed form
1776B08096M5261r9929O8949k31100k38457R1429K5702R4229j69339l1464m9456
1765b86079J80540M2966J3936J0918k02756J2279K73577m3235M603Q9466l0148
1754F6067l3824o5129k4383L6275O3555j84506J87716m7480n3384J18215o2025
1743A097K25238J25135k53732l08719J11524J9609M3548K98152j09477r1026O4680
1732A26029j22243J11157j02919q511J09934J52451j21325o7567J34864n1351
1722A60519J7733m9033k10876J87876J03211n2825j0023p6786p9412K11891n3069
1711A49206m3037J01218q5205p3609r2553K1377n4457j245O1040J03604K811j22939
1699c3789j23489J09621K25050j74749j08912j8158O4316n3037J14152J61754
$$ plain form
1689 162759 2226 5006 2174 -72857 -10914 -10637 -33960 85603 122276 102660 226414 404575
1677 404575 251790 125575 -28862 78954 217702 166317 -2015 -138659 62395 140214
1667 140214 38163 45399 20452 15303 90849 23778 27562 -48141 -48313 -82722 -27569 152371
1655 152371 -83087 -131265 -93966 -106070 114256 212806 48121 -46446 -86761 -47208 162776
1644 162776 260676 54019 -21267 -81593 -168920 -144429 -8906 2329 43872 106007 55711
1633 55711 97377 106355 20702 -147529 11453 132600 25658 -80888 37363 19966 -87081
1622 -87081 -42375 162267 108978 14813 10785 -24809 -10252 -62561 -109345 -346888 -519929
1611 -519929 -242316 43812 129601 79523 -41142 -43529 20314 39106 161718 217812 122654
$$ packed form
1689A62759j60533K780k832p5031O1943K77k3323J19563L6673j9616J23754J78161
1677D04575j52785j26215j54437J07816J38748n1385j68332j36644K01054P7819
1667A40214j02051P236k4947n149P5546o7071L784p5703j72l4409N5153J79940
1655A52371k35458m8178L7299j2104K20326R8550j64685r4567m0315L9553K09984
1644A62776R7900k06657p5286o0326q7327K4491J35523J1235M1543O2135n0296
1633E5711M1666Q978q5653j68231J58982J21147j06942j06546J18251j7397j07047
1622h7081M4706K04642n3289r4165m028l5594J4557n2309m6784k37543j73041
1611e19929K77613K86128Q5789n0078j20665k387O3843J8792J22612N6094r5158
$$ plain form
1600 122654 63203 44467 10693 17269 88900 190648 107453 -98140 -52734 29614 159878
1589 159878 40930 76809 85238 12042 -161120 24887 -127308 -128873 89270 -13130 -34764
1578 -34764 35141 53339 -64550 -29549 325516 240705 -76754 42103 -8401 -123571 -91033
1567 -91033 182533 186735 53976 61992 126541 32355 14587 113177 115165 29791 -113022 -138910
1555 -138910 -136248 -51219 -173822 -70033 -52544 -100088 -215733 -89209 168277 70955 -8253
1544 -8253 -124016 -58251 -11843 -112853 -218954 -287858 -282420 -337485 -154482 118381 164124
1533 164124 367885 295766 197542 65699 293464 60321 -7255 85086 -100122 -131446 -107385
1522 -107385 -143599 17553 156477 70635 2186 13391 59621 154873 -24992 -167270 -17519
$$ packed form
1600A22654n9451j8736l3774O576P1631J01748q3195k05593M5406Q2348J30264
1589A59878j18948L5879Q429p3196j73162J86007j52195j565K18143j02400k1634
1578c4764O9905J8198j17889L5001L55065q4811l17459J18857n0504j15170L2538
1567i1033K73566M202j32759Q016O4549r4186j7768R8590J988q5374j42813k5888
1555a38910K662Q5029j22603J03789J7489m7544j15645J26524K57486r7322p9208
1544h253j15763O5765M6408j01010j06101o8904N438n5065J83003K72863M5743
1533A64124K03761p2119r8224j31843K27765k33143o7576R2341j85208l1324K4061
1522a07385l6214J61152J38924q5842o8449J1205M6230R5252j79865j42278J49751
$$ plain form
1511 -17519 -91110 -40837 243882 37904 204674 186556 -69090 -6726 98530 62173 14522
1500 14522 -10393 24357 -124809 -293775 -195187 -98460 -74179 -63404 -80413 -216929 21921
1489 21921 37194 41798 128688 273775 29959 17068 14473 -620 17834 54781 154769 135740
1477 135740 147982 113263 -107482 -85884 16266 47735 -85830 -7145 92047 -108072 -142730
1466 -142730 190099 122112 -24846 -62522 40371 48584 -95684 -293860 -15915 31064 -200174
1455 -200174 -338412 -35257 110171 101349 45351 -31396 -87270 51304 24065 -37894 66253
1444 66253 -181754 -46343 73769 123044 222249 210471 96108 43738 -59217 197407 104953
1433 104953 -63945 -31210 -16768 -103081 11373 104322 45080 76239 112590 -7441 -86021
$$ packed form
1511a7519p3591N0273K84719k05978J66770j8118k55646O2364J05256l6357m7651
1500A4522k4915L4750j49166j68966R8588R6727K4281J0775j7009j36516K38850
1489B1921J5273M604Q6890J45087k43816j2891k595j5093J8454L6947R9988j9029
1477A35740J2242l4719k20745K1598J02150L1469j33565P8685R9192k00119l4658
1466a42730L32829o7987j46958l7676J02893Q213j44268j98176K77945M6979k31238
1455b00174j38238L03155J45428q822n5998p6747n5874J38574k7239o1959J04147
1444F6253k48007J35411J20112M9275R9205j1778j14363n2370j02955K56624r2454
1433A04953j68898L2735J4442q6313J14454R2949n9242L1159L6351j20031p8580
$$ plain form
1422 -86021 -229878 40755 128003 -103099 -4804 172457 69059 152345 150782 75246 -121454
1411 -121454 -132211 -99672 -122915 -80141 1634 95330 138642 38101 204226 98069 189956
1400 189956 5153 30014 6751 87710 202646 175604 114693 59279 126825 -38531 -81823
1389 -81823 -3890 68830 -146997 -25309 -35209 -61469 63880 292816 222497 30087 5483
1378 5483 -49214 -123900 -25118 -62889 -11579 -1103 45926 147342 203189 156877 188270 -3932
1366 -3932 -231056 -71656 142020 -39958 -27674 -33622 -50989 -217136 42494 -88065 38181
1355 38181 244403 276710 533261 297010 74584 90656 79739 79357 114507 -13453 -193914
1344 -193914 -199092 28877 -148919 -74928 36439 -84414 -99800 64945 7130 112511 139502
$$ packed form
1422h6021j43857K70633Q7248k31102R8295J77261j03398Q3286j563p5536j96700
1411a21454j0757L2539k3243M2774Q1775R3696M3312j00541J66125j06157R1887
1400A89956j84803K4861k3263Q0959J14936k7042o0911n5414O7546j65356m3292
1389h1823P7933P2720k15827J21688r900k6260J25349K28936p0319j92410k4604
1378E483n4697p4686R8782l7771N1310J0476M7029J01416N5847m6312L1393j92202
1366c932k27124J59400K13676j81978J2284n948j7367j66147K59630j30559J26246
1355C8181K06222L2307K56551k36251k22426J6072j0917l82L5150j27960j80461
1344a93914n178K27969j77796P3991J11367j20853j5386J64745n7815J05381K6991
$$ plain form
1333 139502 -110307 -100486 93734 38180 102677 -43937 -2939 9469 86061 326001 270873
1322 270873 263299 237264 218899 55242 22817 145714 273967 13029 -130129 -201015 -394960
1311 -394960 -234588 -119963 -206063 -280984 -343344 41445 66121 158 -8932 83150 312007
1300 312007 206588 1493 -52313 -1711 34565 -73994 -41567 27989 98241 -167903 -67763
$$ packed form
1333A39502k49809R821J94220n5554O4497j46614M0998J2408P6592K39940n5128
1322B70873p574k6035j8365j63657l2425J22897J28253k60938j43158p0886j93945
1311c94960J60372J14625q6100p4921o2360L84789K4676o5963r090R2082K28857
1300C12007j05419k05095n3806N0602L6276j08559L2427O9556P0252k66144J00140
$$ [...]
##END NTUPLES=NMR SPECTRUM
##END=
