##TITLE=1H_TG-2341-A-3
 CDCl3
 8 sc, 
 25.08.2022
##JCAMPDX= 6.0         $$ Bruker NMR JCAMP-DX V2.0
##DATA TYPE= NMR SPECTRUM
##DATA CLASS= NTUPLES
##ORIGIN= UXNMR, Bruker Analytische Messtechnik GmbH
##OWNER= root
$$ XWIN-NMR		Version 3.5
$$ Thu Aug 25 14:30:53 2022 Russian Standard Time (UT+4h)  she@DPX200
##.OBSERVE FREQUENCY= 200.1313499994
##.OBSERVE NUCLEUS= ^1H
##.ACQUISITION MODE= SIMULTANEOUS
##.ACQUISITION SCHEME= undefined
##.AVERAGES= 8
##.DIGITISER RES= 18
##SPECTROMETER/DATA SYSTEM= spect
##.PULSE SEQUENCE= zg30
##.SOLVENT NAME= CDCl3
##.SHIFT REFERENCE= (INTERNAL, CDCl3, 0, 15.7711)
##AUDIT TRAIL= $$ (NUMBER, WHEN, WHO, WHERE, WHAT)
$$ ##TITLE= Audit trail, XWIN-NMR		Version 3.5
$$ ##JCAMPDX= 5.01
$$ ##ORIGIN= Bruker BioSpin GmbH
$$ ##OWNER= she
$$ F:/spectra/data/she/nmr/H-F/1/pdata/1/auditp.txt
$$ ##AUDIT TRAIL=  $$ (NUMBER, WHEN, WHO, WHERE, WHAT)
(   1,<2022-08-25 14:29:34.21 +0400>,<she>,<DPX200>,
      <created by zg, POWCHK disabled, PULCHK disabled
       configuration hash MD5:
       00 E9 B6 7A A2 85 ED C7 34 08 36 98 17 FE 4E 26
       data hash MD5: 16K
       39 D0 7A A0 C2 49 2A D4 2B E6 09 96 E9 84 32 F4>)
(   2,<2022-08-25 14:29:37.00 +0400>,<she>,<DPX200>,
      <Start of raw data processing
       efp BC_mod = 2 LB = 0.24 FT_mod = 6 PKNL = 1 PHC0 = -18197.92 PHC1 = 12.20069 SI = 16K 
       data hash MD5: 16K
       4A 82 C1 DF E8 CE 9A 46 22 BD 08 4C 2C 61 89 8A>)
(   3,<2022-08-25 14:29:56.35 +0400>,<she>,<DPX200>,
      <pk PHC0 = 2.51775 PHC1 = -1.6 
       data hash MD5: 16K
       B1 79 F0 5F 63 AC 7F 1D 23 25 25 17 5D 2E 74 E0>)
(   4,<2022-08-25 14:29:59.78 +0400>,<she>,<DPX200>,
      <abs ABSG = 5 
       data hash MD5: 16K
       55 17 8D EB 64 23 93 C4 21 CE 35 E6 A4 71 3F 07>)
$$ ##END=
$$ 
$$ hash MD5
$$ 26 A3 6C B7 CE 6D 6A 01 01 84 75 C5 C3 72 EC 95
##$RELAX= 
##$RELAX= 
##$RELAX= 
##$RELAX= 
##$RELAX= 
##$RELAX= 
$$ Bruker specific parameters
$$ --------------------------
##$DU= <F:/spectra>
##$EXPNO= 1
##$NAME= <H-F>
##$PROCNO= 1
##$TYPE= <nmr>
##$USER= <she>
##$AMP= (0..31)
100 100 100 100 100 100 100 100 100 100 100 100 100 100 100 100 100 100 
100 100 100 100 100 100 100 100 100 100 100 100 100 100 
##$AQSEQ= 0
##$AQ_mod= 1
##$AUNM= <au_zg>
##$AUTOPOS= <>
##$BF1= 200.13
##$BF2= 200.13
##$BF3= 200.13
##$BF4= 200.13
##$BF5= 200.13
##$BF6= 200.13
##$BF7= 200.13
##$BF8= 200.13
##$BYTORDA= 1
##$CFDGTYP= 0
##$CFRGTYP= 5
##$CHEMSTR= <none>
##$CNST= (0..31)
1 1 145 1 1 1 1 1 1 1 1 1 1 1 1 1 1 1 1 1 1 1 1 1 1 1 1 1 1 1 1 1 
##$CPDPRG= <>
##$CPDPRG1= <>
##$CPDPRG2= <>
##$CPDPRG3= <>
##$CPDPRG4= <mlev>
##$CPDPRG5= <mlev>
##$CPDPRG6= <mlev>
##$CPDPRG7= <mlev>
##$CPDPRG8= <mlev>
##$CPDPRGB= <>
##$CPDPRGT= <>
##$D= (0..31)
0 1.2 0 0 0 0 0 0 0 0.06 0 0.03 0 0 0 0 0.0002 0 0 0 0 0 0 0 0 0 0 0 0 
0 0 0 
##$DATE= 1661423373
##$DBL= (0..7)
120 120 120 120 120 120 120 120 
##$DBP= (0..7)
150 150 150 150 150 150 150 150 
##$DBP07= 0
##$DBPNAM0= <>
##$DBPNAM1= <>
##$DBPNAM2= <>
##$DBPNAM3= <>
##$DBPNAM4= <>
$$ [...]
##$SUBNAM3= <"">
##$SUBNAM4= <"">
##$SUBNAM5= <"">
##$SUBNAM6= <"">
##$SUBNAM7= <"">
##$SUBNAM8= <"">
##$SUBNAM9= <"">
##$SW= 18.0517283424941
##$SWIBOX= (0..15)
0 0 2 0 0 0 0 0 0 0 0 0 0 0 0 0 
##$SW_h= 3612.71676300578
##$TD= 16384
##$TD0= 1
##$TE= 0
##$TE2= 300
##$TE3= 300
##$TEG= 300
##$TL= (0..7)
0 120 120 120 120 120 120 120 
##$TP= (0..7)
150 150 150 150 150 150 150 150 
##$TP07= 0
##$TPNAME0= <>
##$TPNAME1= <>
##$TPNAME2= <>
##$TPNAME3= <>
##$TPNAME4= <>
##$TPNAME5= <>
##$TPNAME6= <>
##$TPNAME7= <>
##$TPOAL= (0..7)
0.5 0.5 0.5 0.5 0.5 0.5 0.5 0.5 
##$TPOFFS= (0..7)
0 0 0 0 0 0 0 0 
##$TUNHIN= 0
##$TUNHOUT= 0
##$TUNXOUT= 0
##$USERA1= <user>
##$USERA2= <user>
##$USERA3= <user>
##$USERA4= <user>
##$USERA5= <user>
##$V9= 5
##$VALIST= <valist>
##$VCLIST= <CCCCCCCCCCCCCCC>
##$VD= 0
##$VDLIST= <DDDDDDDDDDDDDDD>
##$VPLIST= <PPPPPPPPPPPPPPP>
##$VTLIST= <TTTTTTTTTTTTTTT>
##$WBST= 1024
##$WBSW= 4
##$XGAIN= (0..3)
0 0 0 0 
##$XL= 0
##$YL= 0
##$YMAX_a= 1089481
##$YMIN_a= -873817
##$ZGOPTNS= <>
##$ZL1= 120
##$ZL2= 120
##$ZL3= 120
##$ZL4= 120
##$ABSF1= 15.77443
##$ABSF2= -2.277419
##$ABSG= 5
##$ABSL= 3
##$ALPHA= 0
##$AQORDER= 0
##$ASSFAC= 0
##$ASSFACI= 0
##$ASSFACX= 0
##$ASSWID= 0
##$AUNMP= <proc_1d>
##$AZFE= 0.1
##$AZFW= 0.1
##$BCFW= 0
##$BC_mod= 2
##$BYTORDP= 0
##$COROFFS= 0
##$CY= -3
##$DATMOD= 1
##$DC= 0
##$DFILT= <>
##$DTYPP= 0
##$F1P= 0
##$F2P= 0
##$FCOR= 1
##$FTSIZE= 16384
##$FT_mod= 6
##$GAMMA= 0
##$GB= 0
##$INTBC= 1
##$INTSCL= 1.705223e-09
##$ISEN= 128
##$LB= 0.24
##$LEV0= 0
##$LPBIN= 0
##$MAXI= 10000
##$MC2= 0
##$MEAN= 0
##$ME_mod= 0
##$MI= 1.114404
##$NCOEF= 0
##$NC_proc= -5
##$NLEV= 6
##$NOISF1= 3.799351
##$NOISF2= 2.8
##$NSP= 0
##$NTH_PI= 0
##$NZP= 0
##$OFFSET= 15.77113
##$PC= 1
##$PHC0= -18195.4
##$PHC1= 10.60069
##$PH_mod= 1
##$PKNL= yes
##$PPARMOD= 0
##$PSCAL= 0
##$PSIGN= 0
##$REVERSE= no
##$SF= 200.130000081288
##$SI= 16384
##$SIGF1= 3
##$SIGF2= 2
##$SINO= 5.538805
##$SIOLD= 16384
##$SREGLST= <1H.CDCl3>
##$SSB= 0
##$STSI= 16384
##$STSR= 0
##$SW_p= 3612.71676300578
##$SYMM= 0
##$S_DEV= 0
##$TDeff= 16384
##$TDoff= 0
##$TI= <>
##$TILT= no
##$TM1= 0
##$TM2= 0
##$TOPLEV= 0
##$USERP1= <user>
##$USERP2= <user>
##$USERP3= <user>
##$USERP4= <user>
##$USERP5= <user>
##$WDW= 1
##$XDIM= 16384
##$YMAX_p= 332814256
##$YMIN_p= -526108
$$ End of Bruker specific parameters
$$ ---------------------------------
##NTUPLES= NMR SPECTRUM
##VAR_NAME=  FREQUENCY,     SPECTRUM/REAL,   SPECTRUM/IMAG
##SYMBOL=    X,             R,               I
##VAR_TYPE=  INDEPENDENT,   DEPENDENT,       DEPENDENT
##VAR_FORM=  AFFN,          ASDF,            ASDF
##VAR_DIM=   16384,         16384,           16384
##UNITS=     HZ,            ARBITRARY UNITS, ARBITRARY UNITS
##FACTOR=    0.220516191357247, 1,           1
##FIRST=     3156.27616976192, 0,            0
##LAST=      -456.440593243857, 0,           0
##MIN=       -456.440593243857, -526108,     0
##MAX=       3156.27616976192, 332814256,    0
$$ Real data points
##PAGE= N=1
##DATA TABLE= (X++(R..R)), XYDATA
$$ [...]
$$ plain form
6430 -215621 -221779 -232581 -226310 -209231 -243427 -241130 -225636 -232533 -223224 -186822 -188217 -198965 -193859
6417 -193859 -199902 -171054 -162665 -134235 -133462 -126954 -127166 -163926 -185025 -204909 -203117 -196006 -211982
6404 -211982 -214604 -215585 -206251 -205874 -226421 -210210 -192839 -210745 -192184 -191348 -207634 -210499 -212821 -191423
6390 -191423 -173274 -188455 -219570 -230773 -206191 -215015 -191394 -174208 -173192 -153317 -154513 -175724
6378 -175724 -179653 -200139 -195220 -197389 -214683 -204269 -190539 -168324 -164384 -148418 -162804 -144112
6366 -144112 -124234 -125924 -119782 -96881 -101602 -96911 -87264 -108513 -100989 -117335 -136837 -153740 -171727
6353 -171727 -143275 -128421 -108828 -103518 -108858 -112044 -133445 -130505 -94465 -112188 -118295 -106837 -108621
6340 -108621 -113376 -144011 -162127 -184721 -173433 -195858 -179300 -157077 -151352 -166787 -175115 -178461
$$ packed form
6430b15621o158j0802O271J7079l4196K297J5494o897R309L6402j395j0748N106
6417a93859o043K8848Q389K8430P73O508k12l6760k1099j9884J792P111j5976
6404b11982k622r81R334L77k0547J6211J7371j7906J8561Q36j6286k865k322K1398
6390a91423J8149j5181l1115j1203K4582q824K3621J7186J016J9875j196k1211
6378a75724l929k0486M919k169j7294J0414J3730K2215L940J5966j4386J8692
6366a44112J9878j690O142K2901m721M691R647k1249P524j6346j9502j6903j7987
6353a71727K8452J4854J9593N310n340l186k1401K940L6040j7723o107J1458j784
6340a08621m755l0635j8116k2594J1288k2425J6558K2223N725j5435q328l346
$$ plain form
6328 -178461 -168751 -122588 -147737 -147723 -144041 -128109 -121638 -108667 -106081 -123424 -132201 -109295 -105393
6315 -105393 -111150 -96761 -88152 -98967 -78314 -95407 -95253 -125301 -136729 -129500 -125142 -129538 -83674
6302 -83674 -77380 -128477 -108525 -89112 -94668 -130105 -109909 -85343 -83419 -81704 -60789 -51485 -57697
6289 -57697 -91887 -103307 -103811 -118969 -120762 -102565 -93414 -81205 -72873 -86028 -98223 -87887 -50841
6276 -50841 -44716 -66149 -76674 -70673 -57325 -70284 -56459 -53555 -47698 -34567 -56520 -65164 -56477
6263 -56477 -35341 -34470 -53243 -38205 -34283 -37528 -32378 -19920 -18450 -26207 -37096 -34048 -30401 -37222
6249 -37222 6889 5983 9745 -16711 -35842 -14323 -9664 -18320 -12654 -6769 -10609 17121 3085
6236 3085 -16055 -17197 -3171 -9764 -23827 -5609 30098 44895 58010 51338 50630 37255 14513
$$ packed form
6328a78461R710M6163k5149J4L682J5932O471J2971K586j7343q777K2906L902
6315a05393n757J4389Q609j0815K0653j7093J54l0048j1428P229M358m396M5864
6302h3674O294n1097J9952J9413n556l5437K0196K4566J924J715K0915R304o212
6289e7697l4190j1420n04j5158j793J8197R151J2209Q332j3155j2195J0336L7046
6276e0841O125k1433j0525O001J3348j2959J3825K904N857J3131k1953q644Q687
6263e6477K1136Q71j8773J5038L922l245N150J2458J470p757j0889L048L647o821
6249c7222M4111r06L762k6456j9131K1519M659q656N666N885l840K7730j4036
6236C085j9140j142J4026o593j4063J8218L5707J4797J3115o672p08j3375k2742
$$ plain form
6223 14513 20377 27330 41801 62055 43485 83905 89020 101121 92945 74169 83289 76762 93607
6210 93607 89891 91053 93385 74782 80222 71831 88352 115564 120789 103263 99276 114132 163869
6197 163869 150825 114289 114376 131990 132666 148749 160433 170758 166454 173793 169393 148884 143608
6184 143608 148101 153995 142466 166579 130340 133776 172796 186360 170241 190178 172653 204017
6172 204017 192973 188952 231222 232645 196849 202903 186682 160809 143108 160516 184034 170314
6160 170314 167325 194842 172668 157463 116024 130491 148299 110524 132854 151442 146981 176664
6148 176664 162065 147967 148891 149715 152176 162928 177954 197400 226076 188099 178230 173819 179022
6135 179022 205777 200966 203966 208076 199197 262448 280386 253966 254079 227575 219211 222456 248844
$$ packed form
6223A4513N864O953J4471K0254j8570M0420N115J2101q176j8776R120o527J6845
6210I3607l716J162K332j8603N440q391J6521K7212N225j7526l987J4856M9737
6197A63869j3044l6536Q7J7614O76J6083J1684J0325m304P339m400k0509n276
6184A43608M493N894j1529K4113l6239L436L9020J3564j6119J9937j7525L1364
6172B04017j1044m021M2270J423l5796O054j6221k5873j7701J7408K3518j3720
6160A70314k989K7517k2174j5205m1439J4467J7808l7775K2330J8588m461K9683
6148A76664j4599j4098R24Q24K461J0752J5026J9446K8676l7977r869m411N203
6135A79022K6755m811L000M110q879O3251J7938k6420J13k6504q364L245K6388
$$ plain form
6122 248844 232525 241490 280612 276981 278536 263639 254319 250484 267785 265395 258033 262707 302697
6109 302697 325709 329366 311108 311842 285962 292922 313777 317732 359875 373329 352984 371591 351425
6096 351425 351806 368717 360062 353012 376515 355873 353009 397860 416639 424039 413799 432973 436039
6083 436039 407454 414922 425458 430506 418614 400269 422429 425967 448757 447166 465887 540048
6071 540048 557812 542828 540925 554489 551747 548161 551380 568620 583538 571798 579411 595941 616233
6058 616233 616961 644711 639495 636875 633614 646611 661717 665856 689748 696316 694113 676904 685931
6045 685931 703441 717200 745985 781676 807447 837441 840794 886482 887780 883773 930380 933106
6033 933106 953346 968602 996434 1016259 1015834 1027819 1039477 1060272 1061352 1055449 1038671 1041881 1061100
$$ packed form
6122B48844j6319Q965L9122l631J555j4897r320l835J7301k390p362M674L9990
6109C02697K3012L657j8258P34k5880O960K0855L955M2143J3454k0345J8607k0166
6096C51425L81J6911q655p050K3503k0642k864M4851J8779P400j0240J9174L066
6083D36039k8585P468J0536N048j1892j8345K2160L538K2790j591J8721P4161
6071E40048J7764j4984j903J3564k742l586L219J7240J4918j1740P613J6530K0292
6058F16233P28K7750n216k620l261J2997J5106M139K3892O568k203j7209R027
6045F85931J7510J3759K8785L5691K5771K9994L353M5688J298m007M6607K726
6033I33106K0240J5256K7832J9825m25J1985J1658K0795J080n903j6778L210J9219
$$ plain form
6020 1061100 1077154 1094660 1099584 1073202 1090857 1099585 1125237 1140598 1154932 1168760 1178099 1217141
6008 1217141 1202262 1205005 1234172 1231658 1231334 1238662 1252545 1236672 1228635 1239591 1254432 1261112 1215151
5995 1215151 1204393 1180896 1174455 1160896 1169750 1174606 1198112 1239771 1249105 1234734 1206763 1198911
5983 1198911 1183975 1181405 1202800 1216087 1197769 1215846 1236463 1277719 1272064 1260170 1287573 1285674
5971 1285674 1309153 1326275 1339493 1360090 1344709 1342872 1349600 1305396 1301960 1325045 1355480 1392339
5959 1392339 1413184 1423521 1456574 1457263 1494684 1513125 1472942 1471460 1535988 1571586 1578810 1582975
5947 1582975 1623088 1633246 1633464 1638556 1681510 1711038 1714669 1716002 1732908 1737760 1751078 1801736 1801568
5934 1801568 1831956 1858118 1883263 1869117 1837577 1846194 1856053 1896560 1904578 1884990 1904254 1916688
$$ packed form
6020A061100J6054J7506M924k6382J7655Q728K5652J5361J4334J3828R339L9042
6008A217141j4879K743K9167k514l24P328J3883j5873q037J0956J4841O680m5961
5995A215151j0758k3497o441j3559Q854M856K3506M1659R334j4371k7971p852
5983A198911j4936k570K1395J3287j8318J8077K0617M1256n655j1894K7403j899
5971A285674K3479J7122J3218K0597j5381j837O728m4204l436K3085L0435L6859
5959A392339K0845J0337L3053O89L7421J8441m0183j482O4528L5598P224M165
5947A582975M0113J0158K18N092M2954K9528L631J333J6906M852J3318N0658j68
5934A801568L0388K6162K5145j4146l1540Q617R859M0507Q018j9588J9264J2434
$$ plain form
5922 1916688 1920682 1914346 1943744 1969283 2019625 1997879 2012302 2044200 2040689 2054162 2073781 2139425
5910 2139425 2152243 2180920 2192144 2178604 2164265 2167567 2202140 2201747 2208459 2221311 2253344 2290347
5898 2290347 2285528 2306720 2318184 2347516 2376994 2399349 2425484 2443658 2463493 2505393 2538214 2551248
5886 2551248 2564368 2597677 2640148 2665600 2647303 2654687 2682215 2684005 2713124 2738277 2736987 2736646
5874 2736646 2771405 2772713 2828262 2846514 2870214 2922070 2950627 3013141 3061977 3075177 3097434 3083975
5862 3083975 3111653 3135633 3173838 3166624 3171841 3197566 3236326 3251579 3221173 3254455 3308455 3314432
5850 3314432 3355303 3395569 3423220 3438096 3439633 3461801 3449219 3449589 3469405 3491944 3483807 3519545
5838 3519545 3581347 3630929 3661048 3678727 3673598 3734150 3771496 3805777 3816324 3850243 3871491 3881277
$$ packed form
5922A916688L994o336K9398K5539N0342k1746J4423L1898l511J3473J9619O5644
5910B139425J2818K8677J1224j3540j4339L302L4573l93O712J2852L2033L7003
5898B290347m819K1192J1464K9332K9478K2355K6135J8174J9835M1900L2821J3034
5886B551248J3120L3309M2471K5452j8297P384K7528J790K9119K5153j290l41
5874B736646L4759J308N5549J8252K3700N1856K8557O2514M8836J3200K2257j3459
5862C083975K7678K3980L8205p214N217K5725L8760J5253l0406L3282N4000N977
5850C314432M0871M0266K7651J4876J537K2168j2582L70J9816K2539q137L5738
5838C519545O1802M9582L0119J7679n129O0552L7346L4281J0547L3919K1248R786
$$ plain form
5826 3881277 3934845 3955440 3985778 4027580 4073006 4040587 4073580 4120698 4162109 4206777 4253287
5815 4253287 4305880 4328959 4391600 4419886 4462511 4526320 4582109 4654889 4703195 4776588 4809135
5804 4809135 4880861 4988294 5074216 5179012 5248303 5369029 5495837 5595427 5704343 5812104
5794 5812104 5909070 6020215 6122645 6220248 6359532 6502625 6616606 6743109 6866150 6963222
5784 6963222 7038025 7133019 7237595 7348558 7464729 7619667 7767394 7937943 8103332 8269940
5774 8269940 8459425 8654060 8853782 9043817 9242836 9392185 9580300 9780090 9959785 10182129
5764 10182129 10370259 10549140 10718975 10936728 11180592 11414406 11684448 11906466 12173561
5755 12173561 12445988 12721318 12977928 13270796 13579906 13903457 14267642 14634133 14994703
$$ packed form
5826C881277N3568K0595L0338M1802M5426l2419L2993M7118M1411M4668M6510
5815D253287N2593K3079O2641K8286M2625O3809N5789P2780M8306P3393L2547
5804D809135P1726J07433Q5922J04796O9291J20726J26808R9590J08916J07761
5794E812104R6966J11145J02430R7603J39284J43093J13981J26503J23041R7072
5784F963222P4803R4994J04576J10963J16171J54938J47727J70549J65389J66608
5774H269940J89485J94635J99722J90035J99019J49349J88115J99790J79695K22344
5764A0182129J88130J78881J69835K17753K43864K33814K70042K22018K67095
5755A2173561K72427K75330K56610K92868L09110L23551L64185L66491L60570
$$ plain form
5746 14994703 15332794 15686745 16040230 16388424 16777147 17171366 17587072 18057337 18552077
5737 18552077 19059228 19537078 20038372 20566794 21111077 21703847 22280818 22826541 23407163
5728 23407163 23991257 24576502 25138682 25776141 26430200 27180571 27926696 28744090 29617420
5719 29617420 30596432 31705837 32906283 34279786 35774328 37475688 39376463 41478924
5711 41478924 43842361 46484354 49389036 52532692 55857100 59277062 62660101 65920471
5703 65920471 68803904 71238651 73164798 74595391 75541229 75993901 76017400 75594404 74881889
5694 74881889 74069381 73283070 72688464 72432372 72572647 73244071 74499353 76381464 78875024
5685 78875024 82010707 85713195 89884243 94380824 98878051 103066094 106401106 108306007
$$ packed form
5746A4994703L38091L53951L53485L48194L88723L94219M15706M70265M94740
5737A8552077N07151M77850N01294N28422N44283N92770N76971N45723N80622
5728B3407163N84094N85245N62180O37459O54059P50371P46125Q17394Q73330
5719B9617420R79012J109405J200446J373503J494542J701360J900775K102461
5711D1478924K363437K641993K904682L143656L324408L419962L383039L260370
5703F5920471K883433K434747J926147J430593R45838M52672K3499m22996p12515
5694G4881889q12508p86311n94606k56092J40275O71424J255282J882111K493560
5685G8875024L135683L702488M171048M496581M497227M188043L335012J904901
$$ plain form
5677 108306007 108408932 106558910 102901581 97877791 91998912 85736571 79511392 73584930
5669 73584930 68151231 63296211 58998310 55196557 51919489 49082564 46582013 44430220
5661 44430220 42594743 41035190 39731360 38615392 37672525 36952744 36355633 35885766 35545342
5652 35545342 35383967 35274289 35159588 35112030 35057995 34959618 34828702 34680496 34497945 34301133
5642 34301133 34151969 34024783 33979982 34003846 34096365 34263985 34529803 34799184 35143163 35446889
5632 35446889 35723590 35975601 36151640 36269738 36278862 36245995 36133251 35998807 35906392 35838419
5622 35838419 35872458 35924695 36068581 36302735 36528308 36791086 37085856 37422499 37682142 37902477
5612 37902477 38020776 37992464 37814732 37541504 37229683 36903886 36649189 36383140 36202955 36126240
$$ packed form
5677A08306007J02925j850022l657329n023790n878879o262341o225179n926462
5669G3584930n433699m855020m297901l801753l277068k836925k500551k151793
5661D4430220j835477j559553j303830j115968r42867p19781n97111m69867l40424
5652C5545342j61375j09678j14701m7558n4035r8377j30916j48206j82551j96812
5642C4301133j49164j27186m4801K3864R2519J67620K65818K69381L43979L03726
5632C5446889K76701K52011J76039J18098R124l2867j12744j34444r2415o7973
5622C5838419L4039N2237J43886K34154K25573K62778K94770L36643K59643K20335
5612C7902477J18299k8312j77732k73228l11821l25797k54697k66049j80185p6715
$$ plain form
5602 36126240 36113547 36153036 36266169 36452597 36704443 37005028 37294115 37572941 37870530 37968243
5592 37968243 37897826 37656470 37246370 36773781 36254148 35679321 35085399 34486365 33844938 33244612
5582 33244612 32639812 32107878 31682165 31311741 30981146 30693535 30414506 30096539 29755634
5573 29755634 29348850 28831885 28266698 27598333 26876188 26092112 25270510 24366350 23487811
5564 23487811 22578680 21725024 20936540 20175990 19510026 18886555 18334010 17869778 17445492
5555 17445492 17098472 16762714 16491467 16218165 15953685 15705849 15445801 15131849 14792756
5546 14792756 14443142 14119522 13729544 13367021 13040746 12662789 12290695 11894233 11574387
5537 11574387 11277713 10936978 10604938 10273639 9973966 9759911 9499197 9282504 9071137
$$ packed form
5602C6126240j2693L9489J13133J86428K51846L00585K89087K78826K97589R7713
5592C7968243p0417k41356m10100m72589n19633n74827n93922n99034o41427o00326
5582C3244612o04800n31934m25713l70424l30595k87611k79029l17967l40905
5573B9755634m06784n16965n65187o68365p22145p84076q21602r04160q78539
5564B3487811r09131q53656p88484p60550o65964o23471n52545m64232m24286
5555A7445492l47020l35758k71247k73302k64480k47836k60048l13952l39093
5546A4792756l49614l23620l89978l62523l26275l77957l72094l96462l19846
5537A1574387k96674l40735l32040l31299k99673k14055k60714k16693k11367
$$ plain form
5528 9071137 8842846 8657251 8492689 8278363 8104383 7973485 7835495 7680538 7544518 7432395
5518 7432395 7307432 7190324 7082099 6969761 6824693 6741670 6677745 6572750 6439440 6416737
5508 6416737 6371952 6305406 6227422 6141787 6142041 6070616 5998922 5943283 5880471 5835621 5759045 5686829
5496 5686829 5635372 5568714 5578786 5528181 5498420 5457400 5406983 5344803 5294320 5264410 5213282
5485 5213282 5220671 5183923 5146598 5137935 5138191 5104793 5083398 5100660 5077267 5038030 5015074 5005540
5473 5005540 4994605 4972732 4955336 4982864 4983839 4971085 4966757 4965159 4963560 4939564 4928033 4952602
5461 4952602 4984993 4992129 4943850 4957985 4967815 4932142 4954249 4965898 4967119 4969941 4975719 4994927
5449 4994927 4998474 4998289 4997034 4945897 4935196 4956862 4967203 4991461 4975964 4931095 4908960 4912873
$$ packed form
5528I071137k28291j85595j64562k14326j73980j30898j37990j54957j36020j12123
5518G432395j24963j17108j08225j12338j45068q3023o3925j04995j33310k2703
5508F416737m4785o6546p7984q5635K54p1425p1694n5639o2812m4850p6576p2216
5496E686829n1457o6658J0072n0605k9761m1020n0417o2180n0483k9910n1128
5485E213282P389l6748l7325q663K56l3398k1395J7262k3393l9237k2956r534
5473E005540j0935k1873j7396K7528R75j2754m328j598j599k3996j1531K4569
5461D952602L2391P136m8279J4135R830l5673K2107J1649J221K822N778J9208
5449D994927L547j85j255n1137j0701K1666J0341K4258j5497m4869k2135L913
$$ plain form
5437 4912873 4893545 4913073 4946553 4936436 4957561 4963725 4936171 4938539 4952514 4963973 4956813 4966756
5425 4966756 4973871 4986181 5009347 5025394 5011764 5010303 5026135 4994922 5011452 5023199 4990382 5006816
5413 5006816 5035881 5021001 5016383 5048098 5061028 5047376 5059127 5039054 5053358 5103117 5103881 5123688
5401 5123688 5174754 5205674 5211263 5217883 5212699 5231991 5272653 5295988 5319745 5359720 5358890 5365462 5374990
5388 5374990 5364190 5355311 5363413 5430562 5448758 5502990 5549875 5585398 5626169 5673084 5677940 5675869
5376 5675869 5740281 5800125 5861689 5855293 5865720 5912970 5954796 5995970 6044281 6060942 6091899 6126696
5364 6126696 6179748 6235964 6207503 6186972 6194551 6189305 6226671 6206842 6242773 6270725 6249118 6250501
5352 6250501 6254958 6300488 6341606 6379923 6370615 6389454 6403214 6441309 6484812 6498230 6501725 6543537
$$ packed form
5437D912873j9328J9528L3480j0117K1125O164k7554K368J3975J1459p160R943
5425D966756P115J2310K3166J6047j3630j461J5832l1213J6530J1747l2817J6434
5413E006816K9065j4880m618L1715J2930j3652J1751k0073J4304M9759P64J9807
5401E123688N1066L0920N589O620n184J9292M0662K3335K3757L9975q30O572R528
5388E374990j0800q879Q102O7149J8196N4232M6885L5523M0771M6915M856k071
5376E675869O4412N9844O1564o396J0427M7250M1826M1174M8311J6661L0957L4797
5364F126696N3052N6216k8461k0531P579n246L7366j9829L5931K7952k1607J383
5352F250501M457M5530M1118L8317r308J8839J3760L8095M3503J3418L495M1812
$$ plain form
5340 6543537 6576321 6580269 6626638 6675719 6679252 6702834 6724402 6756058 6809781 6822227 6840604 6841884
5328 6841884 6833741 6836725 6870078 6870456 6875983 6898479 6892997 6913174 6922664 6926945 6973877 7013989 7045467
5315 7045467 7087534 7124553 7169414 7181594 7210510 7243733 7291617 7325430 7339333 7344144 7389709 7437937
5303 7437937 7494381 7552631 7603780 7627703 7655241 7680780 7693260 7699177 7741299 7767936 7774827 7788091
5291 7788091 7819189 7855851 7899269 7907918 7877874 7944348 7990151 8024548 8085746 8109912 8155530 8218910
5279 8218910 8273101 8339758 8408027 8487828 8554154 8661099 8722472 8772675 8800716 8822025 8886243
5268 8886243 8932528 8948064 8995395 9016239 9079448 9133253 9160460 9213378 9258262 9270486 9279827 9313202
5256 9313202 9342050 9391952 9404757 9415403 9428288 9458978 9496404 9502323 9502052 9480598 9474820 9445212
$$ packed form
5340F543537L2784L948M6369M9081L533K3582K1568L1656N3723J2446J8377J280
5328F841884q143K984L3353L78N527K2496n482K0177R490M281M6932M0112L1478
5315G045467M2067L7019M4861J2180K8916L3223M7884L3813J3903M811M5565M8228
5303G437937N6444N8250N1149K3923K7538K5539J2480N917M2122K6637O891J3264
5291G788091L1098L6662M3418Q649l0044O6474M5803L4397O1198K4166M5618O3380
5279H218910N4191O6657O8269P9801O6326J06945O1373N0203K8041K1309O4218
5268H886243M6285J5536M7331K0844O3209N3805K7207N2918M4884J2224R341L3375
5256I313202K8848M9902J2805J0646J2885L0690L7426N919k71k1454n778k9608
$$ plain form
5244 9445212 9403210 9371067 9357647 9336701 9343301 9352247 9347025 9364474 9314649 9305898 9289671 9278291
5232 9278291 9276873 9287161 9276874 9233133 9241312 9259806 9272939 9266271 9276219 9289859 9297456 9340300
5220 9340300 9351574 9345905 9322298 9348999 9378390 9394470 9411629 9421797 9442743 9474449 9524510 9541935
5208 9541935 9534058 9537793 9570114 9573399 9593887 9565317 9590442 9641916 9665451 9686985 9648735 9645026
5196 9645026 9665797 9687206 9694150 9730153 9766596 9778754 9798106 9808580 9821911 9833584 9822481 9822978
5184 9822978 9817898 9819733 9824835 9849230 9873094 9862481 9879502 9875897 9884885 9885067 9882910 9903784 9937655
5171 9937655 9951672 9947514 9953401 9955556 9956836 9971030 9971696 9962511 9988200 10010026 10006805 10053888 10026005
5158 10026005 10041462 10031286 10011294 10021125 10039378 10031503 10042212 10070205 10097726 10057770 10051006 10058718
$$ packed form
5244I445212m2002l2143j3420k0946O600Q946n222J7449m9825q751j6227j1380
5232I278291j418J0288j0287m3741Q179J8494J3133o668R948J3640P597M2844
5220I340300J1274n669k3607K6701K9391J6080J7159J0168K0946L1706N0061J7425
5208I541935p877L735L2321L285K0488k8570K5125N1474K3535K1534l8250l709
5196I645026K0771K1409O944L6003L6443J2158J9352J0474J3331J1673j1103M97
5184I822978n080J835N102K4395K3864j0613J7021l605Q988J82k157K0874L3871
5171I937655J4017m158N887K155J280J4194O66r185K5689K1826l221M7083k7883
5158A0026005J5457j0176j9992R831J8253p875J0709K7993K7521l9956o764P712
$$ plain form
5146 10058718 10074607 10090973 10050196 10074408 10094966 10093951 10069266 10080524 10073524 10060482 10060449 10081746
5134 10081746 10080753 10081846 10114356 10133335 10045765 9989993 10003631 10003701 10048845 10049745 10020410 10028303 10010050
5121 10010050 10016973 9996424 9988634 9969660 9980160 9972806 9926060 9887922 9915665 9911005 9908137 9917008
5109 9917008 9908688 9902531 9858587 9820994 9818894 9808161 9815187 9804969 9795448 9762016 9735632 9707643
5097 9707643 9716540 9720672 9704051 9685541 9649325 9648073 9634602 9645185 9625206 9588534 9597043 9579809
5085 9579809 9543603 9530222 9525816 9500704 9479931 9438750 9436373 9436978 9441807 9403978 9359870 9382568
5073 9382568 9384970 9367325 9296749 9248169 9263372 9247444 9206475 9173821 9168092 9152281 9137297 9118069
5061 9118069 9077079 9040455 9028886 9041139 9013937 8969042 8936651 8917348 8879290 8859085 8835989
$$ packed form
5146A0058718J5889J6366m0777K4212K0558j015k4685J1258p000j3042l3K1297
5134A0081746r93J093L2510J8979q7570n5772J3638P0M5144R00k9335P893j8253
5121A0010050O923k0549p790j8974J0500p354m6746l8138K7743m660k868Q871
5109I917008q320o157m3944l7593k100j0733P026j0218r521l3432k6384k7989
5097I707643Q897M132j6621j8510l6216j252j3471J0583j9979l6672Q509j7234
5085I579809l6206j3381m406k5112k0773m1181k377O05M829l7829m4108K2698
5073I382568K402j7645p0576m8580J5203j5928m0969l2654n729j5811j4984j9228
5061I118069m0990l6624j1569J2253k7202m4895l2391j9303l8058k0205k3096
$$ plain form
5050 8835989 8861315 8835328 8826414 8779821 8696340 8667858 8654613 8626114 8615248 8596608 8578064 8551055
5038 8551055 8526524 8478758 8460355 8467770 8476666 8422529 8365334 8335989 8355841 8321691 8268299 8269332
5026 8269332 8254140 8225316 8175706 8141163 8127701 8089746 8067383 8051520 8019781 7995143 7965312
5015 7965312 7932300 7899726 7864398 7866708 7887312 7839848 7811658 7794538 7738644 7696310 7651608 7659097
5003 7659097 7654600 7606281 7610643 7614668 7609509 7549772 7519995 7495220 7459869 7462128 7442672 7431601
4991 7431601 7427023 7408213 7390452 7369565 7356401 7310515 7302019 7318879 7337643 7304731 7279210 7278141
4979 7278141 7277298 7284555 7279148 7247652 7244982 7257196 7281249 7260754 7260147 7309150 7319407 7315422 7320321
4966 7320321 7350262 7313485 7304007 7327710 7330143 7337819 7363980 7365842 7376395 7356236 7382599 7379284
$$ packed form
5050H835989K5326k5987q914m6593q3481k8482j3245k8499j0866j8640j8544k7009
5038H551055k4531m7766j8403P415Q896n4137n7195k9345J9852l4150n3392J033
5026H269332j5192k8824m9610l4543j3462l7955k2363j5863l1739k4638k9831
5015G965312l3012l2574l5328K310K0604m7464k8190j7120n5894m2334m4702P489
5003G659097m497m8319M362M025n159n9737k9777k4775l5351K259j9456j1071
4991G431601m578j8810j7761k0887j3164m5886q496J6860J8764l2912k5521j069
4979G278141q43P257n407l1496k670J2214K4053k0495o07M9003J0257l985M899
4966G320321K9941l6777r478K3703K433P676K6161J862J0553k0159K6363l315
$$ plain form
4954 7379284 7323480 7276120 7254657 7255535 7203510 7171002 7100245 7026158 6970435 6893927 6849715 6784658
4942 6784658 6725152 6685958 6641698 6565370 6514631 6457985 6393980 6350202 6299833 6287777 6242651
4931 6242651 6207385 6163085 6124268 6080731 6077872 6016460 5981951 5977786 5940398 5929691 5916999 5871405
4919 5871405 5830994 5803030 5821355 5823504 5831631 5822080 5803773 5783747 5788220 5791048 5796432 5795569 5775670
4906 5775670 5813937 5818342 5846983 5844440 5851769 5873766 5907805 5965367 5980775 5969258 5984652 5989914
4894 5989914 5991132 5994754 6019265 6065298 6045524 6022670 5998225 5997598 5958875 5927254 5856685 5803210
4882 5803210 5777750 5745927 5689742 5594722 5537165 5460669 5416574 5372079 5304106 5222113 5182045
4871 5182045 5110819 5020641 4955695 4907158 4890978 4851639 4804124 4769571 4731601 4663835 4624341
$$ packed form
4954G379284n5804m7360k1463Q78n2025l2508p0757p4087n5723p6508m4212o5057
4942F784658n9506l9194m4260p6328n0739n6646o4005m3778n0369j2056m5126
4931F242651l5266m4300l8817m3537k859o1412l4509m165l7388j0707j2692m5594
4919E871405m0411k7964J8325K149Q127r551j8307k0026M473K828N384q63j9899
4906E775670L8267M405K8641k543P329K1997L4039N7562J5408j1517J5394N262
4894E989914J218L622K4511M6033j9774k2854k4445o27l8723l1621p0569n3475
4882E803210k5460l1823n6185r5020n7557p6496m4095m4495o7973q1993m0068
4871E182045p1226r0178o4946m8537j6180l9339m7515l4553l7970o7766l9494
$$ plain form
4860 4624341 4626930 4571032 4532959 4485742 4459244 4404428 4395811 4357592 4359554 4329486 4302116 4287606
4848 4287606 4261729 4253418 4234136 4191445 4146663 4146283 4103530 4082435 4096949 4063472 4001881 4007392
4836 4007392 4015308 4052097 4027732 3967559 3975915 4004264 3969538 3948359 3909437 3935329 3920352 3898111
4824 3898111 3893712 3893379 3883307 3858710 3873029 3851455 3828986 3800187 3793125 3768339 3760031 3772252
4812 3772252 3756661 3726745 3739449 3753696 3735243 3681352 3663693 3680032 3663083 3639467 3604881
4801 3604881 3587413 3613147 3608582 3593059 3588625 3583462 3559908 3554829 3526957 3518401 3553286 3521440
4789 3521440 3505735 3519816 3493152 3485658 3478602 3457596 3464831 3447443 3426800 3466980 3460912 3450310
4777 3450310 3422628 3425442 3442757 3435032 3443234 3455642 3451403 3465894 3486969 3487764 3520990 3543362 3518494
$$ packed form
4860D624341K589n5898l8073m7217k6498n4816q617l8219J962l0068k7370j4510
4848D287606k5877q311j9282m2691m4782l80m2753k1095J4514l3477o1591N511
4836D007392P916L6789k4365o0173Q356K8349l4726k1179l8922K5892j4977k2241
4824C898111m399l33j0072k4597J4319k1574k2469k8799p062k4786q308J2221
4812C772252j5591k9916J2704J4247j8453n3891j7659J6339j6949k3616l4586
4801C604881j7468K5734m565j5523m434n163k3554n079k7872q556L4885l1846
4789C521440j5705J4081k6664p494p056k1006P235j7388k0643M0180o068j0602
4777C450310k7682K814J7315p725Q202J2408m239J4491K1075P95L3226K2372k4868
$$ plain form
4764 3518494 3531621 3559146 3564431 3586669 3629386 3641208 3669939 3684699 3656112 3655964 3676113 3664328
4752 3664328 3624501 3613364 3599081 3604726 3587143 3564172 3531868 3539749 3520473 3532959 3500679 3508018
4740 3508018 3527740 3527553 3517706 3520686 3540100 3547265 3544256 3539496 3533417 3504399 3473185 3466709 3471200
4727 3471200 3473977 3466426 3456406 3403778 3369173 3362869 3336322 3282057 3306253 3279317 3254001 3252932
4715 3252932 3242469 3248464 3196845 3168961 3156743 3173963 3165265 3138919 3133350 3133291 3130148 3134965 3122367
4702 3122367 3116920 3117882 3132057 3152174 3171659 3136881 3123601 3135044 3113266 3160765 3163729 3175740
4690 3175740 3196748 3216809 3216356 3190815 3217197 3208507 3226914 3224504 3232020 3247215 3285985 3291725 3293936
4677 3293936 3343154 3360096 3382494 3380956 3397391 3390398 3418626 3459828 3467637 3488389 3529130 3609989
$$ packed form
4764C518494J3127K7525N285K2238M2717J1822K8731J4760k8587j48K0149j1785
4752C664328l9827j1137j4283N645j7583k2971l2304P881j9276J2486l2280P339
4740C508018J9722j87r847K980J9414P165l009m760o079k9018l1214o476M491
4727C471200K777p551j0020n2628l4605o304k6547n4265K4196k6936k5316j069
4715C252932j0463N995n1619k7884j2218J7220q698k6346n569n9l143M817j2598
4702C122367n447R62J4175K0117J9485l4778j3280J1443k1778M7499K964J2011
4690C175740K1008K0061m53k5541K6382q690J8407k410P516J5195L8770N740K211
4677C293936M9218J6942K2398j538J6435o993K8228M1202P809K0752M0741Q0859
$$ plain form
4665 3609989 3641063 3637832 3613455 3645966 3625484 3658228 3669832 3705715 3736657 3766340 3805856 3825389
4653 3825389 3837164 3836486 3828900 3881157 3914683 3961135 3992864 4033390 4053188 4075135 4109635 4098991
4641 4098991 4151671 4196418 4240015 4282749 4303079 4361491 4399869 4446631 4502088 4555557 4566887
4630 4566887 4604270 4701109 4785543 4864589 4932112 5013528 5073841 5133139 5220904 5282928 5345889
4619 5345889 5467565 5563366 5682284 5823794 5927611 6067840 6241344 6366960 6515936 6636335
4609 6636335 6788183 6934475 7103133 7292155 7449707 7597817 7818277 7990449 8166726 8362221
4599 8362221 8552244 8779467 9035849 9289861 9574778 9844425 10129077 10420227 10770279 11191571
4589 11191571 11617140 12083454 12593599 13143096 13763608 14444133 15149449 15903876 16687092
$$ packed form
4665C609989L1074l231k4377L2511k0482L2744J1604L5883L0942K9683L9516J9533
4653C825389J1775o78p586N2257L3526M6452L1729M0526J9798K1947L4500j0644
4641D098991N2680M4747M3597M2734K0330N8412L8378M6762N5457N3469J1330
4630D566887L7383R6839Q4434P9046O7523Q1416O0313N9298Q7765O2024O2961
4619E345889J21676R5801J18918J41510J03817J40229J73504J25616J48976J20399
4609F636335J51848J46292J68658J89022J57552J48110K20460J72172J76277J95495
4599H362221J90023K27223K56382K54012K84917K69647K84652K91150L50052M21292
4589A1191571M25569M66314N10145N49497O20512O80525P05316P54427P83216
$$ plain form
4580 16687092 17414456 18110732 18707634 19162548 19479293 19574592 19592315 19527705 19337822 19196867
4570 19196867 19067450 18984187 19037902 19204765 19460181 19765858 20179559 20659477 21111227 21546792
4560 21546792 21849090 21965340 21958415 21741448 21400586 20912438 20286072 19731005 19229437 18724303
4550 18724303 18287770 18011428 17826470 17712747 17700151 17771784 17889526 18072332 18350673 18719321
4540 18719321 19114398 19602822 20186633 20861159 21614604 22480523 23455236 24529055 25737847
4531 25737847 27033501 28456894 29967555 31591675 33191483 34808078 36323406 37636598
4523 37636598 38649012 39316191 39632749 39599826 39342024 38872626 38333707 37782895 37248008
4514 37248008 36844432 36571946 36462852 36485695 36547855 36642762 36737199 36678934 36428239 35916443
$$ packed form
4580A6687092P27364O96276N96902M54914L16745R5299J7723o4610j89883j40955
4570A9196867j29417q3263N3715J66863K55416L05677M13701M79918M51750M35565
4560B1546792L02298J16250o925k16967l40862m88148o26366n55067n01568n05134
4550A8724303m36533k76342j84958j13723j2596P1633J17742J82806K78341L68648
4540A8719321L95077M88424N83811O74526P53445Q65919R74713J073819J208792
4531B5737847J295654J423393J510661J624120J599808J616595J515328J313192
4523C7636598J012414O67179L16558l2923k57802m69398n38919n50812n34887
4514C7248008m03576k72486j09094K2843O2160R4907R4437n8265k50695n11796
$$ plain form
4504 35916443 35117023 34079575 32745514 31298779 29812776 28280721 26789852 25343152
4496 25343152 24028391 22806852 21735412 20790408 19936217 19209840 18592932 18068257 17596528
4487 17596528 17192741 16895736 16616547 16355930 16221168 16106822 16044376 16033004 16027552 16092424
4477 16092424 16185056 16336061 16513225 16767183 17095764 17480488 17966717 18488841 19121553 19919197
4467 19919197 20809857 21789217 22871603 24062250 25414537 26874811 28396032 29945071
4459 29945071 31342794 32524163 33463670 33923836 33914290 33443384 32569847 31443410 30172895
4450 30172895 28847943 27528411 26289082 25207622 24295226 23534112 22871287 22302361 21898411
4441 21898411 21549434 21288869 21158742 21146109 21234229 21393922 21643792 21964076 22422649 22996325
$$ packed form
4504C5916443p99420j037448j334061j446735j486003j532055j490869j446700
4496B5343152j314761j221539j071440r45004q54191p26377o16908n24675m71729
4487A7596528m03787k97005k79189k60617j34762j14346o2446j1372n452O4872
4477A6092424R2632J51005J77164K53958L28581L84724M86229N22124O32712P97644
4467A9919197Q90660R79360J082386J190647J352287J460274J521221J549039
4459B9945071J397723J181369R39507M60166r546m70906q73537j126437j270515
4450C0172895j324952j319532j239329j081460r12396p61114o62825n68926m03950
4441B1898411l48977k60565j30127j2633Q8120J59693K49870L20284M58573N73676
$$ plain form
4431 22996325 23665873 24430330 25291872 26275853 27405321 28575060 29773679 30956805 31944523
4422 31944523 32687538 33038874 32955157 32422801 31554033 30436302 29163701 27889555 26723641
4413 26723641 25660132 24735419 23992018 23469732 23165463 22960476 22915943 22985792 23156975 23335899
4403 23335899 23414627 23392469 23120626 22594208 21945071 21167016 20355048 19546454 18799227 18106389
4393 18106389 17527296 16988250 16547117 16226351 15910109 15590100 15220870 14832571 14493491
4384 14493491 14203105 13940466 13738859 13574697 13520271 13530733 13625423 13800115 14074660 14381551
4374 14381551 14798049 15238172 15696191 16194479 16661228 17078015 17242731 17188938 16885556 16342585
4364 16342585 15627978 14764439 13882345 13037754 12233468 11475093 10786581 10209411 9701154
$$ packed form
4431B2996325O69548P64457Q61542R83981J129468J169739J198619J183126R87718
4422C1944523P43015L51336q3717n32356q68768j117731j272601j274146j165914
4413B6723641j063509r24713p43401n22286l04269k04987m4533O9849J71183J78924
4403B3335899P8728k2158k71843n26418o49137p78055q11968q08594p47227o92838
4393A8106389n79093n39046m41133l20766l16242l20009l69230l88299l39080
4384A4493491k90386k62639k01607j64162n4426J0462R4690J74692K74545L06891
4374A4381551M16498M40123M58019M98288M66749M16787J64716n3793l03382n42971
4364A6342585p14607q63539q82094q44591q04286p58375o88512n77170n08257
$$ plain form
4355 9701154 9265134 8903252 8568876 8272186 8001101 7755843 7527696 7323173 7142572 6969232
4345 6969232 6805466 6660097 6525635 6426384 6343857 6275289 6191490 6138160 6100742 6054168 5998748
4334 5998748 5961508 5921371 5859086 5769295 5708070 5634624 5554365 5471597 5386691 5367786 5323460
4323 5323460 5243315 5175432 5127276 5110016 5078474 5027857 5002924 4965226 4939345 4888925 4835809
4312 4835809 4775676 4741747 4728762 4690682 4626518 4607847 4591812 4598712 4601666 4590020 4579270 4596714
4300 4596714 4660646 4674172 4648234 4618814 4602578 4607762 4585018 4601039 4631988 4633979 4608652 4585122
4288 4585122 4541962 4522228 4494410 4469789 4460257 4459611 4441769 4445958 4454213 4442489 4420256 4413345 4426765
4275 4426765 4441060 4470449 4504506 4511107 4572874 4635921 4687663 4747556 4777841 4843195 4879428 4921119
$$ packed form
4355I701154m36020l61882l34376k96690k71085k45258k28147k04523j80601j73340
4345F969232j63766j45369j34462r9251q2527o8568q3799n3330l7418m6574n5420
4334E998748l7240m0137o2285q9791o1225p3446q0259q2768q4906j8905m4326
4323E323460q0145o7883m8156j7260l1542n0617k4933l7698k5881n0420n3116
4312D835809o0133l3929j2985l8080o4164j8671j6035O900K954j1646j0750J7444
4300D596714O3932J3526k5938k9420j6236N184k2744J6021L0949J991k5327k3530
4288D585122m3160j9734k7818k4621r532o46j7842M189Q255j1724k2233o911J3420
4275D426765J4295K9389L4057O601O1767O3047N1742N9893L0285O5354L6233M1691
$$ plain form
4263 4921119 4965267 4990407 5037090 5039717 5102622 5188110 5198380 5278553 5332462 5383525 5420446 5455656
4251 5455656 5532567 5533744 5528937 5546350 5579244 5602836 5607931 5616165 5607526 5601364 5628304 5613205 5611474
4238 5611474 5655867 5673637 5740759 5796528 5842556 5935828 6034639 6127180 6194510 6249975 6363625
4227 6363625 6469444 6548600 6652791 6832257 6982947 7145501 7255001 7403404 7537651 7685058
4217 7685058 7834133 7950096 8053894 8177186 8319955 8470413 8631045 8748126 8834690 8942285
4207 8942285 9053129 9221006 9420395 9643101 9891362 10141793 10373151 10662589 10915978 11164449
4197 11164449 11431444 11704472 11935137 12163653 12412366 12636943 12870926 13033261 13236499
4188 13236499 13357540 13450926 13558652 13673991 13788246 13949748 14102258 14254364 14455273 14626965
$$ packed form
4263D921119M4148K5140M6683K627O2905Q5488J0270Q0173N3909N1063L6921L5210
4251E455656P6911J177m807J7413L2894K3592N095Q234q639o162K6940j5099j731
4238E611474M4393J7770O7122N5769M6028R3272R8811R2541O7330N5465J13650
4227F363625J05819P9156J04191J79466J50690J62554J09500J48403J34247J47407
4217G685058J49075J15963J03798J23292J42769J50458J60632J17081Q6564J07595
4207H942285J10844J67877J99389K22706K48261K50431K31358K89438K53389K48471
4197A1164449K66995K73028K30665K28516K48713K24577K33983J62335K03238
4188A3236499J21041R3386J07726J15339J14255J61502J52510J52106K00909J71692
$$ plain form
4178 14626965 14797427 14968156 15110668 15230960 15376429 15586823 15794958 16018544 16246751
4169 16246751 16486245 16714964 16978753 17214133 17451409 17675168 17862246 18047515 18241161
4160 18241161 18424170 18665648 18935809 19225628 19610979 20054050 20515511 20944387 21394580
4151 21394580 21898294 22419677 22964785 23581064 24215115 24855911 25557164 26321753 27119048
4142 27119048 28028643 29002387 29992467 30993787 32125597 33337059 34584471 35874215 37187318
4133 37187318 38483769 39744369 41055695 42461262 43942989 45602405 47471408 49600729
4125 49600729 51872753 54307010 56927699 59659749 62523193 65653021 69110419 72992480
4117 72992480 77344599 82340610 88147586 94848817 102710135 111852896 122574201 135042243
$$ packed form
4178A4626965J70462J70729J42512J20292J45469K10394K08135K23586K28207
4169A6246751K39494K28719K63789K35380K37276K23759J87078J85269J93646
4160A8241161J83009K41478K70161K89819L85351M43071M61461M28876M50193
4151B1394580N03714N21383N45108O16279O34051O40796P01253P64589P97295
4142B7119048R09595R73744R90080J001320J131810J211462J247412J289744J313103
4133C7187318J296451J260600J311326J405567J481727J659416J869003K129321
4125D9600729K272024K434257K620689K732050K863444L129828L457398L882061
4117G2992480M352119M996011N806976O701231P861318R142761J0721305J2468042
$$ plain form
4109 135042243 149512214 166451350 186473455 210231647 237703952 267413757 295865802
4102 295865802 318114345 328753187 324195327 305608530 278048625 247773882 218588687
4095 218588687 192291888 169586172 150527963 134655874 121330657 110007876 100368407
4088 100368407 92169352 85152285 79084346 73744849 68872977 64271592 59985686 55983878
4080 55983878 52358261 49095858 46210724 43685006 41453138 39442573 37538144 35777190
4072 35777190 34098282 32474859 30929511 29575624 28275339 27073554 26033209 25093713
4064 25093713 24278138 23522617 22828047 22160918 21499291 20843437 20237140 19660256 19133112
4055 19133112 18609930 18109562 17659816 17271946 16871048 16505627 16180010 15921329 15685647
$$ packed form
4109A35042243J4469971J6939136K0022105K3758192K7472305K9709805K8452045
4102B95865802K2248543J0638842m557860j8586797k7559905l0274743k9185195
4095B18588687k6296799k2705716j9058209j5872089j3325217j1322781r639469
4088A00368407q199055p017067o067939n339497m871872m601385m285906m001808
4080E5983878l625617l262403k885134k525718k231868k010565j904429j760954
4072C5777190j678908j623423j545348j353887j300285j201785j040345r39496
4064B5093713q15575p55521o94570o67129o61627o55854o06297n76884n27144
4055A9133112n23182n00368m49746l87870m00898l65421l25617k58681k35682
$$ plain form
4046 15685647 15478848 15318117 15118174 14830402 14576278 14309127 14011584 13701824 13400376
4037 13400376 13147406 12920244 12725894 12576787 12438791 12388261 12386025 12351339 12338425 12315098
4027 12315098 12259248 12130733 11989427 11879271 11787973 11726989 11693550 11647043 11590785 11548650 11497091
4016 11497091 11415162 11346436 11306593 11284290 11294800 11323292 11334124 11309357 11316294 11345620 11390183
4005 11390183 11476133 11591109 11674464 11832761 12033895 12259718 12497170 12760573 13000546 13314258
3995 13314258 13643410 13955879 14247806 14567092 14733189 14777232 14777525 14699230 14626032 14546849 14467968
3984 14467968 14459940 14505649 14591792 14704677 14794610 14895271 14976604 15042538 15115719 15218400 15305105
3973 15305105 15392206 15495564 15678497 15851894 16019446 16240596 16461577 16657261 16837572 17013460
$$ packed form
4046A5685647k06799j60731j99943k87772k54124k67151k97543l09760l01448
4037A3400376k52970k27162j94350j49107j37996n0530k236l4686j2914k3327
4027A2315098n5850j28515j41306j10156r1298o0984l3439m6507n6258m2135n1559
4016A1497091q1929o8726l9843k2303J0510K8492J0832k4767O937K9326M4563
4005A1390183Q5950J14976Q3355J58297K01134K25823K37452K63403K39973L13712
3995A3314258L29152L12469K91927L19286J66097M4043K93p8295p3198p9183p8881
3984A4467968q028M5709Q6143J12885Q9933J00661Q1333O5934P3181J02681Q6705
3973A5305105Q7101J03358J82933J73397J67552K21150K20981J95684J80311J75888
$$ plain form
3963 17013460 17241619 17473351 17674769 17912413 18140530 18362569 18647648 18942946 19263972
3954 19263972 19628731 20053354 20494282 20975053 21549768 22132855 22732206 23385069 24065265
3945 24065265 24800685 25584582 26409760 27314838 28252574 29226590 30294183 31398661 32580961
3936 32580961 33857656 35206349 36679280 38256699 39907545 41670020 43506041 45384708
3928 45384708 47373354 49396141 51526492 53707809 55964647 58300633 60735523 63224521
3920 63224521 65772217 68399715 71110700 73860760 76658260 79467765 82320383 85238261
3912 85238261 88078017 90970483 93805163 96585708 99288536 101889061 104329900 106662363
3904 106662363 108853252 110916455 112827477 114622825 116260029 117788602 119114246 120234813
$$ packed form
3963A7013460K28159K31732K01418K37644K28117K22039K85079K95298L21026
3954A9263972L64759M24623M40928M80771N74715N83087N99351O52863O80196
3945B4065265P35420P83897Q25178R05078R37736R74016J067593J104478J182300
3936C2580961J276695J348693J472931J577419J650846J762475J836021J878667
3928D5384708J988646K022787K130351K181317K256838K335986K434890K488998
3920F3224521K547696K627498K710985K750060K797500K809505K852618K917878
3912H5238261K839756K892466K834680K780545K702828K600525K440839K332463
3904A06662363K190889K063203J911022J795348J637204J528573J325644J120567
$$ plain form
3896 120234813 121141359 121746620 122096100 122159258 121905928 121401181 120651289 119686022 118533911
3887 118533911 117215316 115731124 114078712 112298505 110453065 108424492 106219888 103878167
3879 103878167 101373370 98704476 95987312 93133823 90204373 87280904 84299737 81357704
3871 81357704 78456724 75569164 72729367 69929253 67168542 64460552 61770113 59129015
3863 59129015 56603757 54121234 51695274 49401223 47120404 44969374 42907899 40948784
3855 40948784 39120197 37355539 35647349 34076723 32606336 31237427 29916832 28664935
3847 28664935 27501542 26397074 25332369 24308814 23358585 22452353 21647334 20871890 20138997
3838 20138997 19489024 18875396 18283750 17712303 17189722 16713547 16259838 15869649 15504783
$$ packed form
3896A20234813R06546O05261L49480O3158k53330n04747p49892r65267j152111
3887A18533911j318595j484192j652412j780207j845440k028573k204604k341721
3879A03878167k504797k668894k717164k853489k929450k923469k981167k942033
3871H1357704k900980k887560k839797k800114k760711k707990k690439k641098
3863E9129015k525258k482523k425960k294051k280819k151030k061475j959115
3855D0948784j828587j764658j708190j570626j470387j368909j320595j251897
3847B8664935j163393j104468j064705j023555r50229r06232q05019p75444p32893
3838B0138997o49973o13628n91646n71447n22581m76175m53709l90189l64866
$$ plain form
3829 15504783 15187196 14882812 14612537 14332340 14110853 13882513 13662146 13439337 13269548
3820 13269548 13116277 12975422 12843765 12712825 12640150 12563956 12488943 12436222 12416814 12306689
3810 12306689 12173547 11951939 11722312 11435710 11183262 10905199 10675076 10470745 10254480
3801 10254480 10063452 9898228 9775109 9635530 9511608 9417994 9283011 9198290 9145149 9064948
3791 9064948 9014262 8953669 8859653 8754705 8706016 8625227 8536631 8467502 8379558 8321406 8249271
3780 8249271 8235393 8243978 8237297 8167243 8135383 8120726 8110409 8078465 8067910 8074266 8097693 8054813
3768 8054813 8097630 8109387 8097642 8105019 8112158 8124854 8107216 8097553 8048863 8022927 8024087 8025670
3756 8025670 8015601 7962292 7948646 7949221 7936941 7945592 7917052 7902161 7897030 7905536 7918327 7919898 7941832
$$ packed form
3829A5504783l17587l04384k70275k80197k21487k28340k20367k22809j69789
3820A3269548j53271j40855j31657j30940p2675p6194p5013n2721j9408j10125
3810A2306689j33142k21608k29627k86602k52448k78063k30123k04331k16265
3801A0254480j91028j65224j23119j39579j23922r3614j34983q4721n3141q0201
3791I064948n0686o0593r4016j04948m8689q0789q8596o9129q7944n8152p2135
3780H249271j3878Q585o681p0054l1860j4657j0317l1944j0555O356K3427m2880
3768H054813M2817J1757j1745P377P139J2696j7638r663m8690k5936J160J583
3756H025670j0069n3309j3646N75j2280Q651k8540j4891n131Q506J2791J571K1934
$$ plain form
3743 7941832 7961760 7963997 8023284 8045544 8057177 8118976 8142257 8168119 8200670 8238591 8285918 8319984
3731 8319984 8304645 8285991 8311999 8321087 8294600 8255766 8239387 8216396 8186292 8180763 8178347 8170342
3719 8170342 8160030 8130153 8111595 8090352 8104632 8055388 8018341 8002713 7952216 7907115 7886382
3708 7886382 7849998 7877400 7899052 7880316 7880772 7897872 7927301 7952503 7944807 7990097 8018842 8074332
3696 8074332 8115154 8150062 8162327 8213808 8231300 8311279 8362736 8429303 8499174 8547338 8596578
3685 8596578 8660219 8711857 8785222 8888815 9003745 9063593 9124477 9201509 9282078 9359853 9414818
3674 9414818 9502776 9595054 9717765 9792744 9871651 9969648 10058777 10157977 10249945 10362849 10469372
3663 10469372 10574740 10648963 10778523 10921937 11007582 11142706 11299118 11455510 11603681 11741436
$$ packed form
3743G941832J9928K237N9287K2260J1633O1799K3281K5862L2551L7921M7327L4066
3731H319984j5339j8654K6008R088k6487l8834j6379k2991l0104n529k416q005
3719H170342j0312k9877j8558k1243J4280m9244l7047j5628n0497m5101k0733
3708G886382l6384K7402K1652j8736M56J7100K9429K5202p696M5290K8745N5490
3696H074332M0822L4908J2265N1481J7492P9979N1457O6567O9871M8164M9240
3685H596578O3641N1638P3365J03593J14930N9848O0884P7032Q0569P7775N4965
3674I414818Q7958R2278J22711P4979P8907R7997Q9129R9200R1968J12904J06523
3663A0469372J05368P4223J29560J43414Q5645J35124J56412J56392J48171J37755
$$ plain form
3653 11741436 11904381 12116983 12232229 12410141 12606365 12794952 12987035 13178344 13367535
3644 13367535 13569247 13825653 14055306 14244120 14461035 14718834 14991627 15219983 15489490
3635 15489490 15767206 16043733 16337652 16641664 16920369 17202250 17523833 17858759 18224559
3626 18224559 18563201 18967170 19336828 19745811 20225352 20672552 21141247 21603440 22142995
3617 22142995 22710305 23292968 23896674 24540403 25216473 25957404 26810035 27632687 28519313
3608 28519313 29484309 30490739 31515164 32616060 33801307 35042631 36331229 37619888
3600 37619888 39024272 40412407 41802690 43182856 44561323 45896255 47190241 48449943
3592 48449943 49618635 50801659 51979199 53115951 54221501 55228728 56225247 57140784
$$ packed form
3653A1741436J62945K12602J15246J77912J96224J88587J92083J91309J89191
3644A3367535K01712K56406K29653J88814K16915K57799K72793K28356K69507
3635A5489490K77716K76527K93919L04012K78705K81881L21583L34926L65800
3626A8224559L38642M03969L69658M08983M79541M47200M68695M62193N39555
3617B2142995N67310N82663O03706O43729O76070P40931Q52631Q22652Q86626
3608B8519313R64996J006430J024425J100896J185247J241324J288598J288659
3600C7619888J404384J388135J390283J380166J378467J334932J293986J259702
3592D8449943J168692J183024J177540J136752J105550J007227R96519R15537
$$ plain form
3584 57140784 57946271 58625645 59225828 59706874 60046389 60254552 60388299 60438318 60453142 60438461
3574 60438461 60380831 60319577 60306249 60279474 60283751 60293034 60359742 60468867 60620509 60775990 61016400
3563 61016400 61372455 61812341 62385734 63080595 63933262 64991935 66210795 67611465 69199919
3554 69199919 70974945 72983594 75181446 77583108 80234050 83134768 86220195 89490852
3546 89490852 92897027 96471237 100171221 103917684 107709249 111518959 115215844 118830977
3538 118830977 122382119 125829507 129151464 132336456 135371164 138286295 141007002 143509497
3530 143509497 145838458 147871014 149519414 150840604 151769721 152353363 152538534 152400091 151995368
3521 151995368 151347475 150586192 149727612 148717530 147712087 146691402 145731255 144771449 143834461
$$ packed form
3584E7140784Q05487O79374O00183M81046L39515K08163J33747N0019J4824j4681
3574F0438461n7630o1254j3328k6775M277R283O6708J09125J51642J55481K40410
3563F1016400L56055M39886N73393O94861Q52667J058673J218860J400670J588454
3554F9199919J775026K008649K197852K401662K650942K900718L085427L270657
3546H9490852L406175L574210L699984L746463L791565L809710L696885L615133
3538A18830977L551142L447388L321957L184992L034708K915131K720707K502495
3530A43509497K328961K032556J648400J321190R29117N83642J85171j38443m04723
3521A51995368o47893p61283q58580j010082j005443j020685r60147r59806r36988
$$ plain form
3512 143834461 142978199 142213502 141570750 141089387 140783590 140652514 140783552 141169347 141842260
3503 141842260 142746380 143927681 145366501 147025123 148849992 150830698 152898672 155075009
3495 155075009 157285828 159528308 161801201 164054841 166336278 168659742 170927664 173107840
3487 173107840 175228431 177261862 179078398 180668982 182055905 183209284 184044548 184583893
3479 184583893 184885866 184974213 184906576 184680637 184441229 184179485 183937210 183793120 183890522 184188035
3469 184188035 184787479 185631493 186844914 188457857 190468751 193005451 196138718 199979439
3461 199979439 204516552 209853797 216135528 223347982 231500721 240473471 250203158 260462259
3453 260462259 271020803 281535892 291679472 301109989 309526273 316674688 322426134 326837284
$$ packed form
3512A43834461q56262p64697o42752m81363l05797j31076J31038L85795O72913
3503A41842260R04120J181301J438820J658622J824869J980706K067974K176337
3495A55075009K210819K242480K272893K253640K281437K323464K267922K180176
3487A73107840K120591K033431J816536J590584J386923J153379Q35264N39345
3479A84583893L01973Q8347o7637k25939k39408k61744k42275j44090R7402K97513
3469A84188035N99444Q44014J213421J612943K010894K536700L133267L840721
3461A99979439M537113N337245O281731P212454Q152739Q972750R729687J0259101
3453B60462259J0558544J0515089J0143580R430517Q416284P148415N751446M411150
$$ plain form
3445 326837284 329961399 331870910 332765522 332814256 332216799 330897793 328918654 326226968 322701664
3436 322701664 318189570 312504962 305646634 297437280 288044466 277607337 266296325 254379317
3428 254379317 242118246 229803728 217688110 205897204 194633402 183985901 173960581
3421 173960581 164608925 155886922 147797562 140332187 133389529 126953862 121020323 115516114
3413 115516114 110332933 105479914 100892955 96567689 92501856 88631312 84953641 81526364
3405 81526364 78271954 75208977 72285291 69565114 67021340 64642738 62419473 60377733
3397 60377733 58445860 56635378 54876895 53214206 51686808 50214670 48818977 47463752
3389 47463752 46187503 44979345 43776779 42661668 41579952 40546782 39556384 38590808
$$ packed form
3445C26837284L124115J909511Q94612M8734n97457j319006j979139k691686l525304
3436C22701664m512094n684608o858328q209354r392814j0437129j1311012j1917008
3428B54379317j2261071j2314518j2115618j1790906j1263802j0647501j0025320
3421A73960581r351656q722003q089360p465375o942658o435667n933539n504209
3413A15516114n183181m853019m586959m325266m065833l870544l677671l427277
3405H1526364l254410l062977k923686k720177k543774k378602k223265k041740
3397F0377733j931873j810482j758483j662689j527398j472138j395693j355225
3389D7463752j276249j208158j202566j115111j081716j033170r90398r65576
$$ plain form
3381 38590808 37682747 36829441 35949894 35117259 34306896 33538818 32777722 32025720 31302769
3372 31302769 30536432 29826327 29143571 28450999 27819009 27197186 26606720 26058022 25566493
3363 25566493 25069264 24595767 24140802 23663048 23237602 22813240 22407300 22064445 21681200
3354 21681200 21297546 20872500 20471258 20059503 19637633 19270385 18879897 18538397 18172554
3345 18172554 17844559 17517898 17231864 16921077 16606547 16307028 16011211 15767779 15505042
3336 15505042 15251253 15000554 14766003 14551669 14344008 14116862 13903302 13714965 13468110
3327 13468110 13256993 13016613 12807714 12632162 12407060 12165522 11966566 11784466 11604726
3318 11604726 11427282 11255384 11102334 10943697 10800465 10648612 10514212 10354751 10140282
$$ packed form
3381C8590808r08061q53306q79547q32635q10363p68078p61096p52002p22951
3372C1302769p66337p10105o82756o92572o31990o21823n90466n48698m91529
3363B5566493m97229m73497m54965m77754m25446m24362m05940l42855l83245
3354B1681200l83654m25046m01242m11755m21870l67248l90488l41500l65843
3345A8172554l27995l26661k86034l10787l14530k99519k95817k43432k62737
3336A5505042k53789k50699k34551k14334k07661k27146k13560j88337k46855
3327A3468110k11117k40380k08899j75552k25102k41538j98956j82100j79740
3318A1604726j77444j71898j53050j58637j43232j51853j34400j59461k14469
$$ plain form
3309 10140282 9985656 9809144 9693229 9525964 9378193 9231322 9095255 8969260 8838166
3300 8838166 8722776 8586342 8480493 8384487 8281862 8158005 8007229 7878138 7748743 7608578
3290 7608578 7502913 7404735 7316387 7250729 7184433 7087436 6981760 6899713 6825600 6758863 6691915
3279 6691915 6641549 6579732 6541379 6477778 6415151 6377586 6339644 6333227 6259494 6206100 6179478 6165848
3267 6165848 6136172 6119046 6085358 6054276 6035605 6026346 6014321 5989484 5950640 5951471 5932679 5928324
3255 5928324 5936712 5966283 5943613 5862235 5829063 5817821 5836057 5854417 5857550 5835922 5844547 5893401
3243 5893401 5897919 5925309 5942557 5930972 5958312 5981107 6014695 6054332 6108943 6171616 6196396 6236671
3231 6236671 6286723 6284432 6357805 6425706 6476622 6547095 6657586 6786788 6893764 7023715 7151948
$$ packed form
3309A0140282j54626j76512j15915j67265j47771j46871j36067j25995j31094
3300H838166j15390j36434j05849r6006j02625j23857j50776j29091j29395j40165
3290G608578j05665r8178q8348o5658o6296r6997j05676q2047p4113o6737o6948
3279F691915n0366o1817l8353o3601o2627l7565l7942o417p3733n3394k6622j3630
3267F165848k9676j7126l3688l1082j8671r259j2025k4837l8844Q31j8792m355
3255E928324Q388K9571k2670q1378l3172j1242J8236J8360L133k1628Q625M8854
3243E893401M518K7390J7248j1585K7340K2795L3588L9637N4611O2673K4780M0275
3231F236671N0052k291P3373O7901N0916P0473J10491J29202J06976J29951J28233
$$ plain form
3220 7151948 7210622 7326736 7457117 7586802 7671094 7748352 7806593 7806615 7748796 7636051 7501297
3209 7501297 7293228 7088355 6889006 6692178 6522775 6361242 6167640 5995215 5855388 5729397
3199 5729397 5654388 5558052 5434366 5327339 5222687 5153466 5066977 5003970 4887125 4789346 4707105
3188 4707105 4577488 4510217 4413658 4358997 4278501 4201931 4167136 4111537 4030042 3979154 3927863
3177 3927863 3909286 3937114 3895647 3907389 3923142 3953072 4005904 4068086 4100174 4124586 4151904
3166 4151904 4145312 4130097 4105556 4059758 4033563 4001603 3991982 3931087 3932187 3918449 3918481 3891242 3882499
3153 3882499 3887466 3852330 3842213 3816047 3757045 3671047 3601661 3521512 3468111 3383121 3314631 3230109
3141 3230109 3148935 3089508 3033023 2964077 2895060 2832292 2790394 2755053 2703858 2674188 2632996
$$ packed form
3220G151948N8674J16114J30381J29685Q4292P7258N8241K2n7819j12745j34754
3209G501297k08069k04873j99349j96828j69403j61533j93602j72425j39827j25991
3199E729397p5009r6336j23686j07027j04652o9221q6489o3007j16845r7779q2241
3188D707105j29617o7271r6559n4661q0496p6570l4795n5599q1495n0888n1291
3177C927863j8577K7828m1467J1742J5753K9930N2832O2182L2088K4412K7318
3166D151904o592j5215k4541m5798k6195l1960r621o0895J100j3738L2k7239q743
3153C882499M967l5136j0117k6166n9002q5998o9386q0149n3401q4990o8490q4522
3141C230109q1174n9427n6485o8946o9017o2768m1898l5341n1195k9670m1192
$$ plain form
3130 2632996 2584902 2535351 2491905 2448402 2400110 2324630 2265894 2219648 2165276 2103669 2060213
3119 2060213 2000520 1965214 1941285 1917225 1887055 1869140 1853770 1813831 1800696 1782428 1741647
3108 1741647 1729686 1699604 1718861 1741809 1676677 1669790 1701283 1716017 1759593 1832400 1862802 1867979
3096 1867979 1833098 1768364 1684240 1623554 1547774 1518896 1469312 1424682 1385681 1319527 1307854
3085 1307854 1306409 1294026 1266754 1237423 1225985 1206333 1221443 1197223 1166983 1155053 1174544 1143370
3073 1143370 1156312 1131115 1096727 1115504 1147826 1159089 1156991 1143655 1143700 1183402 1156798 1111391
3061 1111391 1058677 995058 971175 961940 907592 906275 908282 906909 900950 877777 869842 865639 864892
3048 864892 849338 807037 801894 797220 787916 781968 766761 780720 802927 763881 740314 710157
$$ packed form
3130B632996m8094m9551m3446m3503m8292p5480n8736m6246n4372o1607m3456
3119B060213n9693l5306k3929k4060l0170j7915j5370l9939j3135j8268m0781
3108A741647j1961l0082J9257K2948o5132o887L1493J4734M3576P2807L0402N177
3096A867979l4881o4734q4124o0686p5780k8878m9584m4630l9001o6154j1673
3085A307854j445j2383k7272k9331j1438j9652J5110k4220l0240j1930J9491l1174
3073A143370J2942k5197l4388J8777L2322J1263k098j3336M5L9702k6604m5407
3061A111391n2714o3619k3883r235n4348j317K007j373n959k3173p935m203p47
3048H64892j5554m2301n143m674r304n948j5207J3959K2207l9046k3567l0157
$$ plain form
3036 710157 712947 745626 737592 747446 735160 722189 706008 679804 732265 723327 663866 650127
3024 650127 661872 668018 663911 633111 648123 646511 618309 597557 600697 591079 583069 616773 620056
3011 620056 599662 578422 600300 601078 602512 608852 624252 613192 593986 560842 532698 562654
2999 562654 579561 606065 619138 634338 599535 591178 614835 610346 614274 609211 639279 647761 620669
2986 620669 589754 628469 649592 624298 615853 626026 596335 583614 592332 601210 622673 618532
2974 618532 604280 603877 604650 619320 603900 595946 629489 616365 611294 625629 583006 613825 641442
2961 641442 642925 662193 631173 606834 597788 615137 603287 632558 623808 619133 645029 629180
2949 629180 614562 626280 602902 574716 574786 582302 602374 613035 612743 625908 623767 643707 634493
$$ packed form
3036G10157K790L2679q034R854j2286j2971j6181k6204N2461q938n9461j3739
3024F50127J1745O146m107l0800J5012j612k8202k0752L140r618q010L3704L283
3011F20056k0394k1240K1878P78J434O340J5400j1060j9206l3144k8144K9956
2999E62654J6907K6504J3073J5200l4803q357K3657m489L928n063L0068Q482k7092
2986F20669l0915L8715K1123k5294q445J0173k9691j2721Q718Q878K1463m141
2974F18532j4252m03P73J4670j5420p954L3543j3124n071J4335m2623L0819K7617
2961F41442J483J9268l1020k4339r046J7349j1850K9271q750m675K5896j5849
2949F29180j4618J1718k3378k8186P0P516K0072J0661k92J3165k141J9940r214
$$ plain form
2936 634493 622041 610788 638875 663907 675344 707978 659738 660228 671517 700887 677000 681047
2924 681047 699532 666730 670621 668791 692880 695614 708664 730108 753292 755165 747972 793720 799790
2911 799790 807445 826092 830618 848152 868026 893600 915328 944952 1002961 1010715 1040816 1096867
2899 1096867 1161146 1216524 1246432 1257761 1286699 1322307 1337409 1358893 1351040 1340071 1357771 1389711
2887 1389711 1404309 1368943 1366692 1366088 1391800 1394400 1399467 1401091 1464407 1525872 1525872 1538828 1565145
2874 1565145 1628082 1704535 1756713 1827071 1908277 1976952 2070225 2202381 2306524 2335597 2320690
2863 2320690 2186665 2063902 1902436 1813922 1689111 1534623 1490139 1455781 1388913 1346711
2853 1346711 1339480 1353097 1339901 1295188 1274415 1293033 1259049 1221191 1214243 1236443 1256121 1268084
$$ packed form
2936F34493j2452j1253K8087K5032J1437L2634m8240M90J1289K9370k3887M047
2924F81047J8485l2802L891j830K4089K734J3050K1444K3184J873p193M5748O070
2911G99790P655J8647M526J7534J9874K5574K1728K9624N8009P754L0101N6051
2899A096867O4279N5378K9908J1329K8938L5608J5102K1484p853j0969J7700L1940
2887A389711J4598l5366k251o04K5712K600N067J624O3316O1465%J2956K6317
2874A565145O2937P6453N2178P0358Q1206O8675R3273J32156J04143K9073j4907
2863B320690j34025j22763j61466q8514j24811j54488m4484l4358o6868m2202
2853A346711p231J3617j3196m4713k0773J8618l3984l7858o948K2200J9678J1963
$$ plain form
2841 1268084 1237724 1229281 1236048 1250220 1275744 1247932 1213736 1238197 1227632 1159087 1102123 1024635
2829 1024635 952609 894641 856652 833232 797292 794521 759331 725839 714103 666430 653991 644271
2817 644271 595338 562236 554562 521321 512907 497718 484637 482160 471646 417360 399133 358753
2805 358753 374953 408133 389135 384353 386784 410100 403409 370395 363914 349262 318108 329909
2793 329909 338343 335249 327099 334648 317870 300150 308418 326696 286909 278419 270199 222145 239161
2780 239161 232515 223971 224504 214439 189215 200091 196746 194495 188838 166688 139213 156860 162099
2767 162099 149280 160168 120262 137878 138747 99283 111392 131574 149746 125871 65096 53427
2755 53427 125064 125331 112395 106669 90977 124292 123055 137590 130728 115082 94337 89689 97220
$$ packed form
2841A268084l0360q443O767J4172K5524k7812l4196K4461j0565o8545n6964p7488
2829A024635p2026n7968l7989k3420l5940k771l5190l3492j1736m7673j2439r720
2817F44271m8933l3102p674l3241q414j5189j3081k477j0514n4286j8227m0380
2805C58753J6200L3180j8998m782K431K3316o691l3014o481j4652l1154J1801
2793C29909Q434l094q150P549j6778j7720Q268J8278l9787q490q220m8054J7016
2780B39161o646q544N33j0065k5224J0876l345k251n657k2150k7475J7647N239
2767A62099j2819J0888l9906J7616Q69l9464J2109K0182J8172k3875o0775j1669
2755E3427P1637K67j2936n726j5692L3315j237J4535o862j5646k0745m648P531
$$ plain form
2742 97220 98862 94709 109029 106738 88563 54411 45875 39185 42608 60647 61241 69105 70847 61352
2728 61352 50074 60670 43730 43213 14608 27862 21382 49086 46236 67228 46558 29312 34551
2715 34551 56402 54419 31829 19016 18739 38422 29796 24251 9193 47122 15235 -4790 -84
2702 -84 6183 38789 45913 23159 42263 38021 5595 16686 -2088 -37146 2975 15853 4402
2689 4402 4468 19864 38152 22119 43594 -5405 -25318 -1984 8481 -21043 -6147 -26487 -30898
2676 -30898 -58388 -72277 -25061 -23580 -33038 -26962 1833 -29227 -32193 -46058 -59944 -66713 -68446
2663 -68446 -52016 -42992 -24797 -5197 -14958 -40350 -73307 -48642 -77070 -39262 -36431 -47670
2651 -47670 -19054 -45739 -59107 -42017 -36650 -13565 -40196 -57893 -64189 -75827 -66791 -47621
$$ packed form
2742I7220J642m153J4320k291j8175l4152q536o690L423J8039N94P864J742r495
2728F1352j1278J0596j6940n17k8605J3254o480K7704k850K0992k0670j7246N239
2715C4551K1851j983k2590j2813k77J9683q626n545j5058L7929l1887k0025M706
2702h4O267L2606P124k2754J9104m242l2426J1091j8774l5058M0121J2878j1451
2689D402O6J5396J8288j6033K1475m8999j9913K3334J0465k9524J4896k0340m411
2676c0898k7490j3889M7216J481r458O076K8795l1060k966j3865j3886o769j733
2663f8446J6430R024J8195J9600r761k5392l2957K4665k8428L7808K831j1239
2651d7670K8616k6685j3368J7090N367K3085k6631j7697o296j1638R036J9170
$$ plain form
2639 -47621 -21332 -28550 -43762 -53118 -30781 -35677 -41374 -42936 -41592 -56758 -49992 -33316 -17726
2626 -17726 -12968 -31524 -60120 -89904 -61743 -62287 -73342 -113735 -57924 -40799 -38152 -32965 -68933
2613 -68933 -95369 -76178 -75275 -88688 -89746 -74912 -69398 -59163 -41569 -33192 -68922 -101902 -63111
2600 -63111 -47667 -66905 -72884 -72482 -62362 -46805 -30995 -70246 -51180 -43191 -43158 -17258 -35640
2587 -35640 -48942 -45083 -46088 -60693 -60016 -47789 -45582 -87911 -81225 -48548 -60792 -56537 -52260
2574 -52260 -52987 -17792 -38188 -51803 -63624 -31288 -34151 -48347 -72354 -47434 -89615 -105701
2562 -105701 -98179 -77160 -38324 -53643 -54930 -41450 -68143 -63812 -41211 -67161 -84402 -100102
2550 -100102 -79442 -46485 -48251 -38725 -86470 -69692 -54152 -63159 -93878 -98413 -108935 -95932
$$ packed form
2639d7621K6289p218j5212r356K2337m896n697j562J344j5166O766J6676J5590
2626a7726M758j8556k8596k9784K8161n44j1055m0393N5811J7125K647N187l5968
2613f8933k6436J9191R03j3413j058J4834N514J0235J7594Q377l5730l2980L8791
2600f3111J5444j9238n979M02J0120J5557J5810l9251J9066P989L3K5900j8382
2587c5640j3302L859j005j4605O77J2227K207m2329O686L2677j2244M255M277
2574e2260p27L5195k0396j3615j1821L2336k863j4196k4007K4920m2181j6086
2562a05701P522K1019L8836j5319j287J3480k6693M331K2601k5950j7241j5700
2550a00102K0660L2957j766R526m7745J6778J5540r007l0719m535j0522J3003
$$ plain form
2538 -95932 -96276 -92180 -90858 -87997 -93858 -88561 -86969 -80003 -88562 -104716 -118331 -88810 -75462 -96971
2524 -96971 -87068 -91002 -105869 -113946 -104594 -132247 -135246 -131019 -113776 -131946 -129735 -110684 -94364
2511 -94364 -101293 -132337 -118335 -99402 -89974 -100894 -114433 -80896 -76164 -77013 -78003 -77634 -108497 -133947
2497 -133947 -146008 -120750 -147702 -155886 -156919 -158979 -137643 -141812 -143336 -142815 -142057 -156040 -162206 -160157
2483 -160157 -123962 -129993 -119401 -131633 -137601 -132780 -133249 -117353 -159183 -145963 -124188 -127927 -131570
2470 -131570 -143167 -124918 -117791 -108473 -75687 -123002 -135979 -159140 -155987 -123331 -135017 -146336
2458 -146336 -171043 -151607 -137193 -137036 -131489 -155196 -153242 -171525 -191843 -183367 -160811 -155843 -153519
2445 -153519 -159922 -168117 -178313 -167328 -156526 -130539 -153518 -144367 -134936 -168605 -149912 -142350 -138433
$$ packed form
2538i5932l44M096J322K861n861N297J592O966q559j6154j3615K9521J3348k1509
2524i6971R903l934j4867q077R352k7653k999M227J7243j8170K211J9051J6320
2511i4364o929l1044J4002J8933R428j0920j3539L3537M732q49r90L69l0863k5450
2497a33947j2061K5258k6952q184j033k060K1336m169j524N21P58j3983o166K049
2483a60157L6195o031J0592j2232n968M821m69J5896m1830J3220K1775l739l643
2470a31570j1597J8249P127R318L2786m7315j2977k3161L153L2656j1686j1319
2458a46336k4707J9436J4414J57N547k3707J954j8283k0318Q476K2556M968K324
2445a53519o403q195j0196J0985J0802K5987k2979R151R431l3669J8693P562L917
$$ plain form
2432 -138433 -144079 -138706 -152386 -135025 -145375 -142903 -115993 -112718 -100176 -128555 -149569 -185453
2420 -185453 -174176 -161436 -135221 -137053 -102574 -121796 -130087 -130829 -153402 -128463 -134720 -138851 -144183
2407 -144183 -159490 -147528 -128779 -148662 -136136 -131540 -106876 -108443 -125688 -98275 -84244 -88371
2395 -88371 -104389 -136604 -132728 -120231 -145786 -143801 -131499 -128154 -130363 -133952 -142209 -148705 -124931
2382 -124931 -104921 -130611 -121545 -121111 -132950 -117082 -116268 -105510 -103198 -114743 -118992 -111113 -142283
2369 -142283 -149906 -148002 -100231 -94738 -101091 -128903 -138513 -111912 -119643 -120472 -130836 -123674 -113378
2356 -113378 -103880 -113608 -158212 -145736 -141133 -153802 -148589 -133516 -127730 -128791 -123000 -108661 -92981
2343 -92981 -110916 -105526 -115700 -85921 -90619 -99581 -110886 -109035 -104579 -127536 -135623 -152651 -151702
$$ packed form
2432a38433n646N373j3680J7361j0350K472K6910L275J2542k8379k1014l5884
2420a85453J1277J2740K6215j832L4479j9222q291p42k2573K4939o257m131n332
2407a44183j5307J1962J8749j9883J2526M596K4664j567j7245K7413J4031m127
2395h8371j6018l2215L876J2497k5555J985J2302L345k209l589q257o496K3774
2382a24931K0010k5690R066M34j1839J5868Q14J0758K312j1545m249P879l1170
2369a42283p623J904M7771N493o353k7812r610K6601p731q29j0364P162J0296
2356a13378R498r728m4604J2476M603j2669N213J5073N786j061N791J4339J5680
2343i2981j7935N390j0174K9779m698q962j1305J851M456k2957q087j7028R49
$$ plain form
2330 -151702 -141852 -120854 -133483 -136375 -132006 -146822 -160276 -174310 -154762 -155308 -183709 -147570 -121207
2317 -121207 -119902 -132689 -98384 -116355 -110476 -120654 -99192 -134369 -148040 -128775 -128645 -132311 -119426
2304 -119426 -130232 -111409 -90876 -133349 -138373 -105356 -92883 -112655 -97200 -68016 -98376 -98257
2292 -98257 -80203 -102123 -103886 -97189 -70702 -84528 -73931 -114121 -113372 -36607 -77046 -96411 -85424
2279 -85424 -64314 -88029 -129641 -121709 -124493 -121178 -124512 -119584 -122967 -137734 -110409 -112012 -85173
2266 -85173 -66192 -105402 -95141 -66970 -61219 -107202 -122985 -80281 -78595 -84384 -105601 -104373 -90775
2253 -90775 -72109 -85340 -106353 -73750 -83314 -91326 -108306 -100179 -118337 -98707 -98182 -68741 -93179
2240 -93179 -84730 -106749 -120992 -115111 -111032 -98245 -87308 -96392 -66755 -44218 -66756 -63620 -71443
$$ packed form
2330a51702R850K0998j2629k892M369j4816j3454j4034J9548n46k8401L6139K6363
2317a21207J305j2787L4305j7971N879j0178K1462l5177j3671J9265J30l666J2885
2304a19426j0806J8823K0533m2473n024L3017J2473j9772J5455K9184l0360J19
2292i8257J8054k1920j763O697K6487j3826J0597m0190P49P6765m0439j9365J0987
2279h5424K1110k3715m1612P932k784L315l334M928l383j4767K7325j603K6839
2266h5173J8981l9210J0261K8171N751m5983j5783M2704J686n789k1217J228J3598
2253i0775J8666j3231k1013L2603r564q012j6980Q127j8158J9630N25K9441k4438
2240i3179Q449k2019j4243N881M079J2787J0937r084K9637K2537k2538L136p823
$$ plain form
2227 -71443 -66308 -72309 -87445 -73450 -126797 -133276 -121815 -149263 -148595 -127981 -105035 -119925 -115187
2214 -115187 -83265 -71043 -34463 -71092 -106175 -101602 -101782 -111873 -114319 -96176 -71810 -28269
2202 -28269 -34585 -84518 -70663 -53703 -61848 -78229 -65867 -89189 -72264 -74035 -111295 -74104
2190 -74104 -61254 -47698 -68763 -43195 -23938 -50186 -48418 -39381 -48245 -57052 -36619 -12790 -4087
2177 -4087 -45386 -79644 -62902 -45167 -31252 -28634 -36721 -26371 -22944 -50700 -4901 -10687 -22415
2164 -22415 -18119 -4672 6442 14805 -13273 19402 4346 9971 18986 10184 -903 2236 651
2151 651 17145 29212 12517 3124 12798 39686 48458 28847 19913 48036 41722 63051 68718
2138 68718 65933 46520 67272 70425 44522 65306 67483 63054 86912 94112 47827 61018 90235
$$ packed form
2227g1443N135o001j5136J3995n3347o479J1461k7448O68K0614K2946j4890M738
2214a15187L1922J2222L6580l6629l5083M573j80j0091k446J8143K4366M3541
2202b8269o316m9933J3855J6960q145j6381J2362k3322J6925j771l7260L7191
2190g4104J2850J3556k1065K5568J9257k6248J768R037q864q807K0433K3829Q703
2177d087m1299l4258J6742J7735J3915K618q087J0350L427k7756M5799n786j1728
2164b2415M296J3447J1114Q363k8078L2675j5056N625R015q802j1087L139j585
2151F51J6494J2067j6695r393R674K6888Q772j9611q934K8123o314K1329N667
2138F8718k785j9413K0752L153k5903K0784K177m429K3858P200m6285J3191K9217
$$ plain form
2125 90235 93034 122156 125070 129862 110000 128424 144734 124963 149810 179633 174449 155517 192131
2112 192131 217547 236655 242458 242474 223848 249284 294997 332552 374542 377894 397069 407103 409429
2099 409429 417165 438599 468408 504269 553386 596856 660983 690695 718993 742747 815445 887314
2087 887314 924243 995336 1080648 1174237 1272226 1393429 1554401 1767446 2020122 2308159 2597639
2076 2597639 2944372 3418093 4042995 4808929 5712241 6481193 6769523 6268358 5190380
2067 5190380 4218660 3476952 2873636 2372031 2000538 1739459 1530901 1380977 1252120 1129762
2057 1129762 1018400 961333 934295 849846 779477 713613 616936 561438 543885 501789 458736
2046 458736 419130 403539 366017 340007 334387 316608 298141 283586 260594 219819 198354 195212
$$ packed form
2125I0235K799K9122K914M792j9862J8424J6310j9771K4847K9823n184j8932L6614
2112A92131K5416J9108N803J6j8626K5436M5713L7555M1990L352J9175J0034K326
2099D09429P736K1434K9809L5861M9117M3470O4127K9712K8298K3754P2698P1869
2087H87314L6929P1093Q5312R3589R7989J21203J60972K13045K52676K88037K89480
2076B597639L46733M73721O24902P65934R03312P68952K88330n01165j077978
2067E190380r71720p41708o03316n01605l71493k61079k08558j49924j28857j22358
2057A129762j11362n7067k7038q4449p0369o5864r6677n5498j7553m2096m3053
2046D58736l9606j5591l7522k6010n620j7779j8467j4555k2992m0775k1465l142
$$ plain form
2034 195212 194236 161203 196241 188653 198239 200094 159735 131005 92526 92406 108142 109663 109401 85020
2020 85020 79691 77864 82512 103832 97826 81061 82626 79512 87311 81670 94789 64131 41675
2007 41675 64725 48678 55586 88019 56491 20297 22319 20775 14315 27235 13359 14646 1274
1994 1274 19735 48912 21392 17999 -6532 -12997 16502 24823 15666 -5348 -14051 -16669 -2633
1981 -2633 9599 -17 -23253 -34339 -38865 -43920 -49782 -37469 -32643 -38320 -19073 -18916 -43377 -50589
1967 -50589 -40424 -13604 -18571 -1354 682 -41857 -21046 -28356 -52072 -22872 -11133 -17606 -13586
1954 -13586 -51873 -44746 -5430 4323 -5728 -59037 -56009 -64053 -75472 -58585 -60952 -44041 -42838
1941 -42838 -36128 -38076 -51217 -69402 -49450 -55686 -9617 -11006 -17108 18430 9986 -12674 -32956
$$ packed form
2034A95212r76l3033L5038p588R586J855m0359k8730l8479j20J5736J521k62k4381
2020H5020n329j827M648K1320o006j6765J565l114P799n641J3119l0658k2456
2007D1675K3050j6047O908L2433l1528l6194K022j544o460J2920j3876J287j3372
1994A274J8461K9177k7520l393k4531o465K9499Q321r157k1014q703k618J4036
1981b633J2232r616k3236j1086m526n055n862J2313M826n677J9247J57k4461p212
1967e0589J0165K6820m967J7217K036m2539K0811p310k3716K9200J1739o473M020
1954a3586l8287P127L9316R753j0051n3309L028q044j1419J6887k367J6911J203
1941d2838O710j948j3141j8185J9952o236M6069j389o102L5538q444k2660k0282
$$ plain form
1928 -32956 -72536 -88710 -75096 -78750 -59062 -33194 -31114 -55196 -48737 -58459 -67055 -67127 -62736 -57770
1914 -57770 -52439 -44539 -29217 -45158 -58612 -44843 -20557 -15031 -32774 -44445 -69168 -43704
1902 -43704 -27283 -36738 -22568 -19690 -27420 -13592 -14830 -30036 -34406 -18956 -35939 -29600 -47814
1889 -47814 -42536 -67980 -51569 -49813 -48110 -53004 -56019 -57086 -8579 10922 -32910 -46882 -76584
1876 -76584 -52587 -50234 -31557 -36009 -21890 -15021 -10951 -4907 -20232 -59438 -48546 -18346 -15097
1863 -15097 -45763 -72036 -30585 -11137 -30787 -24133 -17711 -33171 -11909 -7773 -29059 -68213
1851 -68213 -45562 -38818 -30756 -19946 -11269 -15288 -49450 -32672 -25955 -23225 -5862 -27701 -41034
1838 -41034 -42692 -50759 -16389 -35566 -49419 -65562 -62937 -29321 -11641 -15508 -55165 -71078 -55306
$$ packed form
1928c2956l9580j6174J3614l654J9688K5868K080k4082O459r722q596p2M391M966
1914e7770N331P900J5322j5941j3454J3769K4286N526j7743j1671k4723K5464
1902d3704J6421r455J4170K878p730J3828j238j5206m370J5450j6983O339j8214
1889d7814N278k5444J6411J756J703m894l015j067M8507J9501m3832j3972k9702
1876g6584K3997K353J8677m452J4119O869M070O044j5325l9206J0892L0200L249
1863a5097l0666k6273M1451J9448j9650O654O422j5460K1262M136k1286l9154
1851f8213K2651O744Q062J0810Q677m019l4162J6778O717K730J7363k1839j3333
1838d1034j658q067L4370j9177j3853j6143K625L3616J7680l867l9657j5913J5772
$$ plain form
1825 -55306 -54709 -41345 -65951 -70864 -37072 7403 -3524 -30103 -65821 -84512 -54246 -58559 -56902
1812 -56902 -57909 -53932 -28695 -45635 -57364 -48710 -63854 -40438 -42915 -31751 -38773 -5572 2779
1799 2779 -31211 -35705 -43012 -60135 -34490 -67514 -48885 -8521 -20880 -29847 -70185 -55731 -55847
1786 -55847 -22351 -53529 -59626 -71832 -52701 -70325 -50857 -21817 -31458 -53576 -44502 -45109 -49966
1773 -49966 -62900 -49489 -33341 -37617 -23387 -58828 -54057 -46963 -26129 -45650 -46074 -33982 -20199
1760 -20199 -41061 -33920 -7615 -25748 -54424 -67810 -55380 -61685 -18521 -38229 -33434 -49225
1748 -49225 -36827 -27805 -37797 -39961 -62989 -53388 -54607 -37569 -40373 -51389 -59585 -28125 -25220
1735 -25220 -38946 -38985 -45054 -12250 -26772 -57746 -67845 -42249 -35677 -56533 -92339 -92508 -59546
$$ packed form
1825e5306N97J3364k4606m913L3792M4475j0927k6579l5718j8691L0266m313J657
1812e6902j007L977K5237j6940j1729Q654j5144K3416k477J1164p022L3201Q351
1799B779l3990m494p307j7123K5645l3024J8629M0364j2359q967m0338J4454j16
1786e5847L3496l1178o097j2206J9131j7624J9468K9040r641k2118R074o07m857
1773d9966j2934J3411J6148m276J4230l5441M771P094K0834j9521m24J2092J3783
1760b0199k0862P141K6305j8133k8676j3386J2430o305M3164j9708M795j5791
1748d9225J2398R022r992k164k3028R601j219J7038k804j1016q196L1460K905
1735b5220j3726l9o069L2804j4522l0974j0099K5596O572k0856l5806j69L2962
$$ plain form
1722 -59546 -81602 -76333 -77437 -66452 -49131 -40510 -59856 -55375 -57720 -33778 -47351 -65505 -47492
1709 -47492 6 45976 24185 -35500 -53793 -43882 -45378 -25214 -13610 -9694 -16096 -40399 -57519
1696 -57519 -74070 -48317 -29766 -51660 -32212 -25779 -5748 -1861 -13727 -11938 -8751 -20159 -58222
1683 -58222 -44477 -41044 -30036 -32656 -26357 -39050 -40615 -37059 -32226 -57526 -56334 -60507 -40911
1670 -40911 -33691 -34990 -33755 -36561 -41202 -51989 -27845 -43237 -19269 -45926 -38953 -27801 -41215
1657 -41215 -14966 -40080 -53833 -67361 -72149 -55826 -21076 -19307 -26314 -46569 -39086 -32150 -52431
1644 -52431 -57040 -29154 -823 11498 -14840 -38633 -35175 -25234 -7054 -35003 -26499 -45021 -31419
1631 -31419 -4797 18886 -22572 -15773 -28761 -62013 -55701 -60583 -51964 -46798 -51382 -32176 -34153
$$ packed form
1722e9546k2056N269j104J0985J7321Q621j9346M481k345K3942j3573j8154J8013
1709d7492M7498M5970k1791n9685j8293R911j496K0164J1604L916o402k4303j7120
1696e7519j6551K5753J8551k1894J9448O433K0031L887j1866J789L187j1408l8063
1683e8222J3745L433J1008k620O299j2693j565L556M833k5300J192m173J9596
1670d0911P220j299J235k806m641j0787K4144j5392K3968k6657O973J1152j3414
1657d1215K6249k5114j3753j3528m788J6323L4750J769p007k0255P483O936k0281
1644e2431m609K7886K8331J2321k6338k3793L458R941J8180k7949Q504j8522J3602
1631c1419K6622K3683m1458O799j2988l3252O312m882Q619N166m584J9206j977
$$ plain form
1618 -34153 -27155 -35475 -42547 -20661 -15557 -23710 -44141 -43244 -34617 -13564 -12859 -8141 12708 20342
1604 20342 16210 -24043 -74184 -71644 -78050 -75897 -63032 -25853 -29879 -16104 -832 -121 -16669
1591 -16669 -17634 -14388 -49682 -24517 2237 -32653 -40586 -53216 -32382 -24066 -33217 -46019 -6786
1578 -6786 30237 15585 -14757 -28205 -33136 -56370 -25589 -22837 -12576 -48712 -17353 -13645 -3629
1565 -3629 -20946 -27097 -11666 -6184 -36022 -35229 -45065 -56130 -35064 -34575 -54875 -49952 -54116 -50481
1551 -50481 -26241 -24631 -39532 -52699 -54030 -36988 -9548 -23801 -34394 -10909 -28433 -51849
1539 -51849 -34053 -31467 -36606 -36175 -14496 6953 15452 -6732 4107 2528 12008 -8722 -36640
1526 -36640 -30446 -9425 13182 6914 864 -9213 -22013 4706 5188 4511 26 -36822 -29751 -8729
$$ packed form
1618c4153O998q320p072K1886N104q153k0431Q97Q627K1053P05M718K0849P634
1604B0342m132m0253n0141K540o406K153J2865L7179m026J3775J5272P11j6548
1591a6669r65L246l5294K5165K6754l4890p933j2630K0834Q316r151j2802L9233
1578f786L7023j4652l0342j3448m931k3234L0781K752J0261l6136L1359L708J0016
1565c629j7317o151J5431N482k9838P93r836j1065K1066M89k0300M923m164L635
1551e0481K4240J610j4901j3167j331J7042K7440j4253j0593K3485j7524k3416
1539e1849J7796K586n139M31K1679K1449Q499k2184J0839j579R480k0730k7918
1526c6640O194K1021K2607o268o050j0077j2800K6719M82o77m485l6848P071K1022
$$ plain form
1512 -8729 -10021 -23572 -8281 -8355 -10499 -16460 3339 -15392 -53179 -15239 -37515 -6390 -10483
1499 -10483 -10750 -5593 -14910 -26012 -1463 1615 -2853 -10284 -16980 2818 17141 -16523 2206
1486 2206 -8217 -26459 -33242 -37482 -11751 36669 20773 -8130 -6729 -51386 -33870 -32689 -37670
1473 -37670 -14181 -27065 -18296 -28802 -44605 -8410 4345 -37679 -49399 -6947 5168 32792
1461 32792 -8771 -33987 -37144 -25059 -28130 -10422 5804 30049 53 -39529 -18985 -18736 4193
1448 4193 13600 -8407 -700 4723 -2239 2980 2781 -22151 -20672 -25984 -20384 -23310 -3774 -19867
1434 -19867 -20100 565 23562 678 -15264 -240 12405 23031 37327 14722 2914 -21367
1422 -21367 -4897 23038 -8170 9049 25971 16131 2166 -5608 -37552 -20972 5805 -5226
$$ packed form
1512h729j292j3551J5291p4k144n961J9799j8731l7787L7940k2276L1125m093
1499a0483k67N157r317j1102K4549L078m468p431o696J9798J4323l3664J8729
1486B206j0423j8242o783m240K5731M8420j5896k8903J401m4657J7516J181m981
1473c7670K3489j2884Q769j0506j5803L6195J2755m2024j1720M2452J2115K7624
1461C2792m1563k5216l157J2085l071J7708J6226K4245k9996l9582K0544K49K2929
1448D193R407k2007P707N423o962N219j99k4932J479n312N600k926J9536j6093
1434a9867k33K0665K2997k2884j5942J5024J2645J0626J4296k2605j1808k4281
1422b1367J6470K7935l1208J7219J6922r840j3965p774l1944J6580K6777j1031
$$ plain form
1410 -5226 15229 -36197 -55649 -28416 -27403 -43582 -53094 -31514 -39181 -17678 -6081 -10334 -14733
1397 -14733 -26569 -14898 23808 -10079 -23254 -19101 -3404 -37638 -4233 -2199 14472 16791
1385 16791 -15491 -17210 -12980 -34386 -31352 -25038 -22786 -31750 -28464 -36965 -24311 -26345 -44939 -34992
1371 -34992 -22208 -23127 392 18025 9748 11075 13109 32041 30772 9821 -16840 -33457 -21316
1358 -21316 -9963 -9970 -6835 -26149 -18555 11814 31534 403 -2069 -8414 2714 20139 34108
1345 34108 29905 34729 28105 25109 15109 17995 10389 -42243 -37929 -49348 -62916 -41332 -16417
1332 -16417 6795 6739 -8152 15469 40712 44892 26508 17139 11652 -14135 63 19958 16443
1319 16443 -5847 4048 -4560 24245 34760 38415 20680 20789 -7742 -26020 -31720 -8315 -760
$$ packed form
1410e226K0455n1426j9452K7233J013j6179r512K1580p667K1503J1597m253m399
1397a4733j1836J1671L8706l3887j3175M153J5697l4234L3405K034J6671K319
1385A6791l2282j719M230k1406L034O314K252q964L286q501J2654k034j8594R947
1371c4992J2784r19K3519J7633q277J327K034J8932j269k0951k6661j6617J2141
1358b1316J1353pL135j9314P594L0369J9720l1131k472o345J1128J7425J3969
1345C4108m203M824o624k996j0000K886p606n2632M314j1419j3568K1584K4915
1332a6417K3212n6j4891K3621K5243M180j8384r369n487k5787J4198J9895l515
1319A6443k2290R895q608K8805J0515L655j7735J09k8531j8278n700K3405P555
$$ plain form
1306 -760 6558 17919 -6615 3029 1685 17797 1046 -5683 -28746 -14212 -11760 -19222 -10573 9594
1292 9594 -12957 -2397 -9372 6102 38189 26874 42463 24319 28080 19572 14166 6710 3044
1279 3044 -4555 9846 -7326 -6126 -11209 -7813 36040 1674 14910 29646 -20932 -13810 -5971
1266 -5971 -8483 25665 22326 12170 42891 17465 -3552 -22992 9423 -29947 -36427 12917 29067
1253 29067 30417 2590 -11953 -45537 -10174 5911 1384 -7115 -19172 7100 13098 -6938 -24500
1240 -24500 -25993 -14160 1800 -4114 3023 22868 62401 31042 -4711 1766 -2493 21719 27863
1227 27863 33407 28381 22297 17813 23738 13085 3985 3213 20564 12623 8797 -4918 11842 23215
1213 23215 -6398 -9480 -19075 -17469 6425 14471 17464 40233 56946 35380 13023 -31723 -12364
$$ packed form
1306g60P318J1361k4534R644j344J6112j6751o729k3063J4534K452p462Q649K0167
1292I594k2551J0560o975J5474L2087j1315J5589j8144L761q508n406p456l666
1279C044p599J4401j7172J200n083L396M3853l4366J3236J4736n0578P122P839
1266e971k512L4148l339j0156L0721k5426k1017j9440L2415l9370o480M9344J6150
1253B9067J350k7827j4543l3584L5363J6085m527q499j2057K6272N998k0036j7562
1240b4500j493J1833J5960n914P137J9845L9533l1359l5753O477m259K4212O144
1227B7863N544n026o084m484N925j0653r100p72J7351p941l826j3715J6760J1373
1213B3215k9613l082r595J606K3894Q046K993K2769J6713k1566k2357m4746J9359
$$ plain form
1200 -12364 -2037 -18421 -18061 -20446 -28232 7858 15842 30042 43620 30096 22642 36188 37885
1187 37885 4440 3586 24851 46129 58527 31085 3563 -2593 -17493 2069 8088 -21643 -15696
1174 -15696 12428 13143 7506 20647 24962 36913 20118 2287 7650 9037 27522 21403 23653
1161 23653 41707 57494 48333 10190 6429 26276 42106 44667 64022 34869 15433 35726
1149 35726 -2020 2296 20079 -3874 -1011 4243 23018 49201 40673 29081 28167 36875 8720
1136 8720 7045 8542 26957 36281 25111 -1303 -2268 21255 32379 33915 11859 5163 -27571
1123 -27571 -10462 7229 -17621 28163 22861 18617 -1575 -13965 12171 15175 -16744 5237
1111 5237 16340 -16894 780 16402 21643 17996 44990 36085 48914 54465 45485 65276 46622
$$ packed form
1200a2364J0327j6384L60k385p786L6090P984J4200J3578j3524p454J3546J697
1187C7885l3445q54K1265K1278J2398k7442k7522o156j4900J9562O019k9731N947
1174a5696K8124P15n637J3141M315J1951j6795j7831N363J387J8485o119K250
1161B3653J8054J5787r161l8143l761J9847J5830K561J9355k9153j9436K0293
1149C5726l7746M316J7783k3953K863N254J8775K6183q528j1592r14Q708k8155
1136H720j675J497J8415R324j1170k6414r65K3523J1124J536k2056o696l2734
1123b7571J7109J7691k4850M5784n302m244k0192j2390K6136L004l1919K1981
1111E237J1103l3234J7674J5622N241l647K6994q905J2829N551q980J9791j8654
$$ plain form
1098 46622 39400 15060 -27665 -1041 16511 38271 58234 45558 23386 13972 1377 16822
1086 16822 -9033 -14279 -5065 15347 25425 26109 40424 -5624 -688 15346 17648 -6038 43040
1073 43040 47349 54244 31525 10014 12147 7142 -15915 15794 12258 -11786 12728 35643 38711
1060 38711 22046 32744 22220 15661 14026 9754 9010 9905 18313 26648 21105 9579 -17893 -4355
1046 -4355 16174 45624 23552 -4568 19434 30036 35268 29831 10765 5381 33736 56313 72080
1033 72080 32599 24724 19421 10513 12205 39114 47006 42519 34586 44441 24300 20297 45953 24813
1019 24813 -2413 -8022 20171 13665 30470 38607 50274 51438 41848 9995 12672 49964 36686
1006 36686 40313 39108 18713 1442 33115 50172 28256 7667 -1487 5195 -7444 29519 25522
$$ packed form
1098D6622p222k4340m2725K6624J7552K1760J9963j2676k2172r414j2595J5445
1086A6822k5855n246R214K0412J0078O84J4315m6048M936J6034K302k3686M9078
1073D3040M309O895k2719k1511K133n005k3057L1709l536k4044K4514K2915L068
1060C8711j6665J0698j0524o559j635m272p44Q95Q408Q335n543j1526k7472J3538
1046d355K0529K9450k2072k8120K4002J0602N232n437j9066n384K8355K2577J5767
1033G2080l9481p875n303q908J692K6909P892m487p933R855k0141m003K5656k1140
1019B4813k7226n609K8193o506J6805Q137J1667J164r590l1853K677L7292j3278
1006C6686L627j205k0395j7271L1673J7057k1916k0589r154O682j2639L6963l997
$$ plain form
993 25522 51684 59676 32897 -1133 12043 21257 22283 11721 35811 20197 25056 53182 45931
980 45931 51452 25801 -287 7939 -2990 7404 46012 25809 14684 25220 11144 10567 -3799
967 -3799 17028 27372 28431 28141 22472 36500 13966 5571 27015 17288 23534 26783 53229 47037
953 47037 19958 31481 35522 40568 54241 77850 56715 14560 8095 46454 52851 4789 4183
940 4183 38000 42249 15026 -2523 11847 21945 14443 9268 -6 7418 37193 21966 -12506
927 -12506 -23520 -20565 -17146 -1590 18898 44954 24623 15348 4643 -7900 -7872 7056 636
914 636 6638 11291 -2287 14456 6319 4227 17917 23496 16035 37026 29932 35906 69949 45519
900 45519 40117 63871 60433 32734 16645 16827 8484 -1523 -21415 -15669 6629 -5278 -5546 7257
$$ packed form
993B5522K6162P992k6779l4030J3176R214J026j0562K4090j5614M859K8126p251
980D5931N521k5651k6088Q226j0929J0394L8608k0203j1125J0536j4076n77j4366
967c799K0827J0344J059k90n669J4028k2534q395K1444r727O246L249K6446o192
953D7037k7079J1523M041N046J3673K3609k1135m2155o465L8359O397m8062o06
940D183L3817M249k7223j7549J4370J0098p502n175r274P424K9775j5227l4472
927a2506j1014K955L419J5556K0488K6056k0331r275j0705j2543K8J4928o420
914F36O002M653j3578J6743q137k092J3690N579p461K0991p094N974L4043k4430
900D5519n402K3754l438k7699j6089J82q343j0007j9892N746K2298j1907k68J2803
$$ plain form
886 7257 25566 19328 8241 -12017 19575 -1256 4749 9196 4477 -16313 -10411 26428 32701
873 32701 35897 39196 5173 29489 52804 34492 29935 43447 55852 49039 15646 -14075 6555
860 6555 8571 40222 59249 1284 -1626 7014 10204 38735 47797 25039 5872 41340 42915
847 42915 13104 16760 17616 -1873 7711 13168 7982 41774 -7674 -8307 13795 30823 15589 11689
833 11689 -12006 -7822 15174 15060 -313 717 28512 17081 8495 24176 32924 16725 28225
820 28225 -6750 -4830 -6651 17925 916 -24468 1611 3795 2052 19467 19708 28285 22292 46846
806 46846 28447 29261 24017 34060 42732 49422 41852 44609 41532 35342 31696 54746 67205 57178
792 57178 45638 17653 39075 45809 19870 31220 7035 -6057 11732 35339 17074 10292
$$ packed form
886G257J8309o238j1087k0258L1592k0831O005M447m719k0790N902L6839O273
873C2701L196L299l4023K4316K3315j8312m557J3512J2405o813l3393k9721K0630
860F555K016L1651J9027n7965k910Q640L190K8531R062k2758j9167L5468J575
847D2915k9811L656Q56j9489R584N457n186L3792m9448o33K2102J7028j5234l900
833A1689k3695M184K2996j14j5373J030K7795j1431q586J5681Q748j6199J1500
820B8225l4975J920j821K4576j7009k5384K6079K184j743J7415K41Q577n993K4554
806D6846j8399Q14n244J0043Q672O690p570K757l077o190l646K3050J2459j0027
792E7178j1540k7985K1422O734k5939J1350k4185j3092J7789K3607j8265o782
$$ plain form
780 10292 -184 -6050 38722 21887 13900 16883 12143 22199 21031 17939 4788 6168 10937 -4601
766 -4601 196 6719 2335 5417 23536 38473 21837 5920 8606 36520 44627 64592 72941 25711
752 25711 -27181 818 10122 -4182 -10657 -15675 -17595 -19067 18962 17342 -2203 17676 11023
739 11023 30890 1577 21409 49747 -3236 6184 17095 24361 -22217 -21263 24849 37742 43391
726 43391 46883 22862 -5389 14302 53964 45467 37093 62004 49787 33106 21964 3298 9539
713 9539 18784 19203 19946 41072 34593 13341 32402 18879 8939 21034 2783 33305 35126 25401
699 25401 15452 16824 27066 16754 -1364 13606 46607 33314 24368 51647 19178 4771 29812
686 29812 26864 -1268 9462 1285 36697 33360 24027 23816 -1231 507 16956 11517 -3022 -9244
$$ packed form
780A0292j0476n866M4772j6835p987K983m740J0056j168l092j3151J380M769j5538
766d601M797O523m384L082J8119J4937j6636j5917K686K7914Q107J9965Q349m7230
752B5711n2892K7999R304j4304o475n018j920j472L8029j620j9545J9879o653
739A1023J9867k9313J9832K8338n2983R420J0911P266m6578R54M6112J2893N649
726D3391L492k4021k8251J9691L9662q497q374K4911j2217j6681j1142j8666O241
713I539R245M19P43K1126o479k1252J9061j3523r940J2095j8251L0522J821r725
699B5401r949J372J0242j0312j8118J4970L3001j3293q946K7279l2469j4407K5041
686B9812k948k8132J0730q177L5412l337r333k11k5047J738J6449n439j4539o222
$$ plain form
672 -9244 4380 1295 9522 16714 -1465 -2194 21575 2676 6046 17257 -21799 5157 6499 1481
658 1481 60009 50424 -4111 -29318 -11588 -23428 -7574 6831 2350 28028 63849 58606 20396
645 20396 25 3120 -8201 16423 -43059 -45599 6973 8414 24843 19252 -12380 -9313 -7670
632 -7670 -27679 -17436 13832 24663 12511 19232 3582 26155 -5581 16734 5825 31090
620 31090 33814 27951 25864 27548 30504 6308 23208 21152 40529 44254 18877 21045 -3211 27309
606 27309 18764 19112 19046 49115 59528 28638 22414 27984 -4211 -38424 -16943 2125 3163 29892
592 29892 23273 21715 -5570 14500 32115 38131 60873 3666 -19560 -18637 -2080 23878 18452
579 18452 -19923 -6287 8404 -20240 20388 45463 -10875 -3291 31928 34011 26540 20237 31825
$$ packed form
672i244J3624l085Q227P192j8179p29K3769j8899L370J1211l9056K6956J342n018
658A481N8528r585n4535k5207J7730j1840J5854J4405m481K5678L5821n243l8210
645B0396k0371L095j1321K4624n9482k540N2572J441J6429n591l1632L067J643
632g670k0009J0243L1268J0831j2152O721j5650K2573l1736K2315j0909K5265
620C1090K724n863k087J684K956k4196J6900k056J9377L725k5377K168k4256L0520
606B7309q545L48o6L0069J0413l0890o224N570l2195l4213K1481J9068J038K6729
592B9892o619j558k7285K0070J7615O016K2742n7207k3226R23J6557K5958n426
579A8452l8375J3636J4691k8644M0628K5075n6338P584L5219K083p471o303J1588
$$ plain form
566 31825 5932 -39760 -29204 11601 3216 15277 40346 36005 28740 39537 15867 -37480 -16212
553 -16212 -5045 -5673 -3058 -13180 9508 19737 5367 4143 -19042 -30265 -20930 625 23422
540 23422 38770 36858 3115 23942 54769 11989 1751 13807 -2507 3872 9474 -11148 -1914
527 -1914 32387 37358 46765 43792 28777 8636 3476 20120 28932 14376 -13155 -1724 -11381
514 -11381 -5246 -25317 -5171 -323 21964 -38278 -12904 236 1865 11101 -16011 -18000 -42584
501 -42584 -24556 -2449 28435 38514 25032 -2292 -6103 25707 9789 -3789 20025 1372
489 1372 32252 35715 24431 -20694 -43958 -37161 -14021 -21503 -8196 -38583 -3114 11747 -13487
476 -13487 -27607 -32619 -28145 -9501 -16518 -20237 -1985 -5358 24501 5529 13670 -15008 -24827
$$ packed form
566C1825k5893m5692J0556M0805q385J2061K5069m341p265J0797k3670n3347K1268
553a6212J1167o28K615j0122K2688J0229j4370j224k3185j1223R335K1555K2797
540B3422J5348j912l3743K0827L0827m2780j0238J2056j6314O379N602k0622R234
527a914L4301M971R407k973j5015k0141n160J6644Q812j4556k7531J1431r657
514a1381O135k0071K0146M848K2287o0242K5374J3140J629R236k7112j989k4584
501d2584J8028K2107L0884J0079j3482k7324l811L1810j5918j3578K3814j8653
489A372L0880L463j1284m5125k3264O797K3140p482J3307l0387L5469J4861k5234
476a3487j4120n012M474J8644p017l719J8252l373K9859j8972Q141k8678r819
$$ plain form
463 -24827 -8103 -39486 -58013 -26559 -29463 14601 13414 -10044 -29891 -38498 -2880 -9416 -22739
450 -22739 3524 15320 6502 -6052 3739 147 -9295 -26591 -32320 -21768 -16088 -18722 3793
437 3793 17358 4387 -45513 -25340 -8717 5143 9758 -34389 -15699 -15914 -11817 16554 13289
424 13289 -25682 -20134 4556 6954 2078 2936 233 -449 -30220 2202 -9820 -12731 -17642 -10768
410 -10768 -1826 6697 10640 -1471 22814 -7611 32270 22105 7689 627 4344 16837 -31683
397 -31683 -36139 1897 9989 5787 15000 6500 -9479 -22402 -12435 6380 -29898 -41411 -21267
384 -21267 -36479 -35302 -11597 -34387 -22314 691 15064 19028 13187 19673 1394 11567 5736
371 5736 -2225 -6936 16513 51399 36838 28634 39485 45485 9294 -2588 -16751 -21848 4288
$$ packed form
463b4827J6724l1383j8527L1454k904M4064j187k3458j9847q607L5618o536j3323
450b2739K6263J1796q818j2554R791l592r442j7296n729J0552N680k634K2515
437C793J3565j2971m9900K0173J6623J3860M615m4147J8690k15M097K8371l265
424A3289l8971N548K4690K398m876Q58k703o82k9771L2422j2022k911m911O874
410a0768Q942Q523L943j2111K4285l0425L9881j0165j4416p062L717J2493m8520
397c1683m456L8036Q092m202R213q500j5979j2923R967J8815l6278j1513K0144
384b1267j5212J177K3705k2790J2073K3005J4373L964n841O486j8279J0173n831
371E736p961m711K3449L4886j4561q204J0851O000l6191j1882j4163n097K6136
$$ plain form
358 4288 -9946 -19663 -7284 35325 20217 -1433 -32639 992 -22689 -33864 -53285 -46798 -33876
345 -33876 -14342 -1593 7974 -6552 -12456 -15925 -24317 -30123 -24131 -11113 10316 25231 -9232
332 -9232 8710 17864 23880 22733 -12008 -5669 12220 9096 36216 29914 -11082 -23778 -17215 -7336
318 -7336 -25756 -27898 -24474 -21028 -4555 -5667 -20875 -13135 -4490 -5141 -2341 -28238 -31561 -10968
304 -10968 -269 5044 2982 -32030 -23551 15362 15241 18007 9474 25640 -6819 -11032 30013 71
290 71 4081 -3582 -1841 37873 38597 -5587 -20050 12370 -2094 -15918 17063 -25569 -27307 -23623
276 -23623 -23051 11932 23494 -38587 -31670 -33660 -26906 7907 -2503 -24016 -38504 -53320 -12780
263 -12780 -9881 -13187 -48231 -36921 -26360 -18017 -22174 -4813 -13939 -24535 -16715 -15416 -3500
$$ packed form
358D288j4234r717J2379M2609j5108k1650l1206L3631k3681j1175j9421O487J2922
345c3876J9534J2749R567j4526n904l469q392n806N992J3018K1429J4915l4463
332i232J7942R154O016j147l4741O339J7889l124K7120o302m0996j2696O563R879
318g336j8420k142L424L446J6473j112j5208P740Q645o51K800k5897l323K0593
304a0968J0699N313k062l5012Q479L8913j21K766q533J6166l2459m213M1045k9942
290G1M010p663J741L9714P24m4184j4463L2420j4464j3824L2981m2632j738L684
276b3623N72L4983J1562o2081O917j990O754L4813j0410k1513j4488j4816M0540
263a2780K899l306l5044J1310J0561Q343m157J7361r126j0596P820J299J1916
$$ plain form
250 -3500 5301 -6869 -8699 -2503 -14622 -23283 -5527 -26154 -19500 -21651 15664 5551 -25506
237 -25506 22921 25600 18345 -12723 5916 10241 9650 -12818 -46991 -49210 -21117 -34984 -43677
224 -43677 -46161 -15553 -2287 -31056 -42638 -32799 -38443 -9754 1006 -16447 -5455 20830 9366
211 9366 3810 808 -1778 -8664 -15510 -20746 -16318 4237 8345 -31257 -31804 -31492 -29976 -7457 -4839
196 -4839 -17174 -7112 -32849 -14414 -19472 -29919 -14434 -17015 -14819 -21778 -36401 -15902 12009
183 12009 6558 20601 8134 -34666 -18904 -6445 -14148 -25374 -34340 -24031 -33627 -40107 -39197
170 -39197 -40035 -36883 -18944 -5745 -989 -32070 -39406 -33741 -33930 -30289 -44966 -16018 -15013 -5970
156 -5970 7925 -7290 -47980 -33216 -28072 -32695 -29603 -19202 -17084 -5074 -12549 -16314 1943
$$ packed form
250c500Q801j2170j830O196j2119q661J7756k0627O654k151L7315j0113l1057
237b5506M8427K679p255l1068J8639M325n91k2468l4173k219K8093j3867q693
224d3677k484L0608J3266k8769j1582R839n644K8689J0760j7453J0992K6285j1464
211I366n556l002k586o886o846n236M428K0555M108l9602n47L12J516K2519K618
196d839j2335J0062k5737J8435n058j0447J5485k581K196o959j4623K0499K7911
183A2009n451J4043j2467m2800J5762J2459p703j1226q966J0309r596o480R10
170c9197q38L152J7939J3199M756l1081p336N665j89L641j4677K8948J005R043
156e970J3895j5215m0690J4764N144m623L092J0401K118J2010p475l765J8257
$$ plain form
143 1943 17547 -4840 -25203 -42991 -40669 -7655 -6191 8354 -7872 -11197 -34721 -42520 -22483
130 -22483 -17705 -38026 -61448 -39824 -26266 -25912 -27388 -27140 -19556 -20338 -2070 -6386 -16986 -24575
116 -24575 -19074 -2545 20338 8308 -11580 -5339 -1788 -7333 14389 9173 -706 -23554 -21848
103 -21848 -19328 -26227 -45336 -47491 -27753 -16435 -7283 -18072 -50667 -25872 -21098 -22849 -26633
90 -26633 -12737 -21853 -52401 -44908 -41479 -37165 -19077 -23075 -30784 -15243 -23485 -20108 -23515 -29654
76 -29654 -46934 -53721 -41224 -41338 -8621 -15012 -27860 -41927 -29847 -19456 -23907 -11213 -4031
63 -4031 -11772 -34374 -51569 -58631 -64495 -47827 -25863 -15917 -24947 -39274 -26593 6141 -10889
50 -10889 -10421 -7250 -31155 -53611 -59503 -39483 -27041 -21407 -15052 -21711 -15906 647 -22300 -17706
$$ packed form
143A943J5604k2387k0363j7788K322L3014J464J4545j6226l325k3524p799K0037
130b2483M778k0321k3422K1624J3558L54j476K48P584p82J8268m316j0600p589
116b4575N501J6529K2883j2030j9888O241L551n545K1722n216r879k2848J706
103b1848K520o899j9109k155J9738J1318R152j0789l2595K4795M774j751l784
90b6633J3896r116l0548P493L429M314J8088l998p709J5541q242L377l407o139
76b9654j7280o787J2497j14L2717o391j2848j4067J2080J0391m451J2694P182
63d031p741k2602j7195p062n864J6668K1964R946r030j4327J2681L2734j7030
50a0889M68L171k3905k2456n892K0020J2442N634O355o659N805J6553k2947M594
$$ plain form
36 -17706 -29195 -19530 -37997 -29520 -56682 -60750 -32775 -14481 -23980 -32010 -31332 -27782 -23920 -29773
22 -29773 -26036 -30977 -55675 -45602 -36162 -53313 -35326 -21552 -29974 -27764 -21100 -35869 -36231 -21783
8 -21783 -10468 -20699 -24117 -43277 -35741 -29090 -17574 -28037
0 -28037
$$ packed form
36a7706j1489R665j8467Q477k7162m068K7975J8294r499q030O78L550L862n853
22b9773L737m941k4698J0073R440j7151J7987J3774q422K210O664j4769l62J4448
8b1783J1315j0231l418j9160P536O651J1516j0463
0b8037
$$ Imaginary data points
##PAGE= N=2
##DATA TABLE= (X++(I..I)), XYDATA
$$ plain form
16383 -1452473 -1423035 -1368458 -1334479 -1319519 -1303723 -1291699 -1255936 -1250025 -1219225 -1196308 -1154056
16372 -1154056 -1136004 -1114072 -1059669 -1044502 -1020656 -987055 -943212 -903201 -872448 -851009 -823836
16361 -823836 -820471 -804416 -778613 -738959 -701406 -677660 -650246 -635006 -625359 -596763 -545829 -523208
$$ packed form
16383a452473K9438N4577L3979J4960J5796J2024L5763N911L0800K2917M2252
16372a154056J8052K1932N4403J5167K3846L3601M3843M0011L0753K1439K7173
16361h23836L365J6055K5803L9654L7553K3746K7414J5240R647K8596N0934K2621
$$ [...]
##END NTUPLES=NMR SPECTRUM
##END=
