##TITLE=1H_TG-2341-A-2
 CDCl3
 8 sc, 
 25.08.2022
##JCAMPDX= 6.0         $$ Bruker NMR JCAMP-DX V2.0
##DATA TYPE= NMR SPECTRUM
##DATA CLASS= NTUPLES
##ORIGIN= UXNMR, Bruker Analytische Messtechnik GmbH
##OWNER= root
$$ XWIN-NMR		Version 3.5
$$ Thu Aug 25 12:04:13 2022 Russian Standard Time (UT+4h)  she@DPX200
##.OBSERVE FREQUENCY= 200.1313499994
##.OBSERVE NUCLEUS= ^1H
##.ACQUISITION MODE= SIMULTANEOUS
##.ACQUISITION SCHEME= undefined
##.AVERAGES= 8
##.DIGITISER RES= 18
##SPECTROMETER/DATA SYSTEM= spect
##.PULSE SEQUENCE= zg30
##.SOLVENT NAME= CDCl3
##.SHIFT REFERENCE= (INTERNAL, CDCl3, 0, 15.7524)
##AUDIT TRAIL= $$ (NUMBER, WHEN, WHO, WHERE, WHAT)
$$ ##TITLE= Audit trail, XWIN-NMR		Version 3.5
$$ ##JCAMPDX= 5.01
$$ ##ORIGIN= Bruker BioSpin GmbH
$$ ##OWNER= she
$$ F:/spectra/data/she/nmr/H-F/1/pdata/1/auditp.txt
$$ ##AUDIT TRAIL=  $$ (NUMBER, WHEN, WHO, WHERE, WHAT)
(   1,<2022-08-25 12:02:47.06 +0400>,<she>,<DPX200>,
      <created by zg, POWCHK disabled, PULCHK disabled
       configuration hash MD5:
       00 E9 B6 7A A2 85 ED C7 34 08 36 98 17 FE 4E 26
       data hash MD5: 16K
       21 BA FF 53 D5 06 DE BB F3 91 EA A2 B7 C7 1E DB>)
(   2,<2022-08-25 12:02:49.75 +0400>,<she>,<DPX200>,
      <Start of raw data processing
       efp BC_mod = 2 LB = 0.24 FT_mod = 6 PKNL = 1 PHC0 = -18035.06 PHC1 = 6.600692 SI = 16K 
       data hash MD5: 16K
       AF 8A 7C 38 41 F5 F1 82 9D F1 59 31 C9 60 15 21>)
(   3,<2022-08-25 12:03:11.42 +0400>,<she>,<DPX200>,
      <pk PHC0 = -156.6358 PHC1 = 0 
       data hash MD5: 16K
       07 FF CA D2 4A A6 64 34 67 E8 DA 93 C3 0D 3F 64>)
(   4,<2022-08-25 12:03:14.57 +0400>,<she>,<DPX200>,
      <abs ABSG = 5 
       data hash MD5: 16K
       E4 CD E5 0F FF 3C AA 54 53 30 3F 76 04 05 A7 DF>)
$$ ##END=
$$ 
$$ hash MD5
$$ 92 B8 F1 BC D3 E1 DB B6 6D F5 35 96 03 91 EE 4A
##$RELAX= 
##$RELAX= 
##$RELAX= 
##$RELAX= 
##$RELAX= 
##$RELAX= 
$$ Bruker specific parameters
$$ --------------------------
##$DU= <F:/spectra>
##$EXPNO= 1
##$NAME= <H-F>
##$PROCNO= 1
##$TYPE= <nmr>
##$USER= <she>
##$AMP= (0..31)
100 100 100 100 100 100 100 100 100 100 100 100 100 100 100 100 100 100 
100 100 100 100 100 100 100 100 100 100 100 100 100 100 
##$AQSEQ= 0
##$AQ_mod= 1
##$AUNM= <au_zg>
##$AUTOPOS= <>
##$BF1= 200.13
##$BF2= 200.13
##$BF3= 200.13
##$BF4= 200.13
##$BF5= 200.13
##$BF6= 200.13
##$BF7= 200.13
##$BF8= 200.13
##$BYTORDA= 1
##$CFDGTYP= 0
##$CFRGTYP= 5
##$CHEMSTR= <none>
##$CNST= (0..31)
1 1 145 1 1 1 1 1 1 1 1 1 1 1 1 1 1 1 1 1 1 1 1 1 1 1 1 1 1 1 1 1 
##$CPDPRG= <>
##$CPDPRG1= <>
##$CPDPRG2= <>
##$CPDPRG3= <>
##$CPDPRG4= <mlev>
##$CPDPRG5= <mlev>
##$CPDPRG6= <mlev>
##$CPDPRG7= <mlev>
##$CPDPRG8= <mlev>
##$CPDPRGB= <>
##$CPDPRGT= <>
##$D= (0..31)
0 1.2 0 0 0 0 0 0 0 0.06 0 0.03 0 0 0 0 0.0002 0 0 0 0 0 0 0 0 0 0 0 0 
0 0 0 
##$DATE= 1661414566
##$DBL= (0..7)
120 120 120 120 120 120 120 120 
##$DBP= (0..7)
150 150 150 150 150 150 150 150 
##$DBP07= 0
##$DBPNAM0= <>
##$DBPNAM1= <>
##$DBPNAM2= <>
##$DBPNAM3= <>
##$DBPNAM4= <>
$$ [...]
##$SUBNAM3= <"">
##$SUBNAM4= <"">
##$SUBNAM5= <"">
##$SUBNAM6= <"">
##$SUBNAM7= <"">
##$SUBNAM8= <"">
##$SUBNAM9= <"">
##$SW= 18.0517283424941
##$SWIBOX= (0..15)
0 0 2 0 0 0 0 0 0 0 0 0 0 0 0 0 
##$SW_h= 3612.71676300578
##$TD= 16384
##$TD0= 1
##$TE= 0
##$TE2= 300
##$TE3= 300
##$TEG= 300
##$TL= (0..7)
0 120 120 120 120 120 120 120 
##$TP= (0..7)
150 150 150 150 150 150 150 150 
##$TP07= 0
##$TPNAME0= <>
##$TPNAME1= <>
##$TPNAME2= <>
##$TPNAME3= <>
##$TPNAME4= <>
##$TPNAME5= <>
##$TPNAME6= <>
##$TPNAME7= <>
##$TPOAL= (0..7)
0.5 0.5 0.5 0.5 0.5 0.5 0.5 0.5 
##$TPOFFS= (0..7)
0 0 0 0 0 0 0 0 
##$TUNHIN= 0
##$TUNHOUT= 0
##$TUNXOUT= 0
##$USERA1= <user>
##$USERA2= <user>
##$USERA3= <user>
##$USERA4= <user>
##$USERA5= <user>
##$V9= 5
##$VALIST= <valist>
##$VCLIST= <CCCCCCCCCCCCCCC>
##$VD= 0
##$VDLIST= <DDDDDDDDDDDDDDD>
##$VPLIST= <PPPPPPPPPPPPPPP>
##$VTLIST= <TTTTTTTTTTTTTTT>
##$WBST= 1024
##$WBSW= 4
##$XGAIN= (0..3)
0 0 0 0 
##$XL= 0
##$YL= 0
##$YMAX_a= 766128
##$YMIN_a= -611017
##$ZGOPTNS= <>
##$ZL1= 120
##$ZL2= 120
##$ZL3= 120
##$ZL4= 120
##$ABSF1= 15.75571
##$ABSF2= -2.29614
##$ABSG= 5
##$ABSL= 3
##$ALPHA= 0
##$AQORDER= 0
##$ASSFAC= 0
##$ASSFACI= 0
##$ASSFACX= 0
##$ASSWID= 0
##$AUNMP= <proc_1d>
##$AZFE= 0.1
##$AZFW= 0.1
##$BCFW= 0
##$BC_mod= 2
##$BYTORDP= 0
##$COROFFS= 0
##$CY= -3
##$DATMOD= 1
##$DC= 0
##$DFILT= <>
##$DTYPP= 0
##$F1P= 0
##$F2P= 0
##$FCOR= 1
##$FTSIZE= 16384
##$FT_mod= 6
##$GAMMA= 0
##$GB= 0
##$INTBC= 1
##$INTSCL= 1.705223e-09
##$ISEN= 128
##$LB= 0.24
##$LEV0= 0
##$LPBIN= 0
##$MAXI= 10000
##$MC2= 0
##$MEAN= 0
##$ME_mod= 0
##$MI= 1.114404
##$NCOEF= 0
##$NC_proc= -6
##$NLEV= 6
##$NOISF1= 3.799351
##$NOISF2= 2.8
##$NSP= 0
##$NTH_PI= 0
##$NZP= 0
##$OFFSET= 15.7524
##$PC= 1
##$PHC0= -18191.7
##$PHC1= 6.600692
##$PH_mod= 1
##$PKNL= yes
##$PPARMOD= 0
##$PSCAL= 0
##$PSIGN= 0
##$REVERSE= no
##$SF= 200.130003830338
##$SI= 16384
##$SIGF1= 3
##$SIGF2= 2
##$SINO= 5.538805
##$SIOLD= 16384
##$SREGLST= <1H.CDCl3>
##$SSB= 0
##$STSI= 16384
##$STSR= 0
##$SW_p= 3612.71676300578
##$SYMM= 0
##$S_DEV= 0
##$TDeff= 16384
##$TDoff= 0
##$TI= <>
##$TILT= no
##$TM1= 0
##$TM2= 0
##$TOPLEV= 0
##$USERP1= <user>
##$USERP2= <user>
##$USERP3= <user>
##$USERP4= <user>
##$USERP5= <user>
##$WDW= 1
##$XDIM= 16384
##$YMAX_p= 455100932
##$YMIN_p= -241070
$$ End of Bruker specific parameters
$$ ---------------------------------
##NTUPLES= NMR SPECTRUM
##VAR_NAME=  FREQUENCY,     SPECTRUM/REAL,   SPECTRUM/IMAG
##SYMBOL=    X,             R,               I
##VAR_TYPE=  INDEPENDENT,   DEPENDENT,       DEPENDENT
##VAR_FORM=  AFFN,          ASDF,            ASDF
##VAR_DIM=   16384,         16384,           16384
##UNITS=     HZ,            ARBITRARY UNITS, ARBITRARY UNITS
##FACTOR=    0.220516191357247, 1,           1
##FIRST=     3152.52795203967, 0,            0
##LAST=      -460.18881096611, 0,            0
##MIN=       -460.18881096611, -241070,      0
##MAX=       3152.52795203967, 455100932,    0
$$ Real data points
##PAGE= N=1
##DATA TABLE= (X++(R..R)), XYDATA
$$ [...]
7090H934798K78417L13479K73181K45138K73193L43954L20311M24303L87889M27921
7080A2222584M72662M99427N64544L85086K52299K49169J73679J28758K29445
7071A5177653K86268M03787M69364O09688O87321P44650Q03443Q67600Q91758
7062B0941532J053559J146096J460159J738158J922875K068923K308028K379340
7054C5018670K467849K645992L011667L664107M392713N181226N918722P009489
7046F9310435Q432973R634540R828461P290252J425646n368467j0933926j3068232
7038G6551682j2156443j0033106p845812o030869m567534l469409k764970k178512
7030B7505027j755554j307133r50877p52971o12250l23736j39094j27298O7703
$$ y = [8934798, 9213215, 9526694, 9799875, 10045013, 10318206, 10662160, 10982471, 11406774, 11794663, 12222584, 12695246, 13194673, 13759217, 14144303, 14396602, 14645771, 14819450, 14948208, 15177653, 15463921, 15867708, 16337072, 16946760, 17634081, 18378731, 19182174, 20049774, 20941532, 21995091, 23141187, 24601346, 26339504, 28262379, 30331302, 32639330, 35018670, 37486519, 40132511, 43144178, 46808285, 51200998, 56382224, 62300946, 69310435, 77743408, 87377948, 97206409, 104496661, 105922307, 100553840, 89619914, 76551682, 64395239, 54362133, 46516321, 40485452, 35917918, 32448509, 29683539, 27505027, 25749473, 24442340, 23491463, 22738492, 22126242, 21802506, 21663412, 21536114, 21603817]
7021B1603817K07502L39256N19532O79290Q93977R90964J132274J236927J254882
7012B8858421J424189J738269J977607K522136L062076L643270M451483M962474
7004E2639925M753103L685346J977009p8747k187654m071155n788128o636899
6996D4292800o449638n632790m583938l727688k950118k326161j852309j550521
6988A5219637j281854j062208q94168o90222o26787o12339n54988m37669l86529
6979H672873l63270l67536m19871l41749l04189k92625j31752k33064l01652k14436
6969E702729k15217j47924j44033k04271j58959j50117j84116j75732j13001j29147
6959D080212k1288o2680o4591l7857k8180m4958j6532k7294k8388K8219l6499
$$ y = [21603817, 21811319, 22150575, 22670107, 23349397, 24243374, 25234338, 26366612, 27603539, 28858421, 30282610, 32020879, 33998486, 36520622, 39582698, 43225968, 47677451, 52639925, 57393028, 61078374, 63055383, 62976636, 60788982, 56717827, 50929699, 44292800, 37843162, 32210372, 27626434, 23898746, 20948628, 18622467, 16770158, 15219637, 13937783, 12875575, 11981407, 11291185, 10664398, 10052059, 9497071, 9059402, 8672873, 8309603, 7942067, 7522196, 7180447, 6876258, 6583633, 6451881, 6218817, 5917165, 5702729, 5487512, 5339588, 5195555, 4991284, 4832325, 4682208, 4498092, 4322360, 4209359, 4080212, 4058924, 3996244, 3931653, 3893796, 3865616, 3820658, 3804126, 3776832, 3748444, 3776663, 3740164]
6948C740164J9263K4291J05352Q9096P9071J0700R5289J09337J34633K5879R4364
6937D527439K06724J89872K07304L12763L69201M57321N30273M40473J74385j49066
6927G266689n11386p19307p06646o74703n75844m39479l61191k35593k55663k32676
6917B554201q8342j26420j62090j920j80482r1550L8001m3996j31548r2047L3497
6906A707304m5824n0794J5896o7620o6013L0324p5506j01522m430L8424r987p2567
6894A297685l0398K6523k6319K3821k334p0584l5151k1952P941l7870m7062K8292
6882A112592K5809k4774J2750l7567o398k5525l7020L693j872P706j4243K6436
6870A041587P089N5836P3111n5375p3548m0935p1230j4172J8127J5527k4184n8005
$$ y = [3740164, 3759427, 3783718, 3889070, 3978166, 4057237, 4067937, 4163226, 4272563, 4407196, 4433075, 4527439, 4734163, 4924035, 5131339, 5444102, 5813303, 6270624, 6800897, 7241370, 7415755, 7266689, 6755303, 6035996, 5329350, 4654647, 4078803, 3639324, 3278133, 3042540, 2786877, 2554201, 2465859, 2339439, 2177349, 2175429, 1994947, 1903397, 1941398, 1897402, 1765854, 1673807, 1707304, 1661480, 1610686, 1626582, 1558962, 1492949, 1523273, 1447767, 1346245, 1341815, 1380239, 1370252, 1297685, 1267287, 1293810, 1267491, 1291312, 1288978, 1218394, 1183243, 1161291, 1169232, 1131362, 1084300, 1112592, 1138401, 1113627, 1126377, 1088810, 1082412, 1056887, 1019867, 1023560, 1021688, 1029394, 1015151, 1041587, 1048676, 1104512, 1177623, 1122248, 1048700, 1007765, 936535, 922363, 940490, 956017, 931833, 873828]
6858H73828q359R86j694m4791l8594Q929m0041J6334n175K5699K2729o0033M164
6845G53982m1506o3698M9101n0519k7352j8380K1701j176o377p961J6297K2955
6833F47067j5868L681K4340o4590p7748K8217O8505K8413K118p1602M440K7406
6821F04379j7015J4030p1034k2643K3632N4258Q176o9553m605k1770l0425N7442
6809E24872L6017M1799p1683n499O3937m7163L6644k1091l8672l6211k787j9248
6797D60915R783L0676j5423m9167J2424J4106L4022o085n9409j8258l472m760
6785D05352M9604N7721L2985Q72K5747m9657M1317J0121r7462K5186L696k0009
6773D85473N4203O953n6746k1967J3495n1636l958n2285N0546l0465o3597P6452
$$ y = [873828, 865469, 866455, 864761, 819970, 781376, 790305, 750264, 766598, 761423, 787122, 809851, 749818, 753982, 712476, 648778, 697879, 647360, 620008, 601628, 623329, 622153, 615776, 607815, 624112, 647067, 631199, 634880, 659220, 594630, 516882, 545099, 613604, 642017, 644135, 572533, 576973, 604379, 587364, 601394, 530360, 507717, 531349, 585607, 593783, 524230, 519625, 497855, 467430, 524872, 560889, 602688, 531005, 525506, 589443, 542280, 578924, 557833, 519161, 482950, 480163, 460915, 470698, 501374, 485951, 436784, 449208, 463314, 497336, 491251, 431842, 413584, 410112, 405352, 454956, 512677, 545662, 546534, 572281, 522624, 563941, 574062, 476600, 501786, 505482, 485473, 539676, 546629, 489883, 467916, 481411, 429775, 425817, 373532, 424078, 393613, 330016, 406468]
6761D06468M88j4209m8355J19199k9958J0740K1993L023M611q0633K2040Q8520
6749E03927q583k5314J7214L174k7892k4590q313L772Q2100L8730j13178m981
6737D36066L5395P7012l1914L5175j4n1941m1545L0323L4944N4657m763K0285
6725E93680R2403M3700p4441r9177k0151O0531P354R13P4671l9153K8096O1137
6713G29563K8459K7521j8120k9514p6650n1711L6450p886r885k2890j3697j0301
6701E81339K117L4570k111L3942k7561m6970k0827Q778k1287l1414L3393o0212
6689D83757k6598O3039M4982o019n3089k7556k3091L8767r299p1599P758O343
6677D27395O471l3668J9586j1166M6816j0908M9194k6922n2852P2876N2403k1467
$$ y = [406468, 406956, 392747, 344392, 463591, 433633, 444373, 466366, 469389, 474000, 393367, 415407, 503927, 495344, 470030, 487244, 490418, 462526, 437936, 429623, 433395, 515495, 554225, 441047, 436066, 471461, 548473, 516559, 551734, 551720, 499779, 458234, 488557, 523501, 578158, 573395, 593680, 686083, 729783, 655342, 556165, 536014, 596545, 603899, 604812, 679483, 640330, 668426, 729563, 758022, 785543, 767423, 737909, 661259, 609548, 645998, 638112, 628227, 605337, 591640, 581339, 583456, 618026, 615915, 649857, 622296, 575326, 554499, 563277, 541990, 510576, 543969, 483757, 457159, 520198, 565180, 559161, 506072, 478516, 455425, 494192, 484893, 413294, 421052, 427395, 433866, 400198, 419784, 408618, 455434, 444526, 493720, 466798, 413946, 486822, 539225, 517758]
6665E17758n8741p987R0385k5943q5646K3035Q3606M5820l1454r092M0537j962
6653E80316m6250J05672Q5947m3276r428N7829J3771O2009K442L0136R7028K2526
6641I58722p4146k5533m6623o6787n3714o9173L5528J6685r013o4490O1351K172
6629F64979m8885J9989J4993q4424j5114O290j8860P9859m4679J7983M4601n3675
6617E83057J2500l5826O0826K9699l3068L170l3517J7981N595J6009M1173N3687
6605G21286q036q359j090O0611k3894k408k1184n5925j4130p876j1631J0062O63
6592F38089p4941O834o8080M0346O9234L0004q7544j0128O2134N7813O2060m0921
6580F84900j2067K2106L3212R0529j8420p9967O408O788j709q597l0854l2480
$$ y = [517758, 459017, 451030, 541415, 515472, 429826, 452861, 536467, 582287, 550833, 541741, 582278, 580316, 534066, 639738, 725685, 682409, 672981, 730810, 744581, 806590, 809032, 839168, 936196, 958722, 884576, 859043, 812420, 745633, 691919, 622746, 658274, 674959, 665946, 601456, 662807, 664979, 616094, 636083, 651076, 566652, 551538, 557828, 538968, 618827, 574148, 592131, 636732, 583057, 595557, 559731, 620557, 650256, 617188, 620358, 586841, 604822, 610417, 626426, 667599, 721286, 713250, 704891, 703801, 764412, 740518, 738110, 716926, 661001, 646871, 638995, 627364, 637426, 638089, 563148, 569982, 501902, 542248, 611482, 641486, 553942, 543814, 605948, 663761, 725821, 684900, 672833, 694939, 728151, 818680, 800260, 720293, 726701, 733489, 731780, 723183, 692329, 659849]
6568F59849k9168Q0517K5938j01184R816n6031l1534j09807o004N9041K5332m6622
6556D80143n7810L3541k1375K0208k3728n851L461J3129J2550J7626K0476k8879
6544D63491l0061m2465L4802l1890M5745O770k3265p748K17K6071L518m8103m4986
6531C52096L9515P3707l9746L9808n0004k6879K4986J329l0548j2071P4779M6765
6519D93737M266K79o9866J2722M829r7767K4590O9535K5232p8150Q1333K0825
6507D91565m4331k1053J2325L2349L56M905K9227k0947L5674N7214P632l5829
6495E49087L7269j4045k8809L575R95m9443n393M6846N0410N2088O0267L0824
6483G33671j05279K4784K0802m526J5311j7296L0046j9121L5957k8811j7686k0914
$$ y = [659849, 630681, 711198, 737136, 635952, 645768, 589737, 558203, 448396, 442392, 501433, 526765, 480143, 422333, 455874, 434499, 454707, 430979, 425128, 428589, 441718, 454268, 471894, 492370, 463491, 433430, 390965, 425767, 393877, 439622, 446392, 423127, 415379, 415596, 441667, 445185, 397082, 352096, 391611, 465318, 425572, 465380, 415376, 388497, 413483, 414812, 384264, 372193, 446972, 493737, 498003, 498282, 428416, 441138, 445967, 348200, 372790, 442325, 467557, 389407, 470740, 491565, 447234, 426181, 438506, 470855, 471211, 476116, 505343, 484396, 520070, 577284, 584916, 549087, 586356, 572311, 543502, 547077, 548072, 498629, 493236, 540082, 590492, 642580, 702847, 733671, 628392, 653176, 673978, 669452, 684763, 667467, 697513, 678392, 714349, 685538, 667852, 646938]
6471F46938L0753J5241J1311O652J8756p8765L9551N9770r2878O736q22K898n2103
6458F14038J685n8752o341M9096L8366M9087N969o2410j3753K2317m8968R234
6446E99568J5662M3539j5093p2553j1339N5909J8601m8148L3741k0550o840M1704
6434F34201p9745m2620L3730M7174j8524K3486L9955n2355J0435O61q024o927
6422E81447p791l4684L6800l5698n445P828k1154l1006P386M7378o7302L7324
6410E15083O5064J9112j08O04M3274J5212k0938l2967l1182J4143J0075O356K2610
6397F26338j6556o415n7322j8940M6728O0258k1771J8960K1564J2932J3517n120
6385F74173l616o654m0685N0135K4740l0213Q55O3187k0440m3998P243J4129m3073
$$ y = [646938, 677691, 692932, 704243, 710895, 729651, 650886, 690437, 750207, 657329, 664065, 663243, 666141, 614038, 615723, 556971, 550630, 599726, 638092, 687179, 693148, 630738, 616985, 639302, 590334, 599568, 615230, 658769, 643676, 571123, 559784, 615693, 634294, 586146, 619887, 599337, 592497, 634201, 554456, 511836, 545566, 592740, 574216, 597702, 637657, 585302, 595737, 596398, 588374, 581447, 573656, 538972, 575772, 540074, 534629, 542457, 521303, 490297, 497683, 545061, 477759, 515083, 580147, 599259, 599151, 599755, 643029, 658241, 637303, 604336, 573154, 587297, 597372, 603728, 626338, 609782, 603367, 546045, 527105, 573833, 634091, 612320, 631280, 652844, 665776, 679293, 674173, 670557, 663903, 623218, 673353, 698093, 667880, 668735, 731922, 711482, 667484, 674727, 688856, 645783]
6372F45783K4767P38j4880j2972J1315Q3141m4150m5228K5145l2192m910M5062
6360F81619k0881J113P1022m493J0945L617m6962L2437m1939k5493J1135Q7911
6348G60031k6420n3659j8720L6031l4648L9659K4308J08986o4219J451j1567L5614
6336G96847Q225o2904o539L3779q689m6199l3495O6353K6660r6725O8061J2949
6324G58323M5817j8689j2384m0132L6861n446k3104J8383O3580o850k343P4261
6312H88277L112J2902p0486j7873L8895k2028k9059Q5237L315o0325L0356j1347
6300H50976K8981o351N1334K3600r3652n0607r899M7600P0178K8913j5002l5266
6288H90805R922J3388K6517j8047M461l2568N0764N7606J5291k2157l117K5324
$$ y = [645783, 670550, 671288, 656408, 643436, 654751, 737892, 693742, 648514, 673659, 641467, 636557, 681619, 660738, 661851, 732873, 728380, 739325, 742942, 695980, 728417, 686478, 660985, 672120, 760031, 733611, 679952, 661232, 697263, 662615, 702274, 726582, 835568, 771349, 772800, 761233, 796847, 805072, 742168, 735629, 769408, 760719, 714520, 681025, 747378, 774038, 677313, 745374, 758323, 804140, 785451, 773067, 732935, 769796, 764350, 741246, 759629, 823209, 816359, 814016, 888277, 891389, 904291, 833805, 815932, 854827, 832799, 803740, 888977, 892292, 831967, 862323, 850976, 879957, 873606, 924940, 948540, 854888, 804281, 794382, 841982, 912160, 941073, 926071, 890805, 900727, 914115, 940632, 922585, 927046, 894478, 945242, 1002848, 1018139, 995982, 992865, 1018189]
6276A018189k176k6961M9146K8552R377L1146K944k1188p2362J3341Q3261K6565
6264A139834n7990O0019J3027O1617l5948Q8200o4674p576O6549l7094K6967R512
6252A262443P3599k1508O3127r867n8722L6998j6535M2937R191K3744N3322Q359
6240A467088N0286J15o216k5652J9123k2260o801p2416m26Q3167L4719m2804N0335
6227A528258J2686p808p278M986Q312n4205m1101L1074J7209l7568j2711Q439
6215A450293J8356N8470m6779J5171L9584m224k5129M566M0653K910l1585j06889
6203A415397n4553j8447J9727J890l7918J6578o3625p0321N0233N1016K132k0164
6191A291945O0302o4519n525J7977r805J94J6368l9943Q2310J0326o452j2137
$$ y = [1018189, 1016013, 989052, 1038198, 1066750, 1076127, 1107273, 1110217, 1089029, 1016667, 1030008, 1113269, 1139834, 1081844, 1141863, 1154890, 1216507, 1180559, 1268759, 1204085, 1196509, 1263058, 1225964, 1252931, 1262443, 1336042, 1314534, 1377661, 1367794, 1309072, 1346070, 1329535, 1372472, 1381663, 1405407, 1458729, 1467088, 1517374, 1517489, 1511273, 1485621, 1504744, 1482484, 1475683, 1403267, 1402841, 1486008, 1520727, 1477923, 1528258, 1540944, 1533136, 1525858, 1530844, 1539156, 1484951, 1443850, 1474924, 1492133, 1454565, 1441854, 1450293, 1468649, 1527119, 1480340, 1495511, 1535095, 1530871, 1505742, 1510308, 1550961, 1553871, 1522286, 1415397, 1360844, 1342397, 1362124, 1364014, 1326096, 1342674, 1279049, 1208728, 1258961, 1309977, 1312109, 1291945, 1352247, 1287728, 1282203, 1300180, 1290375, 1290569, 1306937, 1266994, 1349304, 1359630, 1353178, 1341041]
6179A341041L3673L1797r4192k0449K7234N3317j0381K556r664O0260R5274r4064
6167A416402k2958L6392k2385K7808M1204p0338N4024L5238L7483j9563M0363
6156A553670j3874j0076O0724m5047r236J5366O1888M0541l2480r2556P121P1342
6144A607383R583r784O7159N412j4938r333M9995k3713j6094k1512M9072m5624
6132A647606N847M9778R6663M6055j7121j1348k2724N0001M1932j8557M4893m1413
6120A871612L317L6831J5129k691L4853Q55p2970K5075k4707j6056M8900n545
6108A914603L6729O4553o2524Q41L4633j8715M3947N1216k8172K3119O0274m4765
6096B075739L3946M4390m1079L9048J6521j5569N7042K2101l3246L153O6328P3851
$$ y = [1341041, 1374714, 1406511, 1312319, 1291870, 1319104, 1372421, 1362040, 1364596, 1354932, 1415192, 1510466, 1416402, 1393444, 1429836, 1407451, 1435259, 1476463, 1406125, 1460149, 1495387, 1532870, 1513307, 1553670, 1539796, 1529720, 1590444, 1545397, 1536161, 1551527, 1613415, 1653956, 1621476, 1528920, 1536041, 1607383, 1616966, 1607182, 1674341, 1679753, 1664815, 1655482, 1705477, 1681764, 1665670, 1644158, 1693230, 1647606, 1653453, 1703231, 1799894, 1845949, 1828828, 1817480, 1794756, 1844757, 1886689, 1868132, 1913025, 1871612, 1874929, 1911760, 1926889, 1924198, 1959051, 1959906, 1886936, 1912011, 1887304, 1871248, 1920148, 1914603, 1951332, 2015885, 1953361, 1954202, 1988835, 1970120, 2014067, 2065283, 2037111, 2060230, 2120504, 2075739, 2109685, 2154075, 2112996, 2152044, 2168565, 2152996, 2210038, 2232139, 2198893, 2202046, 2268374, 2342225]
6084B342225K7532O5298m4177p894J4688L6176J9337P614K5146J1830L0642l7586
6072B490831Q531Q1208J2751q614j7929J3567K1772L4948J8274P1606j1772L9912
6060B755085O0573j9136M9677N9150P1392m66o5556K1998N2213J3995J2178L7894
6048C048997M5129m8291q8076N9244Q2567O3175L1584m2973K2018O6396m4731
6037C195039M4560P5205M0428M0927l9030p5078L6613O701N2081K9803R433M1194
6025C457876n3068N3280n1887m5540J16379j0728r939o7883K6778J2372o1235
6014C366405M9063j0908m985N2084m8054j8472J19818j149K1872J7449L929L2858
6002C579910Q1916n1609J3533Q5746j0233L2326k7884R055Q6273M0339Q6959P3225
$$ y = [2342225, 2369757, 2435055, 2390878, 2382984, 2397672, 2433848, 2453185, 2460799, 2485945, 2497775, 2528417, 2490831, 2499362, 2580570, 2593321, 2584707, 2566778, 2580345, 2602117, 2637065, 2655339, 2726945, 2715173, 2755085, 2815658, 2796522, 2846199, 2905349, 2976741, 2976275, 2910719, 2932717, 2984930, 2998925, 3011103, 3048997, 3094126, 3045835, 2957759, 3017003, 3099570, 3162745, 3194329, 3151356, 3173374, 3239770, 3195039, 3239599, 3314804, 3355232, 3396159, 3357129, 3282051, 3318664, 3325365, 3377446, 3407249, 3416682, 3457876, 3404808, 3458088, 3406201, 3360661, 3477040, 3466312, 3456373, 3388490, 3415268, 3427640, 3366405, 3415468, 3404560, 3399575, 3451659, 3403605, 3385133, 3504951, 3503802, 3525674, 3543123, 3547052, 3579910, 3661826, 3610217, 3623750, 3709496, 3699263, 3731589, 3703705, 3712760, 3799033, 3839372, 3926331, 3999556]
5990C999556n12L2647P1605Q2928R9687M1644N587K5395M3639Q097J6285N7419
5978D483977k694r956q235k6743j13965q5247K1738L7743L4780M5140j7791j678
5966D357069J17435J2576m4783k8532j3092P4076N3095m911R6207N9074Q0871
5955D759085M7747O5055J4376M7009N2436J3820k7253j7553m7735M2109L0470
5944D979566N1448P3757K5514J05344K3472L3426M4678J3785O6421j4939J21449
5933E523921N3564K3193P438L0250Q5704N1830M0593j9591K6237P8124N8915K4802
5921E984980L1774J04241J2560O1324P6683O4312J06024P6725P9887M0620J02335
5910F741465J23744O5363J938J04254R4635P9770J6358N5827L6126j9971j0954
$$ y = [3999556, 3999044, 4031691, 4103296, 4186224, 4285911, 4327555, 4333142, 4358537, 4402176, 4410273, 4426558, 4483977, 4481283, 4471327, 4463092, 4436349, 4322384, 4237137, 4258875, 4296618, 4331398, 4376538, 4358747, 4357069, 4474504, 4487080, 4442297, 4413765, 4400673, 4474749, 4527844, 4522933, 4619140, 4678214, 4759085, 4806832, 4871887, 4886263, 4933272, 4985708, 4999528, 4972275, 4954722, 4906987, 4949096, 4979566, 5031014, 5104771, 5130285, 5235629, 5259101, 5292527, 5337205, 5350990, 5417411, 5402472, 5523921, 5577485, 5600678, 5608116, 5638366, 5724070, 5775900, 5816493, 5796902, 5823139, 5901263, 5960178, 5984980, 6016754, 6120995, 6133555, 6194879, 6271562, 6335874, 6441898, 6518623, 6598510, 6639130, 6741465, 6865209, 6930572, 6932510, 7036764, 7131399, 7211169, 7227527, 7283354, 7319480, 7299509, 7288555]
5899G288555J25212N5159O2182P9473N7396J00772J09921J38291J09606J15932
5889H242499J66840J14680J40100J29612J39599P0261L2796L8361k9623P2431
5879I117556N0852Q0155P913M711k831q5119Q652k199K6576M2372N8918k897J1532
5866I316191k7642J32728N1417R2966J11465L4044k7106M7483o9031K5658m821
5855I683352L2474M8604R1926J8941J1068M4445O1143M4503N9395N5128K0927
5844A0171906J42741O8172O7723L8143R9937J33457Q9070l122J05902M9529J17978
5833A1081436M0555J3332M2228M7392Q0687R9865J23322J03042J48922J76355
5823A1957136K05490J94492R8409J23857J08662Q5311M6527P7028L1716P8109
$$ y = [7288555, 7413767, 7468926, 7531108, 7610581, 7667977, 7768749, 7878670, 8016961, 8126567, 8242499, 8409339, 8524019, 8664119, 8793731, 8933330, 9003591, 9036387, 9074748, 9045125, 9117556, 9168408, 9248563, 9256476, 9261187, 9258356, 9173237, 9181889, 9179690, 9206266, 9248638, 9307556, 9304659, 9316191, 9288549, 9421277, 9472694, 9565660, 9677125, 9711169, 9684063, 9731546, 9662515, 9688173, 9683352, 9715826, 9764430, 9856356, 9875297, 9886365, 9930810, 9991953, 10036456, 10095851, 10150979, 10171906, 10314647, 10382819, 10450542, 10488685, 10588622, 10722079, 10811149, 10808027, 10913929, 10963458, 11081436, 11121991, 11135323, 11177551, 11224943, 11305630, 11405495, 11528817, 11631859, 11780781, 11957136, 12162626, 12357118, 12455527, 12579384, 12688046, 12773357, 12819884, 12896912, 12928628, 13006737]
5813A3006737J83081J90957J51484J66268J22978J86457J59921K25594K23816
5804A4617293K71613L11407K49609K76461J81681L07605L25636K70727J74774
5795A6986806J57015K72472K85405K56451K57256K58709L16432L56419L02976
5786A9449941L45472K61617L10285L25318M14966M43497M36189M57814M80889
5777B2925988M97612N77463O39085O29632N89704P09317P30304P75245Q44195
5768B8918545Q42781R66955J043338R79860R97248J118892J057730R39473Q79342
5759C7744164Q46654R01300Q05217P13725P28853O98428O82068P28839Q00698
5750D4649946Q86790J088529J283652J413225J580694J808055J983674K160646
$$ y = [13006737, 13189818, 13380775, 13532259, 13698527, 13821505, 14007962, 14167883, 14393477, 14617293, 14888906, 15200313, 15449922, 15726383, 15908064, 16215669, 16541305, 16812032, 16986806, 17143821, 17416293, 17701698, 17958149, 18215405, 18474114, 18790546, 19146965, 19449941, 19795413, 20057030, 20367315, 20692633, 21107599, 21551096, 21987285, 22445099, 22925988, 23423600, 24001063, 24640148, 25269780, 25859484, 26568801, 27299105, 28074350, 28918545, 29761326, 30728281, 31771619, 32751479, 33748727, 34867619, 35925349, 36864822, 37744164, 38590818, 39492118, 40297335, 41011060, 41739913, 42438341, 43120409, 43849248, 44649946, 45536736, 46625265, 47908917, 49322142, 50902836, 52710891, 54694565, 56855211]
5742E6855211K437438K731605L000663L342550L648553L937052M191671M366442
5734H4511185M169863L581999K602546J244902j06329j380549k266198k723996
5726H9633423k560930k294948j924683j290296o29759j28052M24686R84289J571598
5717H3785328K309913L008028L612331M088914M503091M624416M472965L399012
5709A13803998J493557j169636l832340o013956p124123p533659p132931o534114
5701G5956796n819549m982051m272574l575205l063827k405108k078911j703275
5693D8056296j384249j175287j010621p30304o01936n75905l73206l42617l45717
5684D1516454k90629k17650k85368l38913k62256k68310k80931j69059j46472
$$ y = [56855211, 59292649, 62024254, 65024917, 68367467, 72016020, 75953072, 80144743, 84511185, 88681048, 92263047, 94865593, 96110495, 96004166, 94623617, 92357419, 89633423, 87072493, 84777545, 82852862, 81562566, 80932807, 80804755, 81229441, 82213730, 83785328, 86095241, 89103269, 92715600, 96804514, 101307605, 105932021, 110404986, 113803998, 115297555, 114127919, 110295579, 104281623, 97157500, 89623841, 82490910, 75956796, 70137247, 65155196, 60882622, 57307417, 54243590, 51838482, 49759571, 48056296, 46672047, 45496760, 44486139, 43755835, 43153899, 42577994, 42204788, 41862171, 41516454, 41225825, 41008175, 40722807, 40383894, 40121638, 39853328, 39572397, 39403338, 39256866]
5675C9256866j52256p8969M5957O2187J50675K10590K42643K71365K96520K54980
5665D0560558K05675K27742L04471L34811L85988L63453M58348M90839N02191
5656D3834076O64000P39266Q66469R45968R81219J045711J001587Q59434O78140
5647E1615870M52038J56549K5670j5020k19854k11857j40300n6211J25123K79810
5637E2011818M27937O52707R22018R62152J180613J258868J216250J140366J081934
5628F0854663J032092R46786R22580Q48912R36851J053618J049463J021750J007779
5619F9674494J067109J083425J058277J012754Q10795P00324N04212J55219n3570
5610G6013039k51182n25966o88813p89585r33953j059513j172106j433153j417606
$$ y = [39256866, 39104610, 39025641, 39071598, 39133785, 39284460, 39495050, 39737693, 40009058, 40305578, 40560558, 40766233, 40993975, 41298446, 41633257, 42019245, 42382698, 42841046, 43331885, 43834076, 44498076, 45237342, 46103811, 47049779, 48030998, 49076709, 50078296, 50937730, 51615870, 52067908, 52224457, 52250127, 52235107, 52015253, 51803396, 51663096, 51606885, 51732008, 52011818, 52439755, 53092462, 54014480, 54976632, 56157245, 57416113, 58632363, 59772729, 60854663, 61886755, 62833541, 63756121, 64605033, 65541884, 66595502, 67644965, 68666715, 69674494, 70741603, 71825028, 72883305, 73896059, 74706854, 75407178, 75911390, 76066609, 76013039, 75761857, 75235891, 74547078, 73757493, 72823540, 71764027, 70591921, 69158768, 67741162]
5601F7741162j491015j363519j227837j184303r37398p80839p73881q25463r22485
5592E8234422j118452j248833j206285j159356j179972j165362j087271j019212
5584D9049679q86939p32772n09808l80444k66705j56938J2039L2473j8434j91918
5574D5950233k98657m21713o61948p13091q73702r85577j145308j142749j092864
5565C8614624j164435j182603j112467j046784r32233q82907q72743p70008o47500
5556C0002944n40312n48985n33512n08485n00804m95242n11514o07968p05425
5547B5050697p20187o84987o39079n74760n80140n92968n27004m21677m33908
5538A9875987m51130m42770l68138l25489l75543k73977k43520k58364k25131
$$ y = [67741162, 66250147, 64886628, 63658791, 62474488, 61537090, 60756251, 59982370, 59156907, 58234422, 57115970, 55867137, 54660852, 53501496, 52321524, 51156162, 50068891, 49049679, 48162740, 47429968, 46920160, 46539716, 46273011, 46116073, 46128112, 46160585, 46142151, 45950233, 45651576, 45229863, 44567915, 43854824, 42981122, 41995545, 40850237, 39707488, 38614624, 37450189, 36267586, 35155119, 34108335, 33176102, 32293195, 31420452, 30650444, 30002944, 29462632, 28913647, 28380135, 27871650, 27370846, 26875604, 26364090, 25756122, 25050697, 24330510, 23645523, 23006444, 22431684, 21851544, 21258576, 20731572, 20309895, 19875987, 19424857, 18982087, 18613949, 18288460, 17912917, 17638940, 17395420, 17137056, 16911925]
5529A6911925k76186l00682k23532k29934k12226j85274k41764j69111j63449
5520A4909767j15953j87484j45148j13847j62338k42284n3499N228j50118j66088
5510A3578236j05506p3727n4081o7746r3728l7856j4002r8603j55353k7633p837
5499A2842164K1359k1661m4546o1807l5770k8703J2080k7346l6011K4046k2640
5488A2621165l9221J9154R019k4700O3138M3918j2061k9910l0282K3357m1098
5477A2602479O2891k6374n7197j2305n1582r3723l6619Q0596O333m2714o9197
5466A2362588P5180P5460M78J2151l5316R343K6075n8459k4981O2934o639j7214
5454A2481600j1783j3657M5005N9653Q600O2429r2601r9696j9103P0645m9184
$$ y = [16911925, 16635739, 16335057, 16111525, 15881591, 15669365, 15484091, 15242327, 15073216, 14909767, 14793814, 14606330, 14461182, 14347335, 14184997, 13942713, 13889214, 13894442, 13744324, 13578236, 13472730, 13399003, 13344922, 13277176, 13183448, 13145592, 13131590, 13032987, 12877634, 12850001, 12842164, 12863523, 12841862, 12797316, 12735509, 12699739, 12671036, 12683116, 12655770, 12619759, 12643805, 12621165, 12581944, 12601098, 12610117, 12585417, 12648555, 12692473, 12680412, 12650502, 12620220, 12643577, 12602479, 12665370, 12638996, 12581799, 12569494, 12517912, 12424189, 12387570, 12468166, 12474499, 12431785, 12362588, 12437768, 12513228, 12513706, 12525857, 12490541, 12499884, 12525959, 12467500, 12442519, 12505453, 12498814, 12481600, 12469817, 12456160, 12501165, 12560818, 12569418, 12631847, 12539246, 12439550, 12420447, 12491092, 12441908]
5443A2441908k1124j7962o9764L6630K0760L2386j2917K0803J8960k8036L6988
5432A2458632j4037O9915l2181K7568O1705O2004K2325l8884j0674M2558K4216
5421A2673147p1506R585R004N088N1984M5516o6425J8826Q1021q2635n2209P0376
5409A2691772K8912M0020P977J26200M2511L9254R727o3681N5598O7394j4540
5398A3031144l6034j1920q633j9386N1828j4244p0043L4298K5545J3804M1823
5387A3038182J244p1705k9108j1566J1842j495J9159K1122k5577L268k8279J980
5375A2929067J2195J5578K7822r881j4406q951k3335r987p5973M6021N129j8274
5363A2875005K075l7328o6584l2558Q5716p7022k8549M5305n658P845m0493q885
$$ y = [12441908, 12420784, 12402822, 12333058, 12369688, 12390448, 12422834, 12409917, 12430720, 12449680, 12421644, 12458632, 12444595, 12514510, 12482329, 12509897, 12571602, 12633606, 12655931, 12617047, 12606373, 12648931, 12673147, 12601641, 12611226, 12620230, 12625318, 12677302, 12722818, 12656393, 12675219, 12756240, 12673605, 12621396, 12691772, 12720684, 12760704, 12768681, 12894881, 12937392, 12976646, 12986373, 12922692, 12978290, 13045684, 13031144, 12995110, 12983190, 12974557, 12955171, 13006999, 12992755, 12922712, 12957010, 12982555, 12996359, 13038182, 13039426, 12967721, 12938613, 12927047, 12938889, 12937394, 12956553, 12977675, 12952098, 12955366, 12927087, 12929067, 12941262, 12956840, 12984662, 12974781, 12960375, 12951424, 12928089, 12918102, 12842129, 12888150, 12893279, 12875005, 12877080, 12839752, 12773168, 12740610, 12826326, 12749304, 12720755, 12766060, 12760402, 12768247, 12727754, 12718869]
5351A2718869k5812N6246P689o3537J744N4428o8351L2539N2181n3254j3209k7684
5339A2671849p2540Q6282L4796k4770k5180J3997O3713J2471r912q2751L0962
5328A2698917M2704K0174O2631n7937j08J0759l2375m0801l1000K5918o8948M8518
5316A2678452J13450K7831P4161m0126j9840N2778J01633K4077J24953P3937K5771
5305A3237077J01263K6197M674n7241K781J762L2511k2737K1222N1538m1225K9293
5293A3387115P5603N3394o0569l2409J06328l3924p5371o5293R306m1503m6537
5282A3276140q9055p7916j16517j20252j61241q9806j32810j17707j17305q2022
5272A2171509q6586r9658j36794j00971J8488p4137j05577j58202j93497o1853
$$ y = [12718869, 12693057, 12749303, 12756992, 12693455, 12695199, 12749627, 12681276, 12713815, 12765996, 12712742, 12699533, 12671849, 12599309, 12685591, 12720387, 12695617, 12670437, 12684434, 12748147, 12760618, 12750706, 12667955, 12698917, 12741621, 12761795, 12824426, 12766489, 12766381, 12777140, 12744765, 12703964, 12672964, 12698882, 12629934, 12678452, 12791902, 12819733, 12893894, 12853768, 12833928, 12886706, 12988339, 13012416, 13137369, 13211306, 13237077, 13338340, 13364537, 13369211, 13311970, 13314751, 13316513, 13349024, 13326287, 13347509, 13399047, 13357822, 13387115, 13462718, 13516112, 13455543, 13423134, 13529462, 13495538, 13420167, 13354874, 13364180, 13322677, 13276140, 13187085, 13109169, 12992652, 12872400, 12711159, 12621353, 12488543, 12370836, 12253531, 12171509, 12084923, 11985265, 11848471, 11747500, 11765988, 11691851, 11586274, 11428072, 11234575, 11172722]
5262A1172722m1659p0373n0499j40006n0382q8714p2950k3426J270j29439q2169
5251A0424375K849L41j8650j47391m1987J4220J7730m6154k6383k0575q5561o6829
5239A0005985M0777r3086j15658q750j8472l9428j525K2447n9219l0803m9044
5228I653224m2901l4700q0657J0161p2442q3188l7352m5178j16108K4939o8635
5217I107163o9979L712j8147m5165l1674j5391l7644q8654j11078m630k4408l4212
5205H629893n5901k4768m7807q0160Q54R0k5979K0096q9844o3622k8995n7072
5193H176785o8996l8164q0279N9730n8174P525l3575j03097j0151m1730L2356
5182G842230N481q7551k9204n9586k7009l1328L9452j0758m9188k3182k2051k772
$$ y = [11172722, 11131063, 11060690, 11010191, 10870185, 10819803, 10731089, 10658139, 10634713, 10635983, 10506544, 10424375, 10427224, 10427565, 10408915, 10261524, 10219537, 10233757, 10251487, 10205333, 10178950, 10158375, 10072814, 10005985, 10046762, 9953676, 9838018, 9829268, 9810796, 9771368, 9769843, 9792290, 9733071, 9702268, 9653224, 9610323, 9575623, 9494966, 9505127, 9432685, 9349497, 9312145, 9266967, 9150859, 9175798, 9107163, 9037184, 9040896, 9022749, 8977584, 8945910, 8930519, 8892875, 8804221, 8693143, 8688513, 8664105, 8629893, 8573992, 8549224, 8501417, 8421257, 8422111, 8422201, 8396222, 8416318, 8326474, 8262852, 8233857, 8176785, 8107789, 8069625, 7989346, 8049076, 7990902, 7998427, 7964852, 7861755, 7851604, 7809874, 7842230, 7847711, 7760160, 7730956, 7671370, 7644361, 7613033, 7652485, 7641727, 7592539, 7569357, 7547306, 7544534]
5170G544534o2308n6243J9655K1329l3440l9831k6351l1081p4412n8420o5686
5159G137746M3901k1904l6864k7336o9283K630m6348l5531K645m2417o2921O181
5147F850499n3996K0565l054p4048O5842p2787m9750l0533j9507j02097k9496
5136F501638J1237J3068l6720K1490K0872o7084Q559r255q1553k6681L245k9613
5124F329203l8178l2940m2564l8627K043j7032J3736l4870n295K0864m4004o4075
5112F048261n0318n2068K860M350K4130l721j4451o6151o2788l547K2648k4346
5100E824859M5452m1200Q232p8109m6435k0623N4669k70n5559m4243K5369L4680
5088E706822j9123l6825n5305K6632M1211K0979p2530n5734j8226j5374k3537
$$ y = [7544534, 7482226, 7425983, 7445638, 7466967, 7433527, 7393696, 7367345, 7336264, 7261852, 7203432, 7137746, 7181647, 7159743, 7122879, 7095543, 7026260, 7028890, 6982542, 6947011, 6949656, 6907239, 6844318, 6850499, 6796503, 6817068, 6814014, 6739966, 6805808, 6733021, 6683271, 6652738, 6633231, 6531134, 6501638, 6512875, 6525943, 6489223, 6510713, 6531585, 6464501, 6473060, 6463805, 6382252, 6355571, 6358816, 6329203, 6291025, 6258085, 6215521, 6176894, 6178937, 6161905, 6175641, 6140771, 6135476, 6156340, 6112336, 6048261, 5997943, 5945875, 5948735, 5953085, 5977215, 5973494, 5959043, 5892892, 5830104, 5826557, 5849205, 5824859, 5870311, 5829111, 5837343, 5759234, 5712799, 5692176, 5746845, 5746575, 5691016, 5646773, 5672142, 5706822, 5687699, 5650874, 5595569, 5622201, 5663412, 5684391, 5611861, 5556127, 5537901, 5522527, 5498990]
5077E498990K9512k2627m6701p4787K0795K6177O3555l154l8360n7807j0731l4638
5065E350224l970J148n783Q160J6389J8898k1227l8053n9375O0439k4652p303
5053E294895Q394P953k9017l4298K6202j5090J2493n786n2713J3302M8593L3350
5041E308278m4982k3904Q7342m8657L0979k1507M735j2373K0410k6425M2656O4861
5029E381413p7241r6184l9681L8811k1249n6366M6476Q4020J4650L5670l4177
5018E276142p1940R9964L9611l1328O6533m270o2233L48K1081L4704j3667N3724
5006E408669k501L6749K0356j368P1299j5375O161K4992P5470P6406K8162l1507
4994E697513J2427M9137O2782L1391N1767O1818M8912K2770P9523Q2203M358K4109
$$ y = [5498990, 5528502, 5505875, 5459174, 5384387, 5405182, 5431359, 5494914, 5491760, 5453400, 5395593, 5384862, 5350224, 5346254, 5347402, 5341619, 5349779, 5366168, 5385066, 5363839, 5325786, 5266411, 5326850, 5302198, 5294895, 5303289, 5311242, 5282225, 5247927, 5274129, 5259039, 5271532, 5265746, 5213033, 5226335, 5274928, 5308278, 5263296, 5239392, 5326734, 5278077, 5309056, 5287549, 5292284, 5279911, 5300321, 5273896, 5316552, 5381413, 5304172, 5207988, 5168307, 5207118, 5185869, 5129503, 5175979, 5259999, 5274649, 5310319, 5276142, 5204202, 5304166, 5343777, 5312449, 5378982, 5374712, 5312479, 5312827, 5333908, 5368612, 5354945, 5408669, 5406168, 5442917, 5463273, 5461905, 5533204, 5517829, 5523990, 5548982, 5624452, 5700858, 5729020, 5697513, 5709940, 5759077, 5821859, 5853250, 5905017, 5966835, 6015747, 6038517, 6118040, 6200243, 6204601, 6228710]
4982F228710L6856J34386P2203P0285P6375K8345P2778J39014J35278R8601J97168
4971G289999Q9861J74363K08752J34708R8414J84911K13280J38721K26135J84610
4961H943754J41612J84422K07330K02069Q7607J35831J16257J13823M2598P3058
4951A0248361P1883n0281J4163q6530j3765r1835j24989q3089j53426j87161k25747
4940I317584j86318k03182k12788j54449j87200j62545j42514j68450j00094j38754
4930G661290j12594j23551p4718q9007o5381o9218l8875n7932J2862J617p1686
4919F972807Q073L0551j8753Q4650J5922j0779P869K0530N8640N4526R2993P9869
4907G396898L0778Q2304J40765J52405J92413J32424K01472J53937J52167K37713
$$ y = [6228710, 6265566, 6399952, 6472155, 6542440, 6618815, 6647160, 6719938, 6858952, 6994230, 7092831, 7289999, 7379860, 7554223, 7762975, 7897683, 7996097, 8181008, 8394288, 8533009, 8759144, 8943754, 9085366, 9269788, 9477118, 9679187, 9766794, 9902625, 10018882, 10132705, 10175303, 10248361, 10320244, 10269963, 10284126, 10197596, 10183831, 10091996, 9967007, 9883918, 9730492, 9543331, 9317584, 9131266, 8928084, 8715296, 8560847, 8373647, 8211102, 8068588, 7900138, 7800044, 7661290, 7548696, 7425145, 7350427, 7261420, 7196039, 7126821, 7087946, 7030014, 7042876, 7044493, 6972807, 6980880, 7011431, 6992678, 7077328, 7093250, 7082471, 7090340, 7110870, 7169510, 7224036, 7317029, 7396898, 7427676, 7509980, 7650745, 7803150, 7995563, 8127987, 8329459, 8483396, 8635563, 8873276]
4897H873276K07508K67316J86308K33844K77696J28230K45827J66617K19924Q3496
4887A0890042L9610Q7354m1202r519j07803j28572j65102j68442j76623j70400
4877A0049343l19973k38694j92405l10451k86844l26736k83935k09239k27703
4868G653363k11778k23525k22457j48562k22599j66105j88240j85047l5616j20717
4858E928717j17778p1574j58551q6243j16620l6709m2539m0361m3860j15658n6730
4847E042094j8992K4848o2338q7129o9915m6092P5687k5149q0613m5691o0385
4836D646325q6517J8322O908j5799k7966M2015m4354L3926l6104l4663M3836J9572
4824D565501M2627J6578k5532l7798N70J04673N2500n4349N7536K7775K3599K8412
$$ y = [8873276, 9080784, 9348100, 9534408, 9768252, 10045948, 10174178, 10420005, 10586622, 10806546, 10890042, 10929652, 11017006, 10975804, 10966285, 10858482, 10729910, 10564808, 10396366, 10219743, 10049343, 9729370, 9490676, 9298271, 8987820, 8700976, 8374240, 8090305, 7881066, 7653363, 7441585, 7218060, 6995603, 6847041, 6624442, 6458337, 6270097, 6085050, 6049434, 5928717, 5810939, 5739365, 5580814, 5494571, 5377951, 5341242, 5298703, 5258342, 5214482, 5098824, 5042094, 5023102, 5047950, 4985612, 4898483, 4828568, 4782476, 4858163, 4833014, 4752401, 4706710, 4646325, 4559808, 4578130, 4585038, 4569239, 4541273, 4583288, 4538934, 4572860, 4536756, 4502093, 4545929, 4565501, 4608128, 4624706, 4599174, 4561376, 4561946, 4666619, 4719119, 4664770, 4722306, 4750081, 4773680, 4802092]
4812D802092N6971M7071Q4633M3010K3968m1136K7090L6814m949k4245N2168Q8176
4800E191663l5541l1182M4071m7575k6171J9879l2443p97N1523K5532J7129j077
4788E175011L3940J24562N3485N190p6247k5167l9502j9490o3915p5955j1316
4777E080596o9183o9305p9689r5258j32893l8055l1476r4946r879p9193M0887
4766D421606N936k6943k3765J5185N3169o6397l8485O9583K3993M6860N2520O091
4754D539353k5308J8293k406j3872N088l4536O5043N4177l026o5177L0843J3103
4742D581575N1183J3385j2972k5442P4038j4249K0919k481N3049j8188N0785K4410
4730D796012q889K2181M1073P8899L8090j01728L9557Q4854k6675l0775O3669
$$ y = [4802092, 4859063, 4906134, 4990767, 5033777, 5057745, 5016609, 5043699, 5080513, 5075564, 5051319, 5103487, 5191663, 5156122, 5124940, 5169011, 5121436, 5095265, 5115144, 5082701, 5081904, 5133427, 5158959, 5176088, 5175011, 5208951, 5333513, 5386998, 5392188, 5315941, 5290774, 5251272, 5231782, 5167867, 5091912, 5080596, 5011413, 4942108, 4862419, 4767161, 4634268, 4596213, 4564737, 4469791, 4459912, 4380719, 4421606, 4427542, 4400599, 4376834, 4392019, 4445188, 4378791, 4340306, 4409889, 4433882, 4480742, 4533262, 4539353, 4514045, 4532338, 4529932, 4516060, 4521148, 4486612, 4551655, 4605832, 4602806, 4537629, 4568472, 4581575, 4632758, 4646143, 4633171, 4607729, 4681767, 4667518, 4688437, 4685956, 4739005, 4720817, 4771602, 4796012, 4787123, 4809304, 4850377, 4929276, 4967366, 4865638, 4905195, 4990049, 4963374, 4932599, 4996268]
4719D996268J04266l3453J3315L1812K4509m652r502K1580R1793P9861P3590J5517
4707E404904K7519J5252M5465J2552O2231J00738k5566l0952P3736M8909J24059
4696E858847P7580J5917N8753K1272P2220J4430k0798Q7287J3973P1978O5541
4685F337000N8517j3603J02914l2534M3395M3693N0804R0646N1504R4674P6477
4674F903487J62085K0677O9780Q7395Q5679P6888R2122N4845Q6266J49953Q5014
4663G874191J05409J06083P3740J11351J12047J54579J85686J75930J59108J71145
4653I229269J15576J59727K00174K17680J40594J71973K38349J93487K37496K10846
4643A1115171K65487K53437K84289K91911L85048L95233L58152M08266M65008
$$ y = [4996268, 5100534, 5067081, 5080396, 5112208, 5136717, 5132065, 5122563, 5144143, 5235936, 5315797, 5389387, 5404904, 5432423, 5447675, 5493140, 5505692, 5567923, 5668661, 5643095, 5612143, 5685879, 5734788, 5858847, 5936427, 5952344, 6011097, 6032369, 6104589, 6119019, 6098221, 6185508, 6199481, 6271459, 6337000, 6395517, 6381914, 6484828, 6452294, 6495689, 6539382, 6590186, 6680832, 6732336, 6827010, 6903487, 7065572, 7086249, 7156029, 7243424, 7329103, 7405991, 7498113, 7552958, 7639224, 7789177, 7874191, 7979600, 8085683, 8159423, 8270774, 8382821, 8537400, 8723086, 8899016, 9058124, 9229269, 9344845, 9504572, 9704746, 9922426, 10063020, 10234993, 10473342, 10666829, 10904325, 11115171, 11380658, 11634095, 11918384, 12210295, 12595343, 12990576, 13348728, 13756994, 14222002]
4634A4222002M57200N29961N54326M98790N34302O68162O80576O68143O68967
4625A9482429O56026P27154P98816P86686Q95619R42247R00136Q70271O47965
4616B6707349K59690r4211l94431n88467n75263n67000m27502l72787j89124l2358
4606B3725896M881J90431L88778M07746M85924O01292O06130L57847P4037l04020
4596B6538942o29464q24971j019568r02549p23673n68423m86515k89015r4843
4587B0999921q0249p136R8596K24307L69775M24996M72129N45327O42041P67813
4577B4457520P63204R59156J032650J087685J223276J295962J446033J613681
4569C3879167J710678J847288J895384K007976K034528J806269J469867Q77211
$$ y = [14222002, 14679202, 15209163, 15763489, 16262279, 16796581, 17464743, 18145319, 18813462, 19482429, 20138455, 20865609, 21664425, 22451111, 23346730, 24288977, 25189113, 26059384, 26707349, 26967039, 26872828, 26478397, 25889930, 25314667, 24747667, 24320165, 23947378, 23758254, 23725896, 23730777, 23921208, 24309986, 24717732, 25203656, 25804948, 26411078, 26768925, 26842962, 26538942, 25909478, 25084507, 24064939, 23162390, 22438717, 21870294, 21383779, 21094764, 20999921, 20919672, 20912536, 21011132, 21235439, 21605214, 22030210, 22502339, 23047666, 23689707, 24457520, 25220724, 26179880, 27212530, 28300215, 29523491, 30819453, 32265486, 33879167, 35589845, 37437133, 39332517, 41340493, 43375021, 45181290, 46651157, 47528368]
4561D7528368K31984m91762j066298j209720j241979j112337r87114q38337o04911
4552D0207894l34185j38758M4948J86908K62564K87782J55145r4301n27728j123146
4542C8927123j591563k024110k212477k266866k102594j843635j712685j444922
4534B3728271j278650j088359j028464q33867o67618o03190n26439l96311l30726
4525A6974647k93953k93400k07259k36405j96938j31433r2437l4482R781k1935
4515A5476186q8007K1395N7613N034O7099J42079J79014J79422J34133K09916
4505A6383884K82263L28411K79297M44533M08948M67526N22989N33081O50768
4496B0301700P56775P22805P34244R63238J035329J103390J120749J337228J405111
$$ y = [47528368, 47760352, 47268590, 46202292, 44992572, 43750593, 42638256, 41651142, 40812805, 40207894, 39873709, 39734951, 39779899, 39966807, 40229371, 40517153, 40672298, 40577997, 40050269, 38927123, 37335560, 35311450, 33098973, 30832107, 28729513, 26885878, 25173193, 23728271, 22449621, 21361262, 20332798, 19498931, 18831313, 18228123, 17701684, 17305373, 16974647, 16680694, 16387294, 16180035, 15943630, 15746692, 15615259, 15522822, 15488340, 15498121, 15476186, 15388179, 15409574, 15467187, 15472221, 15539320, 15681399, 15860413, 16039835, 16173968, 16383884, 16666147, 16994558, 17273855, 17718388, 18127336, 18594862, 19117851, 19650932, 20301700, 21058475, 21781280, 22515524, 23478762, 24514091, 25617481, 26738230, 28075458, 29480569]
4487B9480569J506561J546478J629933J602308J135203P03058N1417o61949j206237
4478C5787341j520254j510332j452952j302448j163694q74503o90230n30828l65037
4469B6377063k83547r4533M2387L4239J08376K59950L62641K76513M28856N01102
4459B8013047N25364M76531N48933O15080N94134P97996R64572J058698J134499
4450C4728854J196819J125280R65507N45227N2469o10039j226581j447973j520138
4441C3809425j485428j319781j150417q17668n71248l78538j33802N0534J96581
4432B8199658M25234M81230O24765O23470M26999J02596k70616n88552q72957
4423B9151827j020946j144915j086569q92337p58601o88464n27124m56378l51473
$$ y = [29480569, 30987130, 32533608, 34163541, 35765849, 36901052, 37604110, 37655527, 36993578, 35787341, 34267087, 32756755, 31303803, 30001355, 28837661, 27963158, 27272928, 26742100, 26377063, 26093516, 25998983, 26041370, 26075609, 26183985, 26443935, 26806576, 27083089, 27511945, 28013047, 28538411, 29014942, 29563875, 30178955, 30773089, 31571085, 32535657, 33594355, 34728854, 35925673, 37050953, 38016460, 38561687, 38614156, 38004117, 36777536, 35329563, 33809425, 32323997, 31004216, 29853799, 29036131, 28464883, 28086345, 27952543, 28003077, 28199658, 28624892, 29106122, 29730887, 30354357, 30781356, 30883952, 30613336, 30024784, 29151827, 28130881, 26985966, 25899397, 25007060, 24248459, 23559995, 23032871, 22576493, 22225020]
4414B2225020k64848k26573j84988j90665j62978k71717k16815k66515j44578
4405B0295343j6486p7182Q0145J38852J95170L18881M05590L96549M90765N02984
4395B2730611N03201M41269J48708p1242n02717q36428j021561j065912j061353
4386A9264576j054592q44489q21510p09531n55100m81611m85575m65034k80354
4377A3566780l50273l01837j88595j54834j66238j24092j20372p1100j02128m4315
4367A1942996k4726j600m7519j3527Q817L6690L369o106R053j8109k5929M926
4355A1868335k0229o8385j0943p0380j01790j48111n4451j03636j32257k6116
4345A1132037j41787j47338q3532o4823J8021k824J5276J0760L0946m5035k9034
$$ y = [22225020, 21960172, 21733599, 21548611, 21357946, 21194968, 20923251, 20706436, 20439921, 20295343, 20278857, 20201675, 20281820, 20420672, 20615842, 20934723, 21340313, 21736862, 22227627, 22730611, 23233812, 23675081, 23823789, 23752547, 23249830, 22413402, 21391841, 20325929, 19264576, 18209984, 17365495, 16543985, 15834454, 15279354, 14797743, 14312168, 13847134, 13566780, 13216507, 12914670, 12726075, 12571241, 12405003, 12280911, 12160539, 12089439, 11987311, 11942996, 11918270, 11916670, 11869151, 11855624, 11864441, 11901131, 11904500, 11898394, 11907447, 11889338, 11863409, 11868335, 11848106, 11779721, 11768778, 11698398, 11596608, 11448497, 11394046, 11290410, 11158153, 11132037, 10990250, 10842912, 10759380, 10694557, 10712578, 10709754, 10725030, 10735790, 10766736, 10721701, 10692667]
4334A0692667j6608n1219l134j623r6220j14888j00309l6026j4997k1383j8182
4323A0218078K60j6403Q2395P7541j6191m0041j6162J22295J94281J07110Q6132
4312A0799295P6602N8717J02842J55583J21410J52891J02243J98365R8435K12775
4302A2079158J25245K7438J65503K03389J16073N1528J67544J53322J47560J71652
4292A3408412J28065R9167J22115J07590J44769J41474J39730J45644J81163K41325
4282A4859454J66175J85508K60546J52506K07715J59045J73770J91875J60140
4273A6516734J42216J09410O5545J37083Q7867O3817J3662R0808J44635J1793
4263A7383570P5469L9034K6631R7042J74258P9201L6862Q1049R8231J06637R4027
$$ y = [10692667, 10676059, 10624840, 10621706, 10620083, 10523863, 10408975, 10308666, 10272640, 10257643, 10236260, 10218078, 10218338, 10201935, 10284330, 10361871, 10345680, 10305639, 10289477, 10411772, 10606053, 10713163, 10799295, 10875897, 10934614, 11037456, 11193039, 11314449, 11467340, 11569583, 11767948, 11866383, 12079158, 12204403, 12231841, 12397344, 12600733, 12716806, 12768334, 12935878, 13089200, 13236760, 13408412, 13536477, 13635644, 13757759, 13865349, 14010118, 14151592, 14291322, 14436966, 14618129, 14859454, 15025629, 15211137, 15471683, 15624189, 15831904, 15990949, 16164719, 16356594, 16516734, 16658950, 16768360, 16833905, 16970988, 17058855, 17122672, 17136334, 17227142, 17371777, 17383570, 17459039, 17498073, 17524704, 17621746, 17796004, 17875205, 17912067, 17993116, 18091347, 18197984, 18292011]
4252A8292011N1215J18815J46198J19168J73199K27110J97166K56686K38531L08356
4242B0128455K81915K98716K84482K97908K65179K06852K35205J75554J99007
4233B2373273L9187P114L0838J7015k3868k8188M2834J3328M3219N6410R4181
4222B2665343J44454J23690K33072K28738K56097K24740K36713L00142K68604
4213B4681593L28449M22101K74917L63081K51473K92460L34830K45770J33517
4204B7328191J83233J90639J84132K26291L01607L09514L01980L71878M15964
4195B9813429M17955M17570M27295M27007L60101L69454M72025M38156M69892
4186C3612884N58791O38799O60956O49548P50126P98413Q11815Q22342Q27605
$$ y = [18292011, 18343226, 18462041, 18608239, 18727407, 18900606, 19127716, 19324882, 19581568, 19820099, 20128455, 20410370, 20709086, 20993568, 21291476, 21556655, 21763507, 21998712, 22174266, 22373273, 22412460, 22419574, 22450412, 22467427, 22443559, 22415371, 22458205, 22471533, 22514752, 22571162, 22665343, 22809797, 22933487, 23166559, 23395297, 23651394, 23876134, 24112847, 24412989, 24681593, 25010042, 25432143, 25707060, 26070141, 26321614, 26614074, 26948904, 27194674, 27328191, 27511424, 27702063, 27886195, 28112486, 28414093, 28723607, 29025587, 29397465, 29813429, 30231384, 30648954, 31076249, 31503256, 31863357, 32232811, 32704836, 33142992, 33612884, 34171675, 34810474, 35471430, 36120978, 36871104, 37669517, 38481332, 39303674, 40131279]
4177D0131279P63819P81664Q85595R14394Q24227R04922J026623J032647J158585
4168D8423755J226176J300822J276014J343330J381120J406547J403657J437912
4160E9199333J484957J506957J569732J593040J614984J728497J909298K154900
4152G2761698K363992K549738K957358L201394L507762L787567M230958M652889
4144A00013356N135954N892457O572619P378128Q252485Q840392R333563J0042175
4136A61461129J0834927J2004140J3669954J5867141J8263836K1048288K4427235
4129B77576650K8554810L3383793L7349727L7286235K9095706J1854011q517608
4122D46583324k5177711l5045093m0060858m1028509l8021677l3140430k8087434
$$ y = [40131279, 40895098, 41676762, 42562357, 43476751, 44300978, 45205900, 46232523, 47265170, 48423755, 49649931, 50950753, 52226767, 53570097, 54951217, 56357764, 57761421, 59199333, 60684290, 62191247, 63760979, 65354019, 66969003, 68697500, 70606798, 72761698, 75125690, 77675428, 80632786, 83834180, 87341942, 91129509, 95360467, 100013356, 105149310, 111041767, 117614386, 124992514, 133244999, 142085391, 151418954, 161461129, 172296056, 184300196, 197970150, 213837291, 232101127, 253149415, 277576650, 306131460, 339515253, 376864980, 414151215, 443246921, 455100932, 446583324, 421405613, 386360520, 346299662, 305271153, 267249476, 234109046, 206021612]
4115B06021612k3702597j9693056j6122099j2911011r973000p845072o299938
4108A09474839n776764n965949o337452o359557n777170n207857m562226m048750
4100F5439114l487121l046289k724733k428983k246255j982403j930186j823209
4092D5769935j902194j643768j501802j354337j249533j129701j040513q47061
4084C5101026q27003p05723o17041n82169n33840n39812n28418m57050m33399
4075B9876571n13379n01916l55443l00514l24357k29498k21800k09977k32496
4066B6987191j36205k46402l44701k24091j37996j35704k13642k51237l9303j31380
4056B5126530o8872o92q840N4964P4201K8379R2311P6052J48583O4659k8526j0102
$$ y = [206021612, 182319015, 162625959, 146503860, 133592849, 123619849, 115774777, 109474839, 103698075, 97732126, 91394674, 85035117, 79257947, 74050090, 69487864, 65439114, 61951993, 58905704, 56180971, 53751988, 51505733, 49523330, 47593144, 45769935, 43867741, 42223973, 40722171, 39367834, 38118301, 36988600, 35948087, 35101026, 34274023, 33568300, 32951259, 32369090, 31835250, 31295438, 30767020, 30309970, 29876571, 29363192, 28861276, 28505833, 28205319, 27880962, 27651464, 27429664, 27219687, 26987191, 26850986, 26604584, 26259883, 26035792, 25897796, 25762092, 25548450, 25297213, 25257910, 25126530, 25057658, 25056966, 25048126, 25103090, 25177291, 25205670, 25297981, 25374033, 25522616, 25587275, 25558749, 25548647]
4044B5548647M2130m6848Q2215K82441L37839L26162L73685M51918N37078N21004
4034B8456271O61901P15332R70033J210231J351279J369690J315006J128701J174616
4025C8353060J491490K107705K670431L252688L446408L802922N519835P819333
4017F8463872R640371R078592j832459j2017837j1553756q997396o451908m597309
4009D1732170l219910k344178j688723j293268r92401p69106o53217m45204l16251
4000C0009912l27417j61739k10473j78832j12422M311o2677n6987R8534J03486
3990B9105696J66656L43840K40053L43411L17005L12476L83106L74744M39065
3981C2026052N13629N12331O59114O19269O64437P46799Q06624R65094R40114
$$ y = [25548647, 25590777, 25543929, 25626144, 25908585, 26246424, 26572586, 26946271, 27398189, 27935267, 28456271, 29118172, 29833504, 30803537, 32013768, 33365047, 34734737, 36049743, 37178444, 38353060, 39844550, 41952255, 44622686, 47875374, 51321782, 55124704, 60644539, 68463872, 78104243, 87182835, 85350376, 73332539, 61778783, 52781387, 46329479, 41732170, 38512260, 36168082, 34479359, 33186091, 32193690, 31424584, 30771367, 30326163, 30009912, 29682495, 29520756, 29310283, 29131451, 29019029, 29023340, 28960663, 28903676, 29002210, 29105696, 29272352, 29616192, 29856245, 30199656, 30516661, 30829137, 31212243, 31586987, 32026052, 32539681, 33052012, 33711126, 34330395, 34994832, 35741631, 36548255, 37513349, 38453463]
3972C8453463J064817J076380J203295J296368J420059J487005J202519Q63762
3964D8067668O52534Q29168J018475J139126J278077J503564J533450J681205
3956E7703267J825618J882923J990109K077416K219264K282990K460184K470784
3948G4912555K546012K625196K613349K758326K871528K830869K866498K907153
3940I6931486K992261K911484K948044K926249K811702K805289K643843K498643
3932A19469001K485225K319997K128519J988679J820494J694800J570452J478346
3924A34955513J292528J099791R56240P19275M06164J63250m2958l01565n21337
3915A38726901p24215q88128j084038j220505j318168j456976j607541j777049
$$ y = [38453463, 39518280, 40594660, 41797955, 43094323, 44514382, 46001387, 47203906, 48067668, 48720202, 49549370, 50567845, 51706971, 52985048, 54488612, 56022062, 57703267, 59528885, 61411808, 63401917, 65479333, 67698597, 69981587, 72441771, 74912555, 77458567, 80083763, 82697112, 85455438, 88326966, 91157835, 94024333, 96931486, 99923747, 102835231, 105783275, 108709524, 111521226, 114326515, 116970358, 119469001, 121954226, 124274223, 126402742, 128391421, 130211915, 131906715, 133477167, 134955513, 136248041, 137347832, 138304072, 139023347, 139429511, 139592761, 139549803, 139248238, 138726901, 138002686, 137114558, 136030520, 134810015, 133491847, 132034871, 130427330, 128650281]
3907A28650281j858829k002884k109953k286197k393462k529667k552148k627139
3899A10290002k642966k585369k595851k592710k619625k569987k569428k555516
3891H9558550k509020k550842k475091k546895k578623k576268k467264k374301
3883F9480246k322185k228785k209328k199856k074958j983933j879515j861818
3875E2719868j834635j738536j689054j579856j599212j427626j372344j327413
3867D0151192j356998j142591j102004j009447r52296r57543r34135q36521p58630
3858C1101027p59201o79614o97963o75789o56843o43294o41261o26485n92788
3849B5127789n18266n09776n25510m77329m24634l88677m09047k81141l27628
$$ y = [128650281, 126791452, 124788568, 122678615, 120392418, 117998956, 115469289, 112917141, 110290002, 107647036, 105061667, 102465816, 99873106, 97253481, 94683494, 92114066, 89558550, 87049530, 84498688, 82023597, 79476702, 76898079, 74321811, 71854547, 69480246, 67158061, 64929276, 62719948, 60520092, 58445134, 56461201, 54581686, 52719868, 50885233, 49146697, 47457643, 45877787, 44278575, 42850949, 41478605, 40151192, 38794194, 37651603, 36549599, 35540152, 34587856, 33630313, 32696178, 31859657, 31101027, 30341826, 29662212, 28964249, 28288460, 27631617, 26988323, 26347062, 25720577, 25127789, 24609523, 24099747, 23574237, 23096908, 22672274, 22283597, 21874550, 21593409, 21265781]
3840B1265781l21759k13108k59316j59907j69755j84296k97227l36866l42987
3831A8980560l42746m35996m29422m17613l56033k46090k40862j22877j22807
3822A6266114j67699j38150q1393j09614k03099k11829j76437j90591o1532p3697
3812A4852073q0830q0953j8934o4270o7098o3812J5383l4516k219Q5697m4467
3801A4496054r502K1636K4699O0268N2368N3680J4005J3469L6275j2545P2665
3790A4823072M7456P2M725O0116L6399J0470k7560k3238j267k6999O091n6231
3778A4853106q5932j56l9650j6904n0589j58189J8282J7927m8576K2321n9684
3767A4451956q4944j5731n0506n947j0459j1267K521J5953P9817M1626j2954J07
$$ y = [21265781, 20944022, 20730914, 20471598, 20311691, 20141936, 19957640, 19660413, 19323547, 18980560, 18637814, 18201818, 17772396, 17354783, 16998750, 16752660, 16511798, 16388921, 16266114, 16098415, 15960265, 15878872, 15769258, 15566159, 15354330, 15177893, 14987302, 14925770, 14852073, 14771243, 14690290, 14671356, 14607086, 14539988, 14476176, 14491559, 14457043, 14454824, 14540521, 14496054, 14486552, 14508188, 14532887, 14593155, 14645523, 14699203, 14713208, 14726677, 14762952, 14750407, 14823072, 14870528, 14870600, 14875325, 14935441, 14971840, 14982310, 14954750, 14931512, 14930245, 14903246, 14909337, 14853106, 14767174, 14767018, 14727368, 14710464, 14659875, 14501686, 14519968, 14537895, 14489319, 14511640, 14451956, 14367012, 14351281, 14300775, 14294828, 14284369, 14273102, 14275623, 14291576, 14371393, 14413019, 14400065, 14400172]
3755A4400172J0827R3394P8236R3553O0967r8720p9895o2662k1972j4397M3487
3744A4502990N7233J7063n3124L6802l2202L4863L7207O0801o192M4355L5557
3733A4735353Q3865R1624K2950J22476J07890P4738O7386L699O8726O8748J13523
3722A5560978R5723Q4140R4734J17280J00581J18174J74924Q8044J48938J11704
3712A6695220J14237J73597J41000R5094J45717J00434J12319J45465J79965J36084
3702A8039132J99119J86834J23638J41558K59807K14360K36168J84615J66289
3693A9751520K62088K49653K57340K66167K18120L06013K32344K87424K26378
3684B2057047J45204J71264J53103K37887K19352K25692J94504J22386K50937
$$ y = [14400172, 14410999, 14504393, 14582629, 14676182, 14737149, 14638429, 14558534, 14495872, 14473900, 14459503, 14502990, 14560223, 14577286, 14524162, 14560964, 14528762, 14563625, 14600832, 14661633, 14655441, 14699796, 14735353, 14819218, 14910842, 14933792, 15056268, 15164158, 15238896, 15306282, 15309981, 15378707, 15447455, 15560978, 15656701, 15740841, 15835575, 15952855, 16053436, 16171610, 16346534, 16434578, 16583516, 16695220, 16809457, 16983054, 17124054, 17219148, 17364865, 17465299, 17577618, 17723083, 17903048, 18039132, 18238251, 18425085, 18548723, 18690281, 18950088, 19164448, 19400616, 19585231, 19751520, 20013608, 20263261, 20520601, 20786768, 21004888, 21310901, 21543245, 21830669, 22057047, 22202251, 22373515, 22526618, 22764505, 22983857, 23209549, 23404053, 23526439, 23777376]
3675B3777376K29630K52758J80885K05575K44197J77275J48230J62122J96230
3666B5574278J89794K45992K14710K44215K10770L10508L37661L25889M10849
3657B8064666L61003M89760M57592M36729M63006M53384M87935N38118N33607
3648C2285800N65390O08907O34875O71644O07044O59805O60884P69137P66375
3639C8229861Q11735Q05180Q26012R75137Q63037R60192J100033J073819J076925
3630D6721931J196069J285053J292286J389104J436356J432728J517735J682957
3622E7954219J609435J548438J605751J580496J576042J560427J462219J493240
3614G0390267J394452J370813J363897J475895J310219J275758J231218J153612
$$ y = [23777376, 24007006, 24259764, 24440649, 24646224, 24890421, 25067696, 25215926, 25378048, 25574278, 25764072, 26010064, 26224774, 26468989, 26679759, 26990267, 27327928, 27653817, 28064666, 28425669, 28915429, 29373021, 29809750, 30272756, 30726140, 31214075, 31752193, 32285800, 32851190, 33460097, 34094972, 34766616, 35373660, 36033465, 36694349, 37463486, 38229861, 39041596, 39846776, 40672788, 41647925, 42510962, 43471154, 44571187, 45645006, 46721931, 47918000, 49203053, 50495339, 51884443, 53320799, 54753527, 56271262, 57954219, 59563654, 61112092, 62717843, 64298339, 65874381, 67434808, 68897027, 70390267, 71784719, 73155532, 74519429, 75995324, 77305543, 78581301, 79812519, 80966131]
3606H0966131J077415J001699Q02605P34279O41158N45176M33427M20968L20366
3597H6943224L60287L53089M65271L82257M53412N14164N49457N97128O11834
3588I1230123P72441P17435Q51375R86957J096354J144514J323872J412729J658612
3579A01194412J817183K013114K211752K420812K617627K819002K981761L219514
3571A21295177L354860L548556L696492L703920L751593L813184L689380L696403
3563A50549565L594868L521459L358256L177069L051902K924479K798003K654159
3555A75629760K451071K245378J984064J736963J409914J054467N99425K10958
3547A87322000o8281l56485o20825p83699q44576q35078r65784q49226p36908
$$ y = [80966131, 82043546, 83045245, 83847850, 84582129, 85223287, 85768463, 86201890, 86622858, 86943224, 87303511, 87656600, 88121871, 88504128, 88957540, 89471704, 90021161, 90618289, 91230123, 92002564, 92719999, 93571374, 94558331, 95654685, 96799199, 98123071, 99535800, 101194412, 103011595, 105024709, 107236461, 109657273, 112274900, 115093902, 118075663, 121295177, 124650037, 128198593, 131895085, 135599005, 139350598, 143163782, 146853162, 150549565, 154144433, 157665892, 161024148, 164201217, 167253119, 170177598, 172975601, 175629760, 178080831, 180326209, 182310273, 184047236, 185457150, 186511617, 187111042, 187322000, 187253719, 186897234, 186276409, 185492710, 184648134, 183813056, 182847272, 181998046, 181261138]
3538A81261138p37684o61394n69671m82183m17269k71987o1897J49551M08529
3529A78617133O26236R56873J238291J531192J715213K095231K344312K436396
3521A91560877K589393K688051K763233K709587K706409K573842K569627K474085
3513B12635104K419321K332391K209413K098292J990726J772857J558402J320089
3505B28336595J021528O86025M47190J90677j02918l22259l89858n14036m34977
3496B28917967l30325j72758R4374L91644P39940J192027J708463K160430K579544
3487B37281306L145689L780928M325308N026783N732785O470041P331185Q082193
3479B81176218Q987783R556752R962985J0156610J0039457R401393Q376491P154957
$$ y = [181261138, 180523454, 179862060, 179292389, 178810206, 178392937, 178120950, 178059053, 178208604, 178617133, 179243369, 180200242, 181438533, 182969725, 184684938, 186780169, 189124481, 191560877, 194150270, 196838321, 199601554, 202311141, 205017550, 207591392, 210161019, 212635104, 215054425, 217386816, 219596229, 221694521, 223685247, 225458104, 227016506, 228336595, 229358123, 230044148, 230491338, 230682015, 230579097, 230256838, 229866980, 229352944, 228917967, 228587642, 228414884, 228509258, 228900902, 229640842, 230832869, 232541332, 234701762, 237281306, 240426995, 244207923, 248533231, 253560014, 259292799, 265762840, 273094025, 281176218, 290164001, 299720753, 309683738, 319840348, 329879805, 339281198, 347657689, 354812646]
3471C54812646N606735M067692K415302R21246l18394j263403k070268k629589
3463C61541967l153355l710395m213734m980746n917717p162777q310408r578975
3455C14513860j0826249j1769566j2549261j2877082j2932575j2788565j2313256
3448B28457306j1569252j0821521j0110135r353203q565154p895146p349564o798188
3440A55995143o283144n810631n348647m954319m676463m462941m176359l951911
3432A16330728l799381l658611l541038l304240l141710l028369k938788k765176
3424I0153415k698373k572291k371488k335737k179307k138580k025101j882907
3416G1949631j736409j713920j640393j658490j572217j533843j437449j355436
$$ y = [354812646, 360419381, 364487073, 366902375, 367823621, 367505227, 366241824, 364171556, 361541967, 358388612, 354678217, 350464483, 345483737, 339566020, 332403243, 324092835, 314513860, 303687611, 291918045, 279368784, 266491702, 253559127, 240770562, 228457306, 216888054, 206066533, 195956398, 186603195, 178038041, 170142895, 162793331, 155995143, 149711999, 143901368, 138552721, 133598402, 128921939, 124458998, 120282639, 116330728, 112531347, 108872736, 105331698, 102027458, 98885748, 95857379, 92918591, 90153415, 87455042, 84882751, 82511263, 80175526, 77996219, 75857639, 73832538, 71949631, 70213222, 68499302, 66858909, 65200419, 63628202, 62094359, 60656910, 59301474]
3408E9301474j304059j221553j221490j164003j107440j094537j058739q84615
3400E0245038r88306q71817q75165q70080p72139q27201q04136p52901o96459
3391D2786834p06571p07281p39054o43008o49207o12065n89099n17461n48538
3382C7074550n63365n37514n62488n44103n49194n10121n93807m63794n82626
3373C2167538o09005n01490o25062o69453n95751o69824o48405n42487n64209
3364B6741852o22735o26024o32087o32952n52370n11457n66966o37850n41687
3355B1417724n42111o06841n63978n24711m89448m79356m51028m57863m49626
3346A6852762l84393m21410m21855m28504l60125l09294k63377k64736l90552
$$ y = [59301474, 57997415, 56775862, 55554372, 54390369, 53282929, 52188392, 51129653, 50245038, 49256732, 48384915, 47509750, 46639670, 45867531, 45040330, 44236194, 43483293, 42786834, 42080263, 41372982, 40633928, 39990920, 39341713, 38729648, 38140549, 37623088, 37074550, 36511185, 35973671, 35411183, 34867080, 34317886, 33807765, 33213958, 32750164, 32167538, 31558533, 31057043, 30431981, 29762528, 29166777, 28496953, 27848548, 27306061, 26741852, 26119117, 25493093, 24861006, 24228054, 23675684, 23164227, 22597261, 21959411, 21417724, 20875613, 20268772, 19704794, 19180083, 18690635, 18211279, 17760251, 17302388, 16852762, 16468369, 16046959, 15625104, 15196600, 14836475, 14527181, 14263804, 13999068, 13608516]
3337A3608516k42028k56558k66217k34378j90660j46151k83729k34078j33631
3328A1621086j67466k00003k34151k55699q9249q3004j13366j27950j29615j18868
3318A0101715j23002j01625q3586j23992o6204r9932j07606r3748k9201n8051
3308I214768q6693j08644p7348j6604m8131L4823q7705q1382m1703o6830n6445
3297H578106o9145j12911j03272p3565j00623K3638j6596p2467o3029O7678J8159
3286H075973o0517J7284J9830L143L8950N0133N1685L9237n978n6198m7102L7835
3274H164275P7122M2618N0106J00290O5940K8017Q028j7286m0266q4224K3841
3263H418461j5444l6391j2395K5448N3406M0485P9432L7063l4704Q6874J10257
$$ y = [13608516, 13366488, 13109930, 12843713, 12609335, 12418675, 12272524, 11988795, 11754717, 11621086, 11453620, 11253617, 11019466, 10763767, 10674518, 10591514, 10478148, 10350198, 10220583, 10101715, 9978713, 9877088, 9793502, 9669510, 9603306, 9503374, 9395768, 9302020, 9272819, 9214768, 9128075, 9019431, 8942083, 8925479, 8877348, 8912171, 8824466, 8743084, 8701381, 8634551, 8578106, 8508961, 8396050, 8292778, 8219213, 8118590, 8142228, 8125632, 8053165, 7990136, 8057814, 8075973, 8015456, 8032740, 8052570, 8055713, 8094663, 8144796, 8196481, 8235718, 8229740, 8173542, 8126440, 8164275, 8241397, 8284015, 8334121, 8434411, 8500351, 8528368, 8536396, 8519110, 8478844, 8394620, 8418461, 8403017, 8366626, 8354231, 8379679, 8433085, 8473570, 8553002, 8590065, 8555361, 8642235, 8752492]
3252H752492J6059N0544K4139J66840Q6197K9339J2871O3729m079L5439M6794
3241I280364J83377R1863J60766K22024J78229J09466J40104K06824R5879K38204
3231A0907100J60550O4156J08961r503j35828j31288k44742l36697l58354k70951
3221I753404k17209l64598k19571j29479k01884j37966j64709j07091r8735q8353
3211H023809r0557l2584m2803q207L0313l5259J7132j8017R4547J39855K15438
3200H293667J63387K56321M78695M93715M62120K65449j59482o43875p63893o29754
3190H216350o26737l90581k11688k55365j06786j32423j44342j61169j11211p8253
3180E997795l5159k1657l3420r1709j30484j52005p1353q3218n5457j39101j77191
$$ y = [8752492, 8768551, 8819095, 8843234, 9010074, 9096271, 9125610, 9138481, 9202210, 9198131, 9233570, 9280364, 9463741, 9555604, 9716370, 9938394, 10116623, 10226089, 10366193, 10573017, 10668896, 10907100, 11067650, 11131806, 11240767, 11231264, 11095436, 10964148, 10719406, 10382709, 10024355, 9753404, 9536195, 9171597, 8952026, 8822547, 8620663, 8482697, 8317988, 8210897, 8112162, 8023809, 7933252, 7900668, 7857865, 7849658, 7879971, 7844712, 7861844, 7843827, 7938374, 8078229, 8293667, 8457054, 8713375, 9192070, 9685785, 10147905, 10413354, 10253872, 9609997, 8846104, 8216350, 7589613, 7199032, 6987344, 6731979, 6625193, 6492770, 6348428, 6187259, 6076048, 5997795, 5962636, 5940979, 5907559, 5815850, 5685366, 5533361, 5462008, 5378790, 5323333, 5184232, 5007041]
3169E007041o5312n5722r5919j03533n0396p9345j11308q6168j11137j02639k6619
3158D118943j00214j11150m1357n5377j00679n5119r4099p5412n4388l2517n3838
3147C344793j09810o2039L1841o2870j04432N763n6019n7522p544M3519o4917
3136B900763r7040n54L2428M9133p9914o0199n0621o8606l2481k3206k2807q420
3124B538476k5130q0504n0094L2578J9662p2642m0285l4845m0728n7123N0284
3113B239649j2888k6819q8171m9322M9123j9972m7953k8120J5811K5816j3177
3102B043977o3398n9409J4591l5656m6468J9399m7119m0067m4200j0220R847N4558
3090A795835n5794j1901j9656q234M587q5715j16451Q5215L7779n530j4146o0321
$$ y = [5007041, 4941729, 4886007, 4790088, 4686555, 4636159, 4556814, 4445506, 4359338, 4248201, 4145562, 4118943, 4018729, 3907579, 3866222, 3810845, 3710166, 3655047, 3560948, 3485536, 3431148, 3398631, 3344793, 3234983, 3172944, 3204785, 3141915, 3037483, 3043246, 2987227, 2929705, 2922161, 2965680, 2900763, 2803723, 2803169, 2835597, 2884730, 2804816, 2744617, 2693996, 2625390, 2592909, 2569703, 2546896, 2538476, 2513346, 2432842, 2382748, 2415326, 2434988, 2362346, 2322061, 2287216, 2246488, 2189365, 2239649, 2226761, 2199942, 2111771, 2062449, 2111572, 2091600, 2043647, 2015527, 2031338, 2057154, 2043977, 1980579, 1921170, 1935761, 1900105, 1853637, 1873036, 1825917, 1785850, 1741650, 1731430, 1741277, 1795835, 1740041, 1728140, 1708484, 1700250, 1704837, 1619122, 1502671, 1587886, 1625665, 1620135, 1605989, 1545668]
3078A545668N6806k3838n9304k259p4445j5946P5210m9416N2379n8459j2124j6126
3066A418146R047O598m8897L952P0060m2582o1758n4454k6144M6352Q0559K5069
3054A425948n8455q326k478m9987k3688L7565M5440K7179l7268O026o4907m4105
3042A252944J8000K8755L093m167M3378l2434j3560K6306j6830l420l8192j0452
3030A253421J5818J8512j3647K518k4463k2180K5877O0806n3292o0640K4203K5711
3018A252644J6112J8110o7434Q244M2529k8109L1236J4101k5457l6629J8530J7203
3006A261080j6049O3449k738J3132k1776m6497L4480K536L261m7670K6536M9310
2994A319054o288L0341J6180k1543o081l6356m9623J45625L1777l7034N1589n5213
$$ y = [1545668, 1602474, 1578636, 1519332, 1517073, 1442628, 1426682, 1501892, 1452476, 1504855, 1446396, 1434272, 1418146, 1427193, 1433791, 1384894, 1388846, 1458906, 1416324, 1354566, 1300112, 1273968, 1320320, 1400879, 1425948, 1367493, 1359167, 1356689, 1306702, 1283014, 1320579, 1366019, 1393198, 1355930, 1361956, 1297049, 1252944, 1270944, 1299699, 1302792, 1298625, 1342003, 1309569, 1296009, 1322315, 1305485, 1302065, 1263873, 1253421, 1269239, 1287751, 1274104, 1276622, 1252159, 1229979, 1255856, 1316662, 1263370, 1202730, 1226933, 1252644, 1268756, 1286866, 1219432, 1227676, 1270205, 1242096, 1273332, 1287433, 1261976, 1225347, 1243877, 1261080, 1245031, 1308480, 1305742, 1318874, 1297098, 1250601, 1285081, 1287617, 1290878, 1243208, 1269744, 1319054, 1312766, 1343107, 1359287, 1337744, 1331663, 1295307, 1245684, 1391309, 1423086, 1386052, 1437641, 1382428]
2982A382428l5224n267N8992K1410j3734K2643r59p7802M0703j4832k0548K5696
2970A383506N6848K665m2568J8952P3898K603M862O2306l776k2481J6395Q753
2958A561963p3759L0679J5964M2052M0320r0628l4408N8297n4625R1310k1685
2947A565480K2841J986n9292j8922k8460Q26N5676L2960K4990Q4412j0376k4065
2935A648056Q984j3743K8643L4555N8296N4979M2794N1807L205J9575R56R7498
2923B035605m5455m1496P7090K2287L5144q045O1990J22651j7240J02263p228
2912B337566l8108R3636o970n0752N252J4371j5480O5395J4130J5789k6353M994
2900B413470N6138Q1227M9805P7181M8509Q622K0800K8668J11911L3837J04910
$$ y = [1382428, 1347204, 1341937, 1400929, 1422339, 1408605, 1431248, 1430289, 1352487, 1393190, 1378358, 1357810, 1383506, 1440354, 1443019, 1400451, 1419403, 1493301, 1495904, 1500766, 1563072, 1559296, 1536815, 1553210, 1561963, 1488204, 1518883, 1534847, 1576899, 1617219, 1526591, 1492183, 1550480, 1495855, 1587165, 1565480, 1588321, 1590307, 1531015, 1512093, 1483633, 1484459, 1540135, 1573095, 1598085, 1682497, 1672121, 1648056, 1657040, 1643297, 1671940, 1706495, 1764791, 1819770, 1862564, 1914371, 1917576, 1937151, 1938107, 2035605, 1990150, 1948654, 2025744, 2048031, 2083175, 2075130, 2137120, 2259771, 2242531, 2344794, 2337566, 2299458, 2393094, 2386124, 2335372, 2340624, 2354995, 2339515, 2404910, 2419040, 2434829, 2408476, 2413470, 2469608, 2550835, 2600640, 2677821, 2726330, 2734952, 2755752, 2784420, 2896331, 2930168, 3035078]
2889C035078K5024N1169J23852M3655k8521M9026p9332J0016l82m3180m9726q4775
2877C051904n8114m3009j3554p1695n908p292m3245m2292m1384j3648L7972O6464
2865B816199L8396k3331j0885k886J447P9972K1538o0725o1627j786o9452l0807
2853B696053o007n1921o1597o5108r9170p7364m8878q2555l3493o2776N217n3611
2841B058790p1865L4238k3378o9240o747k0602q3628K013n5420j10332j8870j3731
2829A621228M909n7583j01624l3623r552m184L29n5593j3532n0902M035J3144
2817A317052j1221J3874r842p2341m0369m8326k9024j7513j3134j4075O987j2486
2805A069582n1548l0719j6377L4221R40k8849j17784L6304K2085l3933L747p2035
$$ y = [3035078, 3060102, 3111271, 3235123, 3278778, 3250257, 3299283, 3219951, 3229967, 3229585, 3186405, 3136679, 3051904, 2993790, 2950781, 2937227, 2865532, 2859624, 2852332, 2809087, 2766795, 2725411, 2711763, 2749735, 2816199, 2854595, 2831264, 2820379, 2817493, 2818940, 2898912, 2920450, 2859725, 2798098, 2796312, 2726860, 2696053, 2690046, 2638125, 2576528, 2511420, 2412250, 2334886, 2286008, 2203453, 2169960, 2107184, 2112401, 2058790, 1986925, 2021163, 1997785, 1928545, 1921798, 1901196, 1817568, 1819581, 1764161, 1653829, 1634959, 1621228, 1626137, 1568554, 1466930, 1433307, 1423755, 1419571, 1419900, 1364307, 1350775, 1299873, 1303908, 1317052, 1305831, 1319705, 1309863, 1237522, 1197153, 1148827, 1119803, 1102290, 1089156, 1075081, 1082068, 1069582, 1018034, 987315, 970938, 1005159, 1006099, 977250, 859466, 895770, 917855, 883922, 887669, 815634]
2793H15634J4224m7300o0942l5278kK6567M0937l3766n4462n1027m1333M0150
2781F13402J0080L6638J7157j10815m383L910k4044l1394j583l6364L2893p311
2769D98186j6924M150l5662J0806m8550m4168J5780m063m9758k7917L8551k5485
2757C14946k0994L2290L6287k8986m1093R641k8974r634J2552J3961m9064K5510
2745B66442k839q036k6833K0169j7411J3225m4270J5082J6371M629P379R751l6825
2732B16834k7555M2269k5599M701j7949L2359K1194J224q3378n0571n202l63K6365
2719A34329J3434l8153N035N1023l7647n0079j6996j243N2672L4914J043j9505
2707A28827o1123Q897J7600J643L1557j9091k668j5313q981R808m30o6884j1207
$$ y = [815634, 829858, 782558, 721616, 686338, 686336, 712903, 753840, 720074, 665612, 614585, 573252, 613402, 623482, 660120, 677277, 566462, 562079, 565989, 541945, 510551, 508968, 472604, 505497, 498186, 481262, 485412, 449750, 460556, 412006, 367838, 383618, 379555, 329797, 301880, 340431, 314946, 293952, 326242, 362529, 333543, 292450, 302091, 273117, 263483, 276035, 289996, 240932, 266442, 263603, 255567, 228734, 248903, 231492, 244717, 200447, 215529, 231900, 236529, 243908, 253659, 216834, 189279, 231548, 205949, 210650, 192701, 225060, 246254, 247478, 164100, 113529, 108327, 107964, 134329, 147763, 109610, 114645, 165668, 128021, 77942, 60946, 59703, 112375, 147289, 148332, 128827, 67704, 76601, 94201, 95844, 127401, 108310, 105642, 90329, 81348, 91156, 90726, 23842, 12635]
2694A2635K1310l273o338l5296k4745K3256M2369j0161p671k353M5881l6203l0193
2681a0782L6908M642l95P4467l1578m4649k1619K1464M4358n4994L3836m5493
2669F165o5236J0249k841J2652j6178N5841L9895k8743l0113L1721M3411n8406
2657a583l2568J4809L3621j1902p196k011O5592r809n5738J1623n5083M7349n354
2644h250k3911J12990k7475o7434J1474l1027L4125J3126J4128q452M0821L217
2632F3332n9044p8840K6485R2765K7837n1533j2081J4605k3365o3975n8971k6246
2620a49031M1385L9889L2736r775m4856n224J6430J5391N8703M8144p320m8627
2608a2155j7324Q2790j8849l1189l3853k5911L0997L2207M901J008J2269m4586
$$ y = [12635, 33945, 30672, 24334, -10962, -35707, -12451, 29918, 19757, 12086, 9733, 55614, 19411, -10782, 26126, 30768, 30373, 104840, 73262, 28613, 6994, 28458, 72816, 17822, 51658, 6165, -59071, -48822, -51663, -39011, -55189, 652, 40547, 11804, -18309, 13412, 56823, -1583, -34151, -19342, 14279, 2377, -4819, -6830, 58762, 48953, -6785, 4838, -50245, -2896, -8250, -32161, 80829, 53354, -14080, -2606, -33633, 492, 13618, 27746, 19294, 60115, 63332, 4288, -74552, -48067, 44698, 72535, 21002, 8921, 23526, 161, -63814, -122785, -149031, -107646, -67757, -35021, -44796, -89652, -94876, -78446, -63055, -4352, 43792, 36472, -12155, -29479, 53311, 34462, 3273, -30580, -56491, -25494, 6713, 11614, 12622, 24891, -19695]
2596a9695K788k6688j353N3703K1500j2792J8527K6175l8327k3618r60J7980l4882
2583a7642N439l7990L508p902L5623R865J4242n9682j1287k189j5387N778Q760
2570f8864j8779N638O6878N2620K5916k3377l3751J6494P951L285j264p4695k4900
2557f6848M2117M3498K755P40k4173n7595j2954o7336L0373j3708J7123j030K4072
2544h2966K064K9878M4700l3698k0561L8881J11k1860K0860Q806k5022l2373J3314
2531e7866m5783j2060j1444P593M1963K4352k2916n796j3622J9300L171J089l5332
2518a07351N3992k3216j5614o1072N8581J0894N4077k0390l5671P7639l7330n4118
2506i9579p69l0756K6826J5419l6021J5276J9556O6022j658k3886j9682L486p749
$$ y = [-19695, -16907, -43595, -44948, 8755, 30255, 17463, 35990, 62165, 23838, 220, -740, 17240, -17642, -12203, -50193, -46685, -54587, -18964, -9099, 5143, -54539, -65826, -68015, -83402, -77624, -68864, -87643, -82005, -15127, 37493, 63409, 40032, 6281, 22775, 30726, 34011, 32747, -41948, -66848, -24731, 18767, 21522, 22262, -1911, -59506, -72460, -139796, -109423, -123131, -106008, -107038, -82966, -80902, -51024, -6324, -40022, -60583, -21702, -21591, -43451, -22591, -13785, -38807, -71180, -57866, -103649, -115709, -127153, -119560, -77597, -53245, -76161, -81957, -95579, -76279, -73108, -72019, -107351, -53359, -76575, -92189, -153261, -94680, -83786, -29709, -50099, -85770, -8131, -45461, -99579, -100348, -131104, -104278, -88859, -124880, -109604, -90048, -24026, -25684, -49570, -69252, -65766, -73515]
2493g3515j9508l6175J8817P034M7417j8037N6608k6796l9144L489j848o0139
2481a41797J4195N266k5269q566M1545K8337q1889j7776L0230J6781k6950N5544
2469a10349O546m6167M4923J3579o229j8454n3608Q1658N974k6091n296J1073
2457a02441N3452m9649q262J4734J720p2350K0266P6057q720J9732p348O229l0269
2444h6849j6392m6217K303J8434J8257q4267M4152M4165O321k4771M4125L7179
2432d3560j1245l9398N432J5931o3332O899K8252o6631R1103j4553m5852j0193
2420a47147j1821M9929O7655o7430L79j430l9791M0394K3235r710m7049l7004
2408a79790J3050J15833n172j0690n4354l8219M9349P6069p0158J447N79k1786
$$ y = [-73515, -93023, -129198, -110381, -103347, -55930, -73967, -17359, -44155, -83299, -79810, -81658, -141797, -127602, -122336, -147605, -156171, -114626, -86289, -168178, -185954, -155724, -138943, -165893, -110349, -103803, -149970, -105047, -91468, -97697, -116151, -169759, -88101, -82127, -108218, -113514, -102441, -48989, -98638, -106900, -92166, -90446, -162796, -142530, -66473, -75193, -55461, -62809, -56580, -86849, -103241, -149458, -147155, -128721, -110464, -194731, -150579, -106414, -100093, -124864, -80739, -43560, -54805, -94203, -88771, -72840, -136172, -129273, -101021, -167652, -76549, -91102, -136954, -147147, -158968, -109039, -41384, -108814, -108435, -109865, -149656, -109262, -86027, -95737, -142786, -179790, -166740, -50907, -56079, -66769, -121123, -159342, -109993, -33924, -104082, -102635, -102056, -123842]
2396a23842J356K153O851j1799j2420L4301L9799J4761p229J9960K136j1237k9169
2383g4379L1010l4136K4006l3320J9130j031L2308K1745n062o1176k7947M256
2371a04596j9711r866J2198N7651k5660j8167J8310L7432k7720L5481L8231m448
2359a0865j2196l0104m775L1587j8558q297O7573j1602k1552j0666p7808J9967
2347h7296K0894J3397M3990l3020j3592l3309o482j6807J5769N4371k1272n8811
2335a22168O1220o8652j5155P1255L6377k805m3434J3571N0002K568p5156j451
2323i3828M9810J6527j8911m0070n663K0631J025Q033k6435K2314L955L2706k9931
2310e9837j1418J6415K9787L4647L891r4934J9804O0059j2649k5130L3497o6373
$$ y = [-123842, -122486, -120333, -113482, -125281, -137701, -103400, -63601, -48840, -56069, -36109, -33973, -45210, -74379, -43369, -77505, -53499, -86819, -67689, -68720, -36412, -14667, -19729, -80905, -108852, -104596, -124307, -134173, -121975, -64324, -89984, -108151, -89841, -52409, -80129, -44648, -6417, -10865, -23061, -53165, -57940, -26353, -44911, -53208, 14365, 2763, -18789, -29455, -107263, -87296, -66402, -53005, -9015, -42035, -55627, -88936, -95418, -112225, -96456, -42085, -63357, -122168, -60948, -129600, -144755, -73500, -37123, -39928, -83362, -69791, -19789, -17221, -92377, -93828, -44018, -27491, -46402, -86472, -92135, -71504, -70479, -62446, -88881, -66567, -62612, -29906, -59837, -71255, -54840, -25053, 9594, 13485, -81449, -61645, -1586, -14235, -39365, -5868, -72241]
2298g2241j1249n843j0958O0946L6317m9483L3094L7100p2908L253k0837J6435
2286e6374J6029O25q8839p87P8581O5405k821M4727k2792j29970p515P8732K7536
2273B537L7303J4422l3301J6837o0748O3365p6065N2110J1341k1813k265R65p893
2260c205r921O6236J0812j2143p4613N125K054N4373m271m4901p621l4940L7238
2247a5777j2453K6917N6256k748J6316q874M4927j4265l1662r0277K2536K0175
2235A1071J7241O5864n9328l8325J6772j4348N2241L6075l0082j5488K0075K3252
2223H5020J8377k8929L5002L4424o3202N788k7879J2524N4512p695l720k4012
2211I0210l5029k4797P102K3095R4080n7676L120K666p2654N0976M4732N178n092
$$ y = [-72241, -83490, -89333, -100291, -39345, -3028, -52511, -19417, 17683, -55225, -51972, -72809, -56374, -40345, -39720, -128559, -129346, -50765, 14640, 11819, 56546, 33754, -96216, -103731, -24999, 2537, 39840, 54262, 20961, 37798, -22950, 40415, -35650, 16460, 27801, 5988, 3723, 4688, -3205, -13126, 53110, 63922, 51779, -22834, -17709, -15655, 38718, 34447, -10454, -18075, -53015, -15777, -28230, -1313, 54943, 52195, 68511, 59637, 104564, 90299, 58637, -31640, -9104, 11071, 28312, 94176, 34848, -3477, 13295, -1053, 51188, 87263, 57181, 41693, 61768, 85020, 103397, 74468, 109470, 143894, 80692, 86480, 58601, 71125, 125637, 117942, 114222, 90210, 55181, 30384, 37486, 60581, 154661, 96985, 100105, 102771, 30117, 81093, 125825, 131003, 125911]
2198A25911m3352N8738M1267k0760K0534l2692N3251j6362m9813O90k9978N3230
2186A60664M5656J8821K3331p6942m8267L7781q373O666J441L7539l8582J0799
2174A70534K0083K8975N8774l9525L5475k2788J0309O2359J6059n1068O2621J933
2162C53741m2598j7192r298m6533J32044N0485j1365l3569N2509J8534l1894j8670
2150C96194n2462J9905M6740N7334K3409L0346J0136K3570P6991K6235l7005L1061
2138F52454j4979K612N2615P833j2072N198J9881Q8361R5474R0263k6204K1106
2126I82542L3409q904J00656J00513R2349J1460k1202L0908L6653J06470k0412
2115A444442R2797O6007P8173Q3621R8659R0133Q6038J23322J14552J39705K15643
$$ y = [125911, 82559, 141297, 182564, 161804, 182338, 149646, 202897, 186535, 136722, 137412, 107434, 160664, 206320, 225141, 248472, 171530, 123263, 161044, 152671, 159337, 160778, 198317, 159735, 170534, 190617, 219592, 278366, 238841, 274316, 251528, 261837, 324196, 340255, 289187, 351808, 353741, 311143, 293951, 284653, 238120, 370164, 420649, 409284, 375715, 428224, 446758, 414864, 396194, 343732, 363637, 410377, 467711, 491120, 521466, 531602, 555172, 632163, 658398, 621393, 652454, 637475, 640087, 692702, 700535, 688463, 693661, 713542, 801903, 897377, 987640, 961436, 982542, 1015951, 1007047, 1107703, 1208216, 1300565, 1312025, 1290823, 1321731, 1358384, 1464854, 1444442, 1537239, 1603246, 1681419, 1765040, 1863699, 1953832, 2039870, 2163192, 2277744, 2417449, 2633092]
2104B633092K67824K48139K84391L07626K65256J17950J65790K69374M01921M40458
2094E401821N08360P34937P35586R93223J478050K015766K554270K204329J270892
2085A7897234j353204l554994k972929k172856j548401j080406q14625o80198
2077C719621n19461l90814l60887j10038j33884j56604p1458j53785j95891j76411
2067A450388j83130j22875m2407r1839r7239m0627M6071j18766j27603m5472r3180
2056E33321K0115M2580m6376n4475l2717p5314m6989O984o4659L2295O9042k1061
2044C62746j5928o5956K4165k6021l1457j4029r423L8640K2537n8673m1447O654
2032A91808K0325o6199K6627n882n5194N0950J691K535o0177k2636K2527j9195
$$ y = [2633092, 2900916, 3149055, 3433446, 3741072, 4006328, 4124278, 4290068, 4559442, 4961363, 5401821, 5910181, 6645118, 7380704, 8373927, 9851977, 11867743, 14422013, 16626342, 17897234, 16544030, 12989036, 10016107, 7843251, 6294850, 5214444, 4399819, 3719621, 3200160, 2809346, 2448459, 2338421, 2204537, 2047933, 1976475, 1822690, 1626799, 1450388, 1267258, 1144383, 1101976, 1010137, 912898, 872271, 918342, 799576, 671973, 626501, 533321, 553436, 596016, 549640, 495165, 462448, 387134, 340145, 347129, 282470, 314765, 383807, 362746, 346818, 280862, 305027, 279006, 247549, 233520, 224097, 262737, 285274, 226601, 185154, 191808, 212133, 145934, 172561, 166679, 111485, 162435, 164126, 166661, 106484, 83848, 106375, 87180]
2020H7180L7433j7677j9142J293k3866J3377K1644k1475J2136K5346r540J054
2008A07763n6604l3532O234l9666o751j7070K6221J5949k3m4651l9212k4369O8822
1995c6889M0914j1490p3523N4365J19650j0195k6899m8115j4350O721L7693J7257
1983E5139l5965k6574m307j6943N972k5735n625M8800K858o2597K6297M4269J3770
1970A9359k8424L3567M3935j0069n923k2862r2521l5604L7124K2343O4552n7431
1958c1954M0988Q843j3279j2267k1576j8064N4073k2074k6426l5689m314N3032
1946b8707P625M0910k8271l5101k7782O1758p990r598k1086j3165q6318Q7383
1934f0342n4717K4334L4420p447L4736N1357l7558m109l830L4063n0234Q390L0103
$$ y = [87180, 124613, 106936, 87794, 89087, 65221, 78598, 100242, 78767, 90903, 116249, 106709, 107763, 51159, 17627, 23861, -15805, -22556, -39626, -13405, 2544, 2521, -42130, -81342, -105711, -36889, 4025, -7465, -80988, -26623, 93027, 82832, 55933, 7818, -6532, 189, 37882, 55139, 19174, -7400, -11707, -28650, -22678, -48413, -54038, -5238, -2380, -64977, -38680, 5589, 19359, -9065, 24502, 68437, 58368, 52445, 29583, -62938, -98542, -61418, -39075, 25477, -31954, 9034, 17877, 4598, -7669, -29245, -47309, 6764, -15310, -41736, -77425, -81739, -28707, -21082, 19828, -8443, -43544, -71326, -9568, -17558, -27156, -48242, -61407, -147725, -60342, -115059, -90725, -56305, -63752, -29016, 22341, -15217, -19326, -23156, 10907, -39327, -30937, -834]
1921h34q0607K7191o7560J5324P3889O669R825r9320K9249l981N735Q0963l1761
1908c5218M5026o0522P191K2350j9177k2993l565m1070N5834M5756p5741O594
1896g5535Q5742k5294N113k7277k9833N0030k9835K7538L7978n4063j9167l8309
1884i2912R886p842L0503J0281j8155L7194J4268m5353K6579O0819k624o3661
1872d1017j3688L7442M7454j0502p6947k1310O7042n452J4041J738m3143Q359
1860c5983M8979n4349j2081j2327l0252M4680k4870O4082m2087P121k522r973
1848e9582r420K1108O2501J7463j748p1341l3713o0435L1337J0516M969K2080
1836f6265k3110J2093O4982M5618n9369n6376L7758J8520k9009K5234j2076L4855
$$ y = [-834, -81441, -54250, -121810, -106486, -32597, -25928, -16103, -115423, -86174, -90155, -84420, -3457, -35218, 9808, -50714, -43523, -21173, -40350, -63343, -66908, -107978, -52144, -6388, -82129, -75535, 10207, -15087, -9974, -37251, -67084, -17054, -46889, -19351, 18627, -35436, -54603, -92912, -83026, -90868, -60365, -50084, -68239, -31045, -16777, -62130, -35551, 25268, 22644, -41017, -54705, -17263, 30191, 19689, -57258, -78568, -11526, -16978, -2937, -1199, -44342, -35983, 12996, -41353, -53434, -65761, -96013, -51333, -76203, -12121, -54208, -47087, -49609, -59582, -69002, -47894, 14607, 32070, 30322, -41019, -74732, -135167, -103830, -93314, -88345, -66265, -89375, -77282, -12300, 33318, -26051, -82427, -44669, -26149, -55158, -29924, -42000, -7145]
1824g145j5501J6587l5169q1709L0164O5518K6037J6267m4708n8524L3389l3206
1812h8000L254k1374M5913O003n0433L4292K6241l400j520J4393p3352k0685M4142
1799h4526J1342P137K0567l3775J2045j7804n1627R2861j1725l7660K6616J9528
1787d7021J0315O50j5804q7681j5779Q0257L3216k0312j8979l8l6730J8635N7220
1774d2051j2084l3601m4088J3947M4016m3026o4958J14434J0236L8338K5083n1127
1762d4881l4316j5196L7808l965L8683k2927l0609k3998J6197J4913j9449K6262
1750f1478K0704o569l5371M0963R4548q006o7682o1518J6159n2695N2868K2606
1738d5471j2229J901m7342L2171M1463R800m1415j0032N3305j9109J0292j5911
$$ y = [-7145, -22646, -6059, -41228, -122937, -92773, -27255, -1218, 15049, -29659, -88183, -54794, -88000, -84746, -106120, -60207, -54204, -104637, -70345, -44104, -47504, -49024, -34631, -107983, -128668, -84526, -73184, -66047, -45480, -79255, -67210, -85014, -136641, -43780, -55505, -93165, -66549, -47021, -36706, -36056, -51860, -139541, -155320, -75063, -41847, -62159, -81138, -81176, -117906, -99271, -42051, -54135, -87736, -131824, -117877, -73861, -116887, -181845, -67411, -57175, -18837, 6246, -44881, -79197, -94393, -56585, -60550, -21867, -44794, -75403, -99401, -83204, -68291, -87740, -61478, -40774, -47343, -82714, -41751, 52797, 44791, -22891, -84409, -68250, -120945, -68077, -45471, -57700, -55799, -103141, -70970, -29507, -19707, -61122, -71154, -17849, -36958, -26666, -42577]
1726d2577l06J1317n92j9877k0314O1571j4197q079P930L6645l1450m7525L9083
1713b8371L5040j06214j4645P220M862j5364M4470j390l2870L3572K5245m7627
1701i6072O6535N0445o9120L0397J5073m9072J3246n0838K1616L7982J311j8307
1689d6804o9354N406k3626P6982J5089j8231J7164l7155J9784m1701L7528k866
1677f7784p9882M2480O278P3124n227j02574L542L4550k3412N1532J6264J040
1665e0069J8736j9359j0588m7233j2253O5753K092k8368k3862O240k6402O2664
1653f2649l233J9084q242j9109j3169l5481K4764j7802k3782M9070N257L8807
1641d6485J7678o1288k3058M428N0449j9176M855L605L7299L9580k3065J1116
$$ y = [-42577, -42883, -31566, -32158, -52035, -72349, -10778, -24975, -33054, -25124, 11521, -19929, -67454, -28371, 6669, -99545, -114190, -106970, -102108, -117472, -73002, -74392, -107262, -73690, -48445, -96072, -29537, 20908, -48212, -17815, -2742, -51814, -38568, -89406, -67790, -29808, -28497, -46804, -116158, -110752, -134378, -57396, -42307, -60538, -43374, -80529, -60745, -102446, -64918, -67784, -147666, -105186, -98908, -25784, -31011, -133585, -130043, -95493, -118905, -67373, -51109, -50069, -31333, -50692, -61280, -108513, -120766, -55013, -52921, -81289, -105151, -98911, -125313, -62649, -65882, -46798, -55040, -74149, -87318, -122799, -98035, -115837, -139619, -90549, -85292, -46485, -28807, -90095, -113153, -108725, -58276, -77452, -72597, -68992, -31693, 7887, -15178, -4062]
1629d062j8503j5119l4474K684k4765k3705P6614M0369l4575k6158K0221o007
1617d7480j6032l1776M6922L6105o9054M7856O1782l8704k7925k925o007J2752
1605c4486k0286O6325K0064l1869n3055O0229J1020j01775M6141p766O167J5107
1593b4184P415r338j2436j7184P70q4698J951L126r401M2470M0209n713J14007
1580D6994n6336p4267R093m414L6844j064M5415k3071k5757K4596k7785J9357
1568c0395k0016j165J8338k5904K9590P425K421L7573n367J4507o9608l6981m8771
1555a28353K6596L7977k6252L2689k4408l539k7620K0845O3380j7372k5223j4788
1543h6068L7690M7884j16077N9O4802M458l5872N3937o900k3255L9312L471j2854
$$ y = [-4062, -22565, -37684, -72158, -69474, -94239, -117944, -41330, -961, -35536, -61694, -41473, -47480, -63512, -95288, -48366, -12261, -81315, -33459, 28323, -10381, -38306, -41231, -47238, -34486, -54772, 11553, 31617, -252, -53307, 6922, 17942, -83833, -37692, -45458, -39291, -24184, -16769, -26107, -38543, -55727, -54957, -139655, -137704, -134578, -143979, -101509, -61300, -67013, 46994, -9342, -83609, -74516, -78930, -42086, -43150, 2265, -20806, -46563, -21967, -49752, -30395, -50411, -51576, -33238, -59142, -29552, -22127, -19706, 17867, 12500, 27007, -42601, -79582, -128353, -101757, -63780, -90032, -57343, -81751, -85290, -112910, -92065, -28685, -46057, -71280, -86068, -48378, -494, -116571, -116512, -51710, -47252, -83124, -29187, -36087, -59342, -20030, -16559, -29413]
1530b9413n405J425j0752p8042L4270O1532n0450l0028M0966J4194l8190l9170
1518a29063q9q57R3749n226k5115N2535k0845M9289k5904o9265J0959l5312L2716
1505g2428o474J1968j3061l9659N7754L424P5294r7172N98J7339L9223O7767m8561
1492c988n5232j7119j6261J4382L3004l260K1506k9234m0164K924N7250k5886
1480f2078j8417R190J6300j1800L5025n6286q841L8918j3482k4673k0178P269
1468a09053J09300O4166m2102l9486k3058j2758o708L1845j04629m9324N7650
1457a24157J8741K4071j2580N0129M0653l5496l6030M6928k3825p1934L6087J9565
1445f7848k3865L8711M3188N7661l2907l8140K7260K1117O655k5854m8928J5355
$$ y = [-29413, -34818, -33393, -44145, -122187, -87917, -26385, -76835, -106863, -65897, -51703, -89893, -129063, -129152, -130009, -36260, -41486, -66601, -14066, -34911, 14378, -11526, -80791, -69832, -105144, -72428, -78902, -66934, -79995, -119654, -61900, -58476, 16818, -80354, -79756, -62417, -23194, 44573, -3988, -59220, -76339, -92600, -78218, -45214, -48474, -26968, -56202, -96366, -93442, -36192, -62078, -80495, -71305, -55005, -66805, -31780, -88066, -96907, -57989, -71471, -96144, -116322, -109053, 247, 64413, 22311, -17175, -40233, -52991, -59699, -27854, -132483, -181807, -124157, -105416, -81345, -93925, -43796, -3143, -38639, -74669, -27741, -51566, -123500, -87413, -67848, -91713, -53002, -9814, 47847, 14940, -23200, 4060, 25177, 31832, 5978, -42950, -27595]
1433b7595L0495K3618M1328m9251K9589n569k7775k0129l1493j09K0669n877j1602
1420c3701n1434N3804n5717M90Q3709R345o2849m1862P001N0521L1906j2864M8746
1407B7095p6571n407K8401M0770N895p3050K6186J03491m0263n1254M7895l5522
1395b334L4954m2289o4711M9208n277Q653J0562j9294j5169L9173N5346j17655
1383f8833k5096j174n130J3811N7743J6480O478p6777L466L8882M5899l914j7517
1370a5682K6351J75L4365k4114k2392K5763J0079m5513m573j4687j0674Q0309
1358C9407L624j3471J6599l0185k4270N8235m5774l8048n504p6730M9446L8088
1346b8583M8967m3227k7035M1172O7564l0857k6339n684l0660n729L8915k3970
$$ y = [-27595, 2900, 26518, 67846, 18595, 48184, 42615, 14840, -5289, -36782, -36891, -16222, -22099, -33701, -85135, -31331, -87048, -86558, -2849, 6496, -56353, -98215, -91214, -40693, -8787, -21651, 27095, -49476, -54883, -26482, 14288, 20183, -52867, -26681, 76810, 36547, -14707, 33188, -2334, 32620, -9669, -74380, -25172, -30449, -21796, -11234, -30528, -45697, -6524, 48822, -68833, -93929, -95103, -100233, -86422, -28679, -12199, -5721, -82498, -79032, -40150, 5749, 1835, -15682, 10669, 10844, 45209, 21095, -1297, 24466, 34545, -10968, -15541, -30228, -40902, 39407, 43031, 29560, 46159, 15974, -8296, 49939, 4165, -33883, -39387, -116117, -66671, -28583, 20384, -22843, -49878, -8706, 58858, 28001, 1662, -4022, -34682, -40411, -1496, -25466]
1334b5466l977k708J2379r53l020L393P528q4206j7819O7501J02141o3300j8K7086
1320A8561o6807J8194K6023n3693J0575L7339M4406K6256l4596o2482j7085K5050
1308b8259K4888l9920L7995N7981m6315j2858J5276k7838M3993K773l6145J0673
1296B244l6353m58j728l0200M6262j5173j9706P1624p625R728n4673j6403k7360
1283g9821L1724J8239j9590l9960P1552m5549M0617M8176l8316m3743j2872k3677
1271i3220J5984M7552N5970M632m854m2568m0118J9344J6915J7654k1163o3824
1259h7696Q307M7054K1539M1685m3253k0871K1186J6022o1192O0601K2980k2298
1247D064k4816P7119l0598l2638M3425O3781o906j52122l4902N3683P6759j2985
$$ y = [-25466, -29443, -32151, -19772, -20725, -23745, -20352, -12824, -97030, -114849, -47348, 54793, -8507, -8525, 18561, -48246, -30052, -4029, -57722, -47147, -9808, 34598, 60854, 26258, -36224, -53309, -28259, -3371, -43291, -5296, 52685, 6370, -6488, 8788, -19050, 24943, 27716, -8429, 2244, -34109, -34567, -36295, -66495, -20233, -35406, -55112, 16512, 8887, 18615, -36058, -52461, -79821, -48097, -29858, -49448, -89408, -17856, -63405, -22788, 25388, -12928, -56671, -69543, -93220, -77236, -29684, 26286, 30918, 26064, -16504, -56622, -37278, -20363, -2709, -23872, -87696, -79389, -32335, -10796, 30889, -12364, -33235, -12049, 3973, -57219, 3382, 26362, 4064, -20752, 56367, 25769, -6869, 36556, 100337, 93431, -58691, -93593, -39910, 36849, 23864]
1235B3864n8952J8261K3318K4869J3359l4173j578k1692K0629K9764m6459k2109
1223c0899R416p7474Q785R6403m3816K1994L6865n1484k5373M989O9273j6822
1211A857l6508L1702k0193K2705Q088n6418M3868L2888M1026l3477N450L4645
1199G5633M0850r8324q7249J1264L4027N982N8150J6033l3349J761K9240m0871
1187A3147o1530N8093n310L3098o0777q635k2732K7598J0953m1653r053O2763
1175d038k3892j9966P9064p5375L2279J1208n054L7111M429m4726l5104K052K0917
1162b1095M8728j4121j7505j7266j0805j4394K4059M770M2019P543m3612j7518
1150b9197M2760k2807j147N5606O357o4839j4995P776K0380O2934J112J6552k0928
$$ y = [23864, -35088, -16827, 6491, 31360, 44719, 10546, 8968, -12724, 7905, 37669, -8790, -30899, -21483, -98957, -90172, 6231, -37585, -15591, 21274, -30210, -55583, -50594, 18679, 1857, -34651, -2949, -23142, -437, 7651, -48767, -4899, 27989, 69015, 35538, 40988, 75633, 116483, 18159, -69090, -57826, -23799, -17817, 40333, 56366, 23017, 24778, 54018, 13147, -48383, 9710, 4400, 37498, -23279, -31914, -54646, -27048, -16095, -57748, -66801, -4038, -27930, -47896, 31168, -44207, -11928, -720, -5774, 31337, 35766, -8960, -44064, -42012, -21095, 27633, 13512, -3993, -21259, -32064, -46458, -22399, -17629, 24390, 31933, -11679, -29197, 13563, -9244, -10391, 45215, 51572, -13267, -28262, -20486, -106, 62828, 63940, 80492, 59564]
1137E9564K8840m019l9805O988k1838o4373N212M8977q229j4968j7079K3401K1972
1124B4643k7570j3869l1795M1216j9848m2595P9173k3871k2396K757P9909Q844
1112E4598P03j7760J4000m5676m1571N8236M9183m9869p2961L1220K6678J0355
1100A7136L076J0993p420n871k3797l14J7927m1488O749P4940q796m2040K4466
1087B5561o1948N328L6662n7738J7525M2L7347r397m236J7427P601N146J5777
1074C5097p636l4997n0600N9048n0051l3408O377J9020P7284l832J4657J0698
1062D1657n3710j4209L1801M1882q9360O348j4904N5521K5288J0370l0636K6685
1050C6733L6334n3880l306J3239J9586n1760P383j7530J2611j4462J4533J2592
$$ y = [59564, 88404, 84385, 44580, 51568, 29730, -34643, -29431, 19546, 11317, -3651, -20730, 2671, 24643, -2927, -16796, -48591, -7375, -27223, -69818, 9355, -14516, -36912, -34155, 45754, 54598, 55301, 37541, 51541, 5865, -35706, 22530, 71713, 21844, -51117, -19897, 6781, 17136, 20212, 31205, 23785, 17914, -5883, -6197, 11730, -29758, -23009, 51931, 43135, 1095, 25561, -36387, -31059, 5603, -52135, -34610, -34568, 2779, -6618, -10854, 6573, 14174, 19320, 35097, 27461, -7536, -58136, 912, -49139, -82547, -76170, -57150, 20134, 16302, 30959, 41657, -12053, -26262, 5539, 47421, -41939, -35591, -50495, 5026, 30314, 40684, 10048, 36733, 73067, 19187, 15881, 29120, 48706, -3054, 4329, -13201, -590, -15052, -519, 12073]
$$ [...]
##END NTUPLES=NMR SPECTRUM
##END=
