##TITLE=1H_TG-2341-2
 CDCl3
 8 sc, 
 16.12.2021
##JCAMPDX= 6.0         $$ Bruker NMR JCAMP-DX V2.0
##DATA TYPE= NMR SPECTRUM
##DATA CLASS= NTUPLES
##ORIGIN= UXNMR, Bruker Analytische Messtechnik GmbH
##OWNER= root
$$ XWIN-NMR		Version 3.5
$$ Thu Dec 16 11:26:02 2021 Russian Standard Time (UT+4h)  she@DPX200
##.OBSERVE FREQUENCY= 200.131346
##.OBSERVE NUCLEUS= ^1H
##.ACQUISITION MODE= SIMULTANEOUS
##.ACQUISITION SCHEME= undefined
##.AVERAGES= 8
##.DIGITISER RES= 18
##SPECTROMETER/DATA SYSTEM= spect
##.PULSE SEQUENCE= zg30
##.SOLVENT NAME= CDCl3
##.SHIFT REFERENCE= (INTERNAL, CDCl3, 0, 15.737)
##AUDIT TRAIL= $$ (NUMBER, WHEN, WHO, WHERE, WHAT)
$$ ##TITLE= Audit trail, XWIN-NMR		Version 3.5
$$ ##JCAMPDX= 5.01
$$ ##ORIGIN= Bruker BioSpin GmbH
$$ ##OWNER= she
$$ F:/spectra/data/she/nmr/H-F/1/pdata/1/auditp.txt
$$ ##AUDIT TRAIL=  $$ (NUMBER, WHEN, WHO, WHERE, WHAT)
(   1,<2021-12-16 11:24:41.32 +0400>,<she>,<DPX200>,
      <created by zg, POWCHK disabled, PULCHK disabled
       configuration hash MD5:
       00 E9 B6 7A A2 85 ED C7 34 08 36 98 17 FE 4E 26
       data hash MD5: 16K
       06 05 DD 82 26 8C D7 04 5B E7 F2 08 61 87 50 23>)
(   2,<2021-12-16 11:24:43.68 +0400>,<she>,<DPX200>,
      <Start of raw data processing
       efp BC_mod = 2 LB = 0.24 FT_mod = 6 PKNL = 1 PHC0 = -15870.18 PHC1 = 8.60079 SI = 16K 
       data hash MD5: 16K
       D0 2D F0 3C 89 D4 F8 F6 3A 8A 6C 2D EF 8C 1E 9B>)
(   3,<2021-12-16 11:25:01.95 +0400>,<she>,<DPX200>,
      <pk PHC0 = 2.66761 PHC1 = 0 
       data hash MD5: 16K
       5E 36 31 CF 04 DC 64 EC F9 48 05 42 90 A9 2B 0C>)
(   4,<2021-12-16 11:25:05.48 +0400>,<she>,<DPX200>,
      <abs ABSG = 5 
       data hash MD5: 16K
       14 D0 0B 32 6B 1C 1F 3A 96 1D F2 5D 46 15 5B E7>)
$$ ##END=
$$ 
$$ hash MD5
$$ D8 11 96 70 00 46 E7 CE 4A 86 31 74 DB 17 89 E8
##$RELAX= 
##$RELAX= 
##$RELAX= 
##$RELAX= 
##$RELAX= 
##$RELAX= 
$$ Bruker specific parameters
$$ --------------------------
##$DU= <F:/spectra>
##$EXPNO= 1
##$NAME= <H-F>
##$PROCNO= 1
##$TYPE= <nmr>
##$USER= <she>
##$AMP= (0..31)
100 100 100 100 100 100 100 100 100 100 100 100 100 100 100 100 100 100 
100 100 100 100 100 100 100 100 100 100 100 100 100 100 
##$AQSEQ= 0
##$AQ_mod= 1
##$AUNM= <au_zg>
##$AUTOPOS= <>
##$BF1= 200.13
##$BF2= 200.13
##$BF3= 200.13
##$BF4= 200.13
##$BF5= 200.13
##$BF6= 200.13
##$BF7= 200.13
##$BF8= 200.13
##$BYTORDA= 1
##$CFDGTYP= 0
##$CFRGTYP= 5
##$CHEMSTR= <none>
##$CNST= (0..31)
1 1 145 1 1 1 1 1 1 1 1 1 1 1 1 1 1 1 1 1 1 1 1 1 1 1 1 1 1 1 1 1 
##$CPDPRG= <>
##$CPDPRG1= <>
##$CPDPRG2= <>
##$CPDPRG3= <>
##$CPDPRG4= <mlev>
##$CPDPRG5= <mlev>
##$CPDPRG6= <mlev>
##$CPDPRG7= <mlev>
##$CPDPRG8= <mlev>
##$CPDPRGB= <>
##$CPDPRGT= <>
##$D= (0..31)
0 1.2 0 0 0 0 0 0 0 0.06 0 0.03 0 0 0 0 0.0002 0 0 0 0 0 0 0 0 0 0 0 0 
0 0 0 
##$DATE= 1639639480
##$DBL= (0..7)
120 120 120 120 120 120 120 120 
##$DBP= (0..7)
150 150 150 150 150 150 150 150 
##$DBP07= 0
##$DBPNAM0= <>
##$DBPNAM1= <>
##$DBPNAM2= <>
##$DBPNAM3= <>
##$DBPNAM4= <>
##$DBPNAM5= <>
$$ [...]
##$SUBNAM2= <"">
##$SUBNAM3= <"">
##$SUBNAM4= <"">
##$SUBNAM5= <"">
##$SUBNAM6= <"">
##$SUBNAM7= <"">
##$SUBNAM8= <"">
##$SUBNAM9= <"">
##$SW= 18.0517287032376
##$SWIBOX= (0..15)
0 0 2 0 0 0 0 0 0 0 0 0 0 0 0 0 
##$SW_h= 3612.71676300578
##$TD= 16384
##$TD0= 1
##$TE= 0
##$TE2= 300
##$TE3= 300
##$TEG= 300
##$TL= (0..7)
0 120 120 120 120 120 120 120 
##$TP= (0..7)
150 150 150 150 150 150 150 150 
##$TP07= 0
##$TPNAME0= <>
##$TPNAME1= <>
##$TPNAME2= <>
##$TPNAME3= <>
##$TPNAME4= <>
##$TPNAME5= <>
##$TPNAME6= <>
##$TPNAME7= <>
##$TPOAL= (0..7)
0.5 0.5 0.5 0.5 0.5 0.5 0.5 0.5 
##$TPOFFS= (0..7)
0 0 0 0 0 0 0 0 
##$TUNHIN= 0
##$TUNHOUT= 0
##$TUNXOUT= 0
##$USERA1= <user>
##$USERA2= <user>
##$USERA3= <user>
##$USERA4= <user>
##$USERA5= <user>
##$V9= 5
##$VALIST= <valist>
##$VCLIST= <CCCCCCCCCCCCCCC>
##$VD= 0
##$VDLIST= <DDDDDDDDDDDDDDD>
##$VPLIST= <PPPPPPPPPPPPPPP>
##$VTLIST= <TTTTTTTTTTTTTTT>
##$WBST= 1024
##$WBSW= 4
##$XGAIN= (0..3)
0 0 0 0 
##$XL= 0
##$YL= 0
##$YMAX_a= 497687
##$YMIN_a= -796734
##$ZGOPTNS= <>
##$ZL1= 120
##$ZL2= 120
##$ZL3= 120
##$ZL4= 120
##$ABSF1= 15.71824
##$ABSF2= -2.33361
##$ABSG= 5
##$ABSL= 3
##$ALPHA= 0
##$AQORDER= 0
##$ASSFAC= 0
##$ASSFACI= 0
##$ASSFACX= 0
##$ASSWID= 0
##$AUNMP= <proc_1d>
##$AZFE= 0.1
##$AZFW= 0.1
##$BCFW= 0
##$BC_mod= 2
##$BYTORDP= 0
##$COROFFS= 0
##$CY= -3
##$DATMOD= 1
##$DC= 0
##$DFILT= <>
##$DTYPP= 0
##$F1P= 0
##$F2P= 0
##$FCOR= 1
##$FTSIZE= 16384
##$FT_mod= 6
##$GAMMA= 0
##$GB= 0
##$INTBC= 1
##$INTSCL= 0
##$ISEN= 128
##$LB= 0.24
##$LEV0= 0
##$LPBIN= 0
##$MAXI= 10000
##$MC2= 0
##$MEAN= 0
##$ME_mod= 0
##$MI= 1.114404
##$NCOEF= 0
##$NC_proc= -6
##$NLEV= 6
##$NOISF1= 3.799351
##$NOISF2= 2.8
##$NSP= 0
##$NTH_PI= 0
##$NZP= 0
##$OFFSET= 15.73697
##$PC= 1
##$PHC0= -15867.51
##$PHC1= 8.60079
##$PH_mod= 1
##$PKNL= yes
##$PPARMOD= 0
##$PSCAL= 0
##$PSIGN= 0
##$REVERSE= no
##$SF= 200.130002917026
##$SI= 16384
##$SIGF1= 3
##$SIGF2= 2
##$SINO= 5.538805
##$SIOLD= 16384
##$SREGLST= <1H.CDCl3>
##$SSB= 0
##$STSI= 16384
##$STSR= 0
##$SW_p= 3612.71676300578
##$SYMM= 0
##$S_DEV= 0
##$TDeff= 16384
##$TDoff= 0
##$TI= <>
##$TILT= no
##$TM1= 0
##$TM2= 0
##$TOPLEV= 0
##$USERP1= <user>
##$USERP2= <user>
##$USERP3= <user>
##$USERP4= <user>
##$USERP5= <user>
##$WDW= 1
##$XDIM= 16384
##$YMAX_p= 419466216
##$YMIN_p= -425294
$$ End of Bruker specific parameters
$$ ---------------------------------
##NTUPLES= NMR SPECTRUM
##VAR_NAME=  FREQUENCY,     SPECTRUM/REAL,   SPECTRUM/IMAG
##SYMBOL=    X,             R,               I
##VAR_TYPE=  INDEPENDENT,   DEPENDENT,       DEPENDENT
##VAR_FORM=  AFFN,          ASDF,            ASDF
##VAR_DIM=   16384,         16384,           16384
##UNITS=     HZ,            ARBITRARY UNITS, ARBITRARY UNITS
##FACTOR=    0.220516191357247, 1,           1
##FIRST=     3149.43984156135, 0,            0
##LAST=      -463.276921444426, 0,           0
##MIN=       -463.276921444426, -425294,     0
##MAX=       3149.43984156135, 419466216,    0
$$ Real data points
##PAGE= N=1
##DATA TABLE= (X++(R..R)), XYDATA
$$ [...]
$$ plain form
7047 76594913 69282963 63014293 58057061 54226148 51067608 48366777 45992057 43790089
7039 43790089 41942306 40453405 39199046 38141165 37281057 36394948 35542223 34854334 34356064
7030 34356064 33853700 33393964 32983579 32606953 32251340 31928311 31629544 31460715 31212720
7021 31212720 30840634 30463517 30211077 30047248 29842155 29767007 29630142 29539971 29400223 29261159
7011 29261159 29040197 28843573 28581240 28367432 28209741 28046053 28095219 28080768 28073338 28033083
7001 28033083 28009317 28013560 27807705 27572123 27340634 27164744 27171891 27082204 27029366 27120784 27163101
6990 27163101 27101535 27004852 26812641 26637170 26616257 26589100 26544799 26577456 26536652 26423726 26249536
6979 26249536 26070137 25886269 25808298 25665399 25609995 25522756 25402864 25417176 25484465 25390646
$$ packed form
7047G6594913p311950o268670m957232l830913l158540k700831k374720k201968
7039D3790089j847783j488901j254359j057881q60108q86109q52725o87889m98270
7030C4356064n02364m59736m10385l76626l55613l23029k98767j68829k47995
7021C1212720l72086l77117k52440j63829k05093p5148j36865r0171j39748j39064
7011B9261159k20962j96624k62333k13808j57691j63688M9166j4451p430m0255
7001B8033083k3766M243k05855k35582k31489j75890P147q9687n2838R1418M2317
6990B7163101o1566r6683j92211j75471k0913k7157m4301L2657m0804j12926j74190
6979B6249536j79399j83868p7971j42899n5404q7239j19892J4312O7289r3819
$$ plain form
6969 25390646 25245448 25147339 24891045 24776104 24518111 24216214 24223423 24093644 24080315 24030120
6959 24030120 24009770 23908756 23857912 23729114 23535870 23300302 23284096 23158313 22915644 22820888
6949 22820888 22576180 22519379 22601512 22519126 22394358 22248485 22096950 21953923 21748408 21606747
6939 21606747 21528012 21362355 21173647 21089421 20948994 20764365 20590346 20611423 20482029 20246404
6929 20246404 20118725 20000848 19906548 19879625 19689779 19427482 19258477 19059194 18839965 18765810
6919 18765810 18695390 18651339 18552585 18409845 18283601 18121071 17920634 17733796 17583782 17461585
6909 17461585 17390375 17331067 17264260 17199042 17045214 16834798 16597873 16552480 16409822 16258471
6899 16258471 16204058 16139559 15946142 15869597 15645265 15436068 15431143 15188736 15074345 14988318
$$ packed form
6969B5390646j45198r8109k56294j14941k57993l01897P209j29779j3329n0195
6959B4030120k0350j01014n0844j28798j93244k35568j6206j25783k42669r4756
6949B2820888k44708n6801Q2133q2386j24768j45873j51535j43027k05515j41661
6939B1606747p8735j65657j88708q4226j40427j84629j74019K1077j29394k35625
6929B0246404j27679j17877r4300k6923j89846k62297j69005j99283k19229p4155
6919A8765810p0420m4051r8754j42740j26244j62530k00437j86838j50014j22197
6909A7461585p1210n9308o6807o5218j53828k10416k36925m5393j42658j51351
6899A6258471n4413o4499j93417p6545k24332k09197m925k42407j14391q6027
$$ plain form
6889 14988318 14780500 14747381 14733060 14706724 14646745 14475979 14251096 14098749 13929691 13601699
6879 13601699 13359050 13252743 13200922 13260908 13282305 13230922 13284700 13069488 12919228 12707078
6869 12707078 12610309 12454184 12275608 12296599 12276208 12228300 12138363 12022914 11948348 11950931 11854690
6858 11854690 11754140 11542440 11499222 11403282 11251968 11164675 10987238 10861034 10797663 10624209
6848 10624209 10632374 10497832 10386515 10359748 10283806 10256620 10285707 10251149 10181367 9978743 9704778
6837 9704778 9525718 9343948 9388691 9410729 9398261 9401604 9346426 9181952 9074792 9068815 8940605
6826 8940605 8833948 8897063 8788681 8628772 8485424 8368639 8423132 8451428 8308478 8246602
6816 8246602 8218166 8269434 8126595 7968410 7966745 7823767 7650982 7522307 7447325 7468737 7577041
$$ packed form
6889A4988318k07818l3119j4321k6336n9979j70766k24883j52347j69058l27992
6879A3601699k42649j06307n1821N9986K1397n1383N3778k15212j50260k12150
6869A2707078r6769j56125j78576K0991k0391m7908q9937j15449p4566K583r6241
6858A1854690j00550k11700m3218r5940j51314q7293j77437j26204o3371j73454
6848A0624209Q165j34542j11317k6767p5942k7186K9087l4558o9782k02624k73965
6837I704778j79060j81770M4743K2038j2468L343n5178j64474j07160n977j28210
6826H940605j06657O3115j08382j59909j43348j16785N4493K8296j42950o1876
6816H246602k8436N1268j42839j58185j665j42978j72785j28675p4982K1412J08304
$$ plain form
6805 7577041 7547596 7392242 7397069 7334275 7252584 7125312 7052774 7088068 7063468 7057190 6981702
6794 6981702 6986504 6880251 6800116 6933849 6995618 6924060 6697133 6664453 6468783 6411808 6433789
6783 6433789 6354965 6323119 6372074 6373649 6276364 6344468 6250541 6136686 5994142 5936508 6042760
6772 6042760 6072167 5985415 5982134 5859563 5863762 5757905 5710917 5578474 5466827 5464072 5435169
6761 5435169 5515816 5494867 5435976 5256824 5273933 5133869 5169806 5195501 5155489 5305379 5287209
6750 5287209 5206914 5284068 5111687 4902141 4910882 4899421 4935668 4941620 4976489 4975079 4824536
6739 4824536 4743682 4794174 4793124 4803738 4769794 4742871 4626833 4610685 4613463 4607866 4548675 4541500
6727 4541500 4543618 4531319 4437867 4411444 4412515 4459610 4510521 4464305 4489395 4466395 4330577 4330793
$$ packed form
6805G577041k9445j55354M827o2794q1691j27272p2538L5294k4600o278p5488
6794F981702M802j06253q0135J33733O1769p1558k26927l2680j95670n6975K1981
6783F433789p8824l1846M8955J575r7285O8104r3927j13855j42544n7634J06252
6772F042760K9407q6752l281j22571M199j05857m6988j32443j11647k755k8903
6761E435169Q0647k0949n8891j79152J7109j40064L5937K5695m0012J49890j8170
6750E287209q0295P7154j72381k09546Q741j1461L6247N952L4869j410j50543
6739D824536q0854N0492j050J0614l3944k6923j16038j6148K778n597n9191p175
6727D541500K118j2299r3452k6423J071M7095N0911m6216K5090k3000j35818K16
$$ plain form
6715 4330793 4275065 4186788 4118861 4114640 4140945 4156886 4230596 4248994 4376319 4265291 4206922
6704 4206922 4209609 4100875 4160526 4182822 4067834 3978399 4015059 3856336 3707716 3835756 3944889
6693 3944889 4056464 4104753 4091678 4032789 3922933 3835909 3893815 3814240 3654651 3566556 3584191
6682 3584191 3577249 3573755 3641401 3669246 3660883 3750898 3752032 3630252 3676333 3637816 3566226 3628339
6670 3628339 3506375 3432442 3463978 3523635 3529996 3417517 3372753 3432407 3509747 3536682 3625125
6659 3625125 3740056 3638824 3595940 3535954 3458138 3428193 3408971 3360112 3481396 3596895 3525787
6648 3525787 3477712 3430916 3267542 3277908 3174601 3140284 3122807 3130736 3045806 3087317 3117947
6637 3117947 3083561 3214295 3174352 3277337 3221973 3182392 3052339 2971793 2857675 2893569 2892856
$$ packed form
6715D330793n5728q8277o7927m221K6305J5941P3710J8398J27325j11028n8369
6704D206922K687j08734N9651K2296j14988q9435L6660j58723j48620J28040J09133
6693C944889J11575M8289j3075n8889j09856q7024N7906p9575j59589q8095J7635
6682C584191o942l494O7646K7845q363R0015J134j21780M6081l8517p1590O2113
6670C628339j21964p3933L1536N9657O361j12479m4764N9654P7340K6935Q8443
6659C625125J14931j01232m2884n9986p7816k9945j9222m8859J21284J15499p1108
6648C525787m8075m6796j63374J0366j03307l4317j7477P929q4930M1511L0630
6637C117947l4386J30734l9943J02985n5364l9581j30053q0546j14118L5894p13
$$ plain form
6626 2892856 2865977 2796450 2792967 2882325 2932605 2848447 2838438 2821371 2808562 2862645 2865713 2837926
6614 2837926 2894503 2787292 2741176 2692426 2614519 2619119 2558137 2538263 2621466 2601303 2667801
6603 2667801 2668615 2662140 2643749 2576249 2529093 2478313 2379977 2352412 2377998 2363781 2603215 2605419
6591 2605419 2595348 2584965 2566997 2539189 2431441 2296174 2257744 2212578 2202129 2262420 2218773
6580 2218773 2333479 2516858 2401339 2370265 2355327 2308526 2114987 2020940 1978727 2060473 2300271
6569 2300271 2227692 2249258 2206464 2162925 2106204 2037001 1982527 1931598 1908266 1829317 2035305
6558 2035305 2200765 2125827 2074470 1981024 1992580 2040852 1969136 1950255 1930414 1994957 2077535
6547 2077535 2041965 2008658 2044355 2060835 1935156 1928150 2029133 2055137 2114263 2160986 2116998
$$ packed form
6626B892856k6879o9527l483Q9358N0280q4158j0009j7067j2809N4083L068k7787
6614B837926N6577j07211m6116m8750p7907M600o0982j9874Q3203k0163O6498
6603B667801Q14o475j8391o7500m7156n0780r8336k7565K5586j4217K39434K204
6591B605419j0071j0383j7968k7808j07748j35267l8430m5166j0449O0291m3647
6580B218773J14706J83379j15519l1074j4938m6801j93539r4047m2213Q1746K39798
6569B300271p2579K1566m2794m3539n6721o9203n4474n0929k3332p8949K05988
6558B035305J65460p4938n1357r3446J1556M8272p1716j8881j9841O4543Q2578
6547B077535l5570l3307L5697J6480j25679p006J00983K6004N9126M6723m3988
$$ plain form
6536 2116998 2066798 1996797 1998640 1970498 1830679 1842364 1820292 1839701 1781376 1831784 1838452 1714655
6524 1714655 1779955 1737229 1655102 1642944 1654261 1689323 1663718 1753115 1731296 1658298 1631684
6513 1631684 1626506 1557673 1682247 1776050 1834201 1891726 1821773 1868472 1871944 1661715 1598495
6502 1598495 1719314 1757450 1754193 1689672 1667165 1691341 1632788 1457713 1406070 1427051 1589520
6491 1589520 1741830 1665853 1685478 1683465 1661008 1636275 1585163 1640862 1652448 1620399 1497729
6480 1497729 1509529 1583059 1566543 1508951 1548757 1579174 1615916 1556279 1449319 1443711 1478516
6469 1478516 1471574 1472549 1470913 1469694 1465072 1468722 1496637 1545200 1491970 1405871 1392255 1423263 1429942
6456 1429942 1498695 1481438 1560353 1539738 1409848 1457165 1410992 1374094 1450740 1515701 1471754
$$ packed form
6536B116998n0200p0001J843k8142j39819J1685k2072J9409n8325N0408O668j23797
6524A714655O5300m2726q2127j2158J1317L5062k5605Q9397k1819p2998k6614
6513A631684n178o8833J24574R3803N8151N7525o9953M6699L472k10229o3220
6502A598495J20819L8136l257o4521k2507K4176n8553j75075n1643K0981J62469
6491A589520J52310p5977J9625k013k2457k4733n1112N5699J1586l2049j22670
6480A497729J1800P3530j6516n7592L9806L0417L6742n9637j06960n608L4805
6469A478516o942R75j636j219m622L650K7915M8563n3230q6099j3616L1008O679
6456A429942O8753j7257P8915k0615j29890M7317m6173l6898P6646O4961m3947
$$ plain form
6445 1471754 1603545 1659532 1559973 1606603 1658904 1585315 1436087 1520271 1646672 1524576 1456826
6434 1456826 1406446 1540201 1663970 1768150 1644867 1564111 1732379 1643247 1614466 1654009
6424 1654009 1565425 1487759 1513606 1531449 1529968 1691902 1807505 1729219 1822041 1840325 1714599
6413 1714599 1627934 1643668 1640515 1600471 1745754 1867211 1862973 1938186 2022542 1981736 1950117
6402 1950117 2000131 1885614 1888638 1888783 1840649 1903173 1967486 1985316 1919705 1931281 1954609 1998026
6390 1998026 2021963 2019398 2012911 2103404 2061289 2068091 1988088 1991558 1995125 1913623 1963181 1939948
6378 1939948 1921106 1936102 2039284 2007142 1931805 1881266 1859975 1929137 1939656 1891824 1860937
6367 1860937 1864955 1947661 1973898 2099087 2001436 1904187 1770281 1734004 1895131 1998352 2049427
$$ packed form
6445A471754J31791N5987r9559M6630N2301p3589j49228Q4184J26401j22096o7750
6434A456826n0380J33755J23769J04180j23283q0756J68268q9132k8781L9543
6424A654009q8584p7666K5847J7843j481J61934J15603p8286R2822J8284j25726
6413A714599q6665J5734l153m0044J45283J21457m238P5213Q4356m0806l1619
6402A950117N0014j14517L024J45m8134O2524O4313J7830o5611J1576K3328M3417
6390A998026K3937k565o487R0493m2115O802q0003L470L567q1502M9558k3233
6378A939948j8842J4996J03182l2142p5337n0539k1291O9162J0519m7832l0887
6367A860937M018Q2706K6237J25189r7651r7249j33906l6277J61127J03221N1075
$$ plain form
6356 2049427 2099716 2203745 2258513 2295940 2201955 2208389 2132659 2041890 2084828 2189292 2175770
6345 2175770 2112290 2156341 2226653 2218081 2197614 2299069 2309371 2325626 2230570 2184326 2302289
6334 2302289 2324129 2295189 2251657 2209702 2171716 2221594 2281750 2357576 2485644 2482338 2365681
6323 2365681 2280541 2233198 2249863 2305930 2323982 2377421 2401576 2384546 2459103 2547938 2614559
6312 2614559 2649191 2713685 2750047 2764503 2692548 2818892 2905558 2933325 3065666 3244638 3364278
6301 3364278 3441404 3534411 3826417 3940112 3926992 4028943 4225991 4378964 4518709 4733256
6291 4733256 4960775 5130861 5174373 5362475 5587512 5688713 5887620 6081959 6198920 6320171
6281 6320171 6510476 6731340 7041878 7330369 7536023 7753848 7941360 8228846 8436869 8675453
$$ packed form
6356B049427N0289J04029N4768L7427r3985O434p5730r0769M2938J04464j3522
6345B175770o3480M4051P0312q572k0467J01455J0302J6255r5056m6244J17963
6334B302289K1840k8940m3532m1955l7986M9878O0156P5826J28068l306j16657
6323B365681q5140m7343J6665N6067J8052N3439K4155j7030P4557Q8835O6621
6312B614559L4632O4494L6362J4456p1955J26344Q6666K7767J32341J78972J19640
6301C364278P7126R3007K92006J13695j3120J01951J97048J52973J39745K14547
6291D733256K27519J70086M3512J88102K25037J01201J98907J94339J16961J21251
6281F320171J90305K20864L10538K88491K05654K17825J87512K87486K08023K38584
$$ plain form
6271 8675453 8858010 9201878 9478851 9732800 10107573 10412798 10695148 10857373 11152625 11363831
6261 11363831 11518578 11635550 11670519 11825106 11845912 11941935 11967079 12043740 12257712 12485692
6251 12485692 12650060 12821673 12988588 13149945 13240428 13225619 13232349 13109244 12980737 12896702
6241 12896702 12761528 12554287 12506907 12536165 12497298 12466818 12358057 12399704 12487208 12432372 12374679
6230 12374679 12396607 12443796 12388150 12365382 12463561 12557372 12663495 12731798 12706381 12643053 12543826
6219 12543826 12484334 12365354 12242927 12036180 11813708 11805627 11671403 11688344 11673826 11716263
6209 11716263 11576734 11470266 11377423 11081006 10784933 10611305 10489927 10211447 9893357 9653152
6199 9653152 9312035 9001469 8742667 8483132 8276351 8171193 8054132 7898082 7887027 7783142
$$ packed form
6271H675453J82557L43868K76973K53949L74773L05225K82350J62225K95252K11206
6261A1363831J54747J16972L4969J54587K0806R6023K5144P6661K13972K27980
6251A2485692J64368J71613J66915J61357R0483j4809O730j23105j28507q4035
6241A2896702j35174k07241m7380K9258l8867l0480j08761M1647Q7504n4836n7693
6230A2374679K1928M7189n5646k2768R8179R3811J06123O8303k5417o3328r9227
6219A2543826n9492j18980j22427k06747k22472q081j34224J6941j4518M2437
6209A1716263j39529j06468r2843k96417k96073j73628j21378k78480l18090k40205
6199I653152l41117l10566k58802k59535k06781j05158j17061j56050j1055j03885
$$ plain form
6189 7783142 7628238 7359310 7111408 6821057 6667468 6470474 6282659 6150455 6010254 5797902
6179 5797902 5546752 5391106 5332955 5216187 5062101 4983206 4882234 4835768 4696595 4659550
6169 4659550 4719634 4700403 4659185 4537228 4387285 4237191 4096151 3943664 3961721 3971145 3998081
6158 3998081 4037683 4056614 4108389 4045299 3912523 3854825 3892442 3888221 3848571 3945865 3880936
6147 3880936 3876878 3907215 3906706 3906922 3956973 3901600 3918857 3889154 3710976 3693282 3687416 3634729
6135 3634729 3792313 3802901 3849491 4028955 3967164 3968687 3965281 3888697 3896234 3903486 3791222 3779696
6123 3779696 3766058 3769348 3630414 3538026 3524158 3594489 3602953 3684398 3707899 3818292 3830497
6112 3830497 3840474 3890556 3847959 3827845 3552584 3388889 3268139 3068886 2920502 2886744 2901110
$$ packed form
6189G783142j54904k68928k47902k90351j53589j96994j87815j32204j40201k12352
6179E797902k51150j55646n8151j16768j54086p8895j00972m6466j39173l7045
6169D659550O0084j9231m1218j21957j49943j50094j41040j52487J8057R424K6936
6158C998081L9602J8931N1775o3090j32776n7698L7617m221l9650R7294o4929
6147C880936m058L0337n09K16N0051n5373J7257k9703j78178j7694n866n2687
6135C634729J57584J0588M6590J79464o1791J523l406p6584P537P252j12264j1526
6123C779696j3638L290j38934r2388j3868P0331Q464Q1445K3501J10393J2205
6112C830497R977N0082m2597k0114k75261j63695j20750j99253j48384l3758J4366
$$ plain form
6101 2901110 2913935 2859988 2872872 2922633 2879240 2861544 2841799 2879912 2822810 2790651 2831024
6090 2831024 2736716 2617400 2640428 2770741 2925617 2952413 3059611 3113440 3131777 3171763 3101867
6079 3101867 3154994 3217024 3295637 3490615 3596301 3495922 3522395 3512593 3456132 3441865 3499035
6068 3499035 3535023 3547082 3460706 3474962 3603888 3702371 3732887 3745523 3754002 3855389 3943639
6057 3943639 3946976 4042831 4089607 4200652 4354280 4491832 4522900 4567671 4683764 4713775 4800581
6046 4800581 4861163 4901413 4931208 4995708 4882316 4754339 4759891 4788399 4810495 4902527 4924889
6035 4924889 4903818 5021566 5089955 5176410 5235902 5274454 5153389 5221516 5284611 5249484 5369332
6024 5369332 5481012 5679025 5864711 5929706 5972908 6001908 6214974 6304366 6336634 6567440
$$ packed form
6101B901110J2825n3947J2884M9761m3393j7696j9745L8113n7102l2159M0373
6090B831024r4308j19316K3028J30313J54876K6796J07198N3829J8337L9986o9896
6079C101867N3127O2030P8613J94978J05686j00379K6473r802n6461j4267N7170
6068C499035L5988J2059q6376J4256J28926R8483L0516J2636Q479J01387Q8250
6057C943639L337R5855M6776J11045J53628J37552L1068M4771J16093L0011Q6806
6046D800581O0582M0250K9795O4500j13392j27977N552K8508K2096R2032K2362
6035D924889k1071J17748O8389Q6455N9492L8552j21065O8127O3095l5127J19848
6024E369332J11680J98013J85686O4995M3202K9000K13066Q9392L2268K30806
$$ plain form
6014 6567440 6606897 6743383 6987607 7074661 7191011 7506012 7784185 7833246 7985998 8182318
6004 8182318 8306331 8587903 8902285 9222220 9409231 9590870 9731897 9811998 9887168 9959474
5994 9959474 9965222 9733602 9631431 9462208 9269249 9159912 8929110 8599230 8328346 8053604
5984 8053604 7840555 7507525 7288198 7319277 7184180 7019678 6954210 6839917 6781625 6744570
5974 6744570 6806519 6907234 7016245 7051180 7110813 6995294 6817849 6725897 6627026 6408926
5964 6408926 6187870 6223156 6283432 6134547 6141391 6313849 6336401 6270008 6255694 6166351 6151128
5953 6151128 6155182 6100706 6098603 6175563 6155995 6181782 6235641 6211599 6266268 6356160 6297257 6339623
5941 6339623 6462566 6546489 6508558 6542337 6597071 6566233 6541906 6505723 6631503 6738208 6900947
$$ packed form
6014F567440L9457J36486K44224Q7054J16350L15001K78173M9061J52752J96320
6004H182318J24013K81572L14382L19935J87011J81639J41027Q0101P5170P2306
5994I959474N748k31620j02171j69223j92959j09337k30802l29880k70884k74742
5984H053604k13049l33030k19327L1079j35097j64502o5468j14293n8292l7055
5974F744570O1949J00715J09011L4935N9633j15519j77445r1952r8871k18100
5964F408926k21056L5286O0276j48885O844J72458K2552o6393j4314q9343j5223
5953F151128M054n4476k103P6960j9568K5787N3859k4042N4669Q9892n8903M2366
5941F339623J22943Q3923l7931L3779N4734l0838k4327l6183J25780J06705J62739
$$ plain form
5930 6900947 7047322 7216963 7388620 7554536 7497156 7575420 7597903 7670517 7772153 7728221
5920 7728221 7849259 8024585 8048066 8193941 8287195 8280977 8484562 8696561 8774296 8876119
5910 8876119 8840602 8928934 8863189 8880352 8778334 8763901 8725796 8832021 8993831 9134285 9330813
5899 9330813 9489299 9713256 9877063 9871568 9995960 10152180 10346164 10495998 10533468 10836798
5889 10836798 11166122 11314796 11580193 11824028 12065774 12248096 12623282 12995417 13286851
5880 13286851 13742479 13975937 14222517 14492738 14796306 15113540 15430202 15777051 16199811
5871 16199811 16387993 16482020 16542564 16608574 16622065 16641501 16721422 16866303 17071336 17304732
5861 17304732 17476917 17787574 18142864 18381510 18727941 19059730 19381973 19683288 19937933
$$ packed form
5930F900947J46375J69641J71657J65916n7380P8264K2483P2614J01636m3932
5920G728221J21038J75326K3481J45875R3254o218K03585K11999P7735J01823
5910H876119l5517Q8332o5745J7163j02018j4433l8105J06225J61810J40454J96528
5899I330813J58486K23957J63807n495J24392J56220J93984J49834L7470L03330
5889A0836798L29324J48674K65397K43835K41746J82322L75186L72135K91434
5880A3286851M55628K33458K46580K70221L03568L17234L16662L46849M22760
5871A6199811J88182R4027O0544O6010J3491J9436P9921J44881K05033K33396
5861A7304732J72185L10657L55290K38646L46431L31789L22243L01315K54645
$$ plain form
5852 19937933 20368584 20626444 20797507 20880044 20993454 21036950 21140222 21333819 21599962 21916765
5842 21916765 22401879 22903606 23592686 24602175 25728211 26709397 27896510 29175536 30448019
5833 30448019 31782540 33134398 34386674 35515782 36732491 37830736 38861023 39626482
5825 39626482 40123738 40278075 40271119 40143252 39964579 39980540 40043209 40279354 40537131 40992821
5815 40992821 41459518 41995895 42574457 43205004 43973630 44809000 45650901 46532485 47300932
5806 47300932 47879988 48175370 47995610 47607960 46988332 46076094 44890865 43763909 42751175
5797 42751175 41785317 41065932 40536610 40400274 40369839 40394868 40609255 41040402 41671601 42000978
5787 42000978 41800522 41557742 41394579 41481758 41782411 42179664 42496593 42589417 42477355 42047800
$$ packed form
5852A9937933M30651K57860J71063Q2537J13410M3496J03272J93597K66143L16803
5842B1916765M85114N01727O89080J009489J126036R81186J187113J279026J272483
5833C0448019J334521J351858J252276J129108J216709J098245J030287P65459
5825C9626482M97256J54337o956j27867j78673J5961O2669K36145K57777M55690
5815D0992821M66697N36377N78562O30547P68626Q35370Q41901Q81584P68447
5806D7300932N79056K95382j79760l87650o19628r12238j185229j126956j012734
5797D2751175r65858p19385n29322j36336l0435K5029K14387M31147O31199L29377
5787D2000978k00456k42780j63163Q7179L00653L97253L16929R2824j12062m29555
$$ plain form
5777 42047800 41407787 40511476 39681341 38809646 37948608 37290160 36716040 36308607 36171439
5768 36171439 36175599 36245675 36364606 36819657 37453325 38064012 38445346 38890815 39253958 39642483
5758 39642483 39969694 40122760 40175919 40041947 39724451 39487706 39340417 39206800 39073933 39078049
5748 39078049 39290409 39651852 40078012 40628468 41184919 41822753 42597736 43394049 44090283
5739 44090283 44872314 45664127 46472897 47143566 47772165 48282505 48678513 48987697 49092643
5730 49092643 49182661 49183738 49037384 48864985 48700403 48552680 48477150 48244335 47967770 47825149
5720 47825149 47679936 47624984 47682730 47886605 48136051 48693721 49327334 50114317 51112749 52163485
5710 52163485 53307103 54379218 55443690 56437750 57313630 57866129 58197097 58189102 58113980
$$ packed form
5777D2047800o40013q96311q30135q71695q61038o58448n74120m07433j37168
5768C6171439M160P0076J18931M55051O33668O10687L81334M45469L63143L88525
5758C9642483L27211J53066N3159j33972l17496k36745j47289j33617j32867M116
5748C9078049K12360L61443M26160N50456N56451O37834P74983P96313O96234
5739D4090283P82031P91813Q08770O70669O28599N10340L96008L09184J04946
5730D9092643R0018J077j46354j72399j64582j47723p5530k32815k76565j42621
5720D7825149j45213n4952N7746K03875K49446N57670O33613P86983R98432J050736
5710E2163485J143618J072115J064472R94060Q75880N52499L30968p995p5122
$$ plain form
5701 58113980 58186482 58300205 58415651 58758009 59136349 59695984 60615433 61538369 62540288
5692 62540288 63716379 65009027 66527449 68080943 69669744 71328412 72912995 74436360
5684 74436360 75724875 76622076 77113774 77188749 76844867 75993139 74827889 73166261 71134066
5675 71134066 68868775 66511374 64199477 62011217 59888529 57859797 56050607 54415643
5667 54415643 52834066 51541599 50307410 49187130 48043850 46815372 45624955 44574231
5659 44574231 43624543 42660610 41937845 41141142 40417691 39756208 39029919 38402617 37825826
5650 37825826 37370546 36905598 36551340 36011103 35609903 35115653 34546301 34050784 33505870
5641 33505870 32884377 32185519 31345325 30669595 30091745 29448819 28806540 28042182 27415544
$$ packed form
5701E8113980P2502J13723J15446L42358L78340N59635R19449R22936J001919
5692F2540288J176091J292648J518422J553494J588801J658668J584583J523365
5684G4436360J288515Q97201M91698P4975l43882q51728j165250j661628k032195
5675G1134066k265291k357401k311897k188260k122688k028732j809190j634964
5667E4415643j581577j292467j234189j120280j143280j228478j190417j050724
5659D4574231r49688r63933p22765p96703p23451o61483p26289o27302n76791
5650C7825826m55280m64948l54258n40237m01200m94250n69352m95517n44914
5641C3505870o21493o98858q40194o75730n77850o42926o42279p64358o26638
$$ plain form
5632 27415544 26722973 26167920 25548512 24921067 24437144 23916435 23346659 22825707 22369181
5623 22369181 22084423 21750397 21370232 20873621 20360202 19776664 19200239 18726964 18361481
5614 18361481 18111423 17849201 17420983 17175831 16863943 16406511 15948488 15674757 15206686
5605 15206686 14891667 14657198 14294210 13978947 13760077 13739827 13605341 13479823 13225488 12972401
5595 12972401 12696638 12440310 12249319 11973026 11847555 11780181 11608250 11395879 11166647 11127104
5585 11127104 10917704 10751828 10638728 10483501 10421339 10305677 10187483 10216386 10188157 10053629
5575 10053629 9993457 9985408 10051539 10110540 10083598 10034041 9910269 9725808 9680538 9607313 9661273
5564 9661273 9655536 9750654 9889001 9824228 9807141 9883947 9960656 10004467 10149413 10171542 10180462
$$ packed form
5632B7415544o92571n55053o19408o27445m83923n20709n69776n20952m56526
5623B2369181k84758l34026l80165m96611n13419n83538n76425m73275l65483
5614A8361481k50058k62222m28218k45152l11888m57432m58023k73731m68071
5605A5206686l15019k34469l62988l15263k18870k0250j34486j25518k54335k53087
5595A2972401k75763k56328j90991k76293j25471o7374j71931k12371k29232l9543
5585A1127104k09400j65876j13100j55227o2162j15662j18194K8903k8229j34528
5575A0053629o0172q049O6131N9001k6942m9557j23772j84461m5270p3225N3960
5564I661273n737R5118J38347o4773j7087P6806P6709M3811J44946K2129Q920
$$ plain form
5553 10180462 10323478 10491854 10566312 10719435 10793041 10920289 11100557 11338442 11616160 11945642
5543 11945642 12263342 12490394 12717186 13083565 13662807 14337886 14887096 15312458 15775723
5534 15775723 16330978 17136952 17494167 16839020 15474091 14141934 13173840 12521581 12051249
5525 12051249 11830291 11739813 11682577 11448410 11149698 10824026 10507952 10448558 10376730 10481801
5515 10481801 10594384 10603292 10583318 10601239 10551940 10601661 10600131 10644950 10880806 10868330 10725186
5504 10725186 10524876 10308592 10264461 10429706 10612219 10687368 10905780 11145483 11205241 11154722
5494 11154722 11104056 11134304 11273109 11325346 11471665 11708336 12197317 12435209 11854529 10863980
5484 10863980 9982129 9325829 8816132 8667166 8474782 8398977 8264295 8106438 7909338 7775702
$$ packed form
5553A0180462J43016J68376P4458J53123P3606J27248J80268K37885K77718L29482
5543A1945642L17700K27052K26792L66379N79242O75079N49210M25362M63265
5534A5775723N55255Q05974L57215o55147j364929j332157r68094o52259m70332
5525A2051249k20958r0478n7236k34167k98712l25672l16074n9394p1828J05071
5515A0481801J12583Q908j9974J7921m9299M9721j530M4819K35856j2476j43144
5504A0725186k00310k16284m4131J65245J82513P5149K18412K39703N9758n0519
5494A1154722n0666L0248J38805N2237J46319K36671M88981K37892n80680r90549
5484A0863980q81851o56300n09697j48966j92384p5805j34682j57857j97100j33636
$$ plain form
5474 7775702 7735552 7885308 7784074 7549853 7524205 7629645 7695190 7754423 7858158 7867436 7854819
5463 7854819 7844674 7780892 7693260 7718750 7838287 7863720 7840918 7831407 7672830 7518888 7441479
5452 7441479 7462490 7472315 7525283 7679038 7893224 8197370 8424210 8491660 8670979 8944650
5442 8944650 9254822 9096232 8586962 8155848 7833301 7768512 7738857 7660724 7680288 7743509
5432 7743509 7781087 7879549 7938568 8043001 8210531 8458369 8690012 8562459 8106255 7548369
5422 7548369 7102148 6717958 6535288 6333264 6184664 6055850 6013831 5947065 5709537 5650311
5412 5650311 5776282 5668972 5625279 5590597 5647625 5616589 5775919 5913622 6056292 6294815
5402 6294815 6459915 6553886 6717492 6865705 6890894 7053270 7384186 7851128 8130541 7973419
$$ packed form
5474G775702m0150J49756j01234k34221k5648J05440O5545N9233J03735R278j2617
5463G854819j0145o3782q7632K5490J19537K5433k2802r511j58577j53942p7409
5452G441479K1011R825N2968J53755K14186L04146K26840O7450J79319K73671
5442H944650L10172j58590n09270m31114l22547o4789k9655p8133J9564O3221
5432G743509L7578R8462N9019J04433J67530K47838K31643j27553m56204n57886
5422G548369m46221l84190j82670k02024j48600j28814m2019o6766k37528n9226
5412E650311J25971j07310m3693l4682N7028l1036J59330J37703J42670K38523
5402F294815J65100R3971J63606J48213K5189J62376L30916M66942K79413j57122
$$ plain form
5392 7973419 7377161 6914366 6339745 5977046 5914501 5953100 5774717 5740149 5697926 5632427
5382 5632427 5616702 5687857 5694192 5737653 5777294 5848491 5874030 5933359 6012788 5985282 5983336 6116932
5370 6116932 6265060 6455742 6584713 6708214 6826638 6869300 6852974 7000321 6958727 6856185
5360 6856185 6621242 6295236 6042687 5823857 5705863 5620444 5825253 5886743 6021783 5933931
5350 5933931 6000068 5986434 5889844 5873987 5864217 5812685 5902175 5849264 5800904 5757026 5583506
5339 5583506 5440617 5277135 5068118 4943973 4954476 4857277 4877070 4792813 4719544 4733611 4593798
5328 4593798 4451780 4302133 4211163 4179378 4168656 4183265 4211475 4262443 4385105 4520829 4635011
5317 4635011 4696244 4574847 4405210 4450459 4412158 4370525 4293870 4305983 4322249 4341330 4239862
$$ packed form
5392G973419n96258m62795n74621l62699o2545L8599j78383l4568m2223o5499
5382E632427j5725P1155O335M3461L9641P1197K5539N9329P9429k7506j946J33596
5370F116932J48128J90682J28971J23501J18424M2662j6326J47347m1594j02542
5360F856185k34943l26006k52549k18830j17994q5419K04809O1490J35040q7852
5350E933931O6137j3634r6590j5857r770n1532Q9490n2911m8360m3878j73520
5339E583506j42889j63482k09017j24145J0503r7199J9793q4257p3269J4067j39813
5328D593798j42018j49647r0970l1785j0722J4609K8210N0968J22662J35724J14182
5317D635011O1233j21397j69637M5249l8301m1633p6655J2113J6266J9081j01468
$$ plain form
5306 4239862 4245717 4285882 4300100 4378690 4436127 4528985 4673271 4835480 4905695 5006754 5006948
5295 5006948 5023561 5068735 5121040 5183103 5162935 5218849 5260841 5229593 5183939 5167959 5205436
5284 5205436 5232809 5257553 5236129 5195610 5176431 5200579 5061866 5013983 4891683 4828102 4789048
5273 4789048 4716109 4656847 4657706 4680919 4642504 4568539 4475677 4356782 4301571 4338529 4366793 4313035
5261 4313035 4253845 4298637 4358528 4378173 4364057 4358100 4306908 4218325 4049902 3816369 3707805
5250 3707805 3507476 3350231 3262161 3262602 3310475 3259764 3200738 3257288 3183608 3186791 3068120
5239 3068120 2967733 3081060 3124486 3124825 3223153 3293570 3323822 3416358 3413420 3500569 3517376 3422243
5227 3422243 3672706 3800870 4055759 4285194 4447515 4624652 4759604 4853394 4756907 4462801
$$ packed form
5306D239862N855M0165J4218P8590N7437R2858J44286J62209P0215J01059J94
5295E006948J6613M5174N2305O2063k0168N5914M1992l1248m5654j5980L7477
5284E205436K7373K4744k1424m0519j9179K4148j38713m7883j22300o3581l9054
5273D789048p2939n9262Q59K3213l8415p3965r2862j18895n5211L6958K8264n3758
5261D313035n9190M4792N9891J9645j4116n957n1192q8583j68423k33533j08564
5250C707805k00329j57245q8070M41M7873n0711n9026N6550p3680L183j18671
5239C068120j00387J13327M3426L39R8328P0417L0252R2536k938Q7149J6807r5133
5227C422243K50463J28164K54889K29435J62321J77137J34952R3790r6487k94106
$$ plain form
5217 4462801 4223057 4027678 3809614 3781457 3873034 3942003 3769289 3538545 3411226 3300621
5207 3300621 3198415 3148239 3045679 3008716 3017726 3043846 2892126 2855314 2812052 2688182 2612387
5196 2612387 2654197 2606614 2685939 2677854 2615866 2619889 2623826 2604912 2662322 2665038 2623316 2615539
5184 2615539 2625210 2642470 2747146 2821070 2806624 2799366 2778999 2758524 2708603 2705951 2627404 2599339
5172 2599339 2554640 2484998 2481845 2470335 2629761 2623556 2596432 2554979 2484934 2453393 2408792 2424959
5160 2424959 2427280 2348326 2393594 2407042 2324005 2339896 2325488 2376661 2434346 2433017 2451196 2473282
5148 2473282 2431937 2393965 2452885 2514391 2537257 2569086 2734099 2793705 2720333 2684825 2655806
5137 2655806 2551976 2515969 2356545 2357780 2349781 2375365 2514027 2633024 2717691 2682665 2675548
$$ packed form
5217D462801k39744j95379k18064k8157R1577O8969j72714k30744j27319j10605
5207C300621j02206n0176j02560l6963R010K6120j51720l6812m3262j23870p5795
5196B612387M1810m7583P9325q085o1988M023L937j8914N7410K716m1722p777
5184B615539R671J7260J04676P3924j4446p258k0367k0475m9921k652p8547k8065
5172B599339m4699o9642l153j1510J59426o205k7124m1453p0045l1541m4601J6167
5160B424959K321p8954M5268J3448q3037J5891j4408N1173N7685j329J8179K2086
5148B473282m1345l7972N8920O1506K2866L1829J65013N9606p3372l5508k9019
5137B655806j03830l6007j59424J235p999K5584J38662J18997Q4667l5026p117
$$ plain form
5126 2675548 2582489 2541143 2534203 2604065 2632313 2674045 2827710 2903843 2846340 2967704 3031204
5115 3031204 3067912 3010120 3017532 3015274 3014569 2965154 2979407 3062496 3070888 3203113 3301439 3349514
5103 3349514 3384056 3481081 3700758 3853293 3953035 3909658 3875169 3828363 3723684 3626301 3612439
5092 3612439 3500312 3415217 3431137 3466817 3607914 3683659 3693353 3765825 3880470 4099112 4138544
5081 4138544 4289353 4287014 4345053 4402608 4447076 4619920 4727323 4875387 4923036 4908084 4904718
5070 4904718 4782304 4678836 4590380 4468594 4306903 4365249 4415949 4350247 4367625 4311822 4440121
5059 4440121 4539951 4709764 4811719 4919373 5038702 5350104 5527958 5690691 5835874 5884021
5049 5884021 5737392 5651158 5511751 5351088 5158091 5045489 5022090 4853205 4841642 4850574
$$ packed form
5126B675548r3059m1346o940O9862K8248M1732J53665P6133n7503J21364O3500
5115C031204L6708n7792P412k258p05m9415J4253Q3089Q392J32225R8326M8075
5103C349514L4542R7025K19677J52535R9742m3377l4489m6806j04679r7383j3862
5092C612439j12127q5095J5920L5680J41097P5745R694P2472J14645K18642L9432
5081D138544J50809k339N8039N7555M4468J72844J07403J48064M7649j4952l366
5070D904718j22414j03468q8456j21786j61691N8346N0700o5702J7378n5803J28299
5059D440121R9830J69813J01955J07654J19329L11402J77854J62733J45183M8147
5049E884021j46629q6234j39407j60663j92997j12602k3399j68885j1563Q932
$$ plain form
5039 4850574 4866145 4828772 4854745 4817879 4878103 5027940 5018866 5059328 4997387 4974201 4945165
5028 4945165 5045451 5271040 5430744 5559891 5643579 5595340 5580011 5403566 5252170 5123800
5018 5123800 5008159 5027433 5160784 5191946 5228160 5373482 5448358 5455120 5399865 5506514 5618666
5007 5618666 5688182 5788238 5902448 6124859 6306467 6236177 6237151 6325780 6480224 6473268 6477148
4996 6477148 6632473 6813834 6845069 6898550 7026505 7105120 7168644 7285634 7315360 7301780 7291628
4985 7291628 7287151 7472966 7731632 7824640 8146410 8360552 8447808 8413634 8413445 8442455 8458878
4974 8458878 8581715 8685007 8892674 9165487 9282995 9469111 9677695 9897714 10093270 10347874
4964 10347874 10586913 10813644 11071237 11322919 11752031 12182186 12640695 13190420 13741178
$$ packed form
5039D850574J5571l7373K5973l6866O0224J49837r074M0462o1941k3186k9036
5028D945165J00286K25589J59704J29147Q3688m8239j5329j76445j51396j28370
5018E123800j15641J9274J33351L1162L6214J45322P4876O762n5255J06649J12152
5007E618666O9516J00056J14210K22411J81608p0290R74Q8629J54444o956L880
4996F477148J55325J81361L1235N3481J27955P8615O3524J16990K9726j3580j0152
4985G291628m477J85815K58666R3008L21770K14142Q7256l4174j89K9010J6423
4974H458878J22837J03292K07667K72813J17508J86116K08584K20019J95556K54604
4964A0347874K39039K26731K57593K51682M29112M30155M58509N49725N50758
$$ plain form
4955 13741178 14336195 14782720 15271217 15752507 16226445 16906572 17547690 18231989 18948956
4946 18948956 19537485 20138452 20659842 20917852 21315323 21602844 21956467 22154601 22363147
4937 22363147 22449544 22547872 22660987 22711512 22716015 22629945 22531489 22321045 22042183 21637353 21142179
4926 21142179 20770927 20124127 19596319 18979335 18421942 17968727 17653936 17533588 17221605
4917 17221605 16951784 16751219 16715776 16517671 16380266 16286401 16230131 16184616 16109323 16073895
4907 16073895 16296875 16583485 16949330 17284310 17666842 17930086 18186656 18761832 19376725
4898 19376725 20042475 20566637 21194657 22148119 23005581 23653298 24408719 25133866 25773707
4889 25773707 26282328 26704527 27044949 27248355 27324142 27606817 27901729 28051217 28226059 28433164
$$ packed form
4955A3741178N95017M46525M88497M81290M73938O80127O41118O84299P16967
4946A8948956N88529O00967N21390K58010L97471K87521L53623J98134K08546
4937B2363147Q6397R8328J13115N0525M503q6070r8456k10444k78862m04830m95174
4926B1142179l71252o46800n27808o16984n57393m53215l14791j20348l11983
4917A7221605k69821k00565l5443j98105j37405r3865n6270m5515p5293l5428
4907A6073895K22980K86610L65845L34980L82532K63244K56570N75176O14893
4898A9376725O65750N24162O28020R53462Q57462O47717P55421P25147O39841
4889B5773707N08621M22199L40422K03406P5787K82675K94912J49488J74842K07105
$$ plain form
4879 28433164 28465819 28638821 28691370 28566640 28486804 28208702 27986378 27494199 26880205 26434434
4869 26434434 25845226 25176543 24571507 24003993 23289032 22639697 21939531 21384760 20713546
4860 20713546 20047155 19534088 18819009 18276812 17580993 16921259 16290357 15722652 15256775
4851 15256775 14784391 14326095 13802568 13586571 13470022 13245701 13001050 12700524 12492060
4842 12492060 12247294 12032886 11931856 11878028 11776996 11710143 11524066 11465580 11406403 11473473
4832 11473473 11494773 11489800 11554832 11545573 11554192 11617035 11615826 11795999 11847874 11874053 11827682 11615399
4820 11615399 11582869 11688532 11667402 11667216 11729411 11836304 12057535 12177329 12229314 12188278 12239800
4809 12239800 12215129 12268454 12443874 12619068 12897133 12967105 13180110 13397664 13637555 14079067
$$ packed form
4879B8433164L2655J73002N2549j24730p9836k78102k22324m92179o13994m45771
4869B6434434n89208o68683o05036n67514p14961o49335p00166n54771o71214
4860B0713546o66391n13067p15079n42197o95819o59734o30902n67705m65877
4851A5256775m72384m58296n23527k15997j16549k24321k44651l00526k08464
4842A2492060k44766k14408j01030n3828j01032o6853j86077n8486n9177O7070
4832A1473473K1300m973O5032r259Q619O2843j209J80173N1875K6179m6371k12283
4820A1615399l2530J05663k1130j86O2195J06893K21231J19794N1985m1036N1522
4809A2239800k4671N3325J75420J75194K78065O9972K13005K17554K39891M41512
$$ plain form
4799 14079067 14445394 14837744 15316709 15716771 16088657 16454648 16614490 16787832 16990318
4790 16990318 17117666 17194451 17119573 16921214 16622300 16180649 15692241 15329240 14949217 14688915
4780 14688915 14408958 14152978 13926687 13697829 13449903 13145271 13009785 12849277 12665860
4771 12665860 12554956 12508705 12327857 12335398 12492236 12637968 12809221 12958872 13000564 13198775
4761 13198775 13358655 13500335 13700672 14018591 14432221 14993961 15522213 16071701 16527682
4752 16527682 16903315 17311475 17600465 17936739 18333358 18704985 19042945 19311470 19485174
4743 19485174 19476143 19406332 19077898 18708194 18443290 18170497 17906203 17668347 17406424 17181443
4733 17181443 16766719 16364684 15895598 15383570 14865171 14444512 14071657 13625554 13249240
$$ packed form
4799A4079067L66327L92350M78965M00062L71886L65991J59842J73342K02486
4790A6990318J27348P6785p4878j98359k98914m41651m88408l63001l80023k60302
4780A4688915k79957k55980k26291k28858k47926l04632j35486j60508j83417
4771A2665860j10904m6251j80848P541J56838J45732J71253J49651M1692J98211
4761A3198775J59880J41680K00337L17919M13630N61740N28252N49488M55981
4752A6527682L75633M08160K88990L36274L96619L71627L37960K68525J73704
4743A9485174r031o9811l28434l69704k64904k72793k64294k37856k61923k24981
4733A7181443m14724m02035m69086n12028n18399m20659l72855m46103l76314
$$ plain form
4724 13249240 12968333 12606550 12344894 12105103 11837697 11777375 11682125 11498043 11355387 11209828
4714 11209828 11080012 11097101 11097528 10983515 10990096 11009077 11052100 11142353 11224791 11360464 11520024
4703 11520024 11702219 11836384 12005757 12191679 12453342 12683526 12947332 13261662 13637799
4694 13637799 13787890 13926247 14071071 14179888 14171880 14175400 14254448 14165016 14000408 13945990 13859351
4683 13859351 13788363 13666383 13747011 13737701 13850849 13886021 14062525 14334654 14514016 14565177
4673 14565177 14720193 14816078 14801272 14782602 14869949 14875499 14761256 14682947 14724744 14694298 14669293
4662 14669293 14652712 14628099 14718290 14648182 14446381 14121576 13803487 13424477 13000958 12643458
4652 12643458 12351355 12013154 11832740 11584096 11349145 11154744 10942074 10847434 10680959 10549654
$$ packed form
4724A3249240k80907l61783k61656k39791k67406o0322r5250j84082j42656j45559
4714A1209828j29816J7089M27j14013O581J8981M3023R0253Q2438J35673J59560
4703A1520024J82195J34165J69373J85922K61663K30184K63806L14330L76137
4694A3637799J50091J38357J44824J08817q008L520P9048q9432j64608n4418q6639
4683A3859351p0988j21980Q0628r310J13148L5172J76504K72129J79362N1161
4673A4565177J55016R5885j4806j8670Q7347N550j14243p8309M1797l0446k5005
4662A4669293j6581k4613R0191p0108k01801l24805l18089l79010m23519l57500
4652A2643458k92103l38201j80414k48644k34951j94401k12670r4640j66475j31305
$$ plain form
4642 10549654 10446728 10324363 10339266 10246062 10282219 10254418 10414105 10586273 10710970 10794506
4632 10794506 10907968 11077174 11201320 11288554 11498675 11614295 11803904 11983306 12188600 12526614
4622 12526614 12839822 13066606 13394149 13690994 14064829 14464587 14825848 15378311 15871220
4613 15871220 16406360 16922004 17447277 17942056 18320495 18774566 19088023 19424648 19704823
4604 19704823 19822072 19829835 20034144 20197308 20231530 20052690 19775064 19478171 19229042 19036850
4594 19036850 18719805 18411968 18038330 17686242 17174483 16760351 16194243 15687940 15137347
4585 15137347 14678107 14273724 13879592 13375281 12895998 12607711 12235199 11812633 11658406
4576 11658406 11545920 11255548 11032854 10911721 10803308 10741323 10528605 10335209 10256366 10042885
$$ packed form
4642A0549654j02926j22365J4903r3204L6157k7801J59687J72168J24697Q3536
4632A0794506J13462J69206J24146Q7234K10121J15620J89609J79402K05294L38014
4622A2526614L13208K26784L27543K96845L73835L99758L61261N52463M92909
4613A5871220N35140N15644N25273M94779L78439M54071L13457L36625K80175
4604A9704823J17249P763K04309J63164L4222j78840k77626k96893k49129j92192
4594A9036850l17045l07837l73638l52088n11759m14132n66108n06303n50593
4585A5137347m59240m04383l94132n04311m79283k88287l72512m22566j54227
4576A1658406j12486k90372k22694j21133j08413o1985k12718j93396p8843k13481
$$ plain form
4566 10042885 10051955 10123295 10097140 10106159 10083312 10100441 10027780 10003252 9984312 9952293 9932963 10058857
4554 10058857 10144013 10154987 10197093 10371856 10529208 10648081 10719882 10754125 10786947 10803597 10847669
4543 10847669 11008349 11066114 11194176 11464491 11579975 11616824 11656369 11653582 11725068 11921406
4533 11921406 12268820 12461853 12588246 12812143 13007873 13129843 13349648 13488332 13537475 13776319
4523 13776319 14104642 14450451 14741030 15018069 15082010 15340009 15459398 15527128 15606999 15867315
4513 15867315 15995665 16093353 16230299 16317412 16274190 16109138 16050326 16005626 15761539 15524211
4503 15524211 15372909 15094534 14889968 14700220 14453381 14245321 13990494 13839406 13758685 13723277
4493 13723277 13665844 13519232 13509517 13426142 13308297 13384219 13526186 13473543 13462966 13568133 13612176
$$ packed form
4566A0042885R070P1340k6155R019k2847J7129p2661k4528j8940l2019j9330J25894
4554A0058857Q5156J0974M2106J74763J57352J18873P1801L4243L2822J6650M4072
4543A0847669J60680N7765J28062K70315J15484L6849L9545k787P1486J96338
4533A1921406L47414J93033J26393K23897J95730J21970K19805J38684M9143K38844
4523A3776319L28323L45809K90579K77039O3941K57999J19389O7730P9871K60316
4513A5867315J28350R7688J36946Q7113m3222j65052n8812m4700k44087k37328
4503A5524211j51302k78375k04566j89748k46839k08060k54827j51088q0721l5408
4493A3723277n7433j46612r715q3375j17845P5922J41967n2643j0577J05167M4043
$$ plain form
4482 13612176 13644816 13682515 13817838 14001398 14328343 14612448 14927027 15176754 15432487 15655794
4472 15655794 15772609 16036336 16281322 16363437 16332611 16394022 16434850 16367226 16347830 16144878
4462 16144878 15950128 15843347 15698618 15441376 15207974 15073098 14972720 14867743 14693559
4453 14693559 14661158 14697554 14628788 14678056 14800444 14876252 14912905 14912182 14963187 15019646 14999519
4442 14999519 14907256 14920943 14854823 14866759 14904687 14902790 14863559 14812098 14816109 14910855 14927354 14903880
4430 14903880 14935274 14819230 14693060 14498432 14383262 14252487 14247532 14241659 14235725 14222605 14104313
4419 14104313 14149364 14189521 14369860 14534743 14768435 15006301 15363166 15484561 15806701 16135532
4409 16135532 16396515 16586780 16829847 17076780 17374905 17556300 17650047 17870011 17730243 17708314
$$ packed form
4482A3612176L2640L7699J35323J83560L26945K84105L14579K49727K55733K23307
4472A5655794J16815K63727K44986Q2115l0826O1411M0828o7624j9396k02952
4462A6144878j94750j06781j44729k57242k33402j34876j00378j04977j74184
4453A4693559l2401L6396o8766M9268J22388P5808L6653p23N1005N6459k0127
4442A4999519r2263J3687o6120J1936L7928j897l9231n1461M011R4746J6499k3474
4430A4903880L1394j16044j26170j94628j15170j30775m955n873n934j3120j18292
4419A4104313M5051M0157J80339J64883K33692K37866L56865J21395L22140L28831
4409A6135532K60983J90265K43067K46933K98125J81395R3747K19964j39768k1929
$$ plain form
4399 17708314 17656259 17463064 17371031 17224568 17071745 16863063 16700035 16493722 16109841 15919293
4389 15919293 15596396 15496878 15448216 15305441 15120599 15065300 15042429 14988109 14988349 14888879 14852399
4378 14852399 14794235 14815465 14940911 15067407 15228039 15357403 15458932 15523636 15516332 15575888
4368 15575888 15647192 15633755 15713829 15864215 15999015 16224741 16349332 16379175 16160488 16039514
4358 16039514 15796102 15598813 15419414 15085989 14825465 14667009 14405441 14128971 13931134
4349 13931134 13756794 13669095 13602561 13457708 13224883 13181846 13093337 13018730 13017191 12917447 12989182
4338 12989182 12971966 12957451 13019138 12933984 13034722 13080902 13006528 12934723 12885598 12827129 12817070
4327 12817070 12775428 12778765 12715031 12636614 12519178 12350204 12303087 12262128 12119476 12046595 12008380
$$ packed form
4399A7708314n2055j93195r2033j46463j52823k08682j63028k06313l83881j90548
4389A5919293l22897r9518m8662j42775j84842n5299k2871n4320K40r9470l6480
4378A4852399n8164K1230J25446J26496J60632J29364J01529O4704p304N9556
4368A5575888P1304j3437Q0074J50386J34800K25726J24591K9843k18687j20974
4358A6039514k43412j97289j79399l33425k60524j58456k61568k76470j97837
4349A3931134j74340q7699o6534j44853k32825m3037q8509p4607j539r9744P1735
4338A2989182j7216j4515O1687q5154J00738M6180p4374p1805m9125n8469j0059
4327A2817070m1642L337o3734p8417j17436j68974m7117m0959j42652p2881l8215
$$ plain form
4316 12008380 12091299 12166014 12147675 12005474 11887280 11891821 11838736 11821194 11842012 11914640 12040800
4305 12040800 12117231 12215125 12329045 12382064 12311880 12194474 12019202 12041651 11962530 11896266 11880491
4294 11880491 11779329 11725044 11689911 11536147 11337791 11150021 11071755 10753072 10610241 10419685
4284 10419685 10243664 10166019 10112589 10066223 9891034 9825022 9728467 9686886 9627361 9596141 9517901
4273 9517901 9546339 9455873 9332948 9433019 9460672 9440412 9440576 9298648 9275733 9209200 9147939
4262 9147939 9123257 9139565 9094252 9297641 9403597 9430670 9578443 9698626 9724242 9730680 9881001
4251 9881001 9961421 9958393 10009186 10000009 10098825 10232533 10438831 10571577 10629192 10673121 10762723
4240 10762723 10917455 10991424 11097082 11190066 11157715 11210719 11312419 11468693 11792422 12099544
$$ packed form
4316A2008380Q2919P4715j8339j42201j18194M541n3085j7542K0818P2628J26160
4305A2040800P6431R7894J13920N3019p0184j17406j75272K2449p9121o6264j5775
4294A1880491j01162n4285l5133j53764j98356j87770p8266l18683j42831j90556
4284A0419685j76021p7645n3430m6366j75189o6012r6555m1581n9525l1220p8240
4273I517901K8438r0466j22925J00071K7653k0260J64j41928k2915o6533o1261
4262I147939k4682J6308m5313K03389J05956K7073J47773J20183K5616O438J50321
4251I881001Q0420l028N0793r177R8816J33708K06298J32746N7615M3929Q9602
4240A0762723J54732P3969J05658R2984l2351N3004J01700J56274L23729L07122
$$ plain form
4230 12099544 12282858 12455326 12605243 12831819 13206243 13653812 13919901 14278784 14731386
4221 14731386 15043749 15370133 15811234 16142774 16436062 16946356 17426108 17737860 18069270
4212 18069270 18425693 18730565 19188684 19653869 20098786 20685348 21257315 21657760 22125195
4203 22125195 22539520 23077507 23520747 24019681 24653188 25326089 25968696 26641486 27126282
4194 27126282 27770450 28397243 29131537 29766836 30335752 31155407 31986448 32827659 33641275
4185 33641275 34695864 35816430 36894704 38227040 39647959 40870786 42166100 43500815
4177 43500815 44911820 46417594 48183994 50139836 52228738 54400265 56756833 59408845
4169 59408845 62301521 65538208 69142320 73194895 77741692 82736011 88363590 94663187
$$ packed form
4230A2099544J83314J72468J49917K26576L74424M47569K66089L58883M52602
4221A4731386L12363L26384M41101L31540K93288N10294M79752L11752L31410
4212A8069270L56423L04872M58119M65185M44917N86562N71967M00445M67435
4203B2125195M14325N37987M43240M98934O33507O72901O42607O72790M84796
4194B7126282O44168O26793P34294O35299N68916Q19655Q31041Q41211Q13616
4185C3641275J054589J120566J078274J332336J420919J222827J295314J334715
4177D3500815J411005J505774J766400J955842K088902K171527K356568K652012
4169E9408845K892676L236687L604112M052575M546797M994319N627579O299597
$$ plain form
4161 94663187 101758475 109466178 118103838 127963892 139111959 151997691 166723593 183635871
4153 183635871 202677547 224301810 248527021 275407622 304099631 333022356 360168127
4146 360168127 383905728 403230380 416518303 419466216 406690739 378145632 339875720
4139 339875720 300847302 265967782 236898378 213137019 193860723 177844892 164148967
4132 164148967 152375857 142201637 133929003 127125827 121291015 116282895 111773300 107523100
4124 107523100 103537590 99580612 95430907 91287716 87245578 83691056 80484989 77682453
4116 77682453 75095104 72780775 70774921 68766154 66753436 64570917 62248039 60066810
4108 60066810 58012864 56172151 54336931 52639083 51097635 49788641 48562792 47532620
$$ packed form
4161I4663187P095288P707703Q637660R860054J1148067J2885732J4725902J6912278
4153A83635871J9041676K1624263K4225211K6880601K8692009K8922725K7145771
4146C60168127K3737601J9324652J3287923K947913j2775477k8545107l8269912
4139C39875720l9028418l4879520k9069404k3761359j9276296j6015831j3695925
4132A64148967j1773110j0174220q272634o803176n834812n008120m509595m250200
4124A07523100l985510l956978m149705m143191m042138l554522l206067k802536
4116G7682453k587349k314329k005854k008767k012718k182519k322878k181229
4108F0066810k053946j840713j835220j697848j541448j308994j225849j030172
$$ plain form
4100 47532620 46847452 46149530 45441375 44726570 44274584 43725724 43187185 42165232 40906614
4091 40906614 39499855 38198422 37046591 36050677 35098247 34256518 33550520 33041154 32632365
4082 32632365 32244909 31991922 31800984 31429915 31213115 30987619 30802282 30522278 30346565
4073 30346565 30277675 30165730 30164281 30118314 30170878 30363117 30427409 30559147 30888343 31203732
4063 31203732 31404245 31902591 32452719 32853922 33367568 34060366 34893203 35704503 36345589
4054 36345589 37074130 37704747 38358360 39243913 39900356 40296985 40185305 39909078 39722224
4045 39722224 39704432 39751231 39885577 40201437 40787114 41423620 42229844 43138020 43839445 44701842
4035 44701842 45653081 46577959 47475875 48425157 49442191 50368878 51528519 52762807 54090719
$$ packed form
4100D7532620o85168o97922p08155p14805m51986n48860n38539j021953j258618
4091D0906614j406759j301433j151831r95914r52430q41729p05998n09366m08789
4082C2632365l87456k52987j90938l71069k16800k25496j85337k80004j75713
4073C0346565o8890j11945j449m5967N2564J92239O4292J31738L29196L15389
4063C1203732K00513M98346N50128M01203N13646O92798Q32837Q11300O41086
4054C6345589P28541O30617O53613Q85553O56443L96629j11680k76227j86854
4045C9722224j7792M6799J34346L15860N85677O36506Q06224R08176P01425Q62397
4035D4701842R51239R24878Q97916R49282J017034R26687J159641J234288J327912
$$ plain form
4026 54090719 55371719 56639545 57902456 59244572 60564534 61965137 63392029 64884421
4018 64884421 66275437 67628699 69061809 70398797 71654703 72865243 74130089 75324873
4010 75324873 76406797 77572175 78668167 79808869 80836146 81695084 82404025 83083657 83684153
4001 83684153 84154772 84591976 85040303 85358847 85483690 85535755 85560328 85539322 85325739 85156765
3991 85156765 84956675 84621369 84398174 84159069 83725422 83262870 82754375 82104518 81626155
3982 81626155 81119460 80548067 80042782 79517530 79095788 78688537 78353036 78012424 77575134
3973 77575134 77286788 77093726 76871357 76547981 76376191 76355445 76252819 76185941 76348399 76555611
3963 76555611 76745944 76849352 77044623 77277553 77478619 77743245 77855077 78181576 78507239
$$ packed form
4026E4090719J281000J267826J262911J342116J319962J400603J426892J492392
4018F4884421J391016J353262J433110J336988J255906J210540J264846J194784
4010G5324873J081924J165378J095992J140702J027277Q58938P08941O79632O00496
4001H3684153M70619M37204M48327L18544J24843N2065K4573k1006k13583j68974
3991H5156765k00090l35306k23195k39105m33647m62552n08495o49857m78363
3982H1626155n06695n71393n05285n25252m21742m07251l35501l40612m37290
3973G7575134k88346j93062k22369l23376j71790k0746j02626o6878J62458K07212
3963G6555611J90333J03408J95271K32930K01066K64626J11832L26499L25663
$$ plain form
3954 78507239 78807596 79107587 79386943 79708530 80163027 80548853 80846256 81053647 81324489
3945 81324489 81402210 81360074 81510292 81657000 81656664 81521053 81358199 81242750 81008930 80645408
3935 80645408 80275698 79940028 79401398 78922388 78351677 77661852 76948602 76236920 75431591
3926 75431591 74553844 73568610 72515275 71563861 70379909 69175270 67910162 66676081 65584314
3917 65584314 64406613 63093813 61832898 60619699 59273977 57946982 56636554 55338231
3909 55338231 54057491 52679332 51354928 50215689 49025481 47928883 46911923 45965856
3901 45965856 45061441 44035455 43083277 42097992 41165639 40409213 39705323 38947490 38302653
3892 38302653 37772817 37124997 36591945 36181250 35698066 35272344 34828486 34420051 34100562
$$ packed form
3954G8507239L00357K99991K79356L21587M54497L85826K97403K07391K70842
3945H1324489P7721m2136J50218J46708l36j35611j62854j15449k33820l63522
3935H0645408l69710l35670n38630m79010n70711o89825p13250p11682q05329
3926G5431591q77747r85234j053335r51414j183952j204639j265108j234081j091767
3917F5584314j177701j312800j260915j213199j345722j326995j310428j298323
3909E5338231j280740j378159j324404j139239j190208j096598j016960r46067
3901D5965856r04415j025986r52178r85285r32353p56426p03890p57833o44837
3892C8302653n29836o47820n33052m10695m83184m25722m43858m08435l19489
$$ plain form
3883 34100562 33913311 33799165 33760259 33780852 33686815 33511487 33409404 33510605 33717685 33849619
3873 33849619 33941186 34154453 34441023 34729894 34898403 35053858 35126791 35311708 35565957 35804755
3863 35804755 36057505 36335511 36612488 36864509 37093705 37386895 37750373 37841607 38056648 38202738
3853 38202738 38359867 38596120 38578533 38396030 38435637 38447228 38366712 38393479 38340751 38285644 38367130
3842 38367130 38469096 38638435 38856635 39161622 39498400 39915482 40387164 40836182 41335229
3833 41335229 41924756 42720680 43576254 44445535 45438274 46634297 47891610 49225408 50587411
3824 50587411 51861726 53284610 54912387 56568513 58260841 60046855 61921662 63826267
3816 63826267 65788116 67805870 69735045 71746838 73584753 75409120 77036357 78640343
$$ packed form
3883C4100562j87251j14146l8906K0593r4037j75328j02083J01201K07080J31934
3873C3849619R1567K13267K86570K88871J68509J55455P2933J84917K54249K38798
3863C5804755K52750K78006K76977K52021K29196K93190L63478R1234K15041J46090
3853C8202738J57129K36253j7587j82503L9607J1591q0516K6767n2728n5107Q1486
3842C8367130J01966J69339K18200L04987L36778M17082M71682M49018M99047
3833D1335229N89527P95924Q55574Q69281R92739J196023J257313J333798J362003
3824E0587411J274315J422884J627777J656126J692328J786014J874807J904605
3816F3826267J961849K017754J929175K011793J837915J824367J627237J603986
$$ plain form
3808 78640343 80273144 81721096 83148705 84566854 85861429 87122616 88412094 89487996
3800 89487996 90366290 91177953 91846061 92413490 92890015 93132712 93200289 93112381 92861792 92436283
3790 92436283 91901326 91275743 90519607 89694682 88775690 87753860 86600659 85278517 84019749
3781 84019749 82714278 81186524 79666336 78189718 76450918 74818952 73257086 71521074
3773 71521074 69734332 67984822 66166289 64316563 62470920 60689591 58765027 57011648
3765 57011648 55160950 53533302 51842085 50134527 48711045 47209384 45880054 44541904
3757 44541904 43352914 42259355 41274242 40437367 39601725 38837885 38263263 37689952 37167047
3748 37167047 36802681 36410012 36182048 35907829 35633423 35431421 35355128 35246341 35011147 34955405
$$ packed form
3808G8640343J632801J447952J427609J418149J294575J261187J289478J075902
3800H9487996Q78294Q11663O68108N67429M76525K42697O7577q7908k50589m25509
3790I2436283n34957o25583p56136q24925r18992j021830j153201j322142j258768
3781H4019749j305471j527754j520188j476618j738800j631966j561866j736012
3773G1521074j786742j749510j818533j849726j845643j781329j924564j753379
3765E7011648j850698j627648j691217j707558j423482j501661j329330j338150
3757D4541904j188990j093559r85113q36875q35642p63840n74622n73311n22905
3748C7167047l64366l92669k27964k74219k74406k02002p6293j08787k35194n5742
$$ plain form
3738 34955405 34769508 34535156 34487764 34377433 34217238 34020675 33688871 33651068 33540324 33291769
3728 33291769 33049433 32741528 32493199 32105018 31734611 31293050 30902024 30581538 30105682
3719 30105682 29773651 29586089 29378018 28977103 28565974 28146887 27821260 27453659 27117972
3710 27117972 26797873 26408132 26240611 25994885 25889087 25758116 25626915 25573694 25492514 25388268
3700 25388268 25345857 25332090 25194226 25190529 25268541 25425978 25495326 25797071 25980754 26011276 26212786
3689 26212786 26409596 26670807 26978878 27206572 27571333 28056131 28294626 28534852 29006480
3680 29006480 29380510 29813330 30367425 30850146 31455112 32138552 32825337 33588929 34380589
3671 34380589 35104735 35917055 36616635 37343200 38316911 39208995 40098426 41119499 42036085
$$ packed form
3738C4955405j85897k34352m7392j10331j60195j96563l31804l7803j10744k48555
3728C3291769k42336l07905k48329l88181l70407m41561l91026l20486m75856
3719C0105682l32031j87562k08071m00915m11129m19087l25627l67601l35687
3710B7117972l20099l89741j67521k45726j05798j30971j31201n3221q1180j04246
3700B5388268m2411j3767j37864l697P8012J57437O9348L01745J83683L0522K01510
3689B6212786J96810K61211L08071K27694L64761M84798K38495K40226M71628
3680B9006480L74030M32820N54095M82721O04966O83440O86785P63592P91660
3671C4380589P24146Q12320O99580P26565R73711Q92084Q89431J021073R16586
$$ plain form
3662 42036085 43106950 44059654 45123817 46288287 47261858 48271010 49179305 50247055 51225574
3653 51225574 52169663 53252604 54243354 55357079 56409766 57273250 58154778 58978438 59733640
3644 59733640 60476320 61216239 62059570 62978548 63887266 64720201 65586296 66452600 67195586
3635 67195586 67923274 68602076 69332487 70071930 70922383 71895011 72882477 74036594 75206731
3626 75206731 76481541 77959350 79479220 80933765 82464088 84113241 85743163 87645144
3618 87645144 89569988 91557678 93659511 95788251 97985872 100133993 102354461 104610440
3610 104610440 106928921 109446830 112019851 114798519 117494693 120200439 122910227 125663664
3602 125663664 128145175 130650583 133099946 135542489 137926560 140174948 142332036 144491097
$$ packed form
3662D2036085J070865R52704J064163J164470R73571J009152R08295J067750R78519
3653E1225574R44089J082941R90750J113725J052687Q63484Q81528Q23660P55202
3644E9733640P42680P39919Q43331R18978R08718Q32935Q66095Q66304P42986
3635F7195586P27688O78802P30411P39443Q50453R72628R87466J154117J170137
3626G5206731J274810J477809J519870J454545J530323J649153J629922J901981
3618H7645144J924844J987690K101833K128740K197621K148121K220468K255979
3610A04610440K318481K517909K573021K778668K696174K705746K709788K753437
3602A25663664K481511K505408K449363K442543K384071K248388K157088K159061
$$ plain form
3594 144491097 146408647 148279723 150261851 151913260 153488408 154957849 156283083 157385927
3586 157385927 158295914 159060445 159816171 160381070 160954379 161235403 161475585 161414032 161438396 161350557
3576 161350557 161059758 160669362 160402830 160096566 159903913 159666044 159418649 159205209 159102046
3567 159102046 159261845 159329747 159505595 159830170 160316578 160900047 161424578 162194999 163171345
3558 163171345 164260814 165409180 166641652 168064514 169462088 170959581 172490716 173970470
3550 173970470 175522006 177060357 178629808 180285988 181950822 183628819 185106806 186659680
3542 186659680 188068324 189314278 190369199 191448824 192478054 193241234 193824641 194298417
3534 194298417 194722262 194870150 194764866 194490923 194042476 193396346 192438664 191216826 189752113
$$ packed form
3594A44491097J917550J871076J982128J651409J575148J469441J325234J102844
3586A57385927R09987P64531P55726N64899N73309K81024K40182o1553K4364q7839
3576A61350557k90799l90396k66532l06264j92653k37869k47395k13440j03163
3567A59102046J59799O7902J75848L24575M86408N83469N24531P70421R76346
3558A63171345J089469J148366J232472J422862J397574J497493J531135J479754
3550A73970470J551536J538351J569451J656180J664834J677997J477987J552874
3542A86659680J408644J245954J054921J079625J029230P63180N83407M73776
3534A94298417M23845J47888j05284k73943m48447o46130r57682j221838j464713
$$ plain form
3525 189752113 187997705 186120587 184078874 181807952 179357001 176871528 174233108 171536442
3517 171536442 168860195 165906866 163009339 159985951 156971805 153874638 150728942 147554396
3509 147554396 144382434 141430097 138482460 135677576 133092637 130528583 128157076 125834402
3501 125834402 123804499 121955962 120231487 118559846 116983020 115636995 114291717 113130464
3493 113130464 112010302 110963729 109837464 108790719 107776065 106884551 106120889 105392036
3485 105392036 104548936 103736611 103070146 102377055 101616138 100921994 100129624 99299981 98491886
3476 98491886 97553170 96677233 95782331 94956037 94067084 93103593 92087044 91018781 90047010
3467 90047010 88942324 87843934 86733384 85585026 84316443 83015440 81852982 80531786
$$ packed form
3525A89752113j754408j877118k041713k270922k450951k485473k638420k696666
3517A71536442k676247k953329k897527l023388l014146l097167l145696l174546
3509A47554396l171962k952337k947637k804884k584939k564054k371507k322674
3501A25834402k029903j848537j724475j671641j576826j346025j345278j161253
3493A13130464j120162j046573j126265j046745j014654q91514p63662p28853
3485A05392036q43100q12325o66465o93091p60917o94144p92370q29643q08095
3476I8491886r38716q75937q94902q26294q88953r63491j016549j068263r71771
3467I0047010j104686j098390j110550j148358j268583j301003j162458j321196
$$ plain form
3459 80531786 79244856 77879480 76488177 74998637 73717072 72418161 71074776 69678851
3451 69678851 68122122 66651037 65153138 63600561 62197429 60951408 59713697 58683283
3443 58683283 57543220 56408152 55239759 53967516 52776897 51632185 50399646 49359263
3435 49359263 48375967 47562184 46788618 45924572 45269699 44463956 43675707 42919335 42269565
3426 42269565 41629519 40994327 40441785 39911735 39374722 38855498 38271009 37713518 37143975
3417 37143975 36700387 36231479 35723470 35212205 34703163 34256687 33621627 32962542 32437512
3408 32437512 31922183 31388433 30955308 30379528 29692760 29092652 28456143 27660076 26927986
3399 26927986 26275494 25769062 25224556 24670243 24140339 23508037 22821155 22114543 21360669
$$ packed form
3459H0531786j286930j365376j391303j489540j281565j298911j343385j395925
3451F9678851j556729j471085j497899j552577j403132j246021j237711j030414
3443E8683283j140063j135068j168393j272243j190619j144712j232539j040383
3435D9359263r83296q13783p73566q64046o54873q05743p88249p56372o49770
3426D2269565o40046o35192n52542n30050n37013n19224n84489n57491n69543
3417C7143975m43588m68908n08009n11265n09042m46476o35060o59085n25030
3408C2437512n15329n33750m33125n75780o86768o00108o36509p96067p32090
3399B6927986o52492n06432n44506n54313n29904o32302o86882p06612p53874
$$ plain form
3390 21360669 20569456 19992145 19491586 19084457 18628608 18199619 17746544 17235732 16809770
3381 16809770 16321840 15817318 15219724 14780521 14307548 13930708 13551403 13506389 13293504 12912488
3371 12912488 12716376 12349168 11939550 11719571 11542370 11337573 11191247 11062391 10957548
3362 10957548 10808793 10572258 10428580 10286767 10194382 9970010 9813038 9750017 9560737 9440080
3352 9440080 9246812 9059122 8899107 8800584 8709261 8619281 8518735 8374777 8361768 8253669
3342 8253669 8100614 8064388 7959161 7797575 7683770 7529112 7521393 7433332 7443734 7548073
3332 7548073 7451239 7272901 7280035 7282217 7120177 7087182 7053399 7024173 7089079 7065878 6896002
3321 6896002 6804520 6681454 6812128 6778615 6800686 6771144 6722524 6720095 6728406 6666890 6662534 6621741
$$ packed form
3390B1360669p91213n77311n00559m07129m55849m28989m53075n10812m25962
3381A6809770m87930n04522n97594m39203m72973l76840l79305m5014k12885l81016
3371A2912488j96112l67208m09618k19979j77201k04797j46326j28856j04843
3362A0957548j48755k36535j43678j41813r2385k24372j56972o3021j89280j20657
3352I440080j93268j87690j60015r8523r1323q9980j00546j43958j3009j08099
3342H253669j53055l6226j05227j61586j13805j54658p719q8061J0402J04339
3332G548073r6834j78338P134K182j62040l2995l3783k9226O4906k3201j69876
3321F896002r1482j23066J30674l3513K2071k9542m8620k429Q311o1516m356m0793
$$ plain form
3309 6621741 6652802 6635367 6636827 6723169 6723943 6711066 6799194 6762001 6790939 6842734 6866334 6868227
3297 6868227 6908942 6919310 7024499 7172263 7399635 7496168 7464404 7565537 7548875 7590621 7760190
3286 7760190 7900184 8148981 8415696 8731342 8931398 9114562 9122950 9047690 8897888 8541707
3276 8541707 8522379 8488012 8474104 8407143 8398053 8378921 8312641 8235359 8239948 8284716 8391121 8488955
3264 8488955 8568337 8671288 8751078 8769689 9076961 9299191 9486179 9852763 10145387 10366073
3254 10366073 10567109 10874868 11347588 11681558 11715632 11579172 11549269 11416622 11215699 11149350
3244 11149350 11109017 11072934 11033445 11021256 11020390 10956081 10916254 10815528 10674153 10471397 10182725
3233 10182725 9978514 9789927 9506136 9272362 9149539 8857109 8727272 8593650 8523808 8481996
$$ packed form
3309F621741L1061j7435J460Q6342P74j2877Q8128l7193K8938N1795K3600J893
3297F868227M0715J0368J05189J47764K27372R6533l1764J01133j6662M1746J69569
3286G760190J39994K48797K66715L15646K00056J83164Q388p5260j49802l56181
3276H541707j9328l4367j3908o6961r090j9132o6280p7282M589M4768J06405R7834
3264H488955P9382J02951P9790J8611L07272K22230J86988L66584K92624K20686
3254A0366073K01036L07759M72720L33970L4074j36460k9903j32647k00923o6349
3244A1149350m0333l6083l9489j2189q66o4309l9827j00726j41375k02756k88672
3233A0182725k04211j88587k83791k33774j22823k92430j29837j33622o9842m1812
$$ plain form
3223 8481996 8502009 8511618 8505103 8426711 8205536 8170706 8036546 8107374 8107963 8187827 8380419 8528255
3211 8528255 8552290 8628434 8623593 8881985 9243178 9552016 9441903 8942376 8454324 7947673
3201 7947673 7590694 7431922 7291291 7137889 6953652 6852446 6741420 6542750 6427293 6355272
3191 6355272 6416852 6585556 6641165 6802121 7007723 7117100 7266794 7486275 7720923 8151313
3181 8151313 8756862 9295699 9804146 10036909 10478851 10958572 11714711 12349734 11908258 10969792
3171 10969792 9980571 9224953 8658420 8275331 8069760 7821853 7693024 7441257 7293200
3162 7293200 7103487 7057039 6924722 6820288 6888578 7111207 7329348 7649657 8062887 8502072
3152 8502072 8918069 9355881 9900882 10616436 11234815 11899313 12555692 13100812 13746508 14286280
$$ packed form
3223H481996K0013R609o515p8392k21175l4830j34160P0828N89P9864J92592J47836
3211H528255K4035P6144m841K58392L61193L08838j10113m99527m88052n06651
3201G947673l56979j58772j40631j53402j84237j01206j11026j98670j15457p2021
3191F355272O1580J68704N5609J60956K05602J09377J49694K19481K34648M30390
3181H151313O05549N38837N08447K32763M41942M79721P56139O35023m41476r38466
3171A0969792r89221p55618n66533l83089k05571k47907j28829k51767j48057
3162G293200j89713m6448j32317j04434O8290K22629K18141L20309M13230M39185
3152H502072M15997M37812N45001P15554O18379O64498O56379N45120O45696N39772
$$ plain form
3142 14286280 14250177 13397470 12093437 10783178 9604634 8847648 8383723 8011605 7680991
3133 7680991 7435615 7254924 7057071 6866757 6679983 6552550 6449790 6477606 6706758 6987246
3123 6987246 7369431 7811618 8243822 8708702 9177554 9562206 9606869 9678534 9837114 9554213
3113 9554213 8887485 8138056 7263636 6492202 5852374 5365229 4988464 4844315 4668079 4339960
3103 4339960 4180510 3999054 3724802 3589671 3521946 3445967 3380836 3306127 3232196 3201998 3162443
3092 3162443 3047706 2942239 2893359 2926078 2923109 2951900 2962368 2859008 2728265 2555038 2508469
3081 2508469 2463350 2381441 2328310 2245134 2211944 2381639 2479950 2481087 2365869 2291711 2128738
3070 2128738 1909073 1779277 1642304 1578152 1653869 1795767 1807053 1833406 1883668 1676091
$$ packed form
3142A4286280l6103q52707j304033j310259j178544p56986m63925l72118l30614
3133G680991k45376j80691j97853j90314j86774j27433j02760K7816K29152K80488
3123F987246L82185M42187M32204M64880M68852L84652M4663P1665J58580k82901
3113I554213o66728p49429q74420p71434o39828m87145l76765j44149j76236l28119
3103D339960j59450j81456k74252j35131o7725p5979o5131p4709p3931l0198l9555
3092C162443j14737j05467m8880L2719k969K8791J0468j03360j30743j73227m6569
3081B508469m5119q1909n3131q3176l3190J69695R8311J137j15218p4158j62973
3070B128738k19665j29796j36973o4152P5717J41898J1286K6353N0262k07577
$$ plain form
3060 1676091 1578808 1620365 1529131 1408349 1367584 1369393 1562415 1666695 1579409 1624194 1707613
3049 1707613 1606725 1441751 1367057 1252800 1179178 1115966 1234615 1475628 1522121 1537329
3039 1537329 1341159 1373416 1248910 1027358 927271 966390 1060554 1107910 1154755 1104784 1041086
3028 1041086 930195 903536 912815 874952 933881 1073719 1006591 1002322 1007634 934067 840270 702311
3016 702311 713551 815997 859132 889661 877390 904765 901576 952702 805822 776333 892302
3005 892302 836577 854264 930306 883397 839364 760773 734145 783181 766449 755211 881362
2994 881362 863733 799779 788747 842269 772883 829904 852135 746119 673004 561507 580112
2983 580112 685606 711266 869403 963030 923830 874922 709969 669476 611316 621807 675204
$$ packed form
3060A676091r7283M1557r1234j20782m0765J809J93022J04280q7286M4785Q3419
3049A707613j00888j64974p4694j14257p3622o3212J18649K41013M6493J5208
3039A537329j96170L2257j24506k21552j00087L9119R4164M7356M6845m9971o3698
3028A041086j10891k6659R279l7863N8929J39838o7128m269N312p3567r3797j37959
3016G02311J1240J02446M3135L0529j2271K7375l189N1126j46880k9489J15969
3005H92302n5725J7687P6042m6909m4033p8591k6628M9036j6732j1238J26151
2994H81362j7629o3954j1032N3522o9386N7021K2231j06016p3115j11497J8605
2983E80112J05494K5660J58137R3627l9200m8908j64953m0493n8160J0491N3397
$$ plain form
2972 675204 689432 715119 783873 802886 801482 770966 678355 662311 625379 649577 673957 762334
2960 762334 780821 652171 704253 751173 807291 796610 749644 666998 565456 613768 570088
2949 570088 454208 495053 553017 572098 610629 703961 729187 700895 810916 723272 668650
2938 668650 665309 673446 681253 574226 681930 710543 701134 746980 888550 890420 879797 864246
2926 864246 761323 738215 801348 850469 902447 885462 922796 946966 915880 880488 775848
2915 775848 715388 748533 835019 905920 989442 912377 894569 858245 806278 808034 788259 861890
2903 861890 987642 1123004 1152626 1134659 1147316 1120093 1123762 1022092 995838 1140971 1101474
2892 1101474 940973 885384 897191 779545 751751 787085 737170 770193 947042 971000 816125
$$ packed form
2972F75204J4228K5687O8754J9013j404l0516r2611j6044l6932K4198K4380Q8377
2960G62334J8487j28650N2082M6920N6118j0681m6966q2646j01542M8312m3680
2949E70088j15880M0845N7964J9081L8531R3332K5226k8292J10021q7644n4622
2938F68650l341Q137P807j07027J07704K8613r409M5846J41570J870j0623j5551
2926H64246j02923k3108O3133M9121N1978j6985L7334K4170l1086l5392j04640
2915G75848o0460L3145Q6486P0901Q3522p7065j7808l6324n1967J756j9775P3631
2903H61890J25752J35362K9622j7967J2657k7223L669j01670k6254J45133l9497
2892A101474j60501n5589J1807j17646k7794L5334m9915L3023J76849K3958j54875
$$ plain form
2881 816125 830587 781516 715701 701786 772931 915268 929426 920925 972117 929334 939966 882102
2869 882102 746576 619679 526370 668683 760557 737893 887570 1001133 1115955 1003532
2859 1003532 889981 684904 477277 486617 608032 712224 715914 870574 807423 764003 731500
2848 731500 641540 659389 515703 496213 625333 738738 747118 707523 645603 625040 591064
2837 591064 455962 425461 320509 306257 464483 571073 567643 541235 433226 362855 320650
2826 320650 294008 271964 321036 388818 452982 495314 586945 564963 470647 321135 229982
2815 229982 167562 133901 136472 237662 335160 392689 493528 384695 289012 289322 148668
2804 148668 81105 136876 54331 70144 87639 158597 257657 279084 357166 368360 304862 138194
$$ packed form
2881H16125J4462m9071o5815j3915P1145J42337J4158q501N1192m2783J0632n7864
2869H82102j35526j26897r3309J42313R1874k2664J49677J13563J14822j12423
2859A003532j13551k05077k07627R340J21415J04192L690J54660o3151m3420l2503
2848G31500q9960J7849j43686j9490J29120J13405Q380l9595o1920k0563l3976
2837E91064j35102l0501j04952j4252J58226J06590l430k6408j08009p0371m2205
2826C20650k6642k2044M9072O7782O4164M2332R1631k1982r4316j49512r1153
2815B29982o2420l3661K571J01190R7498N7529J00839j08833r5683L10j40654
2804A48668o7563N5771q2545J5813J7495P0958R9060K1427P8082J1194o3498j66668
$$ plain form
2792 138194 163560 137805 143289 217458 256425 214150 175868 103646 73730 152917 210705 203315
2780 203315 248778 221825 256820 264130 236777 242104 135779 71924 21468 77800 70115 163446
2768 163446 76146 88390 111830 76268 93300 82504 109760 86884 81747 151844 133907 92087
2756 92087 -6183 28499 8883 52193 68065 98261 197580 126854 74605 111851 29353 -11752
2744 -11752 36959 107491 177079 186758 242458 231652 198317 129316 41079 -24880 88755 172266
2732 172266 244780 195962 244250 160510 -4277 -22528 -15338 -46557 -30283 85323 175122
2721 175122 215451 184938 110096 90777 17885 -143365 -233956 -182478 30124 115992 217611
2710 217611 234685 242873 141825 25927 -82946 -122145 -48889 45180 223178 257547 105340
$$ packed form
2792A38194K5366k5755N484P4169L8967m2275l8282p2222k9916P9187N7788p390
2780B03315M5463k6953L4995P310k7353N327j06325o3855n0456N6332p685R3331
2768A63446q7300J2244K3440l5562J7032j0796K7256k2876n137P0097j7937m1820
2756I2087r8270L4682j9616M3310J5872L0196R9319p0726n2249L7246q2498m1105
2744a1752M8711P0532O9588R679N5700j0806l3335o9001q8237o5959J13635Q3511
2732A72266P2514m8818M8288q3740j64787j8251P190l1219J6274J15606Q9799
2721A75122M0329l0513p4842j9319p2892j61250r0591N1478K12602Q5868J01619
2710B17611J7074Q188j01048j15898j08873l9199P3256R4069J77998L4369j52207
$$ plain form
2699 105340 46823 49764 -17824 -55067 -106610 -58582 -100926 40904 157310 170263 214648
2688 214648 75554 -59565 -114014 -75033 -55821 -42310 -21763 -82797 -16415 144490 158846
2677 158846 179504 115339 -14518 -161524 -102673 -180420 -89413 -42865 -13067 114804 73988
2666 73988 15360 -92553 -176946 -96595 -30383 56022 148322 112930 -34228 -147090 -80034
2655 -80034 -43793 -124377 -227257 -105782 39977 97339 46254 84732 7746 -101603 -113911
2644 -113911 -62557 -66201 -42016 26966 5556 -21926 -33011 42531 30057 -5117 -10744 -22299
2632 -22299 -89015 -25682 2663 -93022 -103595 -31880 66621 154564 42642 -165047 -139803
2621 -139803 -50789 2496 37382 139698 196878 138170 -8295 -66252 -115222 -123724 -64632
$$ packed form
2699A05340n8517K941o7588l7243n1543M8028m2344J41830J16406J2953M4385
2688B14648j39094j35119n4449L8981J9212J3511K0547o1034O6382J60905J4356
2677A58846K0658o4165j29857j47006N8851p7747R1007M6548K9798J27871m0816
2666G3988n8628j07913q4393Q0351O6212Q6405R2300l5392j47158j12862O7056
2655h0034L6241q0584j02880J21475J45759N7362n1085L8478p6986j09349j2308
2644a13911N1354l644K4185O8982k1410k7482j1085P5542j2474l5174n627j1555
2632b2299o6716O3333K8345r5685j0573P1715R8501Q7943j11922k07689K5244
2621a39803Q9014N3285L4886J02316N7180n8708j46465n7957m8970q502N9092
$$ plain form
2610 -64632 -11449 127435 92396 39762 643 -84765 -66167 3637 61202 65415 181231 221927
2598 221927 119622 -76225 -184684 -276030 -226383 -174758 -84056 50637 157600 168920 40055
2587 40055 -18728 -58480 -154466 -177821 -224851 -33585 36375 53555 -18007 -31546 -41357 47239
2575 47239 31553 7190 98432 146879 94366 -22100 -110304 -132360 -111765 -139608 -35353
2564 -35353 4421 88233 100914 63971 -40962 -29581 -82293 -78406 -35339 14665 -5737 -34810
2552 -34810 -19488 -63694 -144205 -206888 -230078 -276944 -204275 -80191 -106914 -14028 154830
2541 154830 239173 206683 48903 -22407 -61011 -209218 -165410 -28073 -11838 35451 134057
2530 134057 143869 134350 14142 -73477 2803 81795 40105 137917 183026 66175 -45250
$$ packed form
2610f4632N3183J38884l5039n2634l9119q5408J8598O9804N7565M213J15816M0696
2598B21927j02305j95847j08459r1346M9647N1625R0702J34693J06963J1320j28865
2587D0055n8783l9752r5986k3355m7030J91266O9960J7180p1562j3539r811Q8596
2575D7239j5686k4363R1242M8447n2513j16466q8204k2056K0595k7843J04255
2564c5353L9774Q3812J2681l6943j04933J1381n2712L887M3067N0004k0402k9073
2552c4810J5322m4206q0511o2683k3190m6866P2669J24084k6723R2886J68858
2541A54830Q4343l2490j57780p1310l8604j48207M3808J37337J6235M7289R8606
2530A34057R812r519j20208q7619P6280P8992m1690R7812M5109j16851j11425
$$ plain form
2519 -45250 -111771 -218631 -254000 -234928 -137017 3450 32120 38496 91388 13099 104080 22242
2507 22242 -72263 -35242 -117032 -218485 -246440 -141963 -108992 60323 35774 76602 135664
2496 135664 71078 -35413 -92622 -54141 -87602 -91234 -53362 -62619 -28903 -5057 -65422 -96969
2484 -96969 -158624 -128473 -133114 -145436 -79566 -6346 -54047 -14108 -34676 -26398 -9011 117036
2472 117036 110053 26575 31613 -29651 -22043 -75762 -117977 -56978 45258 117284 94797 44511
2460 44511 39537 -7515 -78274 -152489 -140452 -65049 -28101 -87315 -52810 51558 -45353 -82527
2448 -82527 -158621 -197398 39023 36509 20236 61245 154099 85528 -34446 -66599 -43504 -44949
2436 -44949 -77697 -19698 -20117 2505 35541 34957 -55462 -150395 -137216 -141668 -167606 -247763 -171246
$$ packed form
2519d5250o6521j06860l5369J9072R7911J40467K8670O376N2892p8289R0981q1838
2507B2242r4505L7021q1790j01453k7955J04477L2971J69315k4549M0828N9062
2496A35664o4586j06491n7209L8481l3461l632L7872r257L3716K3846o0365l1547
2484i6969o1655L0151m641j2322O5870P3220m7701L9939k0568Q278J7387J26047
2472A17036o983q3478N038o1264P608n3719m2215O0999J02236P2026k2487n0286
2460D4511m974m7052p0759p4215J2037P5403L6948n9214L4505J04368r6911l7174
2448h2527p6094l8777K36421k514j6273M1009R2854o8571j19974l2153K3095j445
2436d4949l2748N7999m19K2622L3036n84r0419r4933J3179m452k5938q0157P6517
$$ plain form
2423 -171246 -18952 86424 68105 41851 -57471 -94883 -139270 -147298 -49402 -14252 607
2412 607 115221 100374 72727 111584 26597 -102366 -156823 -146194 -130808 -15457 57726 -73830
2400 -73830 -104882 -68447 1398 -7743 -84884 -2311 13005 47212 12492 21823 -100893 -202804
2388 -202804 -228383 -278099 -293860 -223799 -146059 -152132 3754 50253 118813 62589 -3420 -56911
2376 -56911 -30230 70368 89089 52862 47171 -53005 -86559 50580 78947 188114 221026
2365 221026 231805 181489 145307 121664 -48252 -151447 -83753 58479 50556 53774 -59980
2354 -59980 -103252 -25433 19170 -31361 -52562 -125197 -141220 -416 9739 -55581 -137031 -62573
2342 -62573 52780 78921 -35490 -46973 -1978 -1021 -126760 -18021 -74416 -102316 19720
$$ packed form
2423a71246J52294J05376j8319k6254r9322l7412m4387q028R7896L5150J4859
2412F07J14614j4847k7647L8857q4987j28963n4457J0629J5386J15351P3183j31556
2400g3830l1052L6435O9845r141p7141Q2573J5316L4207l4720R331j22716j01911
2388b02804k5579m9716j5761P0061P7740o073J55886M6499O8560n6224o6009n3491
2376e6911K6681J00598J8721l6227n691j00176l3554J37139K8367J09167L2912
2365B21026J0779n0316l6182k3643j69916j03195O7694J42232p923L218j13754
2354e9980m3272P7819M4603n0531k1201p2635j6023J40804J0155o5320q1450P4458
2342f2573J15353K6141j14411j1483M4995R57j25739J08739n6395k7900J22036
$$ plain form
2331 19720 93807 60604 -121272 -131735 -116714 -113117 -84392 -59556 -89709 -72172 -31975 -57414
2319 -57414 17317 -3282 -23277 1046 -88089 -78220 -91381 -100743 5747 60646 57607 38366
2307 38366 -29886 5897 -78988 -78388 -59024 -178235 -215337 -158355 -117490 -54997 106666 66424
2295 66424 99660 51802 58920 43924 77115 52622 44764 14 -4077 -30439 -42348 -17366
2283 -17366 72960 22950 -48786 -6136 -18349 71196 87039 120572 123615 92607 113378 60895
2271 60895 -20942 65807 45617 122641 72331 41533 -67465 -73189 48621 56448 36741 65219
2259 65219 65983 76332 134054 152747 111638 -15702 -84427 -31338 16943 -13844 28395 35556
2247 35556 2998 82487 91814 114872 122275 -13576 -18370 -25844 120579 93754 190218 160083
$$ packed form
2331A9720P4087l3203j81876j0463J5021L597K8725K4836l0153J7537M0197k5439
2319e7414P4731k0599j9995K4323q9135R869j3161r362J06490N4899l039j9241
2307C8366o8252L5783q4885O00J9364j19211l7102N6982M0865O2493J61663m0242
2295F6424L3236m7858P118j4996L3191k4493p858m4750m091k6362j1909K4982
2283a7366R0326n0010p1736M2650j2213Q9545J5843L3533L043l1008K0771n2483
2271F0895q1837Q6749k0190P7024n0310l0798j08998n724J21810P827j9707K8478
2259F5219P64J0349N7722J8693m1109j27340o8725N3089M8281l0787M2239P161
2247C5556l2558P9489R327K3058P403j35851m794p474J46423k6825R6464l0135
$$ plain form
2235 160083 71229 60869 50512 142056 70901 31417 54825 16877 -16984 7175 144397
2224 144397 193587 135507 142089 15735 -79440 -140047 -72138 -88976 -81977 -95898 49973 135073
2212 135073 139518 162098 132969 -13746 -24965 29203 48999 259639 371490 244201 316960
2201 316960 241215 154348 114072 39526 43835 49605 313727 461145 405362 450550 400867 392699
2189 392699 375241 344019 297772 201490 241392 349933 363611 291208 433703 434483 581650
2178 581650 710162 723112 714144 745449 782317 903881 755974 651510 615806 566676 616255
2167 616255 728518 828526 929532 898213 858398 1003471 956618 925112 953849 1061762 1149349
2156 1149349 1118247 1133562 1214503 1221293 1251976 1291268 1279421 1377982 1422607 1450242 1565411
$$ packed form
2235A60083q8854j0360j0357R1544p1155l9484K3408l7948l3861K4159J37222
2224A44397M9190n8080O582j26354r5175o0607O7909j6838O999j3921J45871Q5100
2212A35073M445K2580k9129j46715j1219N4168J9796K10640J11851j27289P2759
2201C16960p5745q6867m0276p4546M309N770K64122J47418n5783M5188m9683q168
2189C92699j7458l1222m6247r6282L9902J08541J3678p2403J42495P80J47167
2178E81650J28512J2950q968L1305L6868J21564j47907j04464l5704m9130M9579
2167F16255J12263J00008J01006l1319l9815J45073m6853l1506K8737J07913Q7587
2156A149349l1102J5315Q0941O790L0683L9292j1847R8561M4625K7635J15169
$$ plain form
2145 1565411 1490290 1481811 1625634 1796818 1866655 1868444 1931417 2179251 2224024 2248565 2311805
2134 2311805 2485898 2534606 2613266 2850480 3001424 3185181 3355835 3650869 3859796 3931937
2124 3931937 4192827 4366869 4700255 5166678 5697850 6201409 6604750 7109881 7736346 8342687
2114 8342687 9028781 9893360 10991171 12235945 13828779 15603968 17888779 20859745 24662965
2105 24662965 29288484 33678103 35915907 40113115 43038572 38777347 31846424 24990786
2097 24990786 19998994 16413914 14009061 12161011 10669393 9509280 8592411 7796772
2089 7796772 7318209 6910913 6548821 6343551 5888308 5228017 4772725 4445721 4102310 3895617
2079 3895617 3797623 3544861 3277622 3128780 2913237 2781509 2656488 2670862 2660959 2516143
$$ packed form
2145A565411p5121q479J43823J71184O9837J789O2973K47834M4773K4541O3240
2134B311805J74093M8708P8660K37214J50944J83757J70654K95034K08927P2141
2124C931937K60890J74042L33386M66423N31172N03559M03341N05131O26465O06341
2114H342687O86094Q64579J097811J244774J592834J775189K284811K970966L803220
2105B4662965M625519M389619K237804M197208K925457m261225o930923o855638
2097B4990786m991792l585080k404853j848050j491618j160113r16869p95639
2089G796772m78563m07296l62092k05270m55243o60291m55292l27004l43411k06693
2079C895617r7994k52762k67239j48842k15543j31728j25021J4374r903j44816
$$ plain form
2069 2516143 2423466 2250803 2159177 1965870 1956266 1930743 1829486 1767320 1764802 1699140 1573449
2058 1573449 1400572 1288358 1405820 1425491 1251663 1158767 1106591 1216763 1211811 1058823
2048 1058823 1089118 1076616 1088464 1034115 1014660 1077149 978358 884340 912036 899078 800084
2037 800084 672410 730502 766156 733114 820942 821808 858904 785916 666529 670008 518896 451025
2025 451025 395588 440766 584554 593569 506075 473224 526986 515300 418251 333875 320873 411067
2013 411067 460681 447864 423689 458847 463938 445576 481350 458867 265722 204237 111029 262355
2001 262355 287866 324568 454912 355200 250904 158482 91266 -17635 73805 158525 241033
1990 241033 370375 474645 439397 359501 349645 295001 170806 140903 110616 39199 120758
$$ packed form
2069B516143r2677j72663r1626j93307r604k5523j01257o2166k518o5662j25691
2058A573449j72877j12214J17462J9671j73828r2896n2176J10172m952j52988
2048A058823L0295j2502J1848n4349j9455O2489r8791r4018K7696j2958r8994
2037H00084j27674N8092L5654l3042Q7828Q66L7096p2988j19387L479j51112o7871
2025D51025n5437M5178J43788R015q7494l2851N3762j1686r7049q4376j3002R0194
2013D11067M9614j2817k4175L5158N091j8362L5774k2483j93145o1485r3208J51326
2001B62355K5511L6702J30344r9712j04296r2422o7216j08901R1440Q4720Q2508
1990B41033J29342J04270l5248p9896r856n4644j24195k9903l0287p1417Q1559
$$ plain form
1979 120758 172517 252444 310931 428856 309025 196942 177997 158578 111195 26856 -21355
1968 -21355 10233 1042 30760 118115 200400 86256 86702 156538 168077 160889 242940 245264 242293
1955 242293 196307 94776 14382 -59040 -87191 -67499 -45738 37055 207939 215583 195314
1944 195314 210397 189206 50488 -13317 -50037 -210220 -168799 -19478 -30848 6374 98081
1933 98081 132842 117442 58253 49760 57903 -33844 -47697 -90170 36380 174509 195705 143266
1921 143266 34190 -63470 -167225 -202591 -109881 -133115 -17323 78949 201602 301853 269179
1910 269179 200286 160328 46035 -94525 -192447 -168696 -61160 -28227 -86459 -52229 -40373
1899 -40373 2888 69646 167829 80642 36402 44630 -31748 -98603 -111647 -79719 -87742 -3814
$$ packed form
1979A20758N1759P9927N8487J17925j19831j12083j8945j9419m7383q4339m8211
1968b1355L1588r191K9718Q7355Q2285j14144M46O9836J1539p188Q2051K324k971
1955B42293m5986j01531q0394p3422k8151J9692K1761Q2793J70884P644k0269
1944A95314J5083k1191j38718o3805l6720j60183M1421J49321j1370L7222R1707
1933I8081L4761j5400n9189q493Q143r1747j3853m2473J26550J38129K1196n2439
1921A43266j09076r7660j03755l5366R2710k3234J15792R6272J22653J00251l2674
1910B69179o8893l9958j14293j40560r7922K3751J07536L2933n8232L4230J1856
1899d0373M3261O6758R8183q7187m4240Q228p6378o6855j3044L1928q023Q3928
$$ plain form
1887 -3814 -18572 -52574 -68028 74374 105423 133577 80215 67576 38354 -78701 -104534 -183287
1875 -183287 -183421 -98114 103196 265072 133917 53086 49051 -68981 -5030 79060 39843
1864 39843 99794 73609 15832 7892 -98914 -171955 -154172 -79029 46289 73325 103983 107652
1852 107652 88902 -5868 -2800 41232 -25801 -42062 -30816 3526 -65145 -24658 -19172 -5359
1840 -5359 79638 197809 190663 200773 179168 203603 79379 92184 211689 99520 -54850
1829 -54850 54804 83228 88861 148791 136603 143686 81600 28805 52248 12851 -32437 -72001
1817 -72001 -49689 14282 -39908 -27968 -55238 -144340 -191507 -18093 -8505 -10945 57245 188935
1805 188935 95871 7859 -74121 -177172 -257101 -249896 -163889 -160621 -33695 71431 80490 -45372
$$ packed form
1887c814j4758l4002j5454J42402L1049K8154n3362j2639k9222j17055k5833p8753
1875a83287j34Q5307K01310J61876j31155q0831m035j18032O3951Q4090l9217
1864C9843N9951k6185n7777p940j06806p3041J7783P5143J25318K7036L0658L669
1852A07652j8750r4770L068M4032o7033j6261J1246L4342o8671M0487N486J3813
1840e359Q4997J18171p146J0110k1605K4435j24224J2805J19505j12169j54370
1829e4850J09654K8424N633N9930j2188P083o2086n2795K3443l9397m5288l9564
1817g2001K2312O3971n4190J1940k7270q9102m7167J73414R588k440O8190J31690
1805A88935r3064q8012q1980j03051p9929P205Q6007L268J26926J05126R059j25862
$$ plain form
1793 -45372 -133031 -76361 -101485 -87804 -69906 -145100 -173349 -117736 -123757 -116189 -111737 -119439 -137627
1780 -137627 -101566 -79273 32466 113559 90086 21562 20848 39109 22438 -83035 -161535 -178943
1768 -178943 -227015 -219795 -145029 19477 93797 67591 -28091 -39707 -47676 -140478 -132493 -95700
1756 -95700 -49885 55392 96222 22540 -60515 -164545 -135947 -55043 -51162 -22105 27657 7694
1744 7694 12714 57723 -89132 -111377 -133652 -141304 -169447 -143988 -43615 81405 143529 81540
1732 81540 -37016 -221947 -262056 -111110 -128157 -171254 -141100 -122517 -132354 -38484 57078
1721 57078 75830 68832 11623 -79432 -150230 -90047 -164626 -222391 -256745 -183662 -155654 -82296
1709 -82296 -75988 -156803 -37218 -25028 23160 81767 77968 -23235 -130567 -88513 -73540 -50621
$$ packed form
1793d5372q7659N6670k5124J3681J7898p5194k8249N5613o021P568M452p702j8188
1780a37627L6061K2293J11739Q1093k3473o8524p14J8261j6671j05473p8500j7408
1768a78943m8072P220P4766J64506P4320k6206r5682j1616p969r2802P985L6793
1756i5700M5815J05277M0830p3682q3055j04030K8598Q0904L881K9057M9762j9963
1744G694N020M5009j46855k2245k2275p652k8143K5459J00373J25020O2124o1989
1732H1540j18556j84931m0109J50946j7047m3097L0154J8583r837R3870R5562
1721E7078J8752o998n7209r1055p0798O0183p4579n7765l4354P3083K8008P3358
1709h2296O308q0815J19585J2190M8188N8607l799j01203j07332M2054J4973K2919
$$ plain form
1697 -50621 11564 -43844 -43781 18779 -44310 2824 -197510 -150987 -75077 3374 10507 96255
1685 96255 88118 74654 49297 -102165 -165443 -203825 -320841 -332238 -149414 -169900 -179932
1674 -179932 16000 130162 159524 158212 108907 -10870 -160163 -221938 -332187 -279979 -138455
1663 -138455 -15216 21269 146755 130742 130225 42089 -25956 -87345 -52696 -98424 -77056 -206942
1651 -206942 -214073 -197096 -161836 -180895 -84413 -23733 -7851 159827 124777 37424 -41902 -130776
1639 -130776 -186178 -262120 -246052 -140652 -10336 21129 -1880 65912 69952 28830 9020
1628 9020 29811 100813 58810 -47246 72023 -132556 -122856 -18675 -52560 -95907 -81984
1617 -81984 -6741 50850 211676 68411 -75055 -100723 -163375 -139625 -136776 -142780 47087
$$ packed form
1697e0621O2185n5408O3O2560o3089M7134k00334M6523P5910P8451P133Q5748
1685I6255q137j3464k5357j51462o3278l8382j17016j1397J82824k0486j0032
1674a79932J95932J14162K9362j312m9305j19777j49293o1775j10249N2208J41524
1663a38455J23239L6485J25486j6013n17q8136o8045o1389L4649m5728K1368j29886
1651b06942p131J6977L5260j9059R6482O0680J5882J67678l5050q7353p9326q8874
1639a30776n5402p5942J6068J05400J30316L1465k3009O7792M040m1122j9810
1628I020K0791P1002m2003j06056J19269k04579R700J04181l3885m3347J3923
1617h1984P5243N7591J60826j43265j43466k5668o2652K3750K849o004J89867
$$ plain form
1606 47087 134683 172543 70297 -23219 -69558 -48761 -68191 -17308 80146 -31052 17929
1595 17929 63871 -2013 -101748 -162421 -170359 -60497 26119 32710 52436 58707 -41118 -11379
1583 -11379 11797 -21838 -117741 -201412 -165890 -74177 -80197 -136124 -90910 -55254 28498 -42739
1571 -42739 -86926 25842 17760 -36419 -108883 -184631 -137735 -54668 -140131 -168813 -107991 -89399
1559 -89399 -34125 -77142 -79445 -25417 -76117 -61400 -88617 -80298 -70242 -52145 16635 -1872
1547 -1872 -37827 44619 122937 88073 40971 58893 -51264 -65532 -46808 -59931 -118497 -132507
1535 -132507 -171258 -126079 -14568 -102759 -145062 -25118 -14890 -25816 -46837 -81745 -87159
1524 -87159 -180654 -266635 -259930 -229524 -109694 -84717 8035 68534 66005 -29054 -68919 -31370
$$ packed form
1606D7087Q7596L7860j02246r3516m6339K0797j9430N0883R7454j11198M8981
1595A7929M5942o5884r9735o0673p938J09862Q6616O591J9726O271r9825K9739
1583a1379K3176l3635r5903q3671L5522R1713o020n5927M5214L5656Q3752p1237
1571d2739m4187J12768q082n4179p2464p5748M6896Q3067q5463k8682O0822J8592
1559h9399N5274m3017k303N4028n0700J4717k7217Q319J0056J8097O8780j8507
1547a872l5955Q2446P8318l4864m7102J7922j10157j4268J8724j3123n8566j4010
1535a32507l8751M5179J11511q8191m2303J19944J0228j0926k1021l4908n414
1524h7159r3495q5981O705L0406J19830K4977R2752O0499k529r5059l9865L7549
$$ plain form
1512 -31370 -146836 -160957 -102684 -136390 -30427 23288 -20751 64341 -3617 -65838 -106976
1501 -106976 -138977 -29444 -36811 -103869 17804 45829 -23590 -105742 -139532 -175416 -139857
1490 -139857 -96667 -165233 -26816 119210 71198 2254 -55126 -117730 -99438 -4901 -42757
1479 -42757 -50512 -45122 66210 26352 -102165 -101491 -38890 -39258 41338 41603 80686 -48757 -138586
1466 -138586 -96854 -149031 -71481 -64316 109 44137 52647 -92570 -107721 -69391 -165788 -215968
1454 -215968 -232424 -139162 -165640 -33238 46656 43296 47012 22349 -41956 -93783 -95799 -220695
1442 -220695 -216580 -275873 -128940 127405 74668 74487 97391 102029 -32006 -77346 -32481 -67904
1430 -67904 -188027 -43755 25067 -84237 444 47160 15144 56023 50108 34466 31697 -67227
$$ packed form
1512c1370j15466j4121N8273l3706J05963N3715m4039Q5092o7958o2221m1138
1501a06976l2001J09533p367o7058J21673K8025o9419q2152l3790l5884L5559
1490a39857M3190o8566J38417J46026m8012o8944n7380o2604J8292R4537l7856
1479d2757p755N390J11332l9858j28517O74O2601l68Q0596K65L9083j29443q9829
1466a38586M1732n2177P7550P165O4425M4028Q510j45217j5151L8330r6397n0180
1454b15968j6456R3262k6478J32402P9894l360L716k4663o4305n1827k016j24896
1442b20695M115n9293J46933K56345n2737j81K2904M638j34035m5340M4865l5423
1430f7904j20123J44272O8822j09304Q4681M6716l2016M0879n915j5642k769r8924
$$ plain form
1418 -67227 -44465 -48419 -123636 -104199 -72141 -56236 33476 92007 70788 -25842 23508 60378
1406 60378 92921 71207 42613 -11412 -116227 -212247 -192047 -193095 -121901 37623 119261 216958
1394 216958 236881 110329 -86832 -215944 -281577 -192455 -230789 -109307 -44943 88736 190629
1383 190629 112627 -25315 -102517 -137528 -58438 -25072 -8554 9607 33507 186222 155473
1372 155473 113383 -14259 -114652 -110668 -177043 -133745 -88470 -36536 82498 -12511 88455
1361 88455 46292 69551 8783 -55990 -73403 -171125 -144275 -94710 -107298 -15115 117534 118997
1349 118997 104940 100915 91142 -39797 -114575 -183083 -99567 -33136 -60319 -12968 34886 31516
1337 31516 93565 -49121 -94338 -92721 -215728 -157769 -103539 -14707 32437 25755 26409 66841
$$ packed form
1418f7227K2762l954p5217J9437L2058J5905Q9712N8531k1219r6630M9350L6870
1406F0378L2543k1714k8594n4025j04815r6020K0200j048P1194J59524Q1638R7697
1394B16958J9923j26552j97161j29112o5633Q9122l8334J21482O4364J33679J01893
1383A90629p8002j37942p7202l5011P9090L3366J6518J8161K3900J52715l0749
1372A55473m2090j27642j00393L984o6375M3298M5275N1934J19034r5009J00966
1361H8455m2163K3259o0768o4773j7413r7722K6850M9565j2588R2183J32649J463
1349A18997j4057m025r773j30939p4778o8508Q3516O6431k7183M7351M7854l370
1337C1516O2049j42686m5217J617j23007N7959N4230Q8832M7144o682O54M0432
$$ plain form
1325 66841 -31935 -52203 -189857 -158026 -73741 45094 -8473 80193 95151 -7248 62824
1314 62824 78127 95989 69410 1865 -96609 -194730 -250641 -307066 -188573 -91864 -1088 121720
1302 121720 291434 177440 23267 -52542 -125157 -151988 -218956 -85311 -44741 -59057 20211
1291 20211 -37830 -83968 -35473 -172573 -153447 -136421 -50696 -9471 -53786 -154796 -141833
1280 -141833 -84136 -42746 -101122 -151966 -143176 -105765 -42912 27060 41953 -26727 -50337 -465
1268 -465 33267 -18340 -135412 -61182 -15173 -25529 -170253 -53197 -85294 -146003 -46772 -32560
1256 -32560 31747 127388 133320 123096 67982 -147591 -257278 -303895 -275020 -138779 65803
1245 65803 87771 132074 173152 56335 -36610 -118539 -119009 -76508 4948 72156 121763 216845
$$ packed form
1325F6841r8776k0268j37654L1831Q4285J18835n3567Q8666J4958j02399P0072
1314F2824J5303J7862k6579o7545r8474r8121n5911n6425J18493R6709R0776J22808
1302A21720J69714j13994j54173p5809p2615k6831o6968J33645M0570j4316P9268
1291B0211n8041m6138M8495j37100J9126J7026Q5725M1225m4315j01010J2963
1280a41833N7697M1390n8376n0844Q790L7411O2853O9972J4893o8680k3610M9872
1268d65L3732n1607j17072P4230M6009j0356j44724J17056l2097o0709R9231J4212
1256c2560O4307R5641N932j0224n5114k15573j09687m6617K8875J36241K04582
1245F5803K1968M4303M1078j16817r2945q1929m70M2501Q1456O7208M9607R5082
$$ plain form
1233 216845 175225 137228 140056 76448 -7180 -33463 -97947 -147569 -24298 19758 -5791 35770
1221 35770 59460 28626 -18684 -5889 -4720 -48156 99533 25389 48853 8922 -7978 -72988
1209 -72988 -127889 -74032 -86833 -52934 18705 72192 54108 99319 -126547 -230759 -181772
1198 -181772 -232681 -247903 -182877 -85929 38900 52017 51516 166260 105141 -69530 -80617
1187 -80617 -170138 -193391 -167343 -88897 -66800 -18126 76872 58098 86837 71382 -31495 -43587
$$ packed form
1233B16845m1620l7997K828o3608q3628k6283o4484m9622J23271M4056k5549M1561
1221C5770K3690l0834m7310J2795J169m3436J47689p4144K3464l9931j6900o5010
1209g2988n4901N3857j2801L3899P1639N3487j8084M5211k25866j04212M8987
1198a81772n0909j5222O5026R6948J24829J3117n01J14744o1119j74671j1087
1187h0617q9521k3253K6048P8446K2097M8674R4998j8774K8739j5455j02877j2092
$$ [...]
##END NTUPLES=NMR SPECTRUM
##END=
